##TITLE=31Pdec_SR41_k
 D2O, 24 sc
 4.03.2021
##JCAMPDX= 6.0         $$ Bruker NMR JCAMP-DX V2.0
##DATA TYPE= NMR SPECTRUM
##DATA CLASS= NTUPLES
##ORIGIN= UXNMR, Bruker Analytische Messtechnik GmbH
##OWNER= root
$$ XWIN-NMR		Version 3.5
$$ Thu Mar  4 10:57:59 2021 Russian Standard Time (UT+4h)  she@DPX200
##.OBSERVE FREQUENCY= 81.013821
##.OBSERVE NUCLEUS= ^31P
##.ACQUISITION MODE= SIMULTANEOUS
##.ACQUISITION SCHEME= undefined
##.AVERAGES= 24
##.DIGITISER RES= 16
##SPECTROMETER/DATA SYSTEM= spect
##.PULSE SEQUENCE= zgpg30
##.SOLVENT NAME= CDCl3
##.SHIFT REFERENCE= (INTERNAL, CDCl3, 0, 248.564)
##AUDIT TRAIL= $$ (NUMBER, WHEN, WHO, WHERE, WHAT)
$$ ##TITLE= Audit trail, XWIN-NMR		Version 3.5
$$ ##JCAMPDX= 5.01
$$ ##ORIGIN= Bruker BioSpin GmbH
$$ ##OWNER= she
$$ F:/spectra/data/she/nmr/P31/1/pdata/1/auditp.txt
$$ ##AUDIT TRAIL=  $$ (NUMBER, WHEN, WHO, WHERE, WHAT)
(   1,<2021-03-04 10:56:19.00 +0400>,<she>,<DPX200>,
      <created by zg, POWCHK disabled, PULCHK disabled
       configuration hash MD5:
       00 E9 B6 7A A2 85 ED C7 34 08 36 98 17 FE 4E 26
       data hash MD5: 32K
       70 EA A3 C1 D0 F2 B1 32 3A F6 1F AF 22 B2 02 05>)
(   2,<2021-03-04 10:56:21.43 +0400>,<she>,<DPX200>,
      <Start of raw data processing
       efp BC_mod = 2 LB = 1 FT_mod = 6 PKNL = 1 PHC0 = -3356.959 PHC1 = 985.4008 SI = 64K 
       data hash MD5: 64K
       3D 22 E7 DB 49 DF 8A 81 F7 5B 99 C5 27 CD 2E 32>)
(   3,<2021-03-04 10:56:58.54 +0400>,<she>,<DPX200>,
      <pk PHC0 = 345.7719 PHC1 = -885.6 
       data hash MD5: 64K
       C2 2D D1 DA 70 51 56 5F 50 A5 96 2B FE 7E 26 B4>)
(   4,<2021-03-04 10:57:01.53 +0400>,<she>,<DPX200>,
      <abs ABSG = 5 
       data hash MD5: 64K
       B7 51 E2 DD 02 F8 4A 64 F8 B0 4A 3F E7 AE 67 DD>)
$$ ##END=
$$ 
$$ hash MD5
$$ 49 DE 5F 6E B5 E4 5B 7E 9F FE 83 81 04 C6 06 E2
##$RELAX= 
##$RELAX= 
##$RELAX= 
##$RELAX= 
##$RELAX= 
##$RELAX= 
##$RELAX= 
##$RELAX= 
$$ Bruker specific parameters
$$ --------------------------
##$DU= <F:/spectra>
##$EXPNO= 1
##$NAME= <P31>
##$PROCNO= 1
##$TYPE= <nmr>
##$USER= <she>
##$AMP= (0..31)
100 100 100 100 100 100 100 100 100 100 100 100 100 100 100 100 100 100 
100 100 100 100 100 100 100 100 100 100 100 100 100 100 
##$AQSEQ= 0
##$AQ_mod= 1
##$AUNM= <au_zg>
##$AUTOPOS= <>
##$BF1= 81.014009
##$BF2= 200.13
##$BF3= 200.13
##$BF4= 200.13
##$BF5= 200.13
##$BF6= 200.13
##$BF7= 200.13
##$BF8= 200.13
##$BYTORDA= 1
##$CFDGTYP= 0
##$CFRGTYP= 5
##$CHEMSTR= <none>
##$CNST= (0..31)
1 1 145 1 1 1 1 1 1 1 1 1 1 1 1 1 1 1 1 1 1 1 1 1 1 1 1 1 1 1 1 1 
##$CPDPRG= <waltz16>
##$CPDPRG1= <>
##$CPDPRG2= <waltz16>
##$CPDPRG3= <>
##$CPDPRG4= <mlev>
##$CPDPRG5= <mlev>
##$CPDPRG6= <mlev>
##$CPDPRG7= <mlev>
##$CPDPRG8= <mlev>
##$CPDPRGB= <>
##$CPDPRGT= <>
##$D= (0..31)
0 1 0 0 0 0 0 0 0 0 0 0.03 2e-05 3e-06 0 0 0 0 0 0 0 0 0 0 0 0 0 0 0 0 
0 0 
##$DATE= 1614840978
##$DBL= (0..7)
120 120 120 11 120 120 24 19 
##$DBP= (0..7)
150 150 150 150 150 150 150 150 
##$DBP07= 0
##$DBPNAM0= <>
##$DBPNAM1= <>
##$DBPNAM2= <>
$$ [...]
##$SUBNAM3= <"">
##$SUBNAM4= <"">
##$SUBNAM5= <"">
##$SUBNAM6= <"">
##$SUBNAM7= <"">
##$SUBNAM8= <"">
##$SUBNAM9= <"">
##$SW= 501.771253377433
##$SWIBOX= (0..15)
0 1 3 0 0 0 0 0 0 0 0 0 0 0 0 0 
##$SW_h= 40650.406504065
##$TD= 32768
##$TD0= 1
##$TE= 0
##$TE2= 300
##$TE3= 300
##$TEG= 300
##$TL= (0..7)
0 120 53 12 22 120 120 120 
##$TP= (0..7)
150 150 150 150 150 150 150 150 
##$TP07= 0
##$TPNAME0= <>
##$TPNAME1= <>
##$TPNAME2= <>
##$TPNAME3= <>
##$TPNAME4= <>
##$TPNAME5= <>
##$TPNAME6= <>
##$TPNAME7= <>
##$TPOAL= (0..7)
0.5 0.5 0.5 0.5 0.5 0.5 0.5 0.5 
##$TPOFFS= (0..7)
0 0 0 0 0 0 0 0 
##$TUNHIN= 0
##$TUNHOUT= 0
##$TUNXOUT= 0
##$USERA1= <user>
##$USERA2= <user>
##$USERA3= <user>
##$USERA4= <user>
##$USERA5= <user>
##$V9= 5
##$VALIST= <valist>
##$VCLIST= <CCCCCCCCCCCCCCC>
##$VD= 0
##$VDLIST= <DDDDDDDDDDDDDDD>
##$VPLIST= <PPPPPPPPPPPPPPP>
##$VTLIST= <TTTTTTTTTTTTTTT>
##$WBST= 1024
##$WBSW= 4
##$XGAIN= (0..3)
0 0 0 0 
##$XL= 0
##$YL= 0
##$YMAX_a= 27496
##$YMIN_a= -30348
##$ZGOPTNS= <>
##$ZL1= 120
##$ZL2= 120
##$ZL3= 120
##$ZL4= 120
##$ABSF1= 248.5645
##$ABSF2= -253.2056
##$ABSG= 5
##$ABSL= 3
##$ALPHA= 0
##$AQORDER= 0
##$ASSFAC= 0
##$ASSFACI= 0
##$ASSFACX= 0
##$ASSWID= 0
##$AUNMP= <proc_1d>
##$AZFE= 0.1
##$AZFW= 0.5
##$BCFW= 0
##$BC_mod= 2
##$BYTORDP= 0
##$COROFFS= 0
##$CY= -3
##$DATMOD= 1
##$DC= 0
##$DFILT= <>
##$DTYPP= 0
##$F1P= 0
##$F2P= 0
##$FCOR= 1
##$FTSIZE= 65536
##$FT_mod= 6
##$GAMMA= 0
##$GB= 0
##$INTBC= 1
##$INTSCL= 5.30512e-09
##$ISEN= 30
##$LB= 1
##$LEV0= 0
##$LPBIN= 0
##$MAXI= 10000
##$MC2= 0
##$MEAN= 0
##$ME_mod= 0
##$MI= 50
##$NCOEF= 0
##$NC_proc= -5
##$NLEV= 6
##$NOISF1= 182.463
##$NOISF2= 159.3651
##$NSP= 0
##$NTH_PI= 0
##$NZP= 0
##$OFFSET= 248.5645
##$PC= 4
##$PHC0= -3011.187
##$PHC1= 99.80084
##$PH_mod= 1
##$PKNL= yes
##$PPARMOD= 0
##$PSCAL= 0
##$PSIGN= 0
##$REVERSE= no
##$SF= 81.014009
##$SI= 65536
##$SIGF1= 159.3651
##$SIGF2= -187.1042
##$SINO= 113.3802
##$SIOLD= 16384
##$SREGLST= <1H.CDCl3>
##$SSB= 0
##$STSI= 65536
##$STSR= 0
##$SW_p= 40650.406504065
##$SYMM= 0
##$S_DEV= 0
##$TDeff= 32768
##$TDoff= 0
##$TI= <>
##$TILT= no
##$TM1= 0
##$TM2= 0
##$TOPLEV= 0
##$USERP1= <user>
##$USERP2= <user>
##$USERP3= <user>
##$USERP4= <user>
##$USERP5= <user>
##$WDW= 1
##$XDIM= 65536
##$YMAX_p= 302113062
##$YMIN_p= -117250249
$$ End of Bruker specific parameters
$$ ---------------------------------
##NTUPLES= NMR SPECTRUM
##VAR_NAME=  FREQUENCY,     SPECTRUM/REAL,   SPECTRUM/IMAG
##SYMBOL=    X,             R,               I
##VAR_TYPE=  INDEPENDENT,   DEPENDENT,       DEPENDENT
##VAR_FORM=  AFFN,          ASDF,            ASDF
##VAR_DIM=   65536,         65536,           65536
##UNITS=     HZ,            ARBITRARY UNITS, ARBITRARY UNITS
##FACTOR=    0.620285442955139, 1,           1
##FIRST=     20137.2065510759, 0,            0
##LAST=      -20513.1999529892, 0,           0
##MIN=       -20513.1999529892, -117250249,  0
##MAX=       20137.2065510759, 302113062,    0
$$ Real data points
##PAGE= N=1
##DATA TABLE= (X++(R..R)), XYDATA
$$ [...]
42733 -4158518 -3426064 -1887580 -718108 18510 740586 1175268 891374 401917 604800
42724 604800 1411810 1893557 1614909 1024537 680611 775225 1205207 1483655 910565 -489501
42714 -489501 -1595396 -1502632 -741432 -318980 -130979 483770 1112043 747960 -259576
42705 -259576 -465002 259154 324581 -1000714 -2364697 -2576870 -2384904 -2698580 -2615225 -1062671
42695 -1062671 741292 717699 -685116 -841983 1201995 3384532 3679942 2565547 1531725
42686 1531725 848904 116946 -277178 223662 1079626 1414750 1466225 1924295 2308689 1517191
42676 1517191 -133909 -911897 7645 1399957 1591434 299625 -1497437 -2723190 -2817650
42667 -2817650 -1870667 -620814 71924 14176 -361027 -762546 -1217102 -1555493 -1470145 -1136838
42657 -1136838 -1023464 -1041082 -752629 -479862 -1104763 -2470134 -3145683 -2388452 -1300074
42648 -1300074 -1258152 -2059448 -2471425 -1934017 -876207 85367 497224 157328 -453220
42639 -453220 -388519 481014 1090035 756353 302275 704618 1447592 1339813 324624 -692050
42629 -692050 -1280412 -1578546 -1443650 -735890 -37734 100887 184541 806116 1227908 441613
42619 441613 -803442 -781800 555654 1476196 1053974 123061 -525842 -1130003 -1770820
42610 -1770820 -1900443 -1534932 -1345538 -1157129 -83268 1359206 1249425 -763272 -2445336
42601 -2445336 -2131258 -1039926 -972846 -1458985 -1089132 -285033 -503377 -1470654 -1401039 271611
42591 271611 2207761 3166765 3190260 2799499 2324993 2037876 1865108 1151069 -241327
42582 -241327 -991669 172825 2305484 3088862 1851299 235958 -333939 -335899 -757824
42573 -757824 -1364278 -1254705 -362537 452322 482412 -158039 -769260 -760170 -211305 342191
42563 342191 774519 1488546 2293423 2008502 154107 -1678186 -1546375 109665 1013380
42554 1013380 255829 -723629 -618299 26954 284093 457951 1138357 1798477 1545624
42545 1545624 526131 -433640 -953895 -988923 -297386 970914 1751108 1186631 -144229
42536 -144229 -1078203 -1456048 -1792405 -1845620 -896227 670085 1468037 1050743 541856 935031
42526 935031 1815806 2264672 2059293 1379627 241201 -988995 -1319801 -399436 489991
42517 489991 -148779 -1835426 -2507196 -1211656 683045 1369595 764693 125059 171087
42508 171087 472685 458194 186339 -32795 -202666 -491103 -763754 -582150 274107 1362303
42498 1362303 1806134 1166085 62252 -369715 228887 986889 860126 -133708 -1033628
42489 -1033628 -1076277 -397338 261284 267716 -340133 -815007 -461014 388526 586640 -302873
42479 -302873 -1244680 -1072335 -55271 684791 865011 1067254 1300600 821722 -427302
42470 -427302 -1397014 -1407579 -1066003 -1168454 -1558187 -1707935 -1688168 -1832484 -1992368 -1817348
42460 -1817348 -1387297 -1005134 -713265 -476825 -483273 -863842 -1480808 -2252671 -3185721 -3865818
42450 -3865818 -3645904 -2712428 -2167017 -2524143 -2928763 -2498676 -1624593 -1151649 -1043343
42441 -1043343 -788382 -476061 -462212 -495919 -172845 213063 234356 231952 616063 807709
42431 807709 86557 -955207 -1155968 -671794 -655370 -1176199 -1050102 53799 872403
42422 872403 437320 -580410 -1050186 -820340 -300841 415900 1215912 1504952 946703
42413 946703 179132 28135 293837 -26577 -1412665 -3171712 -4097157 -3559541 -2028672
42404 -2028672 -643074 -182317 -434892 -623690 -289107 384400 840695 541533 -529088
42395 -529088 -1482169 -1212593 76888 724444 -316815 -1951653 -2418226 -1613146 -775807
42386 -775807 -472891 -357166 -506578 -1310180 -2152030 -1973104 -1217077 -1363732 -2284099 -2155645
42376 -2155645 -666090 -56935 -1647346 -3314038 -2357691 510951 2182572 1344170 -430229
42367 -430229 -1425445 -1582551 -1403796 -859589 -29138 380618 -128214 -1165471 -2043041
42358 -2043041 -2522197 -2728576 -2833156 -3033478 -3438671 -3839509 -3928264 -3724240 -3386253 -2728776
42348 -2728776 -1504805 -142051 495877 279586 113267 679929 1381534 1104310 -168025
42339 -168025 -1148877 -841804 111457 135080 -1338243 -3135566 -3734734 -2949107 -1837511
42330 -1837511 -1283625 -1269698 -1431748 -1614145 -1668846 -1264883 -275293 908528 1690778 1743614
42320 1743614 1135372 288118 -146456 251620 1174488 1828287 1775456 1280399 792720 440742
42310 440742 148398 -57038 -31095 317390 857840 1175090 875652 121939 -439958 -501589
42300 -501589 -390696 -246716 406794 1629358 2328310 1542144 -74085 -1150542 -1519164
42291 -1519164 -1941852 -2312671 -1719834 -280872 687537 613432 350509 572549 853749
42282 853749 739095 423891 15349 -553607 -628840 579948 2206249 2355719 1078792
42273 1078792 676894 2145235 3467435 2801766 1252184 672588 677693 114936 -128613
42264 -128613 1457762 3771220 4141149 2320231 824859 1186835 2201222 2280417 1474221
42255 1474221 558456 -125582 -253915 576946 1861277 2311383 1518668 418228 -269422
42246 -269422 -895850 -1764284 -2343315 -2220021 -1871886 -1851502 -1948095 -1687523 -1040893 -237660
42236 -237660 545247 1014163 860928 293229 -39753 214607 917719 1900501 2962471
42227 2962471 3505298 2974960 1705441 578611 -130488 -774332 -1301310 -1221572 -689982
42218 -689982 -547287 -950757 -914557 296044 2024771 2959794 2535931 1307764 334372
42209 334372 333165 1036416 1368324 663141 -465177 -984367 -838433 -711413 -724173 -394418
42199 -394418 224511 457134 131008 -201890 -258837 -292158 -318985 -93347 114290 -197150
42189 -197150 -643276 -348127 436004 523937 -78496 147126 1709905 2830845 1861378
42180 1861378 -245076 -1283885 -775381 -108925 -212366 -604788 -710719 -717097 -765178 -378264
42170 -378264 666998 1576221 1385430 307344 -456519 -284006 116908 -138318 -745640
42161 -745640 -701415 103870 716172 637061 513422 917304 1427646 1557001 1622996 1857954
42151 1857954 1616155 570772 -180754 425498 1530895 1427906 61220 -1069957 -1142369
42142 -1142369 -554338 435381 1833663 2784909 2189757 633228 -47045 640252 1371283
42133 1371283 1326604 1084003 836485 -210369 -1926781 -2716383 -1881855 -786795 -632152
42124 -632152 -787923 -470765 -346283 -1039602 -1566734 -821866 581612 1421853 1679116
42115 1679116 1801141 1337570 -52637 -1204464 -796597 551861 1107581 420055 -517159
42106 -517159 -957073 -864844 -202366 872945 1509507 1145991 582515 844979 1450723 1112898
42096 1112898 -204854 -1253697 -1290812 -747349 -331663 -489667 -1446361 -2808101 -3519243
42087 -3519243 -3153205 -2695671 -3039374 -3435402 -2726980 -1427286 -1004977 -1537753 -1715593
42078 -1715593 -1010958 -279240 -170665 -361911 -501322 -660793 -664445 -56568 1068358 2059068
42068 2059068 2566522 2693781 2491859 2035515 1618119 1127586 -115953 -1976037 -2850425
42059 -2850425 -1708609 106737 701217 381499 657581 1276957 675382 -946239 -1655214
42050 -1655214 -1082621 -1002398 -1962893 -2004726 -8953 2001172 1655610 -377774 -1645735
42041 -1645735 -1329522 -613313 -445857 -653195 -929581 -1296411 -1628197 -1696715 -1635866 -1688914
42031 -1688914 -1648111 -1097693 -62256 965155 1459583 1161299 281078 -478803 -519574
42022 -519574 -482 519750 897655 1223925 1167544 471306 -183533 -25894 305521 -405931
42012 -405931 -1701081 -1819587 -578756 109589 -713873 -1488853 -739705 587810 879579
42003 879579 390125 307299 519412 190134 -303441 109372 1241048 1909559 1790925 1453837
41993 1453837 901612 -301087 -1634347 -1969930 -1333066 -836820 -777893 -288839 863223
41984 863223 1614824 1288756 692386 830703 1483351 1795666 1562603 1207375 974738 777458
41974 777458 558034 345143 127874 -83047 -280707 -647384 -1374476 -2182995 -2425252 -1868399
41964 -1868399 -1043219 -606814 -640944 -769650 -706807 -472848 -253599 -226162 -406877 -569605
41954 -569605 -440261 -41372 297671 342616 218959 175276 212304 115405 -173246 -400521
41944 -400521 -323491 -59436 66193 -67130 -382552 -937306 -1769403 -2371785 -2011539 -900139
41934 -900139 -269739 -665324 -986918 -213408 734807 342133 -844707 -879720 261085
41925 261085 293354 -1663734 -3197372 -2012978 459391 980070 -945265 -2670597 -2296149
41916 -2296149 -833740 -160632 -577249 -1179056 -1432708 -1424249 -1161143 -450590 637085
41907 637085 1560955 1624518 619811 -688932 -1054544 -134181 932012 893272 59419
41898 59419 -118484 973405 2313251 2565109 1639284 677838 706120 1420358 1417321 -58612
41888 -58612 -1755098 -1679414 57313 906493 -752916 -3129253 -3371028 -1547979 -361033
41879 -361033 -1136348 -2184600 -1612390 33853 903973 374931 -637944 -1154279 -982026
41870 -982026 -514132 -312550 -590730 -785211 -96086 1318923 2303372 2122270 1236516
41861 1236516 355617 -463794 -1267257 -1559987 -987780 -132031 147171 -162668 -426054
41852 -426054 -418993 -502099 -825311 -986002 -627703 -2027 325862 268924 452683 1331615
41842 1331615 2146924 1504228 -567405 -1989698 -1125344 725939 842905 -1114810 -2652024
41833 -2652024 -2121415 -906852 -929053 -1740187 -1723267 -945979 -876665 -1824094 -2526002 -2231561
41823 -2231561 -1607074 -1346647 -1190273 -745167 -344605 -647531 -1897265 -3677875 -4976903
41814 -4976903 -4748654 -3083745 -1488577 -1157036 -1337109 -503841 1159887 1864543 821428
41805 821428 -726480 -1455194 -1583299 -1933079 -2533965 -2909155 -2850722 -2269375 -1131957
41796 -1131957 -87010 -147922 -1127092 -1514440 -726100 -224661 -1227073 -2509138 -2138355
41787 -2138355 -533933 134357 -789580 -1795040 -1864604 -1791746 -2297494 -2603083 -1837751
41778 -1837751 -550287 208518 307681 94858 -531844 -1563420 -2170511 -1702551 -851061
41769 -851061 -685475 -940573 -459511 846985 1701216 1255996 186614 -328501 20947
41760 20947 671919 1049474 1120695 1306798 1895340 2457911 2231751 1373809 1144816 2101007
41750 2101007 2836450 1784331 -218799 -834569 354015 1201052 281280 -1073910 -1085664
41741 -1085664 -184942 189896 140683 747984 1763052 1904639 1177283 915198 1404945
41732 1404945 1326557 25019 -1306994 -1415937 -595715 217183 707822 770584 70005
41723 70005 -1058306 -1438650 -848274 -792699 -2143695 -3160735 -1741981 1092367 2227522
41714 2227522 906951 -172315 1110150 3299767 3785810 2626442 2044164 2861683 3464261
41705 3464261 2441926 626733 -194987 440512 1518448 2066463 1968440 1475633 733729
41696 733729 1066 -218277 315601 1137410 1510059 1248259 811979 613633 602786 606580
41686 606580 650024 708064 547283 150806 -99103 -84089 -307236 -920055 -901557 679981
41676 679981 2762339 3030977 918073 -1449347 -2000040 -1182460 -624991 -488538 214940
41667 214940 1297060 1331322 42530 -977701 -554286 452924 637049 35341 -362850
41658 -362850 -264780 -123607 -60082 159246 315248 -59909 -716836 -868112 -446194 -304069
41648 -304069 -849601 -1261851 -654391 477789 730691 -369072 -1708246 -2070295 -1716802
41639 -1716802 -1789272 -2346507 -2068927 -412163 961165 127975 -2186196 -3202035 -1749869
41630 -1749869 219558 443480 -784153 -1667071 -1619537 -1389034 -1211109 -561788 426747
41621 426747 825477 305680 -510570 -1136420 -1526421 -1358440 -291083 1039066 1626778
41612 1626778 1731469 2352691 3001432 1986833 -531288 -1990689 -1109102 22363 -693915
41603 -693915 -1858670 -931700 1316272 1775964 -79345 -1439772 -705680 236189 -532270
41594 -532270 -1830926 -1584520 -298757 -132138 -1510003 -2732271 -2513661 -1156933 580912
41585 580912 2154687 2764268 1786955 533 -930430 -639199 -584383 -1832500 -3370732
41576 -3370732 -3459486 -1923337 -176188 625197 604742 518717 806988 1322051 1547849 1086355
41566 1086355 201987 -296112 -21748 438840 382898 37172 81268 396533 196379 -588072
41556 -588072 -1027041 -591355 83962 351963 619597 1481825 2453498 2558718 1839642 1274530
41546 1274530 1310885 1435349 1219827 838330 366346 -488199 -1587722 -2167514 -1963566
41537 -1963566 -1779395 -2267745 -2796963 -2356255 -1147483 -356266 -515037 -978465 -1067453
41528 -1067453 -929401 -999896 -1209436 -1097449 -405399 674285 1624180 1913689 1495381
41519 1495381 1034516 1237320 1848602 1835502 867850 86951 781817 2539123 3442947
41510 3442947 2253690 -173162 -1928729 -2059390 -1110344 -27309 775331 1207294 1064166
41501 1064166 280584 -668612 -1093267 -760434 63535 1120273 2277625 3126902 2977800
41492 2977800 1612799 -169223 -1153178 -909583 -182816 30161 -373854 -626990 -239832
41483 -239832 273135 148469 -446924 -619686 -112059 294537 24968 -394220 -272435 37685
41473 37685 -311161 -1308177 -2176565 -2565434 -2671469 -2276394 -788291 1498126 3156565
41464 3156565 3117929 1736197 45604 -1307102 -1986974 -1625418 -271335 1227162 1910890
41455 1910890 1614132 901896 431377 614715 1468224 2436159 2717170 2106865 1265726
41446 1265726 951634 1249857 1633335 1462531 489243 -695775 -918398 226998 1566991
41437 1566991 1808604 1459847 1918942 2816351 2154690 -457097 -2695526 -2688824 -1531229
41428 -1531229 -1247377 -1802512 -1854750 -1236631 -753945 -386029 347538 826019 109249 -1054141
41418 -1054141 -914533 685284 2162334 2594783 2538179 2395058 1758423 727185 294431
41409 294431 906915 1834177 2276862 2023603 990186 -618214 -1714485 -1351168 -358266
41400 -358266 -392157 -1301596 -1246852 296915 1622351 1468166 687961 394085 295811 1239
41390 1239 231065 1310933 1894348 785263 -1002177 -1534795 -573511 450822 484399
41381 484399 -309177 -1251557 -1673595 -1196146 -295317 -37836 -610745 -906122 -244838 503816
41371 503816 400585 -71025 -113725 -141439 -805890 -1405628 -871672 247570 413884 -583735
41361 -583735 -1451457 -1426793 -1114219 -1215342 -1583732 -1706241 -1276432 -278089 809419 1115890
41351 1115890 433311 -198577 192705 1056155 1201188 719748 770976 1605208 2101497 1462512
41341 1462512 322031 -172671 315332 1134214 1322957 443741 -914135 -1653256 -1494123
41332 -1494123 -1347176 -2010238 -3151211 -4034908 -4380692 -3898658 -2142840 189782 1075808
41323 1075808 -302855 -1970987 -1770189 -458466 -157168 -699553 -160756 1420271 1809407
41314 1809407 392097 -593783 445354 2164095 2679971 2145622 1529897 700084 -657968
41305 -657968 -1667887 -1451237 -606149 -90854 325013 1129198 1646367 1063384 11369
41296 11369 -393959 -347546 -652653 -908465 -121797 1268419 1744632 1028246 406162 582978
41286 582978 736955 115006 -788125 -1244832 -1364860 -1415117 -957558 442097 2135351
41277 2135351 2849567 2099041 614857 -541175 -892736 -662485 -371047 -404983 -748506
41268 -748506 -1035602 -967034 -695815 -657286 -981235 -1309533 -1392010 -1599203 -2380139 -3316203
41258 -3316203 -3385060 -2343422 -1130279 -497035 -21325 818694 1382394 801266 -354945
41249 -354945 -726471 -273048 -222404 -808647 -718163 629708 1827136 1555864 675357 890928
41239 890928 2151982 2822191 2075660 784066 45560 -28848 145144 392585 691822
41230 691822 863014 715476 268555 -353012 -1085160 -1879090 -2554777 -2777417 -2324311 -1503312
41220 -1503312 -1079741 -1434382 -1984172 -1912967 -1261097 -648650 -173860 473632 945298 529422
41210 529422 -312506 -99632 1422733 2545695 1978127 744302 567798 1365475 1669582
41201 1669582 849333 -387514 -1219474 -1258241 -334755 1100676 1802194 1122329 169660
41192 169660 410802 1598675 2378497 2414751 2328768 1912795 309997 -1978819 -3166026
41183 -3166026 -2663127 -1795269 -1525146 -1181537 -207502 517588 215982 -347873 -232542
41174 -232542 73424 -205507 -423798 421140 1595759 1345902 -496482 -2209614 -2585056
41165 -2585056 -2230393 -2156143 -2320813 -2172890 -1675653 -1057156 -188778 1013202 1922408
41156 1922408 1707124 500566 -495942 -297484 758262 1433314 1001183 -46405 -749606
41147 -749606 -798836 -595136 -450177 -290311 -139262 -207328 -239107 520062 2127922 3277227
41137 3277227 2664671 784506 -512611 -242240 744284 1113474 518063 -594361 -1784404
41128 -1784404 -2613718 -2476065 -1248227 182383 754027 433155 -33034 -348987 -880642
41119 -880642 -1691653 -2243503 -2282055 -2255682 -2461580 -2418105 -1603058 -376301 328382 -43105
41109 -43105 -1303334 -2694767 -3157149 -2063171 -197604 632043 -333082 -1681324 -1609616
41100 -1609616 -281742 654812 503244 158924 404102 947562 1435913 2139502 3076460
41091 3076460 3486752 2831164 1560419 402715 -378838 -667859 -352152 61204 -297000
41082 -297000 -1214273 -1288117 1233 1234044 1037605 47966 -311836 -17588 47273 -43360
41072 -43360 415559 1041185 738123 -346245 -921879 -649386 -489986 -787354 -714888 -114030
41062 -114030 -205714 -1608085 -3040989 -3066530 -2040060 -1225183 -847202 -243357 617382
41053 617382 991930 564762 -152165 -565862 -451886 212990 1189472 1835117 1679928 1126352
41043 1126352 962676 1159132 836381 -322952 -1284980 -887088 448970 977990 -230825
41034 -230825 -2040528 -2609372 -1565250 -95747 878755 1585738 2285047 2417563 1579446
41025 1579446 493628 103942 309925 512672 812849 1557046 2170775 1743043 560417
41016 560417 -228637 -384486 -689807 -1302323 -1455474 -1045731 -1033353 -1731877 -2068830 -1297511
41006 -1297511 -267211 -125067 -722895 -1201256 -1354393 -1528921 -1776283 -1880135 -1751121
40997 -1751121 -1254294 -210137 991229 1466532 974565 248617 -155246 -428131 -568740
40988 -568740 -53257 962910 1371547 833050 486986 999698 1296116 484399 -348525
40979 -348525 120431 1109981 999110 -20724 -566246 -572071 -988022 -1483332 -835632 522154
40969 522154 771231 -242863 -603519 478374 1359510 762792 -240975 -261874 242089
40960 242089 221630 -104744 -125529 -213143 -682867 -601450 649118 1636979 649759 -1420938
40950 -1420938 -1981305 -386706 1175546 724234 -1142989 -2395124 -1879939 11294 1993377
40941 1993377 2681217 1560201 -298116 -1107995 -365996 636887 674444 211429 485028
40932 485028 1507472 1954251 1043027 -307650 -638750 161344 765632 233714 -702912
40923 -702912 -685495 323581 1002256 644487 187059 687964 1612586 1597607 411041 -962086
40913 -962086 -1898494 -2517567 -2530008 -1240132 813726 1698622 540120 -1064227 -1301410
40904 -1301410 -738674 -1046061 -1933165 -1504365 418404 1598904 701052 -679068 -484968
40895 -484968 909688 1788940 1793018 1742683 1652414 909060 32107 260273 1368325 1756133
40885 1756133 960922 280986 435294 408626 -561886 -1493880 -1251139 -309265 184648 -26126
40875 -26126 -718273 -1914556 -3004318 -2452404 52789 2274417 2036875 273842 -466965
40866 -466965 185639 407221 -395182 -661861 466069 1689040 1783961 1374622 1413109 1492916
40856 1492916 898505 109694 5934 410586 489559 -47691 -961452 -2003084 -2680239
40847 -2680239 -2247539 -738218 640022 878518 316895 -209815 -592169 -1045130 -1267972
40838 -1267972 -945900 -503981 -485626 -720281 -903203 -1337417 -2169630 -2565433 -1767460 -434024
40828 -434024 286170 559681 1362702 2407985 2160874 215407 -1720786 -1890051 -597163
40819 -597163 480446 470394 -17209 -165408 -119297 -537640 -1321174 -1460924 -479513 553122
40809 553122 288181 -914340 -1467417 -1039964 -993292 -1819473 -1961793 -459688 928420
40800 928420 235327 -1333842 -1049903 911079 1505895 -496001 -2620457 -2437970 -843083
40791 -843083 -115290 -550002 -798636 -341680 145425 208338 -57437 -591950 -1101477 -753786
40781 -753786 713865 2122819 2228777 1439638 998955 1030709 753902 194613 140427 539257
40771 539257 467605 -223866 -648198 -439678 -195153 -106767 413176 1304959 1506010 709154
40761 709154 134041 672550 1501192 1578536 1362218 1742388 2240479 1811202 796802 447187
40751 447187 812849 757562 30695 -304118 225623 702485 477633 283251 916941 1895433
40741 1895433 2274829 1981236 1525718 1126726 883695 1105013 1635374 1536021 355366
40732 355366 -882708 -966387 -269064 -145582 -936403 -1744327 -1980701 -1904138 -1636510 -876515
40722 -876515 179369 725415 515039 221448 282106 261439 -230230 -808064 -973359 -773669
40712 -773669 -344577 468455 1466225 1749485 740317 -850098 -1708723 -1350537 -433510
40703 -433510 88531 -261083 -1306308 -2420444 -2969495 -2716285 -1779274 -434685 729706
40694 729706 902450 49517 -496063 486642 2159472 2447657 944949 -449004 -258045
40685 -258045 689375 921719 482130 300243 534695 791855 1110238 1502305 1333537 441914
40675 441914 114727 1501556 3574205 4116982 2469907 30465 -1679064 -2213976 -1760243
40666 -1760243 -751892 143524 620810 1077798 1593724 1296348 -129624 -1186977 -411066
40657 -411066 1202967 1438573 75398 -1071722 -1069392 -765509 -805873 -854545 -984235 -1744559
40647 -1744559 -2463798 -1573920 782890 2467256 2340296 1593299 1355626 1051946 144306
40638 144306 -526090 -414735 -455041 -1199420 -1521839 -670383 29901 -802792 -2308741 -2822139
40628 -2822139 -2360290 -1981854 -1792065 -1291824 -731446 -523591 -265684 220813 63738
40619 63738 -942281 -1233962 81826 1223140 400389 -986275 -500770 1222233 1626020
40610 1626020 608084 272576 684722 -315325 -2664911 -3300780 -1067134 1108315 793583
40601 793583 -281526 503310 2307470 2585690 1354823 672571 917364 580328 -563213
40592 -563213 -841164 394071 1477488 873625 -684732 -1424873 -858660 4335 176952
40583 176952 -322044 -813092 -814803 -496288 -361089 -547110 -653335 -379410 -41388 -148616
40573 -148616 -665404 -1067720 -1115310 -1252413 -2031581 -3165317 -3449771 -2070015 53981
40564 53981 946723 -42337 -1338173 -1307637 -435300 -147870 -245326 707599 2633207 3565336
40554 3565336 2429642 440255 -920746 -1638470 -2033077 -1588420 -171574 977616 903930
40545 903930 466054 814575 1437316 1278084 782107 1004873 1458990 849997 -514831
40536 -514831 -1134949 -917614 -1171926 -1887990 -1376748 660456 1915233 647085 -1640986
40527 -1640986 -2328993 -1277913 -516296 -998588 -1515133 -851823 474398 1143419 768366
40518 768366 96984 -116634 37513 -85042 -682089 -1019999 -307503 1007835 1510616
40509 1510616 696235 -195400 78076 879263 664889 -524920 -973287 115657 1327022
40500 1327022 1098314 -22199 -288896 750043 1932821 2368954 2356273 2324677 2068168
40491 2068168 1463473 993910 970669 956118 542074 78181 57035 377318 797903 1467506
40481 1467506 2328174 2720807 2460187 2558983 3722063 4769830 4059577 2132557 1243892
40472 1243892 2201486 3378567 3232296 2115894 933709 -324543 -1633097 -1948467 -558185
40463 -558185 1577887 3123908 4115878 5088505 5371634 3975283 1696381 554647 1149571
40454 1149571 2160142 2633341 3231742 4712652 6467998 7341229 7063131 6232124 5482098
40445 5482098 5170441 5348772 5597856 5355874 4783147 4846057 6153479 8095586 9542724
40436 9542724 10132133 10480889 11254789 12366427 13200103 13538282 14047358 15588544 18168748
40427 18168748 21084722 24118366 27827428 32433628 37449110 43001901 50410751 60539331
40419 60539331 72920649 87911137 107832047 132668949 155001513 163284759 152399358
40412 152399358 129010178 104750212 85840755 71129725 58019942 46645671 38265152
40405 38265152 32639547 28381417 24525262 20873378 17662343 15388566 14244028 13513160
40397 13513160 12291721 10816603 10083430 10082407 9632172 8265793 6971556 6446223 5902851
40388 5902851 4614950 3561556 4150847 5888889 6766187 5852577 4225316 3162083 2589214
40379 2589214 1803785 804201 162424 83166 302309 708298 1471596 2562203 3538799
40370 3538799 3891591 3425256 2382730 1372259 1004017 1294566 1542223 1142395 435000
40361 435000 271687 723574 839135 13985 -954004 -805437 462427 1543930 1479292
40352 1479292 640644 -135932 -681355 -1240498 -1617290 -1328354 -458843 333688 737795
40343 737795 1111905 1706012 2125375 1952194 1495673 1426780 1863283 2299723 2373610 2218236
40333 2218236 1995373 1548612 764297 -40602 -381789 -84404 703828 1744169 2685425
40324 2685425 3066318 2761201 2288648 2210754 2311308 1948853 1221581 981373 1374446 1241518
40314 1241518 -260622 -2094091 -2476547 -1269620 -11202 408160 688331 1321966 1349253
40305 1349253 -13338 -1641262 -1875552 -949295 -415062 -509900 19942 1307868 1620585
40296 1620585 124669 -1363480 -869157 773269 1244863 262382 -253880 623639 1515730
40287 1515730 1140276 285176 348202 1133168 1362193 713100 116163 221313 585290 528422
40277 528422 143921 162688 1036495 2301365 2893740 2221334 852709 -112088 -232969
40268 -232969 109930 535774 927909 941325 163132 -1036028 -1695608 -1559258 -1232287 -833260
40258 -833260 231826 1658322 1943040 696691 -238693 585444 1850747 1567666 362691
40249 362691 314803 1229941 844827 -1218967 -2492771 -1407166 453222 1012122 476149
40240 476149 -35802 -747428 -2189436 -3264245 -2508122 -648364 102051 -810101 -1539557
40231 -1539557 -515531 1463922 2370819 1427981 -110906 -452543 758443 2105911 2141982
40222 2141982 1116415 395470 458087 499074 19452 -451691 -558165 -743984 -1096374 -822327
40212 -822327 365988 1560250 2187096 2944972 4201321 4823180 3958872 2750435 2665739
40203 2665739 3149981 2694805 1420362 703708 801811 752948 294470 12790 -185407 -867165
40193 -867165 -1443549 -689363 984983 1699126 896764 158399 668838 1568618 1622949 1098013
40183 1098013 1018897 1578108 2134675 2124821 1439760 453571 -127012 -52873 -66104 -806884
40173 -806884 -1485285 -853755 715231 1595290 1306723 933304 999092 677140 -431685
40164 -431685 -1393283 -1473824 -1132532 -853812 -374776 316841 593802 392001 437009 779521
40154 779521 616254 28148 114461 793002 519035 -885224 -1365126 788 993007
40145 993007 -440236 -2783249 -3207354 -1758548 -755240 -1022028 -1356461 -1230669 -1451735
40136 -1451735 -2125540 -2193487 -1305894 -394946 -107924 -137600 -222984 -429348 -440786 6191
40126 6191 49769 -1379562 -3516491 -4264460 -3012947 -1396213 -817577 -736176 -109593 787403
40116 787403 954888 215581 -750840 -1447822 -1922043 -2297620 -2415923 -1953267 -850790
40107 -850790 356752 946967 957123 1233672 2128009 2770942 2319991 1315251 900199
40098 900199 1170057 1260688 731092 -50226 -555829 -330573 891592 2411984 2646770
40089 2646770 1142232 -293212 51179 1094688 563403 -1243284 -1646288 338184 2483504
40080 2483504 2619794 1351557 460632 338990 342258 403085 845616 1328346 1168796 330314
40070 330314 -675194 -1422705 -1559186 -750370 724479 1795849 1604995 407702 -820208
40061 -820208 -1353686 -1165590 -803098 -848603 -1143903 -817416 396539 1432435 1388341 1056412
40051 1056412 1593299 2309264 1693843 324153 389812 2040843 2707401 979338 -1163502
40042 -1163502 -1382627 -192726 570858 721352 1088669 1244420 176923 -1401185 -1569612
40033 -1569612 70685 1851699 2256468 1378028 152087 -757685 -1223405 -1548426 -2039530
40024 -2039530 -2314336 -1619813 -286508 155178 -855055 -1746632 -1013692 503907 1004225
40015 1004225 409972 -88385 -388294 -1299687 -2379878 -2123097 -470482 796538 571957
40006 571957 -319192 -803423 -908803 -868798 -356623 616440 1212190 925275 315111 35346
39996 35346 52034 279134 966404 1889730 2123736 1259376 39578 -710883 -893253 -418358
39986 -418358 1164033 3491958 4874334 4079916 2030258 670453 607724 880993 735826
39977 735826 503337 646399 843738 439624 -556037 -1238163 -663840 964011 2148903
39968 2148903 1640713 123603 -376410 944539 2512955 2407258 851443 -225571 243850
39959 243850 1333629 1583191 759644 -159179 -285033 286940 793246 794593 669218 969834
39949 969834 1486963 1446839 676777 -46914 -86806 223696 271780 133083 266436 682512
39939 682512 1061395 1357159 1633617 1620223 1155519 792176 1120203 1649554 1303459 58297
39929 58297 -853925 -615580 173556 551839 474643 474328 632027 569062 180496 -201450 -301547
39918 -301547 -201035 -174913 -376891 -583920 -289870 633102 1445739 1285089 446055 161607
39908 161607 826700 1304355 605194 -534103 -668701 275729 982499 591922 -396969
39899 -396969 -1041765 -938034 -267285 406550 421614 -203043 -439831 466850 1667382 1805871
39889 1805871 1255048 1681652 3184729 3728575 2290190 797373 1429220 3349319 4037166
39880 4037166 3026530 2175882 2471883 2756626 2046218 1175789 1179611 1465163 816969 -636126
39870 -636126 -1612967 -1401314 -449033 510343 1100391 1138159 535880 -436047 -1150339 -1112344
39860 -1112344 -420336 288838 419973 35244 -244633 -121591 -118103 -770309 -1576687 -1442858
39850 -1442858 -189071 1080530 1318972 670968 23578 -60372 322873 717955 677627
39841 677627 169626 -249680 -73460 286654 -149096 -1533553 -2781209 -2875402 -2023151
39832 -2023151 -1128599 -636455 -347941 28964 598405 1250878 1590623 1204222 260393
39823 260393 -536460 -827226 -961648 -1195028 -1083962 -173299 1125588 1875244 1631389
39814 1631389 797338 187394 407319 1289397 1798245 1034225 -475751 -1184059 -560389
39805 -560389 88063 -543050 -1840268 -2098456 -807699 840003 1567598 1295867 773507
39796 773507 582908 706066 752986 491702 163908 111875 181220 -19797 -281249 43837
39786 43837 859613 1190100 599869 -167577 -480000 -726164 -1225247 -1325676 -619460 -44637
39776 -44637 -495760 -1189004 -865244 99987 434453 261140 784254 1944443 2392224 1894459
39766 1894459 1726763 2230031 2029593 570765 -467933 370878 1947393 2150024 835416
39757 835416 -412200 -672762 -256289 562721 1675834 2192259 1072655 -1016007 -1974546
39748 -1974546 -993063 217279 -291077 -2140430 -3321417 -2799123 -1352303 -137166 469991
39739 469991 561329 247276 -130434 -62075 490524 1102268 1735994 2745342 3663063 3122942
39729 3122942 904670 -980540 -630018 1062667 1717013 948817 505618 1031241 1111173
39720 1111173 166027 -130238 1322092 2872709 2572115 1149291 535367 794335 793511
39711 793511 858362 2167024 4016393 4330391 2923450 1849574 2205854 2850234 2799920
39702 2799920 2702134 3093324 3169703 2343879 1383464 955474 518148 -295320 -605103 259814
39692 259814 1484036 2076323 2271082 2469996 2032516 562705 -646958 -146284 1334753
39683 1334753 1761625 716338 -179124 172954 853984 543880 -415882 -417902 1270811
39674 1270811 3418651 4100602 2863973 1210448 718095 1174902 1185473 215455 -941793
39665 -941793 -1572777 -1772491 -1679679 -1179600 -670684 -969336 -2010749 -2701759 -2476733 -1916650
39655 -1916650 -1480439 -921122 -410848 -712961 -1481479 -992860 1302749 3396213 3200852
39646 3200852 1198277 -692984 -1629769 -1760112 -903510 862463 2230032 2129320 1477664
39637 1477664 1749319 2572384 2620433 2138501 2403079 3149914 2886004 1630837 966786
39628 966786 1155536 568744 -1394541 -2978827 -2612198 -1048290 2350 -47650 -818513
39619 -818513 -1888307 -2717175 -2785741 -2496664 -2832096 -3634831 -3584947 -2430451 -1650153 -2059814
39609 -2059814 -2391044 -1421083 -14647 384043 13969 -15500 292866 357023 638178 1865177
39599 1865177 3215666 3176520 1931733 1024281 762352 -21405 -1378986 -1547473 229615
39590 229615 1943091 1308109 -1085294 -2593802 -1907249 -244933 597156 147770 -869219
39581 -869219 -1519232 -1200331 27969 1286268 1594299 1041847 719666 1214032 1808887
39572 1808887 1650022 1057929 938828 1360769 1647588 1643175 1829885 2185020 2034638 1327247
39562 1327247 969103 1373488 1693920 1238313 729682 1199743 2338674 3007649 2873539
39553 2873539 2459723 1996380 1351063 782075 586351 243876 -827885 -1829525 -1315923
39544 -1315923 533103 1833408 1532782 642134 410832 634121 588373 474563 866554
39535 866554 1503041 1650802 1200476 614225 189576 66 147207 542590 861049 1074539
39525 1074539 1460426 1808136 1480880 672469 505993 1183509 1248237 -195735 -1635184
39516 -1635184 -1049948 1067922 2312018 1662374 481214 192699 624570 1040969 1363129
39507 1363129 1682771 1669960 1212562 836344 824421 605483 -320865 -1418085 -1772016 -1351207
39497 -1351207 -948343 -1020172 -1146127 -718359 140372 561169 -94710 -1340224 -2010391
39488 -2010391 -1749966 -1489013 -1945313 -2302563 -1377356 261982 661799 -884735 -2795068
39479 -2795068 -3225623 -2089146 -496709 796310 1604777 1799208 1495391 1245654 1285183
39470 1285183 1060155 151987 -918748 -1515330 -1811588 -2015388 -1444453 362826 2177791
39461 2177791 2264726 881453 55777 731288 1663177 1576722 936488 774225 991454 872790
39451 872790 449208 316832 612963 984508 1138815 832041 -102259 -1149775 -1329550
39442 -1329550 -711832 -763479 -2175711 -3355865 -2513502 -430200 630274 256831 55516
39433 55516 568986 359083 -1227994 -2569810 -2242230 -1216413 -1104932 -1645865 -1633798
39424 -1633798 -1253318 -1561295 -2285961 -2105743 -938280 -143813 -341360 -660946 -455128
39415 -455128 -212775 -280839 -96160 621965 1148738 1012152 864188 1199853 1245798 243578
39405 243578 -1013007 -1251580 -769788 -949541 -1940771 -2365309 -1557882 -661895 -820019
39396 -820019 -1412758 -1074688 256497 1360129 1444353 862932 271357 -10967 199157
39387 199157 867507 1312654 776027 -288208 -470592 539479 1214634 403141 -687055
39378 -687055 -78033 1993999 3292739 2636594 1100175 32 -590765 -764659 -3292
39369 -3292 1394790 1623608 -318671 -2628440 -2680654 -423092 1802834 2406779 1848726
39360 1848726 987517 -76196 -1207089 -1820825 -1814943 -1739345 -1573755 -486798 1611384
39351 1611384 3339336 3410503 2165523 917593 455889 756870 1478053 2073285 1941813
39342 1941813 1085796 286754 238952 857982 1627041 2079262 1795174 684423 -476210
39333 -476210 -663453 -143669 -396737 -1903535 -3045033 -2162852 95642 1649041 1702340
39324 1702340 1379887 1768735 2446987 2259803 917564 -550897 -838179 164758 1051235
39315 1051235 472458 -1063081 -1760947 -1023196 -251869 -666721 -1535466 -1559395 -978819
39306 -978819 -978194 -1715691 -2382082 -2764648 -3276504 -3667423 -3202231 -2125289 -1536029 -1668474
39296 -1668474 -1645497 -1164266 -1029591 -1577907 -1917281 -1401328 -687109 -541330 -616192 -289850
39286 -289850 166444 248172 327085 1028214 1996543 2389841 2321801 2688638 3555711 3781621
39276 3781621 2604993 846895 19229 632485 1830063 2486775 2249785 1514704 772893
39267 772893 264552 124738 431398 900461 871616 34927 -954969 -1075975 -180990 819838
39257 819838 1140874 1019923 1176193 1750461 2167313 1897096 1061480 309157 206336 703361
39247 703361 1215954 1337500 1314082 1532238 1755856 1440677 752199 527841 1011543 1381561
39237 1381561 999575 441338 572283 1104200 996601 123321 -425624 79683 896897
39228 896897 760177 -445766 -1437510 -902956 1102252 3113989 3569223 2252305 453337
39219 453337 -408467 -227057 -47675 -563260 -1234226 -1112463 -158226 712456 798702 382488
39209 382488 158011 191553 -184502 -1395991 -2806399 -3151601 -1857132 234155 1602600
39200 1602600 1475265 375602 -679741 -1230818 -1466942 -1559682 -1354995 -790535 -231054
39191 -231054 -98376 -336761 -527516 -457597 -308058 -310974 -485398 -703474 -729902 -208263
39181 -208263 977424 2208073 2491956 1682601 912746 1242692 2142203 2084231 675072
39172 675072 -661957 -560655 441087 723889 -106503 -759045 -268348 489161 -18560
39163 -18560 -1807432 -3291311 -3307016 -2380798 -1683619 -1441132 -1048766 -436081 -476377 -1767619
39153 -1767619 -3476584 -3914799 -2338601 94945 1447456 1055262 100970 -73783 295223
39144 295223 76847 -646452 -423789 1192057 2391203 1361463 -995700 -2048064 -854928
39135 -854928 876992 1388258 951185 762179 951479 660523 -536244 -2119426 -3199234
39126 -3199234 -3072441 -1599478 473929 1905518 2089342 1549134 1125372 1114990 1343319
39117 1343319 1441710 855891 -640899 -2162817 -2350589 -1204041 -267695 -459720 -895963
39108 -895963 -666108 -460628 -1161473 -1954394 -1485624 -149748 482638 37058 -539958
39099 -539958 -835161 -1175939 -1249493 -454489 383840 -296099 -2088351 -2691041 -1318053
39090 -1318053 14176 -380853 -1366554 -1032306 382898 1318342 1438475 1517494 1562157
39081 1562157 908236 -143460 -477175 63444 473507 281529 180332 666334 1108014
39072 1108014 658564 -567191 -1626117 -1680639 -661663 649473 1195627 662672 -140921
39063 -140921 -268097 200186 438837 128775 -177389 87917 800243 1337019 1143170 205556
39053 205556 -715459 -599073 609519 1584613 1093919 -343744 -1125024 -844513 -890205
39044 -890205 -2375625 -4358078 -4883031 -3373227 -1211708 -64691 -287896 -1061311 -1473207
39035 -1473207 -1135983 -194793 714091 696667 -579918 -2226037 -2865642 -2242087 -1505824
39026 -1505824 -1594656 -2049755 -2035346 -1757536 -1845395 -1906280 -1077205 208414 559850 -121603
39016 -121603 -362766 405661 771969 -278215 -1440778 -995190 521235 1233694 794175
39007 794175 533542 1064006 1504055 1215841 766257 764290 980015 1067234 1127942 1132354 736557
38996 736557 137616 183739 1031948 1500838 535435 -1203394 -2028147 -1326419 -291651
38987 -291651 -433456 -1772079 -2837322 -2428450 -1017406 -26888 59207 79164 555164
38978 555164 719019 -119323 -1155075 -1162096 -369023 -461 -357701 -720826 -876890 -1196615
38968 -1196615 -1271020 -219311 1380837 1682154 305931 -885014 -683159 -421878 -1545812
38959 -1545812 -2885667 -2340263 -280267 930522 443414 -211956 69463 362668 -323327
38950 -323327 -1145797 -742234 556662 1176947 589220 -38789 417613 1527037 1978199
38941 1978199 1320221 435727 256674 520406 226656 -901464 -2041591 -2443998 -2313794
38932 -2313794 -2151057 -1831859 -1018309 -79770 242198 -188 60428 825561 1622606 1650822
38922 1650822 965687 159734 -472585 -981465 -1268047 -1093854 -580687 -278945 -549142
38913 -549142 -1080015 -1253974 -954023 -749166 -1105458 -1601773 -1321021 -84001 1105951
38904 1105951 1116446 -96351 -1637569 -2780627 -3478347 -3909967 -4069894 -3924393 -3570268
38895 -3570268 -3056122 -2339228 -1568786 -1096781 -979488 -761742 -117758 468366 150103
38886 150103 -1064259 -1996548 -1571231 -165771 811775 675946 195461 293493 620809
38877 620809 117021 -1295323 -2437606 -2369143 -1375889 -234288 719739 1316226 1084139
38868 1084139 -145927 -1547417 -1983589 -1260973 -117469 853277 1633493 2278338 2688408
38859 2688408 2933298 3234183 3559919 3686220 3593365 3335966 2727206 1808661 1373961 2058303
38849 2058303 2995611 2604811 960861 42359 947776 2164580 1752935 223509 -293855
38840 -293855 801245 1961073 2001319 1588566 1729277 2153748 2079748 1632978 1490281 1642941
38830 1642941 1478629 861135 295564 63047 -106737 -412582 -612298 -492744 -317983
38821 -317983 -546179 -1275666 -2135753 -2637892 -2551424 -1980987 -1125287 -40388 1200474
38812 1200474 2145235 2134228 1090765 -140155 -647971 -527906 -674579 -1531740 -2502021
38803 -2502021 -2728498 -2064139 -1019550 -65869 629259 904634 510310 -470228 -1330769
38794 -1330769 -1261852 -298721 488893 52877 -1453693 -2853644 -3251191 -2737718 -1783471
38785 -1783471 -590054 586244 1104090 640608 -113486 -189366 428667 1002181 1241134
38776 1241134 1464513 1702980 1631392 1411514 1532609 1686551 1024499 -162496 -462535
38767 -462535 285458 221423 -1679360 -3424162 -2569452 -51403 822716 -985457 -2901695
38758 -2901695 -2496260 -537604 683742 437715 -349549 -940428 -1292089 -1313076 -879638
38749 -879638 -393888 -433729 -972485 -1525174 -1787937 -1644458 -990362 -117056 242098 -95118
38739 -95118 -255487 437205 1254844 1076160 185457 -72805 719488 1549776 1539173 985526
38729 985526 610718 639003 900662 1094998 716107 -493038 -1723925 -1597088 13693
38720 13693 1388749 888541 -1006544 -2279472 -1708096 60993 1640791 2405411 2642866
38711 2642866 2656692 2202006 925122 -884315 -2349965 -2900050 -2770157 -2450487 -2078481
38702 -2078481 -1739638 -1835459 -2465011 -2840046 -2190682 -1008290 -414677 -477694 -324296 133210
38692 133210 46696 -520236 -238338 1229765 2204352 1424364 106293 -6668 520634
38683 520634 -72609 -1528929 -1783629 -335073 867574 451741 -456811 -295859 592359
38674 592359 923994 563465 311984 421953 604418 990744 1901495 2954044 3423901
38665 3423901 3323845 3270912 3440015 3422012 2986205 2304881 1591028 1121837 1300315 1946861
38655 1946861 1893401 291795 -1810643 -2305837 -608906 1553191 2251802 1414911 363532
38646 363532 55303 413230 935349 1298613 1418171 1294240 919656 361340 -52916 89318
38636 89318 644236 789355 31765 -1010659 -1515289 -1767672 -2569465 -3550509 -3391651 -1934311
38626 -1934311 -708957 -774460 -1251179 -834737 306548 1182757 1635722 2128794 2506961
38617 2506961 2226856 1469587 885709 528045 140862 162669 1123873 2204349 1858364
38608 1858364 72666 -1363825 -1244741 -339616 133211 170643 280600 200123 -503319
38599 -503319 -1180469 -697146 835933 1908207 1343171 -415502 -1903334 -2125295 -1309498
38590 -1309498 -401550 17773 188903 467213 508630 -230549 -1281002 -1348839 -64854
38581 -64854 1268746 1296466 330463 -301597 -125734 185110 158327 191705 729911 1487590
38571 1487590 1802724 1399167 628231 168494 468149 1255337 1734239 1551410 1327916
38562 1327916 1778473 2510102 2333770 806517 -1095770 -2001059 -1433867 5703 1321589
38553 1321589 1801044 1377445 591227 78357 12146 116252 104832 -91147 -357560 -360595
38543 -360595 299713 1472183 2212694 1747631 550503 -233315 -386780 -790774 -1835030
38534 -1835030 -2635152 -2377441 -1619625 -1439629 -1846720 -1968715 -1514048 -1058214 -908540
38525 -908540 -656868 -111181 184662 -144374 -527203 -219443 557285 972123 898263 1081918
38515 1081918 1865998 2458250 1926649 487598 -769205 -1258850 -1414055 -1786404 -2220806
38506 -2220806 -2253168 -1956188 -1915084 -2431784 -3128386 -3419577 -3137749 -2572501 -2053422 -1672268
38496 -1672268 -1393852 -1255717 -1278653 -1201430 -583468 591248 1583235 1556532 588239 -346351
38486 -346351 -492233 -49419 353197 484347 510123 550141 654915 968881 1481908 1789242
38476 1789242 1499062 746833 -15999 -513320 -571745 64675 1247880 2044098 1602998
38467 1602998 305627 -707265 -1063873 -1321718 -1580564 -1065089 466568 1913457 2165720
38458 2165720 1496889 839009 333969 -424558 -1157853 -1027075 67786 1233724 1685409
38449 1685409 1329777 267106 -1353516 -2760782 -2813870 -1428749 -87506 -213608 -1431391
38440 -1431391 -2139426 -1581538 -590465 -241558 -493656 -536860 -21917 624039 1009143 1347154
38430 1347154 1951069 2483891 2188899 894121 -612717 -1432167 -1504328 -1424118 -1520198 -1535704
38420 -1535704 -1190441 -633403 -187039 65776 246752 402187 402664 38570 -776012 -1708026
38410 -1708026 -1981224 -1043351 635932 1855370 2001668 1653039 1526162 1331726 364637
38401 364637 -1057903 -1671929 -925163 238270 630540 220664 -199912 -177478 251896
38392 251896 1148858 2541262 3814641 4089565 3349477 2449304 1792898 837322 -604241
38383 -604241 -1412481 -484866 1402131 2195950 1128441 -342084 -572842 149739 305216
38374 305216 -613982 -1554610 -1494501 -608892 390558 1207350 1717006 1497101 446397 -513306
38364 -513306 -303778 821512 1564669 1404572 1113334 1182447 902383 -251032 -1359023
38355 -1359023 -1340910 -765178 -991755 -1900095 -2029550 -982021 -77024 -209705 -582564
38346 -582564 -319406 51679 -179129 -349619 503321 1746664 1817693 487836 -897327
38337 -897327 -1372779 -1293250 -1192498 -882456 -114880 721555 1081745 945479 686679 617094
38327 617094 811594 1052072 912482 245257 -480235 -700381 -472903 -249966 -163319 -35840
38317 -35840 173606 512769 1264896 2327424 2787406 2045775 973950 791366 1072905
38308 1072905 292215 -1649462 -2985028 -2547740 -1240936 -428269 -138191 327686 1046806
38299 1046806 1591012 1713507 1273347 247622 -676859 -447022 877707 1966859 2063112
38290 2063112 1851701 1907879 1663368 808845 281850 654308 914491 290535 -66799 1016746
38280 1016746 2376663 2149490 842178 411782 888356 504417 -961815 -1681933 -1002667
38271 -1002667 -555785 -1255744 -1584147 -216629 1638471 2156992 1614052 1461840 1834756
38262 1834756 1711798 827906 -167047 -962807 -1592634 -1612932 -682502 319408 165386
38253 165386 -789581 -900268 391748 1745694 1894728 1306166 1165971 1522016 1379311
38244 1379311 345453 -693045 -700185 251998 1209945 1560354 1559321 1598347 1441115 639087
38234 639087 -509199 -1018588 -377859 807620 1607670 1861392 2090215 2488063 2513994
38225 2513994 1729732 728476 648662 1577410 2040666 794644 -1213104 -1763599 -317497
38216 -317497 1268482 1514495 1351467 2211406 3415566 3323327 2288511 2231955 3377869
38207 3377869 3676133 1980633 -189386 -913445 -230937 701272 1306994 1410225 736268
38198 736268 -289089 -494986 204732 305259 -750980 -1108318 702858 2963654 3060416
38189 3060416 1585011 1466411 3335626 4549169 3262755 925592 -295070 -420871
38181 -420871 -581849 -731866 -183630 646154 795661 531129 929851 1829965 1714803 -35147
38171 -35147 -1981211 -2365935 -1239555 -104547 101946 -178616 -215000 30006 346671
38162 346671 926281 1831290 2333915 1779069 892592 1045308 2104707 2359497 1106136
38153 1106136 -80970 326149 1464933 1536002 673437 528677 1449762 2108413 2027257
38144 2027257 2444371 3997708 5314729 4980184 3567816 2526197 2110281 1716598 1443832
38135 1443832 1849407 2574776 2651899 2126589 2126052 3155023 4399191 4991195 4987569 4676776
38125 4676776 3835592 2359336 994593 640553 1216844 1907341 2321682 2714315 3157071
38116 3157071 3316758 3229627 3494648 4220462 4427177 3229460 1278598 250306 974441
38107 974441 2735137 4369832 5307990 5427504 4726855 3586290 2785081 2766725 3195488
38098 3195488 3495811 3427629 2949676 2123649 1492937 1879199 3245481 4345629 4189349
38089 4189349 3399847 3366344 4380589 5413977 5588399 5106055 4687013 4670632 4797010
38080 4797010 4568837 3836370 3143332 3196520 3826836 3990391 3136760 2000658 1584759
38071 1584759 1966869 2631042 3264227 3557885 3020153 1897784 1539521 2729769 4267159
38062 4267159 4399722 3156656 1994625 1636234 1691969 2006286 2725669 3193598 2503679
38053 2503679 1268176 1207793 2728165 4418506 5184283 5277396 4925386 3749940 2186432
38044 2186432 1736360 2860144 4081916 4150470 3723551 3909667 4499528 4819655 5114533
38035 5114533 5766120 6154394 5650924 4949692 5108138 5904742 6351102 6259123 6145267 6086883
38025 6086883 5786515 5359663 5071376 4715613 4163063 4022935 4807201 5911037 6382126
38016 6382126 6272513 6296482 6558835 6557435 6143419 5689464 5592476 6141160 7323878 8278842
38006 8278842 7799078 6048337 4759113 4918555 5473664 5391112 5555489 7006938 8599784
37997 8599784 8519228 7255260 6807543 7477257 7820721 7549966 7957747 9220959 9731196
37988 9731196 8815546 7991464 8564096 9764354 10284326 10115591 9845051 9504601 9163055
37979 9163055 9467963 10581303 11563359 11644837 11149314 10532661 9723580 9131587 9883544
37970 9883544 12004671 13690458 13629736 12841031 12852530 13305731 13077636 12722276 13667394
37961 13667394 15499401 16260245 15477418 14866415 15646120 17025258 18027999 19094524 20809394
37952 20809394 22439485 23070661 23245619 24100394 25525344 26607699 27521859 29441765 32518766
37943 32518766 35393057 37127331 38378673 40062996 42062152 44150066 47113034 51677922
37935 51677922 57081511 62155886 67358878 74123862 82431367 90887013 99411511 109862805
37927 109862805 123239519 138170020 153420185 170195835 190200606 212623952 234967253
37920 234967253 255912911 275113170 290495969 298207824 295870095 284433623 266557320
37913 266557320 244723883 221320486 198786940 178491890 160238367 143519055 128509315
37906 128509315 115410638 103763301 93062511 83419577 75148973 68254903 62586470
37899 62586470 57890432 53602488 49343661 45664105 43336449 41814153 39539911 36097973
37891 36097973 32909965 31311912 30974763 30705771 29772927 27948477 25369269 22986200
37883 22986200 22058681 22487515 22692594 21843330 21014117 21203302 21471025 20426679 18659091
37874 18659091 18086236 19248640 20660672 20835269 19874468 18946892 18967272 19930231 21087071
37865 21087071 21713994 21813874 21845848 21918589 21966544 22585848 24441605 26641602 27299160 26421284
37855 26421284 26529647 29174726 32458750 33750744 33453617 33880755 35453701 36710477
37847 36710477 37719701 40551190 45770045 51042846 54476290 57378687 62194529 69148131
37839 69148131 76614830 83907149 91972798 101632820 112559994 124021698 135416458 145696907
37831 145696907 153081722 155932236 153748307 147207506 137591502 126376748 115004880 104498730
37823 104498730 95115480 86535499 78504005 71190004 64884638 59609303 55256047 51909856
37815 51909856 49684396 48341579 47411033 46580314 45649600 44375580 42905713 42089399 42570792
37806 42570792 43731385 44483768 45059102 46815190 50042670 53267901 55337530 57020599
37798 57020599 59739822 63770933 68655868 74448358 81402064 89133189 97271668 106446229
37790 106446229 117529060 130324146 144086355 159036310 176320566 196579402 219252684
37783 219252684 242910400 265424605 284148278 296799779 302113062 299395345 288355409
37776 288355409 270177699 247888334 224512260 201363127 178901554 158236692 140472696
37769 140472696 125384693 112158482 100780616 91383483 83108500 75237653 68589315
37762 68589315 63936311 59879561 54494585 48447824 44006563 41352953 38602150 35361486
37754 35361486 33221538 32283586 30362626 26718093 23616688 22656941 22260489 20714458
37746 20714458 19194989 19401721 20286840 19868069 18744941 18882738 19854162 19290114 16808618
37737 16808618 14730529 14601529 15356662 15523785 15238282 15217863 15333614 15213450 15152909
37728 15152909 15464098 15654025 15073729 13941209 13113732 13139094 13925962 15032123 15869155
37719 15869155 15838528 14745735 13212091 12411955 13018113 14294496 14655892 13577657 12559289
37710 12559289 13345307 15352374 16057380 14260988 11737596 10874251 11732480 12583510 12593596
37701 12593596 12526506 12946513 13113356 12143766 10500561 9735110 10889769 13369093 15434678
37692 15434678 15895192 15225840 14762540 15009074 15388980 15566859 15992380 16828129 17384772
37683 17384772 17240421 17012845 17289949 17662276 17680184 17927735 19077571 20580406 21500730
37674 21500730 22127870 23459843 25429403 27021612 28074101 29598918 32098871 34749960
37666 34749960 36687406 38213386 40265968 43302137 47032569 50781384 53962644 56732465
37658 56732465 60282124 65923224 73731468 82591048 91666369 101289776 112291925 125059084
37650 125059084 139520052 155590559 173280958 192584780 213405559 235290858 256963913
37643 256963913 276170264 290133275 296373869 293537007 281882129 263144081 239964524
37636 239964524 215393033 192289615 172171833 154407293 137359323 120740902 106106551
37629 106106551 94624749 85370302 76683340 68393529 61546249 56425506 52099049 47809273
37621 47809273 43741637 40315865 37499061 34911660 32101611 28868678 25795551 24042461
37613 24042461 23938734 24235674 23566907 22167330 21186018 20784666 20109590 18844246 17518021
37604 17518021 16381141 15165945 13909921 12899930 11940642 10841870 10351392 11171658
37596 11171658 12292745 12047759 10800582 10599505 11871870 12627180 11647952 10245118 9682050
37587 9682050 9069431 7555889 6611342 7751413 9381967 8646478 5789557 3954210 4618860
37578 4618860 5810152 5458308 4252729 4009571 4919703 5848800 6292949 6646811 7086172
37569 7086172 7316760 7186129 6785999 6215061 5795219 6064773 6882760 7020254 5544942
37560 5544942 3356876 2353957 3033486 3877947 3450886 2284767 2051329 3315580 4850971
37551 4850971 5159037 4122088 2920824 2574516 2890618 2947425 2392485 1848301 1898662
37542 1898662 2195008 2164704 2253280 3434685 5361597 6194180 4992415 3281845 3093478
37533 3093478 4134904 4355683 2999613 1412846 669731 192423 -525024 -486395 1158672
37524 1158672 3201314 3745497 2891752 2436586 3122365 3790333 3466453 2828894 2959396
37515 2959396 3666375 3873866 3159820 2227640 2024108 2772571 3822770 4347653 4244562
37506 4244562 4186160 4578305 4836053 4210324 2999517 2157081 1840862 1292529 296892
37497 296892 -184320 700938 2458369 3839461 4222871 3928150 3500386 3157568 2772007
37488 2772007 2066962 974036 582 -12510 1182329 2695663 3217871 2327208 912370
37479 912370 207449 479404 828114 352958 -728171 -1459879 -1453920 -1176713 -904532 -259884
37469 -259884 779793 1272256 539567 -567116 -579075 732210 2270867 3099093 3131663
37460 3131663 2665160 2222484 2628338 4106515 5404445 5025756 3363272 2311653 2570931
37451 2570931 2769775 1813038 696976 976393 2408772 3293844 2663298 1136150 -166903
37442 -166903 -748258 -823929 -869982 -1163816 -1551165 -1675407 -1406387 -838974 -41712 764903
37432 764903 1029274 574625 299399 1220014 2814915 3417612 2482932 1326760 1186359
37423 1186359 1681832 1851689 1663487 1637077 1797523 1906441 2103221 2491354 2637548 2229911
37413 2229911 1691782 1440625 1133354 401504 -261472 -177850 469116 1078469 1592546 2156247
37403 2156247 2337886 1668906 595986 -35168 -131399 -126706 -21120 353079 488330 -176831
37393 -176831 -954767 -484354 1277405 2787355 2921083 2231648 1830614 1957198 2212478
37384 2212478 2438185 2644563 2543428 1880920 1046731 744343 1061745 1373874 1331341 1531100
37374 1531100 2765444 4712289 5935590 5478804 4032221 3029235 2922674 3047177 2952743
37365 2952743 2903444 2954688 2560023 1539548 608929 395205 595780 639294 545428 585015
37355 585015 665766 562621 219635 -514119 -1705507 -2587086 -2061963 -521015 111279
37346 111279 -915213 -1718475 -395637 2045159 3110060 2371929 1593934 1672165 1588695
37337 1588695 625275 -311242 -237505 488180 1013792 1142596 1006115 533684 -180685 -746716
37327 -746716 -1100187 -1502558 -1703886 -1059841 201941 873011 430233 -141294 200700
37318 200700 1151193 1812844 2085563 2434229 2773433 2495072 1485823 451057 135576
37309 135576 517894 819734 276640 -996965 -2004246 -1958081 -1176123 -497741 -94479
37300 -94479 491452 1298260 1732420 1448954 752296 64478 -393632 -463348 -279365 -471896
37290 -471896 -1302069 -1837054 -1094013 168638 213885 -1049767 -1831321 -1267224 -725830
37281 -725830 -1403860 -2274466 -1845856 -695324 -523838 -1421732 -1825088 -940334 343971
37272 343971 1015583 1108057 1092965 1136341 1243271 1384355 1313056 909834 720818 1396033
37262 1396033 2535175 2933881 2219161 1461267 1741716 2717596 3133981 2408762 1206294
37253 1206294 554737 756973 1214142 1165120 505499 -199575 -511480 -672305 -1117716 -1640091
37243 -1640091 -1492573 -394258 944835 1531260 1144308 484299 342168 805607 1322081
37234 1322081 1400184 1075771 695226 475083 441172 610929 949954 1243924 1326106 1376419
37224 1376419 1651284 1954504 1793009 1094578 326393 -192152 -607591 -993075 -1031087 -585383
37214 -585383 -143413 -232504 -689504 -949030 -837483 -665278 -720344 -1092312 -1823498 -2733009
37204 -2733009 -3164026 -2474423 -930312 343904 587379 268533 397437 1184935 1849830
37195 1849830 1773365 1320908 1171905 1229767 839990 4291 -402877 63827 576486 91162
37185 91162 -1156017 -1860789 -1143684 740498 2949513 4646791 5223772 4712254 3998940
37176 3998940 3921293 4093239 3366699 1592838 125698 221426 1570809 2809617 2966557
37167 2966557 2052205 726196 -182743 -187858 446439 1039367 1369141 1786804 2318786 2288978
37157 2288978 1257279 -160471 -945313 -868603 -566060 -577414 -704277 -325964 799391
37148 799391 2047159 2358227 1394338 84147 -414288 -128670 -45473 -577935 -1061397
37139 -1061397 -884764 -309655 117165 249871 145283 -126945 -184790 413318 1269318 1272753
37129 1272753 64636 -1359052 -1944943 -1713220 -1156705 -461832 6031 -542445 -2029805
37120 -2029805 -2747155 -1173691 1765689 3468953 2680198 779161 -79470 665807 1753697
37111 1753697 1754443 608758 -467531 -540788 -108993 -249180 -918314 -1052847 -369468 154732
37101 154732 -21935 -150969 242104 291091 -584575 -1194692 -204715 1627328 2445130 1915599
37091 1915599 1214677 830452 146034 -897728 -1452953 -1293017 -1225063 -1683237 -2155788
37082 -2155788 -2219692 -1961979 -1293707 -151808 565657 -184602 -1598909 -1558801 292683
37073 292683 1759966 1300847 325956 889091 2432684 2632180 785796 -1390034 -2177084
37064 -2177084 -1598853 -649387 -5187 148062 -111207 -381579 -134756 707709 1638991
37055 1638991 2120911 2086970 1914258 2064832 2633825 3084457 2675341 1413008 275322
37046 275322 68488 316204 -125166 -1402575 -2293054 -1773646 -427949 304575 84708
37037 84708 105491 1259635 2584303 2433107 964491 254212 1512579 3328332 3635689
37028 3635689 2539721 1787502 1916322 1696879 608081 76153 1296623 3136901 3560249
37019 3560249 2442498 1591030 2160880 3308269 3642662 3050385 2536896 2770934 3379613
37010 3379613 3643660 3517300 3691868 4610952 5696095 5972446 5474559 5479613 6971372
37001 6971372 9245336 10579693 10178776 8935980 8193309 8187153 8008364 6897766 5227751
36992 5227751 4077340 3977913 4327379 4166321 3352418 2651295 2652697 2986796 2911513 2433726
36982 2433726 2340726 3037938 3859161 3929186 3349776 2854513 2429543 1295311 -351178
36973 -351178 -700086 1428428 4373073 5184404 3301917 1143897 759598 1502234 1748239
36964 1748239 1357906 1156543 1133294 678613 -46430 -347024 -126356 379406 1380159
36955 1380159 2783285 3373944 2306225 864205 977162 2318233 2761930 1588331 237536
36946 237536 -201387 -155360 91338 1012297 2129101 1886809 275399 -488321 786090
36937 786090 2255323 1871476 437081 -83414 196342 -243525 -1440855 -2014270 -1540109
36928 -1540109 -757211 215771 1804451 3330252 3509141 2637862 2280811 2563521 1826133
36919 1826133 -470647 -2467150 -2505395 -1375135 -776479 -854477 -628031 47145 381910
36910 381910 78386 -366490 -589415 -602507 -229116 768591 1955468 2452898 2114590 1774472
36900 1774472 1972926 2034390 1017193 -720948 -1667818 -1011250 291198 758966 266882
36891 266882 -15867 603260 1452546 1548146 800306 -176947 -829729 -826883 -81079 856575
36881 856575 974771 -18512 -1177995 -1575060 -1484846 -1554122 -1410294 -225769 1648878
36872 1648878 2840308 2745113 2071128 1494524 902654 273222 209100 998591 1951136 2310652
36862 2310652 2240628 2319261 2560047 2538450 2138203 1622115 1201403 983247 1126352 1625762
36852 1625762 2099828 2157201 1868656 1599221 1515826 1548843 1725289 2217564 3028386 3826019
36842 3826019 4203508 4110341 3995884 4386417 5217868 5776846 5544123 4915150 4698928 4979929
36832 4979929 4928866 3818890 1868595 -11378 -1005171 -899021 -166196 377962 329669
36823 329669 156842 603698 1690570 2736172 3307243 3527855 3378386 2458792 835887
36814 835887 -522779 -740646 -43487 768099 1479836 2416860 3424318 3667195 2655985
36805 2655985 1002635 -146285 -265664 123982 140030 -422041 -815778 -272984 844668
36796 844668 1224789 155538 -1474842 -2141518 -1414219 -254801 279251 80029 -300885
36787 -300885 -452720 -367924 -230649 -184704 -146678 217543 1070073 1911210 1917264 981195
36777 981195 49554 89765 960518 1628810 1344555 354482 -369360 40915 1441804 2420476
36767 2420476 1541886 -711201 -1974831 -791642 1326326 1810025 450535 -729307
36759 -729307 -781035 -888205 -1656603 -1643712 44977 1641451 1194807 -205713 4131
36750 4131 1871924 2914313 1833733 -59932 -1238942 -1589418 -1323716 -365301 591646
36741 591646 336315 -853615 -1270619 -504209 -169457 -1089345 -1838016 -1270657 -460613
36732 -460613 -631821 -1092825 -948114 -1001861 -1939508 -2358578 -973116 728170 669310 -228058
36722 -228058 383732 2000665 1850907 -493664 -2408463 -2462637 -2220391 -2978239 -3630861
36713 -3630861 -3069321 -2178358 -1904116 -1452483 -69876 1136530 847429 -397681 -1324031
36704 -1324031 -1866751 -2522073 -2951600 -2782596 -2768550 -3557719 -4135278 -3090624 -848046
36695 -848046 847208 1225111 931059 586446 264122 175704 647766 1459726 2133974 2713554
36685 2713554 3410973 3782138 3178946 1817831 555109 -181170 -458559 -168602 806624
36676 806624 1956772 2530068 2442926 2108321 1619126 884583 312916 454369 1063396 1350250
36666 1350250 1134498 978380 1163547 1273983 927576 350809 64452 342890 1014110
36657 1014110 1570538 1602923 1283120 1132929 1223755 1149208 930609 1102142 1515042 1096261
36647 1096261 -465594 -1834168 -1866182 -1374663 -1726252 -2519678 -2342027 -1331499 -1076568
36638 -1076568 -1979182 -2592820 -2002298 -1206816 -1427978 -2396420 -3149289 -3438237 -3473644 -3129910
36628 -3129910 -2259815 -1166853 -84417 1181194 2474070 2908381 2081148 1024225 966117
36619 966117 1559398 1394857 119149 -1057211 -1168795 -841508 -1239188 -2263110 -2619319
36610 -2619319 -1625501 -247109 46353 -888871 -1705320 -1209652 311213 1605980 1898710
36601 1898710 1447875 912495 617260 465958 285663 113753 138580 325446 255890 -350061
36591 -350061 -1056756 -1179468 -832244 -799425 -1178185 -1030273 117736 1317556 1535937
36582 1535937 1164153 1160363 1331095 772638 -309055 -662839 44384 647718 230808 -635715
36572 -635715 -887480 -331475 474390 996692 935219 293699 -332970 -132748 829565 1426951
36562 1426951 830001 -403171 -1060350 -753537 -213179 -286154 -973156 -1428850 -848377
36553 -848377 565398 1653871 1547318 620814 -141330 -367471 -301572 16409 684929
36544 684929 1265504 1185859 780250 876089 1308952 1058626 105268 -177589 921449 2215444
36534 2215444 2299888 1489076 1084426 1464178 1954758 2085638 1920317 1399351 287736
36525 287736 -1244455 -2595603 -3226377 -2845194 -1454369 351719 1548451 1670968 1312834
36516 1312834 1224742 1384539 1414770 1319976 1176007 664165 -333978 -1181188 -1303267 -1064804
36506 -1064804 -1008785 -803515 26871 882445 910610 688871 1530619 3113570 3479824 1893855
36496 1893855 163486 201598 1499252 2217242 1929345 1848728 2612124 3217498 2502645
36487 2502645 815043 -311711 190009 1898440 3370109 3475903 2344572 1035309
36479 1035309 350906 224253 325249 760150 1676545 2510975 2393554 1344990 362073
36470 362073 58557 -126074 -922862 -2026069 -2550200 -2284258 -1702265 -988876 -10755
36461 -10755 779103 506949 -732007 -1671595 -1600319 -1315255 -1610946 -1797303 -835007 807662
36451 807662 1783119 1875473 1919755 1964940 1156035 -419693 -1386111 -1049672 -300732 19104
36441 19104 267559 825064 1165607 1030962 1227880 2155281 2761128 2222718 1486640 1680389
36431 1680389 2149103 1843716 1575930 2609824 3719367 2423559 -789781 -2353602 -607829
36422 -607829 1731285 1619934 -51402 -419292 760491 1176448 -47635 -1189843 -1085021
36413 -1085021 -1028014 -2362127 -3873156 -3267258 -508288 1930397 2143000 866301 89723
36404 89723 547923 1352906 1605481 1414569 1265392 1172780 866324 318367 -383127 -1325157
36394 -1325157 -2380792 -2770972 -1689369 591373 2761519 3728102 3432114 2422780 1166347
36385 1166347 -53705 -1032039 -1710558 -2070584 -1888852 -1014931 75555 618207 623133
36376 623133 870483 1487896 1408397 14040 -1455904 -1347413 -62970 349731 -811475
36367 -811475 -1839274 -1227725 14820 -66452 -1398716 -2129208 -1552434 -996680 -1419059
36358 -1419059 -1800512 -938181 462797 890978 388489 209979 539439 316448 -557871
36349 -557871 -629991 799750 2271783 2132767 799133 -162439 -391072 -775911 -1591418
36340 -1591418 -2044676 -1721797 -1271863 -1326645 -1596425 -1409368 -615369 265846 458470 -422250
36330 -422250 -1714750 -1996563 -685860 954529 1281812 449082 -26732 281792 195710
36321 195710 -812880 -1454166 -654233 542064 445275 -724390 -1240747 -457230 493860
36312 493860 641494 452447 707187 1182551 1221071 938365 978527 1322255 1186842 245671
36302 245671 -718120 -796417 -202114 51887 -387618 -748176 -348576 351821 462107 -21472
36292 -21472 -327807 -121973 185501 285382 284178 82580 -633966 -1468170 -1324436 40919
36282 40919 1290163 1128791 36353 -531263 -160359 386007 743134 1330241 2000141
36273 2000141 1617656 -286227 -2338150 -2771954 -1607657 -402363 12016 436869 1617751
36264 1617751 2683563 2264070 699689 -131396 600372 1440131 730492 -1010388 -1951089
36255 -1951089 -1609950 -1168561 -1188640 -657947 1077139 2802117 2915673 1566702 279904
36246 279904 51783 751836 1829404 2597557 2312223 1042691 31937 86244 132133
36237 132133 -1200243 -2977381 -2822865 -479918 1510236 1408599 658689 1375003 3001798
36228 3001798 3291808 1774628 344072 524747 1725475 2436748 1982137 754171 -399922
36219 -399922 -698990 17743 1026036 1457082 1264162 930117 455769 -528280 -1755133
36210 -1755133 -2402814 -2265917 -1913707 -1591756 -1027497 -504107 -845986 -1854295 -2111413
36201 -2111413 -1166327 -556899 -1403626 -2212141 -861698 1952657 3348013 2231632 621222
36192 621222 570350 1633133 2239281 1994273 1401161 498055 -836034 -1989400 -2350721
36183 -2350721 -2388380 -2783550 -3041582 -2359481 -1447010 -1789583 -3099961 -3297621 -1541962
36174 -1541962 370693 589010 -223674 -244170 609205 797128 -240450 -1286102 -1295673
36165 -1295673 -729079 -461711 -521693 -601847 -941085 -1844455 -2877733 -3353833 -3268827 -3027327
36155 -3027327 -2567099 -1582466 -432487 66486 -221693 -646372 -881870 -1255342 -1737978
36146 -1737978 -1591361 -553433 484155 689458 432271 405751 372178 -110454 -338032
36137 -338032 704962 2377866 2827570 1623651 461004 679684 1439437 1220933 38338
36128 38338 -877202 -792202 137848 1507161 2661503 2650101 1275661 -216796 -530659
36119 -530659 -15623 42312 -624788 -1227312 -1444937 -1550237 -1165211 470746 2733485
36110 2733485 3692954 2595072 973985 557686 1215005 1806362 1977429 2038389 1896066
36101 1896066 1286166 562019 190333 -157311 -1012267 -1942387 -2029610 -1324989 -750800 -571758
36091 -571758 -75490 969986 1574678 824705 -776439 -1919674 -2012766 -1463733 -747014
36082 -747014 53904 741254 780615 32243 -712732 -542130 328807 745433 166072 -636012
36072 -636012 -783259 -529614 -587825 -753721 -235377 794572 1093549 40901 -1496976
36063 -1496976 -2373742 -2420206 -2063814 -1518792 -980029 -928758 -1498128 -2037560 -2025606 -1952359
36053 -1952359 -2497307 -3211633 -2979839 -1716584 -685528 -876525 -1700588 -1699717 -291683
36044 -291683 1516244 2199423 1399466 279520 -29778 25706 -841080 -2600941 -3579297
36035 -3579297 -2685886 -929607 48934 69539 52497 305005 417312 477914 1081748 2145918
36025 2145918 2823189 2692186 2099522 1285756 185996 -742583 -551020 903311 2481282
36016 2481282 3041897 2602195 1886142 1340442 999810 782535 449168 -357694 -1604129
36007 -1604129 -2618443 -2680526 -1780838 -683630 -298778 -879898 -1667046 -1541530 -292893
35998 -292893 1104159 1817481 2197629 2837440 3235262 2513774 1103350 354146 497157
35989 497157 391396 -466948 -1116374 -839321 -346123 -444716 -690067 -343875 256682 351564
35979 351564 49981 -87862 -164744 -562707 -907020 -535139 244858 421539 -243607 -892808
35969 -892808 -760975 20135 842098 1266582 1214095 895157 494727 -232542 -1620395 -3112822
35959 -3112822 -3416374 -2241974 -1074330 -1286504 -2228548 -2339105 -1496783 -834226 -657572
35950 -657572 -207987 618093 1037275 1053188 1638904 2793024 3125739 2141319 1297336 1721267
35940 1721267 2358180 1771550 561967 358682 1251608 1949646 2000321 2127349 2510451
35931 2510451 2358472 1369771 268371 -374254 -721282 -887105 -671187 -256600 -77968
35922 -77968 173301 1227560 2711388 3281275 2676590 2211668 2590564 2723659 1681921
35913 1681921 379388 -36771 -239745 -1512673 -3376272 -4235288 -3849029 -3312501 -2880343
35904 -2880343 -1767643 -160910 556018 34864 -375610 132671 609245 240780 -141695
35895 -141695 362731 1032138 836165 335829 657812 1358014 1054268 -184374 -794328
35886 -794328 -67055 989656 1379912 1342708 1403133 1388787 1051637 782454 972637 1256287
35876 1256287 1072537 599428 499255 919480 1288245 1125740 688587 614387 1024099 1233602
35866 1233602 604944 -429338 -703174 142131 1049753 983438 461354 857175 2372982
35857 2372982 3563794 3029140 998420 -934736 -1291630 64247 1783701 2182190 912480
35848 912480 -676917 -1223186 -959390 -959256 -1238277 -749044 778213 2195920 2481456 1938040
35838 1938040 1409036 1152969 1035141 1089551 1256666 1123236 540638 91534 404428 1325477
35828 1325477 2189220 2571914 2409509 1761592 893532 297392 249226 557941 942833 1289942
35818 1289942 1344587 672016 -690144 -1923281 -2130929 -1101167 716425 2496730 3238787
35809 3238787 2480250 1139192 799613 1657318 2075490 904291 -708317 -920804 156429
35800 156429 847582 532270 241946 553247 542298 -482066 -1522468 -1224133 146894
35791 146894 1136991 1041027 355129 -430589 -1336431 -2093575 -1964430 -899653 -55644 -427521
35781 -427521 -1522417 -2202575 -2400165 -2916244 -3640170 -3248149 -1118842 1487777 2879836
35772 2879836 2806799 2149002 1449701 678807 -79822 -714456 -1486809 -2383271 -2493268 -1187963
35762 -1187963 437828 687492 -313602 -839599 -293660 -27493 -962178 -2075427 -2156044
35753 -2156044 -1605741 -1351956 -1203238 -615077 -85801 -295282 -578728 134219 1261677
35744 1261677 1123099 -428348 -1495279 -723328 829576 1157778 -130223 -1538249 -1666799
35735 -1666799 -750500 -86933 -369875 -1041192 -1304885 -1219155 -1270879 -1278659 -627843 459962
35725 459962 933433 437430 -196497 -406254 -747705 -1601676 -2121644 -1490429 -354655
35716 -354655 181118 325940 1056491 2226849 2629502 1875238 926219 568237 452081
35707 452081 34561 -389815 -150690 734584 1410040 1067748 -78220 -794384 -140320
35698 -140320 1212176 1621666 685914 -43941 819384 2477230 3001837 1893284 529501
35689 529501 285382 1137254 2102461 2336936 1745717 924406 435828 60461 -737649 -1557005
35679 -1557005 -1307986 -146725 103344 -1609291 -3817356 -4370244 -3041069 -1112346 587209
35670 587209 1810511 2101122 1576210 1604597 2845608 3480130 1601369 -1295964 -1817324
35661 -1817324 479521 2423972 1812469 59033 -602007 -214438 -57416 -309433 -282371
35652 -282371 142790 573439 866941 1023285 976938 930929 1119733 1058865 43979 -1492771
35642 -1492771 -2314845 -2154750 -1839478 -1643748 -1098994 -502318 -768375 -1519731 -1306350
35633 -1306350 -159398 168193 -882844 -1722217 -1373408 -893016 -977502 -535735 947856
35624 947856 1927680 1333471 424093 342442 49999 -1254662 -1925968 -577298 1065235
35615 1065235 852372 -66327 629658 2133747 1905546 312711 67703 1458392 1980565
35606 1980565 868358 241618 1064414 1501311 434671 -603551 -441275 -260569 -928211
35597 -928211 -1086289 116242 879795 -326451 -1798196 -1172524 622586 812408 -816391
35588 -816391 -1779140 -816447 637532 1052636 644105 184905 -162524 -258631 204726 706298
35578 706298 99688 -1549146 -2656924 -2393744 -1924354 -2377519 -2867749 -2017479 -510501
35569 -510501 -256052 -1341657 -1803958 -710300 448044 271274 -375891 -89570 554225
35560 554225 67102 -1202558 -1529009 -796831 -815531 -2250236 -3333066 -2625775 -1328256
35551 -1328256 -1419318 -2706340 -3288098 -2297223 -770263 -63528 -508329 -1531861 -2333171
35542 -2333171 -2519335 -2458253 -2665690 -2736335 -1784441 -238582 131556 -1252928 -2634044
35533 -2634044 -2488414 -1858289 -2461305 -3631661 -3240838 -1054187 974219 1572507 1302640
35524 1302640 809334 -64688 -998584 -852151 620770 2058208 2231372 1468859 737590
35515 737590 225636 -506136 -1569620 -2478566 -2618203 -1949721 -1388434 -1954504 -3138257
35506 -3138257 -3039411 -1000284 1007158 992376 -161130 -288788 520051 399449 -776200
35497 -776200 -1116070 -110711 421828 -517912 -1477201 -1064707 33922 636482 757183
35488 757183 657694 10695 -915667 -948231 94828 884739 856526 1108953 2062038 2350905
35478 2350905 1319309 415392 566551 407872 -1013630 -2018698 -1078131 221793 -356227
35469 -356227 -1984286 -2362729 -1580694 -1327538 -1401540 -315865 1290832 1242752 -334293
35460 -334293 -989620 64045 984591 696651 287037 376543 -50076 -1282736 -1974333
35451 -1974333 -1616179 -1488380 -2094524 -2087603 -941698 -230778 -802149 -1103860 -83736
35442 -83736 585296 -656875 -2250549 -1863788 -129403 657498 351556 587893 1342152
35433 1342152 880799 -894188 -1866120 -991649 232104 404334 240462 832930 1576321
35424 1576321 1223028 -57289 -975535 -869449 -131030 660979 1157470 1114360 653319
35415 653319 476956 1120830 2030148 2026755 864310 -199362 185926 1681925 2478828
35406 2478828 1529000 12653 -142489 1079131 1728024 731430 -515038 -298937 781392
35397 781392 813859 -436962 -1315124 -1002087 -651230 -1283279 -2154454 -2164813 -1643509 -1561419
35387 -1561419 -1840526 -1691937 -1111592 -850519 -1141500 -1474443 -1513195 -1354384 -963089 -167462
35377 -167462 802464 1447522 1606763 1374395 690902 -287256 -792543 -355657 212771 -136711
35367 -136711 -930412 -814342 131232 374563 -474321 -854808 151502 1131118 529471
35358 529471 -887474 -1360312 -825961 -455920 -287642 586417 1708918 1298947 -979318
35349 -979318 -3085425 -3206213 -1944846 -1100044 -1348491 -2023368 -2399588 -2305793 -1885995
35340 -1885995 -1400550 -1036203 -647520 -14735 634599 940423 1168439 1795300 2355240
35331 2355240 1827739 376012 -555108 -294356 215955 209030 234949 582535 138510 -1657664
35321 -1657664 -2993707 -1779370 1132337 2810528 2058888 463921 -321627 -381865 -273746
35312 -273746 154563 848225 919064 -62094 -1187427 -1489294 -1184166 -876178 -505188 -18117
35302 -18117 -142151 -1277217 -2274118 -1650476 268490 1658945 1544902 667531 -18031
35293 -18031 -482718 -905597 -933013 -352688 244609 232102 -101844 -58923 373852 620037
35283 620037 441775 69586 -412233 -1051208 -1487286 -1288596 -901507 -1310266 -2439253
35274 -2439253 -2910825 -2017105 -936165 -989207 -1542899 -1058441 285731 782663 50757
35265 50757 -197699 1023875 2087980 1050729 -1320983 -2492420 -1587305 -200131 162498
35256 162498 -123897 -11778 465121 466282 -295437 -1211731 -1526394 -972106 127332 1074763
35246 1074763 1318946 1002223 796733 1007709 1118189 548879 -330996 -454312 537107
35237 537107 1541230 1134887 -586729 -1894517 -1458522 53659 1039994 1132960 1226372
35228 1226372 1506254 939837 -750681 -2023125 -1534652 -206241 78497 -847041 -1501192
35219 -1501192 -1055803 -13682 1213880 2729315 3994209 3907712 2548541 1399856 1215983
35210 1215983 1034099 49198 -937515 -982725 -622986 -719011 -771126 38782 939060 516024
35200 516024 -818382 -1191181 -147238 678489 243946 -256260 598392 2107744 2410545
35191 2410545 1080260 -488045 -1037281 -770648 -669134 -1189139 -1798695 -1505892 60056
35182 60056 1875078 2211432 567566 -1481869 -2027997 -1117535 -465498 -1039841 -1988445
35173 -1988445 -2177017 -1713933 -1317398 -1021049 -417842 317105 631675 610700 835646 1248486
35163 1248486 1105009 282156 -252897 260502 1327221 2036248 2357027 2818554 3269268
35154 3269268 2918982 1669002 535949 348861 619990 297617 -665472 -1204839 -703679
35145 -703679 -38488 -549513 -2191926 -3358042 -2756025 -991269 170963 -139074 -1130614
35136 -1130614 -1590147 -1275379 -846831 -878837 -1322244 -1703994 -1517575 -577679 677957
35127 677957 1320218 701654 -815685 -2075619 -2158380 -1155064 75249 833678 1182422
35118 1182422 1584671 2077607 2126817 1452870 665137 663575 1549451 2552637 2976757 2781912
35108 2781912 2262380 1654352 1164672 930604 769156 302892 -526705 -1328018 -1668930
35099 -1668930 -1397033 -723523 -315923 -929313 -2316561 -2920185 -1628113 431456 1088972
35090 1088972 54433 -851970 -598276 -294374 -873925 -1194945 110939 2205331 3180161
35081 3180161 2814900 2469079 2682053 2582761 1615642 384580 -362991 -458188 54093 1008927
35071 1008927 1831975 2024312 1850544 1796367 1719180 1447292 1653929 2877690 4154982
35062 4154982 4108035 3057924 2449526 2446976 1952706 938722 654186 1222452 1221201 304193
35052 304193 10282 897001 1075638 -778865 -2853771 -2686471 -838793 154724 -399493
35043 -399493 -926515 -564140 -262102 -748167 -1414522 -1735446 -2106304 -2581332 -2225046 -639024
35033 -639024 953995 1149141 156056 -736162 -908082 -712721 -461770 -127264 69303
35024 69303 -247944 -781244 -715996 -61248 2442 -1241875 -2755058 -3011180 -2108924 -1468780
35014 -1468780 -1621732 -1710630 -1401070 -1677527 -2915490 -3653436 -2643090 -972520 -481764
35005 -481764 -900763 -488054 972459 1967046 2002345 2307167 3301383 3520415 2056970
34996 2056970 261999 -244475 183039 245399 -272739 -827964 -1350262 -1720823 -1002255
34987 -1002255 1188800 3206650 2950952 649503 -1385675 -1647646 -745871 118758 623615
34978 623615 966203 1109192 894867 345608 -444252 -1358968 -2138147 -2524695 -2508003 -2205583
34968 -2205583 -1707013 -1228168 -1050937 -1074259 -885228 -487945 -330204 -369147 13999 745043
34958 745043 734830 -483249 -1828897 -2258743 -2191581 -2236646 -1643780 362498 2499553
34949 2499553 2583103 546721 -1424908 -1839621 -1425316 -1483245 -2108709 -2510449 -2105412
34940 -2105412 -945212 235844 393848 -640007 -1588854 -1308292 -551182 -842884 -1897002
34931 -1897002 -1844569 -139215 1542795 1804706 1276979 1086001 1081906 664511 173715 227564
34921 227564 499014 315939 -116088 -183995 -130238 -766787 -2072489 -2970544 -2578386 -1134643
34911 -1134643 329548 896565 457321 -213609 -252009 242325 293101 -561511 -1433677 -1120679
34901 -1120679 340417 1684061 1835774 866666 -366921 -1057959 -880502 -33591 882314
34892 882314 1249838 1007186 808853 1325057 2320527 2809873 2373395 1839487 2084992 2617857
34882 2617857 2357518 1610108 1863843 3309082 4076751 2830104 808430 51836 646443
34873 646443 1221857 1404543 2071863 3506541 4899958 5619729 5619209 4724583 2895528 1098223
34863 1098223 498417 782026 636099 -160571 -615085 -475314 -642016 -1383149 -1762103
34854 -1762103 -1276230 -591728 -224641 78732 287989 -41712 -448613 206759 1645943
34845 1645943 2065253 844646 -438242 -596196 -551887 -1277194 -1876883 -1315563 -459538
34836 -459538 -574075 -1054330 -581430 396857 282608 -1123594 -2388500 -2405196 -1234974
34827 -1234974 517484 1923662 1972720 878502 392977 1449055 2410584 1358694 -768081
34818 -768081 -1413875 -227762 684010 238354 -259857 330308 1209534 1261012 740768 377392
34808 377392 139179 -125622 76580 1014316 1910039 1905849 1284707 970766 1235853 1534725
34798 1534725 1332708 604936 -302873 -974396 -1168200 -903263 -310343 413626 828628
34789 828628 525478 -86689 92810 1324615 2312863 1927931 984638 1052972 1962387 2050633
34779 2050633 857458 -50201 620514 2112110 2817904 2259875 1178738 390358 181055
34770 181055 335790 319350 -190400 -759219 -640184 191122 1016720 1380335 1419450 1208882
34760 1208882 601395 -157884 -446588 -58796 677036 1547421 2440771 2812637 2188478
34751 2188478 1199976 1022098 1707365 2225344 2205289 2294494 2646643 2640405 2486626 3358021
34741 3358021 5179641 6095522 5258376 4382076 4967067 5629443 4314363 1984061 1546078
34732 1546078 3515906 5283702 4948364 3576843 2907724 2839805 2440561 1902221 1939299
34723 1939299 2177522 1726390 932697 1088138 2387014 3436922 3114970 1921134 1021025
34714 1021025 741457 629280 416452 212458 80070 77294 451932 1151596 1467024 988214
34704 988214 611948 1466483 2919910 3068128 1516198 151231 402927 1252011 1159115
34695 1159115 572413 821526 1560770 1356305 282161 -186198 254752 351161 -318240
34686 -318240 -586788 138987 824261 684905 475293 979434 1637614 1649651 1227858 834667
34676 834667 312976 -339102 -440982 223631 785433 663210 475917 738491 821435 195062
34666 195062 -422880 -250804 229959 177185 -323268 -783529 -1099106 -1000690 9079 1327528
34656 1327528 1416932 303378 34800 1302359 1811503 18677 -1773556 -864024 1184281
34647 1184281 753442 -2188629 -4334127 -4225972 -3340700 -2188797 512169 4136101 5662587
34638 5662587 4307067 3104106 4150405 5539492 5072859 3904423 3905979 4081440 2632198
34629 2632198 591680 260932 1411066 2059824 1993495 2528657 3485462 3438325 2689395
34620 2689395 2971132 4022839 3448515 771385 -1081857 214194 2955183 3770118 2104129
34611 2104129 469393 772443 2134063 2620457 1930147 1545602 2599544 4455166 5717974
34602 5717974 6024408 6034751 5967959 5316753 4200452 3743286 4468595 5396309 5541140 5294344
34592 5294344 5388950 5549409 5360779 5472442 6416339 6992076 5589205 2778892 910697
34583 910697 1204321 2706735 4032226 4623760 4290625 3054538 1697029 1149529 1201111
34574 1201111 1061353 1095686 2371070 4384225 5100292 3771082 2019476 1465026 1892648
34565 1892648 2498919 3219388 3786979 3157163 1271792 17152 877056 2711979 3408480
34556 3408480 2774704 2166699 2077433 1942498 1838372 2465563 3547488 3978837 3644128
34547 3644128 3476771 3553877 2826558 1199825 210497 775036 1690428 1538372 937366
34538 937366 1398438 2579584 2394967 6380 -2692487 -3256696 -1528684 477953 1080609
34529 1080609 464932 -218432 -452038 -599130 -992822 -1387168 -1346180 -828761 -252643 -85799
34519 -85799 -388747 -737911 -743400 -653512 -1067973 -1869590 -2007735 -900872 421496 416699
34509 416699 -971200 -2328783 -2666345 -2224133 -1353035 100213 1808593 2602044 1957791
34500 1957791 948486 790307 1215503 1251723 863577 617135 282060 -794595 -2093537
34491 -2093537 -2139692 -549585 1295957 1966429 1383567 198914 -1127055 -2017457 -1596896
34482 -1596896 136376 1554767 1006645 -941527 -1977180 -990423 490589 494711 -581535
34473 -581535 -561704 1327368 3276902 3432651 2400665 2131661 3117293 4130024 4401095
34464 4401095 4455211 4651103 4468335 3768149 3342838 3462515 3187795 2064530 1261881
34455 1261881 1856231 3070413 3539377 3355114 3376507 3387452 2667223 1741270 1672122 2001634
34445 2001634 1397863 191152 113593 1317502 1881747 932810 115678 858958 2063453
34436 2063453 1998009 1032095 790134 1548022 2118604 1768655 808995 -354760 -1475410
34427 -1475410 -2017694 -1615288 -827340 -451935 -286942 421516 1482536 1842357 1219906
34418 1219906 596184 781114 1360407 1485733 1066381 709788 887121 1559999 2366323
34409 2366323 2809853 2400467 986615 -883913 -2071098 -1647563 127552 1775180 1942131
34400 1942131 826592 -110882 93606 898218 1129971 338146 -992380 -2087898 -2403245
34391 -2403245 -1928644 -1340123 -1438229 -2092541 -2198949 -1098270 425391 1073889 595708
34382 595708 -78862 59372 1295127 3088966 4294076 3912394 2216914 710452 368759
34373 368759 444460 -177793 -997485 -513639 1317140 2613370 1969291 239093 -726857
34364 -726857 -324322 596412 1193543 1386178 1334670 1049949 699972 658806 904805 839254
34354 839254 181158 -292825 398103 1879070 2536233 1579357 271382 374468 1843244
34345 1843244 2980177 2678213 1524790 660387 533121 989670 1646496 1839473 1111748
34336 1111748 131539 186930 1327820 2065023 1538708 836870 1227383 2187218 2462927
34327 2462927 2184434 2358487 2810675 2339889 816773 -454402 -638264 -244252 148484
34318 148484 664206 1170344 883243 -242775 -750061 657081 3200567 4705068 4019142
34309 4019142 2107135 779339 853075 1700960 2299734 2358872 2236846 1996526 1177861
34300 1177861 -271548 -1505852 -1800805 -1573847 -1683277 -2106913 -2122291 -1484684 -535028
34291 -535028 600014 1873661 2518059 1602071 -370891 -1525515 -783252 831352 1565663
34282 1565663 994058 164224 98725 681879 1032472 804001 850298 2076003 3640241
34273 3640241 3440692 1081315 -931822 -401060 1260372 1048636 -977640 -1778741 -195289
34264 -195289 1238247 438804 -998245 -635338 898517 1271110 284467 -294850 -13626
34255 -13626 -204012 -1221495 -1595253 -470930 971906 1307907 662047 -48131 -521169
34246 -521169 -911964 -1150151 -1244112 -1620923 -2346120 -2450625 -939474 1577281 3072180
34237 3072180 2335345 607956 305741 2028329 3597498 2733022 107339 -1452033 -664375
34228 -664375 810205 1092778 551501 439078 526071 -146421 -1044401 -719827 662489
34219 662489 1390131 941647 689990 1326537 1525226 291908 -984547 -451714 1254609
34210 1254609 1783563 412179 -1119483 -1272882 -668213 -714298 -1451116 -1828037 -1544905
34201 -1544905 -1413326 -1852790 -2071952 -1273527 8204 557464 169668 -172904 136196
34192 136196 468708 84825 -609055 -664975 -83954 131263 -573183 -1488853 -1557116 -679749
34182 -679749 242104 449826 191600 302502 1069773 1887846 2200044 2300666 2633427 2701469
34172 2701469 1705038 230465 -2491 1399278 2553547 1817541 229389 56423 1551745
34163 1551745 2784995 2561609 1853838 1929084 2464852 2339088 1369181 356182 -132269
34154 -132269 -260450 -385123 -563045 -618448 -472291 -372139 -725079 -1540149 -2199018 -2116129
34144 -2116129 -1485062 -948232 -666957 -262153 371736 801623 726870 443713 486418 1090326
34134 1090326 1991950 2511037 2072522 1037257 632130 1430051 2296042 1724003 -51297
34125 -51297 -1334172 -1269370 -701483 -595779 -785481 -703995 -341742 56782 423549 532164
34115 532164 25023 -794236 -1005841 -356898 316117 376007 190417 166523 20137 -303401
34105 -303401 -52005 1019968 1689075 789825 -961596 -1882735 -1591136 -1127721 -1097597
34096 -1097597 -939798 -112438 978244 1441717 722361 -997102 -2702814 -3095812 -1825647
34087 -1825647 35468 1205520 1426788 1006627 -42041 -1443592 -2030703 -1048262 356910
34078 356910 398868 -855287 -1772480 -1758639 -1788349 -2153970 -1653219 191060 1827016 1791907
34068 1791907 837189 623275 1298482 1795089 1816372 2005067 2447062 2443749 1814829 1243741
34058 1243741 1128666 1054413 658340 194400 -63422 -261100 -468420 -378235 96384 467575
34048 467575 378341 209451 446843 809410 662434 80783 -288486 -426359 -1070934 -2252437
34038 -2252437 -2640387 -1279284 644028 1048087 -204938 -1165089 -712556 27331 11523
34029 11523 329430 2258475 4483361 4533097 2586350 1441139 2418262 3640837 3249812
34020 3249812 2108341 1811038 1865930 899923 -592152 -1014509 -561683 -995166 -2559509
34011 -2559509 -3340752 -2201967 -437856 347427 405774 782877 1368217 1342188 768559
34002 768559 422001 453285 401228 308217 707321 1476504 1688815 861814 -347994 -975788
33992 -975788 -750753 -47916 678403 1150046 1346493 1585264 2174422 2762568 2476952 1112525
33982 1112525 -214105 -236897 789584 1334593 639276 -236352 90912 1364961 2029399
33973 2029399 1332294 213038 -109955 304124 450598 -200043 -1180186 -1739630 -1615572
33964 -1615572 -1114316 -713576 -571753 -322361 480375 1640154 2394896 2388227 2080849 1845293
33954 1845293 1239152 -143995 -1570661 -1874446 -1102892 -419635 -266475 256165 1673774
33945 1673774 2813541 2173349 132590 -1266455 -795814 529599 869584 -133935 -1094715
33936 -1094715 -855289 -47529 -165766 -1391224 -2208184 -1466544 -7764 515594 -113267
33927 -113267 -648484 -385322 758 -186412 -593677 -628306 -404140 -197917 250665 1058354
33917 1058354 1435175 606101 -808278 -1329610 -530108 437608 369434 -618830 -1520871
33908 -1520871 -1727559 -1501376 -1386640 -1484201 -1398130 -842450 -124207 208040 109811 31202
33898 31202 136816 71080 -318422 -635220 -656336 -752057 -1050567 -827006 480951 2091170
33888 2091170 2599351 1670276 236519 -756034 -997242 -488319 431976 862304 209223
33879 209223 -722906 -648655 132428 -25606 -1427411 -2147924 -788507 1272709 1867300
33870 1867300 1274623 1563861 3065163 3637752 1985981 -151067 -369473 1058901 1796385
33861 1796385 838351 -373311 -349760 465363 831189 670821 765882 1120340 944333 215343
33851 215343 20451 909708 1852068 1554931 243759 -695704 -592274 -163894 -227544 -476616
33841 -476616 -40589 1070607 1740524 1176794 119116 20531 1076601 1845775 1250442
33832 1250442 223374 481696 2095050 3400529 3251746 2168616 1096552 285074 -143231
33823 -143231 241513 1244755 1701974 983320 27906 -5877 672554 1155194 1243974 1134864
33813 1134864 530849 -666082 -1461833 -919254 353986 1204432 1796705 2918511 3990838
33804 3990838 3684839 2343726 1789494 2499419 2875177 1845022 472665 188938 796678
33795 796678 1078459 409802 -815323 -1540907 -636631 1824799 3830716 3304587 836527
33786 836527 -956491 -928782 -474875 -779561 -1093329 -589893 44102 69565 53601 533485
33776 533485 872696 660349 686352 1255280 1157025 -266995 -1685598 -1974692 -2134887 -3183443
33766 -3183443 -3888641 -2894071 -1581567 -2144334 -3874276 -4174566 -2632797 -1297661 -1191246
33757 -1191246 -1265919 -858575 -608481 -639349 -142266 853085 1367755 1394715 1872788 2564861
33747 2564861 2177674 876829 346294 889278 881923 -248754 -1020249 -771563 -945244
33738 -945244 -2176708 -2637019 -1082102 671341 461890 -836084 -955385 177769 932390
33729 932390 1004100 1422548 2041451 1451605 -558811 -2433197 -2951945 -2356030 -1299574
33720 -1299574 -205746 219952 -597961 -1792041 -1536040 561233 2635629 2807322 1416535
33711 1416535 326181 553008 1319179 1287835 172625 -1079079 -1517122 -1233631 -914041
33702 -914041 -689388 -183320 344638 -26397 -1323777 -2172877 -1673175 -856446 -1164616
33693 -1164616 -2216706 -2451285 -1534183 -621268 -354129 -133013 419101 741760 555274
33684 555274 441453 533884 -77354 -1651540 -2663155 -1743209 20420 385596 -718917
33675 -718917 -1015079 590294 2111582 1354027 -624575 -784039 1568860 3700459 3166265
33666 3166265 895523 -566402 -627005 -780288 -1722602 -2254193 -1439208 -287937 -263860
33657 -263860 -1027703 -893002 730246 2446267 2676542 1580643 601218 457804 382003
33648 382003 -458185 -1512569 -1602435 -787726 -392602 -988407 -1495463 -932667 -10596 64102
33638 64102 -430561 -259995 736116 1535725 1628396 1410648 968224 -47204 -1186777 -1356877
33628 -1356877 -558522 -44523 -312393 -443109 -18811 -32548 -900499 -1185569 226675
33619 226675 1938657 1779449 -50707 -1372962 -1200850 -764439 -1292925 -2311344 -2610089
33610 -2610089 -1836042 -590429 366177 585427 72969 -719581 -1274812 -1462355 -1433232
33601 -1433232 -1198405 -623337 251512 1146019 1714438 1696447 1159607 639679 588816 625086
33591 625086 5234 -991258 -1077283 153549 1308085 980079 -331632 -1082799 -851192
33582 -851192 -523866 -688073 -983217 -966729 -641271 -96097 566359 942418 705240 264644
33572 264644 348057 926176 1244933 962356 572004 541019 591541 112880 -972228 -1912329
33562 -1912329 -1721880 -290240 1114671 1005652 -449637 -1403783 -592703 1133620 2144518
33553 2144518 2074132 1667531 1348484 1088067 1158113 1731619 2034868 1205978 -116307 -367734
33543 -367734 716073 1710154 1536646 666966 -47436 -533640 -928999 -946433 -570650 -524805
33533 -524805 -1193346 -1748792 -1268962 -241370 50703 -598878 -1145466 -1089578 -1327315 -2572311
33523 -2572311 -3762905 -3153939 -793420 1240136 1361897 209563 -756669 -1349261 -2197818
33514 -2197818 -2904978 -2262987 -324178 1191703 977733 -443010 -1736680 -2187571 -1781889
33505 -1781889 -909291 -363823 -646629 -983470 -150485 1515490 2328510 1782011 1197631
33496 1197631 1323091 1211108 407853 219918 1421273 2603584 2474106 2003743 2391890
33487 2391890 2632688 1342793 -508363 -1136534 -898985 -1162852 -1445837 -478144 924917
33478 924917 1046673 472344 946289 1779825 935618 -750807 -362020 1980929 2878532
33469 2878532 1220380 -122161 580603 1180087 -77020 -1386794 -970347 -368802 -1259498
33460 -1259498 -2010545 -689670 1030759 546637 -1091380 -1015956 436626 391942 -1603033
33451 -1603033 -3005066 -2559083 -1783090 -1855472 -2028937 -1769224 -1850603 -2508460 -2715480 -2108012
33441 -2108012 -1674084 -1763649 -1321130 -11609 672409 -394589 -2083290 -2556029 -1647368
33432 -1647368 -536727 105704 443090 487636 -8926 -782889 -1098236 -722357 -281349
33423 -281349 -383793 -716831 -386897 817980 1853198 1489497 -123960 -1462645 -1323283
33414 -1323283 -61357 1054286 1245021 719775 216005 320266 885127 1035102 253481
33405 253481 -608865 -273305 978182 1428784 375978 -867716 -1085713 -894949 -1318295
33396 -1318295 -1855880 -1385048 -114844 812020 1066070 1117010 1009117 537800 205128
33387 205128 561571 906288 112264 -1414542 -2090057 -1508016 -1005413 -1595014 -2580743
33378 -2580743 -2679753 -1586407 -23039 1048590 1019192 78756 -771380 -700742 -38494
33369 -38494 268517 8266 -196611 17428 368431 592528 738270 789961 637192 370031
33359 370031 48460 -615460 -1716630 -2574439 -2439438 -1587229 -988714 -1061932 -1388940 -1429896
33349 -1429896 -924384 61807 902757 725302 -414188 -1311629 -1255874 -1008302 -1274957
33340 -1274957 -1343176 -552032 56600 -630728 -1479595 -634987 1210605 1536737 -117199
33331 -117199 -1468294 -1015900 120790 530060 457663 518907 417347 -21782 -230100 -233722
33321 -233722 -934477 -2174448 -2367812 -1147992 -439639 -1463602 -2560898 -1821037 -223898
33312 -223898 -6008 -1174874 -2007114 -2142955 -2687508 -3609649 -3524054 -2211242 -1115986
33303 -1115986 -858069 -273346 1272591 2414652 1812081 314853 -252167 342983 726372
33294 726372 88362 -874867 -1209269 -871318 -331215 238081 842532 1186157 961621 498689
33284 498689 484898 943306 1126887 723062 466644 924702 1276969 301947 -1694219 -3061781
33274 -3061781 -2963307 -2224578 -1770277 -1365805 -505983 454664 901488 969015 1094855 1117219
33264 1117219 670080 48205 -166496 -11074 137306 427770 1218377 2088162 2154922 1422986
33254 1422986 890955 1093692 1366260 951349 152928 -163091 223050 748504 909957
33245 909957 714845 358984 -78405 -532718 -889457 -1167807 -1540088 -2050880 -2536520 -2923953
33235 -2923953 -3302663 -3525704 -3174568 -2323826 -1866280 -2339301 -2753586 -1625958 842357
33226 842357 2792606 3175284 2910427 2999441 2860908 1643217 1945 -915094 -1390737
33217 -1390737 -2367817 -3342718 -2897068 -1138538 250946 495404 451144 613644 306896
33208 306896 -541273 -678539 420065 1363413 905545 -115397 -201689 520334 842923
33199 842923 510091 289605 486446 668515 631785 569207 427914 -13069 -522642 -566261
33189 -566261 39251 1074802 2193665 2819565 2301956 781783 -549420 -653012 278865
33180 278865 1354630 1981014 1887123 990573 -80136 -199540 658408 932827 -326600
33171 -326600 -1666125 -1110124 758313 1356340 -314377 -2336651 -2559913 -1216992 -101481
33162 -101481 -99653 -476643 -227127 641246 1254606 970707 113777 -467428 -432044 -183055
33152 -183055 -89536 -36331 73272 18296 -188778 -123032 224453 151028 -633363 -1299611
33142 -1299611 -1035656 -212999 376965 757515 1286246 1569431 960289 -288905 -1411061
33133 -1411061 -2236518 -2886308 -2877341 -1813450 -614614 -662321 -1827154 -2653375 -2461773
33124 -2461773 -1955283 -1695212 -1342814 -664529 -41161 375144 910257 1448091 1324352
33115 1324352 494679 -186048 -185963 165986 618302 1363466 2099090 1931392 845350 158658
33105 158658 675291 1333090 720994 -715720 -1154507 91726 1546914 1345439 -508138
33096 -508138 -2136833 -2046818 -914459 -524080 -1116537 -1007939 601378 1864684 835561
33087 835561 -1229063 -1249890 1265203 3493608 3356241 2074542 1733354 2278877 2382269
33078 2382269 1790430 1161035 530813 -462258 -1412833 -1573182 -1060448 -532724 -75434
33069 -75434 544433 939087 526499 -350665 -754241 -497829 -323802 -786568 -1617861 -2148789
33059 -2148789 -1916995 -1029749 -211283 -119289 -420619 -183830 604293 883840 311172 10598
33049 10598 731100 1434636 877575 -370730 -789011 -30693 1062852 1847319 2003532
33040 2003532 1064454 -753433 -1962809 -1570148 -728834 -1018224 -1884845 -1770538 -1058486
33031 -1058486 -1447768 -2686474 -2608229 -682782 1068229 1309054 1039463 1146199 829692
33022 829692 -226658 -483008 923799 2247337 1665657 134555 -296304 334919 506191
33013 506191 -52332 -356057 -177037 -42991 247568 1216857 2240311 2298799 1814937 1938929
33003 1938929 2371250 1831772 507396 12741 806676 1550094 1316127 689703 334075
32994 334075 139312 164448 757818 1304107 545511 -1278036 -2278544 -1600304 -605728
32985 -605728 -560084 -791009 -242889 659310 1021918 1099087 1486895 1704589 1008792 -126901
32975 -126901 -690876 -708597 -905803 -1289257 -1227785 -574611 309455 1279598 2220974 2546849
32965 2546849 1828108 620105 -131357 -172263 200851 803699 1373341 1357880 699027 183093
32955 183093 237910 180701 -445386 -753971 58567 1070254 884885 -171883 -703719 -578290
32945 -578290 -887778 -1790099 -2111182 -1274099 -224936 -113226 -986718 -1892135 -1629572
32936 -1629572 230494 2434942 2998635 1947297 1750281 3524692 4490186 1736283 -2789595
32927 -2789595 -4421075 -2389319 -562016 -1240312 -2144165 -965451 713381 413441 -1094275
32918 -1094275 -1360205 -91011 1168167 1807036 2197261 2017823 823301 -423615 -437008
32909 -437008 281344 198972 -831016 -1519154 -1102238 54935 1361562 2211033 1851498
32900 1851498 353920 -832291 -527559 539985 870193 234577 -582194 -1230532 -1685912
32891 -1685912 -1530824 -675446 58535 331479 1140936 2832169 3607515 1948880 -678408
32882 -678408 -1743241 -1223816 -875620 -911538 -212520 761273 321113 -1267154 -1895350
32873 -1895350 -1127124 -752947 -1433222 -1667789 -827578 -392930 -1118179 -1570330 -740674
32864 -740674 282929 563350 905800 1752658 1764738 211250 -1293265 -1276808 -727343
32855 -727343 -992624 -1224385 -154932 1173352 931856 -429833 -1129779 -1131226 -1704313
32846 -1704313 -2553499 -2107669 -565522 -23436 -1170289 -2176648 -1613190 -489377 -376659
32837 -376659 -1075164 -1321093 -734618 47130 483639 461559 4946 -585652 -671834 -3945
32827 -3945 771512 911816 652263 848759 1627903 2106166 1694439 1022908 942383 1047033
32817 1047033 212712 -1382562 -2043854 -1002830 145249 -308085 -1447599 -1018171 1002927
32808 1002927 2200139 1264982 -342746 -975505 -1043276 -1472724 -1659110 -642110 842516
$$ [...]
##END NTUPLES=NMR SPECTRUM
##END=
