##TITLE=31Pdec_SR41(35)_k
 D2O, 24 sc
 12.03.2021
##JCAMPDX= 6.0         $$ Bruker NMR JCAMP-DX V2.0
##DATA TYPE= NMR SPECTRUM
##DATA CLASS= NTUPLES
##ORIGIN= UXNMR, Bruker Analytische Messtechnik GmbH
##OWNER= root
$$ XWIN-NMR		Version 3.5
$$ Fri Mar 12 13:16:01 2021 Russian Standard Time (UT+4h)  she@DPX200
##.OBSERVE FREQUENCY= 81.013821
##.OBSERVE NUCLEUS= ^31P
##.ACQUISITION MODE= SIMULTANEOUS
##.ACQUISITION SCHEME= undefined
##.AVERAGES= 24
##.DIGITISER RES= 16
##SPECTROMETER/DATA SYSTEM= spect
##.PULSE SEQUENCE= zgpg30
##.SOLVENT NAME= D2O
##.SHIFT REFERENCE= (INTERNAL, D2O, 0, 248.564)
##AUDIT TRAIL= $$ (NUMBER, WHEN, WHO, WHERE, WHAT)
$$ ##TITLE= Audit trail, XWIN-NMR		Version 3.5
$$ ##JCAMPDX= 5.01
$$ ##ORIGIN= Bruker BioSpin GmbH
$$ ##OWNER= she
$$ F:/spectra/data/she/nmr/P31/1/pdata/1/auditp.txt
$$ ##AUDIT TRAIL=  $$ (NUMBER, WHEN, WHO, WHERE, WHAT)
(   1,<2021-03-12 13:14:49.29 +0400>,<she>,<DPX200>,
      <created by zg, POWCHK disabled, PULCHK disabled
       configuration hash MD5:
       00 E9 B6 7A A2 85 ED C7 34 08 36 98 17 FE 4E 26
       data hash MD5: 32K
       91 29 63 B6 4D 97 4E 1D 0F F8 BB A2 B0 72 91 1C>)
(   2,<2021-03-12 13:14:51.54 +0400>,<she>,<DPX200>,
      <Start of raw data processing
       efp BC_mod = 2 LB = 1 FT_mod = 6 PKNL = 1 PHC0 = -4342.791 PHC1 = 709.8011 SI = 64K 
       data hash MD5: 64K
       F3 84 D4 D8 2B 9C 8F 73 79 80 D0 F9 C9 D7 8E 93>)
(   3,<2021-03-12 13:15:15.06 +0400>,<she>,<DPX200>,
      <pk PHC0 = 90.47838 PHC1 = -229.2 
       data hash MD5: 64K
       58 E6 27 EC D5 4A CB F8 87 6B F2 FB 86 76 D4 D2>)
(   4,<2021-03-12 13:15:18.40 +0400>,<she>,<DPX200>,
      <abs ABSG = 5 
       data hash MD5: 64K
       18 D3 7C EF E8 D1 83 5E 16 C7 D1 0C E8 82 21 A0>)
$$ ##END=
$$ 
$$ hash MD5
$$ 9D 6B 9F FE 75 FF A6 63 C6 3A EF 69 53 84 55 FA
##$RELAX= 
##$RELAX= 
##$RELAX= 
##$RELAX= 
##$RELAX= 
##$RELAX= 
##$RELAX= 
##$RELAX= 
$$ Bruker specific parameters
$$ --------------------------
##$DU= <F:/spectra>
##$EXPNO= 1
##$NAME= <P31>
##$PROCNO= 1
##$TYPE= <nmr>
##$USER= <she>
##$AMP= (0..31)
100 100 100 100 100 100 100 100 100 100 100 100 100 100 100 100 100 100 
100 100 100 100 100 100 100 100 100 100 100 100 100 100 
##$AQSEQ= 0
##$AQ_mod= 1
##$AUNM= <au_zg>
##$AUTOPOS= <>
##$BF1= 81.014009
##$BF2= 200.13
##$BF3= 200.13
##$BF4= 200.13
##$BF5= 200.13
##$BF6= 200.13
##$BF7= 200.13
##$BF8= 200.13
##$BYTORDA= 1
##$CFDGTYP= 0
##$CFRGTYP= 5
##$CHEMSTR= <none>
##$CNST= (0..31)
1 1 145 1 1 1 1 1 1 1 1 1 1 1 1 1 1 1 1 1 1 1 1 1 1 1 1 1 1 1 1 1 
##$CPDPRG= <waltz16>
##$CPDPRG1= <>
##$CPDPRG2= <waltz16>
##$CPDPRG3= <>
##$CPDPRG4= <mlev>
##$CPDPRG5= <mlev>
##$CPDPRG6= <mlev>
##$CPDPRG7= <mlev>
##$CPDPRG8= <mlev>
##$CPDPRGB= <>
##$CPDPRGT= <>
##$D= (0..31)
0 1 0 0 0 0 0 0 0 0 0 0.03 2e-05 3e-06 0 0 0 0 0 0 0 0 0 0 0 0 0 0 0 0 
0 0 
##$DATE= 1615540488
##$DBL= (0..7)
120 120 120 11 120 120 24 19 
##$DBP= (0..7)
150 150 150 150 150 150 150 150 
##$DBP07= 0
##$DBPNAM0= <>
##$DBPNAM1= <>
##$DBPNAM2= <>
$$ [...]
##$SUBNAM3= <"">
##$SUBNAM4= <"">
##$SUBNAM5= <"">
##$SUBNAM6= <"">
##$SUBNAM7= <"">
##$SUBNAM8= <"">
##$SUBNAM9= <"">
##$SW= 501.771253377433
##$SWIBOX= (0..15)
0 1 3 0 0 0 0 0 0 0 0 0 0 0 0 0 
##$SW_h= 40650.406504065
##$TD= 32768
##$TD0= 1
##$TE= 0
##$TE2= 300
##$TE3= 300
##$TEG= 300
##$TL= (0..7)
0 120 53 12 22 120 120 120 
##$TP= (0..7)
150 150 150 150 150 150 150 150 
##$TP07= 0
##$TPNAME0= <>
##$TPNAME1= <>
##$TPNAME2= <>
##$TPNAME3= <>
##$TPNAME4= <>
##$TPNAME5= <>
##$TPNAME6= <>
##$TPNAME7= <>
##$TPOAL= (0..7)
0.5 0.5 0.5 0.5 0.5 0.5 0.5 0.5 
##$TPOFFS= (0..7)
0 0 0 0 0 0 0 0 
##$TUNHIN= 0
##$TUNHOUT= 0
##$TUNXOUT= 0
##$USERA1= <user>
##$USERA2= <user>
##$USERA3= <user>
##$USERA4= <user>
##$USERA5= <user>
##$V9= 5
##$VALIST= <valist>
##$VCLIST= <CCCCCCCCCCCCCCC>
##$VD= 0
##$VDLIST= <DDDDDDDDDDDDDDD>
##$VPLIST= <PPPPPPPPPPPPPPP>
##$VTLIST= <TTTTTTTTTTTTTTT>
##$WBST= 1024
##$WBSW= 4
##$XGAIN= (0..3)
0 0 0 0 
##$XL= 0
##$YL= 0
##$YMAX_a= 4619
##$YMIN_a= -4371
##$ZGOPTNS= <>
##$ZL1= 120
##$ZL2= 120
##$ZL3= 120
##$ZL4= 120
##$ABSF1= 248.5645
##$ABSF2= -253.2056
##$ABSG= 5
##$ABSL= 3
##$ALPHA= 0
##$AQORDER= 0
##$ASSFAC= 0
##$ASSFACI= 0
##$ASSFACX= 0
##$ASSWID= 0
##$AUNMP= <proc_1d>
##$AZFE= 0.1
##$AZFW= 0.5
##$BCFW= 0
##$BC_mod= 2
##$BYTORDP= 0
##$COROFFS= 0
##$CY= -3
##$DATMOD= 1
##$DC= 0
##$DFILT= <>
##$DTYPP= 0
##$F1P= 0
##$F2P= 0
##$FCOR= 1
##$FTSIZE= 65536
##$FT_mod= 6
##$GAMMA= 0
##$GB= 0
##$INTBC= 1
##$INTSCL= 5.30512e-09
##$ISEN= 30
##$LB= 1
##$LEV0= 0
##$LPBIN= 0
##$MAXI= 10000
##$MC2= 0
##$MEAN= 0
##$ME_mod= 0
##$MI= 50
##$NCOEF= 0
##$NC_proc= -7
##$NLEV= 6
##$NOISF1= 182.463
##$NOISF2= 159.3651
##$NSP= 0
##$NTH_PI= 0
##$NZP= 0
##$OFFSET= 248.5645
##$PC= 4
##$PHC0= -4252.312
##$PHC1= 480.6011
##$PH_mod= 1
##$PKNL= yes
##$PPARMOD= 0
##$PSCAL= 0
##$PSIGN= 0
##$REVERSE= no
##$SF= 81.014009
##$SI= 65536
##$SIGF1= 159.3651
##$SIGF2= -187.1042
##$SINO= 113.3802
##$SIOLD= 16384
##$SREGLST= <1H.CDCl3>
##$SSB= 0
##$STSI= 65536
##$STSR= 0
##$SW_p= 40650.406504065
##$SYMM= 0
##$S_DEV= 0
##$TDeff= 32768
##$TDoff= 0
##$TI= <>
##$TILT= no
##$TM1= 0
##$TM2= 0
##$TOPLEV= 0
##$USERP1= <user>
##$USERP2= <user>
##$USERP3= <user>
##$USERP4= <user>
##$USERP5= <user>
##$WDW= 1
##$XDIM= 65536
##$YMAX_p= 452523426
##$YMIN_p= -24959311
$$ End of Bruker specific parameters
$$ ---------------------------------
##NTUPLES= NMR SPECTRUM
##VAR_NAME=  FREQUENCY,     SPECTRUM/REAL,   SPECTRUM/IMAG
##SYMBOL=    X,             R,               I
##VAR_TYPE=  INDEPENDENT,   DEPENDENT,       DEPENDENT
##VAR_FORM=  AFFN,          ASDF,            ASDF
##VAR_DIM=   65536,         65536,           65536
##UNITS=     HZ,            ARBITRARY UNITS, ARBITRARY UNITS
##FACTOR=    0.620285442955139, 1,           1
##FIRST=     20137.2065510759, 0,            0
##LAST=      -20513.1999529892, 0,           0
##MIN=       -20513.1999529892, -24959311,   0
##MAX=       20137.2065510759, 452523426,    0
$$ Real data points
##PAGE= N=1
##DATA TABLE= (X++(R..R)), XYDATA
$$ [...]
15090 2925284 5067942 3138299 -3743337 -9661877 -9611379 -5781258 -2946480 -2136362 -2308360
15081 -2308360 -3881271 -6565110 -7430390 -5275265 -3556370 -4773444 -5315011 -849997
15073 -849997 5978296 8958904 7669787 7395862 10183310 11956775 9484755 4990279
15065 4990279 1935966 348067 -1455170 -3625238 -5380765 -6479157 -6481802 -4611463 -1437619
15056 -1437619 1401613 3715039 6328156 7843808 5642131 1186577 -138443 3273067
15048 3273067 6262758 4879210 2700674 4469500 7554062 6115083 1095188 -1200346
15040 -1200346 559596 1413306 -344285 -41476 4399876 7386531 3901785 -2485025
15032 -2485025 -4976528 -3301931 -2927056 -6576239 -11203778 -12669516 -10104825 -6118268
15024 -6118268 -4665105 -7453452 -11006872 -9676595 -3380729 913095 -1771763 -7391685
15016 -7391685 -8867536 -6010066 -4398549 -6269525 -7923197 -5676582 167429 7013394
15008 7013394 11701271 11249426 6007460 1417764 2463245 7105623 9526165 8659044
15000 8659044 8244245 9409820 9539745 8424020 8583851 8564443 3420772 -5688568 -9912071
14991 -9912071 -4887036 2018434 1910547 -3535306 -6075088 -2828658 2053764 4951186
14983 4951186 6087055 6739995 7808097 9806579 10868013 7432631 640035 -2012311
14975 -2012311 3115254 8086721 3591801 -6024025 -7523826 1779713 9674815 6890071
14967 6890071 -338491 -1202028 3755708 5415873 377019 -5717773 -7831880 -7350853
14959 -7350853 -7304761 -7135588 -4506125 619619 5648949 7803257 6228308 2881749 1413845
14950 1413845 3748017 7717181 9481889 8182933 6512092 6545145 6935370 5097832 760128
14941 760128 -3808706 -6360283 -6537549 -5616752 -5052095 -5057832 -4427481 -2294813 -169949
14932 -169949 -1057640 -5649850 -10317051 -10410049 -5467297 193262 2319866 966010 -601847
14923 -601847 -30413 2157915 4084066 4739856 4535045 4244794 3740769 1971192 -1420068
14914 -1420068 -4791986 -6005813 -5337079 -5165224 -5912985 -4383175 1706896 8976416 11177799
14905 11177799 6583068 -163424 -3942565 -4259217 -3551068 -3021715 -2081282 -421153 1329756
14896 1329756 2565970 3203337 3516162 3869986 4052913 3043139 632019 -1167214 -479600
14887 -479600 793976 -1210193 -6013337 -7875532 -3499201 2474658 3190835 -1184666
14879 -1184666 -3937979 -779281 5427023 9083415 7796177 3223446 -1382900 -3587581
14871 -3587581 -3647594 -4458389 -7822493 -10874542 -8915189 -2246691 3038558 2653378 -504443
14862 -504443 -1151186 624689 121893 -4420321 -9122548 -10047917 -7857124 -4856130 -395735
14853 -395735 7199186 15427645 18635200 15074021 9345418 5869929 3158313 -2137875
14845 -2137875 -7958317 -8522618 -3003176 2378208 2448778 -678505 -1787043 291244 2657446
14836 2657446 3029322 1261065 -1999124 -4950161 -4459787 222208 4588540 3430072
14828 3430072 -2227342 -6485022 -6563660 -5114608 -4168669 -1878113 2500575 5017929 2312323
14819 2312323 -2579185 -4011725 -1520570 514959 -18960 -775492 76396 1176223 1366373
14810 1366373 1681250 2263265 1297147 -582782 924870 6699705 9794939 3953402 -5843249
14801 -5843249 -8450385 -1797481 4681114 4484323 2698121 5778169 10233245 8917559
14793 8917559 3482470 1721724 5058224 7698396 7514379 8519349 11315602 10276426
14785 10276426 3679312 -1519126 -50795 3416283 2566408 315576 3862112 12249303
14777 12249303 16745516 12903141 5738325 2261605 3679940 6031300 5218415 656563
14769 656563 -4073539 -4618735 -1509590 -615628 -5559421 -12057383 -13250594 -8495251 -2805983
14760 -2805983 439830 1369772 -442320 -6250779 -14016070 -18781311 -18217727 -14431652
14752 -14431652 -10142459 -6590358 -4931105 -5509676 -5655440 -2577042 1169621 -207219
14744 -207219 -7096289 -12579255 -11035724 -4670691 737522 3156445 4769022 7469824
14736 7469824 10214485 9888789 4354889 -3942746 -8313892 -4745164 2376954 5494924
14728 5494924 4126154 4525219 8908116 11584570 8084255 1806525 -2250410 -4806990
14720 -4806990 -8344673 -10487103 -7623168 -2421610 -1265004 -4979004 -7753485 -5667034
14712 -5667034 -1607893 -510306 -3136168 -6065438 -5692686 -1187506 5014540 9034971
14704 9034971 8903462 6265516 4059299 3084518 1985014 -88165 -2337910 -3570760
14696 -3570760 -3285623 -1672025 379974 1389675 472207 -1314667 -1427907 1766179 6780464
14687 6780464 9581361 7512531 2846513 640726 2124870 2663945 -1558797 -7516733
14679 -7516733 -9589423 -7538232 -5352822 -3746471 -79004 4366703 4147558 -1353743
14671 -1353743 -5315738 -3109677 1269640 2232607 523857 -508049 -1385935 -3573099
14663 -3573099 -4375923 -1145187 2675515 2277113 -283899 488760 3692732 3191782 -1769913
14654 -1769913 -4757024 -2191257 1671543 2174207 750913 864506 2314725 3235425 4117425
14645 4117425 6113178 7856343 7469908 6209660 7104477 10639613 13865175 13456597 8665555
14636 8665555 2055613 -2122891 -1681485 761272 537127 -2810381 -4335692 -389680
14628 -389680 5736790 7624000 3983488 -141480 -631544 358425 -1912537 -7653768 -11800074
14619 -11800074 -10209401 -4265411 1522518 4607826 5572055 5651220 5321237 4887351 4458703
14610 4458703 3416082 1592235 595046 1883748 3840517 3220102 -488046 -4667304
14602 -4667304 -7432551 -8884568 -8570671 -5588256 -2058188 -2355350 -7079643 -11468150
14594 -11468150 -11728755 -9216206 -6249063 -2140014 3385028 6849742 5324255 1240883
14586 1240883 -964384 -627223 93556 210589 -474539 -2775044 -5552169 -5065704 -840893
14577 -840893 1594048 -1409501 -5026020 -3224260 1033958 128417 -6150026 -10653119
14569 -10653119 -9834349 -7062353 -5324166 -3911666 -2672962 -2819663 -3118170 -1606900
14561 -1606900 -914604 -4927925 -10401284 -9849093 -3413921 558839 -1709664 -4729339
14553 -4729339 -4175130 -3106100 -4055999 -3576372 171172 1985655 -2210363 -7932168 -8693235
14544 -8693235 -4815736 -572045 2235829 2931690 -231250 -5642573 -7186802 -2899543
14536 -2899543 935920 -58721 -633998 4654389 10816085 10040382 4641350 2631640 4388255
14527 4388255 4124407 1900793 3105250 6843393 5807872 -1241896 -6726509 -5976400
14519 -5976400 -2976798 -2065115 -2062527 -1480213 -1924671 -2975169 -631077 5405805 9091421
14510 9091421 6539451 1706858 -111253 631320 837437 141462 -649601 -2142950 -3666954
14501 -3666954 -2095432 2936599 6560901 5207588 2021251 2075406 5583681 9330498
14493 9330498 11233503 9928794 3864487 -4865988 -9650532 -7302147 -3471583 -4758542
14485 -4758542 -8716749 -8190265 -3184458 -789740 -3711567 -6563675 -5281263 -3485258
14477 -3485258 -5983076 -10797000 -11989628 -7785377 -1960289 1762752 3518971 5428086
14469 5428086 8094861 9956752 9457063 6927806 3849624 788666 -2715549 -6293870
14461 -6293870 -8555559 -9201167 -9213290 -8132046 -3919815 2726188 7009071 5929016 2880229
14452 2880229 2670576 4343818 3617200 681085 -175192 1687627 1961666 -1185511 -4285433
14443 -4285433 -5199265 -6793908 -10617117 -12136968 -7122069 1074273 6021070 7288935
14435 7288935 9095571 11437848 9394512 2181679 -3287860 -1046505 5846648 9646333
14427 9646333 7868227 4907213 4696603 5779837 4627267 920659 -2527873 -3637717
14419 -3637717 -2597863 -153539 3075746 5076585 2949124 -3073339 -8012054 -7387501
14411 -7387501 -3106679 -893441 -2168076 -2369306 1729846 7080609 9092908 7986135
14403 7986135 7209774 8009519 9183421 10456969 12156695 12571444 9683019 5141137 2561002
14394 2561002 1870475 -536263 -5483735 -9156421 -8924509 -6928878 -5759353 -4383149
14386 -4383149 -1287282 1525805 1193447 -1634296 -4521574 -7378271 -11083875 -13506704
14378 -13506704 -11293716 -5288229 -3652 2576703 4519511 6387030 4817718 -1557338
14370 -1557338 -7466172 -6558253 27437 5008351 4657736 2831038 3985432 6250004
14362 6250004 4866143 128745 -2710200 -1340647 309358 -1549732 -4621379 -4176978
14354 -4176978 -254847 2659520 2009082 -636706 -3267299 -5267851 -5486776 -2913232
14346 -2913232 -224351 -1915426 -6922005 -8070316 -2238358 3780038 2620231 -2507035
14338 -2507035 -2886363 1756197 2583282 -4480332 -12136007 -12194598 -6330001 -1711575 -609850
14329 -609850 62179 1731144 2619186 2302697 2569906 3440443 2707475 226760 -1258487
14320 -1258487 -710468 -404754 -1280948 -665790 2467142 3645158 -1148277 -7968310 -8944887
14311 -8944887 -3284060 1755201 1991709 1992352 6126833 10038248 7455701 1555667 1236865
14302 1236865 7026868 9339761 2602616 -6802008 -10580340 -9663263 -9816188 -11678708
14294 -11678708 -12039399 -11225780 -11670152 -11227178 -5718597 2387450 5534774 2241704 -530549
14285 -530549 1778363 4960507 3823003 233483 -1152901 -496988 -1077648 -3255187 -4850285
14276 -4850285 -5146223 -4390876 -1713539 2356324 3889705 824733 -2139647 467598
14268 467598 5728467 5810983 258838 -2609447 1553939 6130211 3472173 -3838691 -7438171
14259 -7438171 -5177066 -2124209 -1275767 -208946 2280550 2597092 -1569838 -6186755
14251 -6186755 -6058910 -2370605 -740792 -3106259 -5860604 -5927935 -4512781 -3699307 -2851572
14242 -2851572 -427508 3064288 5962952 7488705 7215319 4556938 683704 -1272179
14234 -1272179 -346462 165324 -2228289 -4419477 -2243784 1873385 1296185 -4899515 -10079194
14225 -10079194 -9437261 -5820498 -3846635 -3465122 -2982034 -3745424 -6754315 -8005134 -3090733
14216 -3090733 5279037 10071724 9572351 8619787 9982192 10268671 6286362 525573 -2749038
14207 -2749038 -3408311 -4218249 -6071493 -7639296 -8402357 -9253390 -10627927 -11843323 -11780195
14198 -11780195 -9319193 -4439559 275896 1436198 -370475 -221586 4326276 8822871
14190 8822871 7856307 3082378 747366 2669705 5097271 6160447 8302425 11920247
14182 11920247 12562198 7437096 -83134 -5599250 -8747518 -9887590 -7142699 -1636776
14174 -1636776 -433014 -7444904 -15370123 -14468010 -6521177 -1457488 -2087518 -2251101 121022
14165 121022 -603486 -5800627 -8140192 -4153143 -1203092 -5054970 -9450332 -6644213
14157 -6644213 -821719 -941326 -5669122 -6279533 -1351837 2086140 655710 -2021444
14149 -2021444 -3610383 -5441065 -6525642 -4231405 -1578720 -4863293 -12531593 -15254540
14141 -15254540 -9443078 -2311844 -505876 -1772979 -1718226 -1170495 -1981404 -1905495 1166927
14132 1166927 4814409 6227123 6216975 5680998 3171400 -525390 -888155 3289041 6728302
14123 6728302 5656708 3418976 3695302 4048541 1607904 -567522 863624 2641458
14115 2641458 641443 -1931283 337268 5154620 5523202 382316 -5134512 -8246931
14107 -8246931 -10003244 -9622471 -5006816 1334057 3945443 2411959 1363041 2242018
14099 2242018 1650699 -1143069 -1743579 1912964 5206677 3228601 -2352514 -6002978
14091 -6002978 -5414003 -3178582 -2665459 -4153831 -5032791 -3452882 -1277562 -1850963 -4774117
14082 -4774117 -5917131 -3770403 -1883543 -2623970 -2962318 -322978 1756994 -902908
14074 -902908 -5630439 -6921160 -5019325 -3929116 -3310573 278370 5454288 6985151
14066 6985151 4399700 2263528 1683883 -952371 -5852407 -8129373 -6401735 -5892563
14058 -5892563 -9660533 -12921978 -10209581 -3513298 857054 353392 -2311735 -3598462
14050 -3598462 -2524217 -802218 -559733 -1030594 1277868 6989256 10926841 8817046
14042 8817046 4322828 3763935 6112321 5392740 1579835 593989 3379267 4048423 530443
14033 530443 -1891587 -425120 583352 -1497068 -2643512 -749079 -848721 -5996495 -10508509
14024 -10508509 -8975201 -5279844 -5375767 -7097782 -5172907 -1411130 -1346666 -4294025 -5227856
14015 -5227856 -4096668 -4957779 -7262850 -6062094 -779095 3223338 2367625 -1558739
14007 -1558739 -5692527 -8575084 -8266154 -3395942 3148610 6133881 4253388 719172
13999 719172 -2236061 -5074525 -7029121 -5210338 866604 7210591 9311791 6263963
13991 6263963 734364 -3293288 -3302015 -922048 -911828 -5241692 -9754946 -9525875 -5657588
13982 -5657588 -3106702 -3437345 -4093820 -3729834 -3436922 -3042577 -1109079 978010 -304583
13973 -304583 -4658491 -6956099 -3988119 1213975 3675450 2215496 -1052882 -4469286
13965 -4469286 -7612551 -9574413 -8717114 -4556093 699496 3138565 729692 -3893061
13957 -3893061 -5834227 -3758730 -1068080 -168535 1121344 4766392 7543942 5458667
13949 5458667 1093390 1212488 7339589 13505773 13905074 8775102 2117855 -2500751
13941 -2500751 -2965129 822261 5762614 7541945 4997009 729064 -2514507 -3668482
13933 -3668482 -2355278 291268 181510 -5849472 -14142042 -16878026 -11996107 -5756932
13925 -5756932 -3530009 -3256047 -1483275 -730112 -5040421 -11292313 -11827390 -5497893 108615
13916 108615 -754205 -4149082 -2526711 4424635 9105266 5455935 -4272454 -12722896
13908 -12722896 -14872100 -11046682 -4483634 1858755 6365833 8439691 7916803 4767290
13900 4767290 -188637 -4253789 -4299648 -663374 2074736 658562 -1756943 622988
13892 622988 7958490 14203254 15115868 12596664 9852214 6775347 2615444 -817259
13884 -817259 -1992428 -2536510 -3891968 -4106464 -1662059 410339 -1330380 -4794042 -5409375
13875 -5409375 -3526175 -3651364 -6949997 -9484984 -8209338 -4462441 -886433 1576449
13867 1576449 2972076 3524357 3891229 4006266 2303565 -1490616 -4284270 -3577782 -1791327
13858 -1791327 -2619722 -4747443 -4050840 -717877 1397572 1636608 2483757 2966712 -699498
13849 -699498 -6869247 -8465882 -3841392 -349459 -3065302 -6651634 -3939645 2868532
13841 2868532 6083739 3875879 1067135 774141 1669148 2780764 5224217 8634328
13833 8634328 10303909 8794958 5413065 1863584 -862210 -1465225 802198 3963870
13825 3963870 4548338 1540306 -2557686 -4561484 -3079481 1079034 5079089 5529699
13817 5529699 2095956 -1022597 315830 4671069 6744730 4214272 -167809 -3245185
13809 -3245185 -4767878 -5278281 -4300159 -2599908 -3267411 -7673060 -12180742 -11869322 -6549754
13800 -6549754 -347941 3861355 6358429 7151396 4703369 -247253 -2950550 229644
13792 229644 6673210 10316599 8523904 3651512 -889036 -2980142 -1432524 2554098
13784 2554098 3898901 -1535001 -9707460 -11020885 -2368216 8122665 11428494 8211852
13776 8211852 5066593 4492769 4152908 3193104 3111635 3605119 3124754 2741142 4181219
13767 4181219 4976058 1462061 -3832012 -4324810 523255 3952865 2291454 -214783
13759 -214783 297307 906724 -1778871 -4629791 -3028128 1101166 2344971 417237 -260791
13750 -260791 1505261 1904999 -1186395 -4378488 -3349280 1566616 6095954 6903020 4537550
13741 4537550 2066398 1478559 1775290 872885 -1311089 -2997850 -3280137 -2677196 -1143002
13732 -1143002 1762737 4274421 3174133 -1366943 -4538915 -2673508 1732378 2910686
13724 2910686 -1609190 -8845129 -13403293 -11644626 -4656253 1883375 2926061 212068
13716 212068 657231 7232025 14518572 15664190 10922695 6111767 4582179 4345718 2546519
13707 2546519 -331386 -1339311 1240718 5533603 7557362 5750468 3100330 2697247
13699 2697247 2419190 -1937551 -8535615 -9958306 -3358769 5341338 10144072 12239837
13691 12239837 14458892 14158807 8196614 1245886 1451527 8757172 14300558 11982697
13683 11982697 5332767 1887561 4916464 11654853 16426133 14892264 7900312 1226468
13675 1226468 -666855 372929 -30952 -1958861 -2141163 -266466 561840 -605791 -1285536
13666 -1285536 -304563 464441 -34330 -141142 1646161 4924350 8857086 12483681 13834095
13657 13834095 12062577 9944256 10522975 12102350 11035111 8477989 8541731 10016170
13649 10016170 7053466 -480941 -4802302 -1709965 2517883 634753 -4815357 -6236258
13641 -6236258 -2387297 1374486 1839724 835112 516661 1112548 2891503 5801577 7417268
13632 7417268 5375695 1657220 528905 2397762 3705800 3004931 2814219 4488146
13624 4488146 5393791 3279639 339712 283474 3039124 4715623 2404399 -2214328 -4069596
13615 -4069596 307028 8249372 12260059 7762711 -911838 -4869513 -1087229 4605584
13607 4605584 5980515 4287459 4796533 7977095 8578545 3683365 -2169108 -2204092 3997655
13598 3997655 9836558 9694895 5283035 2423579 2971203 3001287 -413769 -4033206 -2989739
13589 -2989739 1570948 3598922 496574 -4148480 -6986891 -9031191 -10819186 -8587478
13581 -8587478 -281447 8208387 9268697 4398469 1968791 4357884 4859821 -658033
13573 -658033 -6507003 -5883963 -759217 2376924 1757620 -777675 -5747549 -13220197 -16986972
13564 -16986972 -10537093 1615021 7436402 3473285 -1160506 442774 3089744 -392058
13556 -392058 -6895829 -8557024 -5302830 -3332690 -3958736 -2797049 535224 581737 -4252935
13547 -4252935 -7570084 -4259599 1584414 2716001 -875132 -2777051 159083 3933347
13539 3933347 3889694 1358875 1480730 5898715 10094521 8482720 836611 -7413711 -10721928
13530 -10721928 -8074485 -2498588 2092477 2875192 -936174 -6883491 -9723264 -5521780
13522 -5521780 3887327 11694494 12243403 6114334 -1155205 -4941392 -5437148 -5618836 -6435341
13513 -6435341 -5777957 -2449424 1177317 2321165 1863691 2561497 4420464 5299562 5546542
13504 5546542 7812097 11621972 12442913 7925746 1387103 -2949977 -4578742 -4307562
13496 -4307562 -1291207 4038252 7599969 6676398 4843447 7210617 12401152 14222954
13488 14222954 10734156 6805314 7005890 9931582 11116663 8984415 6264083 6488872
13480 6488872 9788718 12180031 9899779 4467058 1286916 2689195 5514429 6878619
13472 6878619 8105478 10135124 9586695 4146974 -1556946 -1034438 5244471 11236866
13464 11236866 13485461 12690008 9470331 4652055 1887680 3336326 4198988 -1260113
13456 -1260113 -9486463 -11651682 -7388809 -5080932 -7463958 -7449741 -1790528 1638866
13448 1638866 -3271213 -9469394 -6807394 2495092 7449588 3828645 -2280305 -4536010
13440 -4536010 -2428881 1844216 5875682 6416294 1928627 -3885398 -5761811 -3965354
13432 -3965354 -3102522 -4170529 -3187764 1353231 4960989 3539081 -583787 -2092819
13424 -2092819 211471 2743102 2397539 -263156 -3095850 -5322149 -7068214 -7305981
13416 -7305981 -4765932 -1295811 -1396483 -6059018 -9477474 -5885458 1709346 4829458
13408 4829458 1553565 -906603 2432079 6770167 5573700 860725 -523557 2417678
13400 2417678 4274825 1844828 -2557452 -5950077 -7656911 -7355572 -4862625 -2355518
13392 -2355518 -2609344 -4390980 -3531649 662163 3897198 2848573 -962529 -4518652
13384 -4518652 -7022599 -8520043 -8087721 -5882329 -4581958 -6011808 -7737814 -5621520
13376 -5621520 759272 7329506 10150887 9226474 7259914 5901325 4529405 2654762
13368 2654762 1873874 3803353 6698387 6541533 2195658 -2645852 -3824341 -1077947
13360 -1077947 3205876 7146608 9235904 7621528 2718676 -1241971 -808006 1765508
13352 1765508 1769724 -967363 -2686476 -2665471 -4324453 -8457840 -10602076 -7675784 -2970045
13343 -2970045 -1173417 -1793612 -1525663 -762214 -2982928 -8249566 -11739028 -9785967 -4286033
13334 -4286033 335833 2264549 2777338 3329732 4254696 5635126 7440456 8656664 7857110
13325 7857110 5186848 2591904 1422353 963362 268590 158530 1687928 3463336 2825227
13316 2825227 -165000 -2127130 -516645 3412708 6701589 8065817 8079863 7553112 7154935
13307 7154935 7547058 8606151 9381425 9627184 10060369 10286800 8397992 4101759 265096
13298 265096 -773330 -651576 -2067658 -3830887 -2267945 2671763 6116556 4132872
13290 4132872 -1319613 -4457881 -1463313 6298824 13542842 15055888 9657377 986770
13282 986770 -5937855 -8806879 -8296268 -5421509 -593201 4619558 6841385 3619703
13274 3619703 -3331226 -8559525 -7458051 -889424 5345978 6594722 4233655 2824927
13266 2824927 3214930 1772847 -2847257 -6117883 -3499577 2961596 7343442 7284451 5073455
13257 5073455 2675637 -9450 -1956390 -384633 4989046 9847134 9548312 4394755
13249 4394755 -677571 -1186942 2644678 6373327 5955697 1952205 -1452302 -1599954 -63208
13240 -63208 305860 -933048 -2320539 -2853386 -2286216 -850834 -209916 -2557957 -6878201
13231 -6878201 -8514142 -4985204 74179 1607530 -579854 -3391704 -5686581 -7901865
13223 -7901865 -8717130 -6881784 -4805473 -5355710 -6318644 -3431461 1855116 3561163 248595
13214 248595 -3048198 -2907136 -1705889 -1958573 -1948970 279800 2968623 3466932 1670568
13205 1670568 -1308699 -4494505 -5585290 -2197810 3429625 4955312 -424404 -8248216
13197 -8248216 -12703947 -12684401 -10073305 -6162595 -2403683 -874336 -1100743 163522 3459634
13188 3459634 4779886 2012467 -996377 -438150 1453656 782603 -1129502 -283071 3020143
13179 3020143 4760162 3262627 219817 -3159515 -6818820 -9487542 -9578086 -8207761
13171 -8207761 -8188569 -10146833 -11947266 -11476164 -8286534 -3537296 344193 1609832 1848974
13162 1848974 4134829 7526360 7252174 2147905 -2699937 -3444314 -2500611 -2433041 -575499
13153 -575499 4893538 9066574 7474186 4406642 5962679 8756670 5111978 -2924913
13145 -2924913 -5348494 252636 5287698 3787007 -347584 -2398743 -3867182 -6453603
13137 -6453603 -7250608 -4731525 -2438409 -1870425 1464180 9489761 15635289 14002542
13129 14002542 8985406 8528714 12025889 12549524 8276160 3959145 2330556 1297310
13121 1297310 -263103 -296359 1780222 3302703 2639906 1388784 1143797 1307907 1156944
13112 1156944 1327391 2122218 2290329 420799 -3354210 -6922655 -6975894 -1888368 4857573
13103 4857573 6507672 833020 -6062278 -6868158 -1939635 2775493 4642034 5920705
13095 5920705 7142581 4911694 -2058489 -9478718 -12616561 -11660499 -9761232 -8554891
13087 -8554891 -7913072 -7764636 -7766757 -6852311 -5047201 -4089474 -4491640 -3951149 -943596
13078 -943596 1926868 1126018 -2334847 -3912968 -1910704 416208 -42494 -2045312 -2728587
13069 -2728587 -2122906 -2091161 -2084267 467710 5231898 7876824 5632388 1310397 -699323
13060 -699323 -433018 -1230071 -3961169 -6155112 -6538328 -6474956 -6384797 -4757914 -2014059
13051 -2014059 -1353523 -3736957 -5779419 -5132093 -4173876 -5308676 -6685064 -6757507 -8905205
13042 -8905205 -15501852 -20640035 -16577167 -6402962 -1852733 -7070192 -12545696 -8849899
13034 -8849899 423870 4941081 2130545 -1057217 1083959 6350853 8968993 6553155
13026 6553155 1638355 -1619739 -1425744 289259 465512 -1390279 -3377493 -4538939
13018 -4538939 -5302359 -4564176 -281291 5629177 7261806 2467391 -3034914 -2873787 1733777
13009 1733777 4877628 4189166 1591382 -1697170 -5499651 -7535728 -5654731 -2679428
13001 -2679428 -3431297 -6919649 -7202178 -2595408 2012574 3498436 4795955 7955992
12993 7955992 9047372 4711053 -938122 -1716795 1330692 1973648 -1493193 -4581210
12985 -4581210 -4554801 -4334956 -6758509 -9334033 -7619578 -1535261 4273194 5540636 2377274
12976 2377274 -1269761 -1312874 2689958 6852190 6686931 1938681 -3012555 -3952882 -1151566
12967 -1151566 1827637 2780102 2899886 4056835 5483709 4524753 325365 -4774163 -7990267
12958 -7990267 -8829953 -8205426 -6479699 -4230173 -3565802 -5844354 -8571797 -7818890 -4033829
12949 -4033829 -1935039 -3477175 -4725381 -2139886 1607082 1920639 -184670 326801
12941 326801 4439938 7735287 7651205 7295030 9980390 13768571 14392117 11114285 6654119
12932 6654119 3031097 672586 482524 2990800 5242740 2373787 -5798631 -12576959
12924 -12576959 -11755065 -5664403 -2304191 -4658311 -6905876 -2951757 4858377 8972662
12916 8972662 6342334 621701 -4301670 -7883376 -9411237 -6433912 324513 4863528
12908 4863528 3090841 -768879 196618 5373930 7494118 3298177 -2327481 -4040215
12900 -4040215 -2535751 -718333 1932462 6761177 10526202 7861794 -1032729 -9341979
12892 -9341979 -11384511 -8533463 -5967227 -5842414 -5969755 -4182092 -1398141 226372
12884 226372 454549 977096 3001542 6033682 8663811 9348386 6834482 1678904 -2461722
12875 -2461722 -1387995 4419337 8939796 6918553 -95826 -5891305 -6711183 -4035668
12867 -4035668 -1057102 900285 2214731 3346277 3939000 2475662 -2530437 -9394535
12859 -9394535 -12707647 -9091787 -2900122 -2194436 -8494050 -14663683 -14495649 -10108923
12851 -10108923 -7047841 -6117638 -4654707 -3232026 -5258580 -10099866 -12127377 -8590844
12843 -8590844 -4295069 -5180503 -9704968 -10605240 -4870367 1878306 2763973 -1132460 -2335675
12834 -2335675 2540931 7645122 5428866 -3246439 -10310505 -10983678 -8727706 -8626842
12826 -8626842 -10021896 -8904492 -5037296 -2576208 -4092204 -7385119 -8814761 -7385129
12818 -7385129 -4786489 -3252437 -4093438 -6738488 -8529465 -7085972 -3750917 -2889833
12810 -2889833 -6188598 -9251115 -6485385 1179436 6651978 5677807 2320793 2885334
12802 2885334 6864896 8256404 5090947 2302084 3575971 5617184 4228497 1667798
12794 1667798 2389467 4432223 2029456 -4105167 -6573504 -2449317 2629703 4054603
12786 4054603 4631142 7020951 6876052 449483 -6271775 -4808226 2121111 3419842
12778 3419842 -4035499 -10829904 -8905802 -2067701 1334828 -217080 -2492266 -3292984
12770 -3292984 -3431520 -2727000 -604224 520351 -2657802 -8936559 -13091789 -11859204
12762 -11859204 -6415599 683561 7372274 10677347 7696223 29722 -5805227 -5227858
12754 -5227858 -1169045 14951 -2801981 -4301103 -635779 4726387 5461022 769054
12746 769054 -4099892 -5449745 -5436562 -7079267 -8437977 -5556492 470367 3976412 2505237
12737 2505237 -205416 -419068 533585 18557 -678437 1182084 4497651 5989545 5894174
12728 5894174 7211877 9519774 8632326 3660680 -298703 984951 5081188 6955868
12720 6955868 5747559 4022160 2736751 1023716 -471634 -306857 132494 -2276057
12712 -2276057 -7318846 -10919975 -10379421 -7199718 -4154797 -2537873 -2868458 -4974581
12704 -4974581 -6374136 -4078294 491984 1927265 -1856037 -6332102 -6984291 -5482167
12696 -5482167 -5614942 -6432332 -4297923 337383 3440190 3746647 3617370 3779096 2116522
12687 2116522 -1711846 -4909656 -5841833 -5803260 -5507222 -3754019 -940150 -21968 -2087240
12678 -2087240 -4240875 -3753546 -1395311 833095 2055938 1108376 -3459796 -9704126
12670 -9704126 -12247080 -8818280 -3778420 -2246950 -3736679 -4747353 -4647833 -5220453 -6783329
12661 -6783329 -8559993 -10817400 -12988734 -11980325 -6534417 -1201334 -1244976 -5130304
12653 -5130304 -7092692 -6071831 -6472745 -10039304 -12625490 -10413000 -4720195 1007180
12645 1007180 5006655 6370170 4241747 28732 -2545558 -1617742 883045 2705926
12637 2705926 3919415 4729018 3701597 194485 -3890201 -6675180 -8352301 -8996521
12629 -8996521 -7124552 -2872271 -48222 -1725504 -5352116 -5695082 -1979404 1276957
12621 1276957 745281 -1592002 -2161684 -1187168 -1767037 -4313824 -4936409 -931457 4043233
12612 4043233 3420334 -3579835 -9983609 -9402702 -3442375 1832822 4123051 5538919
12604 5538919 6762969 5800470 2783516 1082208 2106391 3136107 2253001 1537656 2769384
12595 2769384 3461452 627678 -4004221 -6219920 -5178754 -3470253 -2231003 127114
12587 127114 4124114 7345401 7654109 6307023 6209774 7753602 7985249 4611459 -73529
12578 -73529 -1156932 2458714 5907847 4742418 1336366 1280009 4650797 5835141 2441173
12569 2441173 -932463 108603 3618411 5489554 5531337 5479859 4647895 2291129 1396873
12560 1396873 4673485 8582073 7142789 1034714 -2866811 -1415596 1026225 314051
12552 314051 -1301446 152270 3476586 4128364 1019270 -2136908 -1852343 1241868 3640165
12543 3640165 2604483 -1585357 -6164579 -8491603 -8294943 -7264896 -6896209 -7492301 -8734192
12534 -8734192 -9877576 -9685345 -7785852 -6046212 -6820647 -9610657 -11226736 -9619756
12526 -9619756 -5798849 -1673244 1823894 3788827 2990057 -102162 -2966567 -4254622
12518 -4254622 -5288639 -6553344 -5271553 348949 6398376 7204025 3641538 2856642
12510 2856642 8428851 15029088 15419155 9337249 2024196 -3245339 -6556732 -6996487
12502 -6996487 -2836350 3061388 3599843 -3634671 -11660464 -12261691 -6421903 -2356991
12494 -2356991 -4455372 -8677738 -9025292 -4473185 1633355 5697282 5695784 1567728 -4064826
12485 -4064826 -7086943 -5552594 -1375551 2245165 3586603 2081151 -2337286 -7870203
12477 -7870203 -10799081 -9142204 -5365890 -3349684 -3373670 -2377548 917107 3522586 2030432
12468 2030432 -2262269 -3935420 126010 5939788 6138909 -890545 -7912829 -7231180
12460 -7231180 -517568 3334025 -294599 -6669737 -9123645 -7266739 -5263694 -5338041
12452 -5338041 -6519776 -7855663 -9330582 -10357709 -10034386 -8515019 -6427520 -3896397
12444 -3896397 -1695174 -1811293 -4801821 -8005250 -8583785 -7086351 -5944247 -5941542 -6387484
12435 -6387484 -7045268 -7301778 -5260551 -747431 2512692 1323971 -1764751 -1631599 2035099
12426 2035099 4803303 4423953 3155716 3030483 3309857 3407884 4116069 4909087 4133888
12417 4133888 2994600 4970759 9619860 11459393 7422002 1142506 -3083693 -6183283
12409 -6183283 -10092517 -11811192 -7542031 -537892 1689702 -2007089 -4526112 -849725
12401 -849725 4890982 5867382 2346964 639985 3772768 7711226 7574850 4122693 1924469
12392 1924469 3088822 5496418 6655047 6696688 7032453 8011888 8833311 8417033 5809657
12383 5809657 1296554 -2497466 -2942609 -1688161 -3516147 -8940836 -11434713 -5755289
12375 -5755289 3728407 8119160 6021483 4652697 8530389 12875457 10755110 2450782
12367 2450782 -5602795 -8636248 -7355610 -5356242 -4938638 -5120542 -3385150 -113416
12359 -113416 136694 -5388670 -11800261 -11578082 -5356263 -1819206 -5266554 -9494468 -7385304
12350 -7385304 -782546 3975749 5419839 5999465 5692909 3272142 1468391 3952589
12342 3952589 8364610 9014390 5993814 4797243 6629996 6404796 2296583 204239
12334 204239 4725019 11191918 11836585 6473938 1879104 2158525 4389366 3763026 -387391
12325 -387391 -4541847 -5140738 -2034859 1626506 2856490 2034810 1865375 3443776 5011903
12316 5011903 4725712 2656803 -424965 -4070124 -7146077 -8098805 -7367228 -7274038 -8142886
12307 -8142886 -6990308 -2052021 3734053 6370127 6031929 5635663 5598597 3670045 -312404
12298 -312404 -3130819 -2591775 -442156 606704 799779 2439305 6012502 8988821 8648247
12289 8648247 5147807 1161677 -1327513 -3023215 -5401216 -7592596 -7088894 -3849380
12281 -3849380 -1437794 -2593963 -5526108 -6686250 -5708538 -4911426 -4968165 -4448230 -3524834
12272 -3524834 -4418341 -7008899 -7376039 -2999486 2911820 4990977 2330264 -1034029
12264 -1034029 -1603222 110856 1657304 1936108 1460622 640949 -930826 -3560223 -6418322
12255 -6418322 -7920148 -7435840 -6236983 -5831078 -5470832 -2775016 2636092 7680813 9193236
12246 9193236 7583167 5709422 5046498 4577556 2868748 -355860 -4290481 -7271750
12238 -7271750 -7468127 -4853108 -1873161 -538761 267350 2519835 5208805 5885868 5508791
12229 5508791 7654222 11995307 12724000 5942740 -4521727 -11717307 -13622949 -13298192
12221 -13298192 -12840145 -11270006 -8079391 -5117300 -4045498 -4384572 -4846690 -4671144 -3221898
12212 -3221898 -335067 2366037 2626919 885644 326561 2356513 4126097 2588332
12204 2588332 -588391 -1002442 2043567 4188467 2091581 -1760821 -2619481 -313027
12196 -313027 628207 -2239105 -5530185 -4699482 -109198 3961849 4860617 3356827 795330
12187 795330 -2411563 -5423758 -6965094 -7072115 -6368453 -3668712 2351862 8712355 9537756
12178 9537756 3680784 -2937230 -5105590 -4788441 -6534555 -9738558 -9817245 -5179795 1038874
12169 1038874 5012558 4747528 327072 -4827381 -4947795 1557768 8238143 7926045 2453414
12160 2453414 -317507 1863704 3357683 430798 -3274649 -3310302 -908485 290421
12152 290421 -197389 -720217 -1042706 -1946881 -3387407 -4955694 -6157784 -5345437 -1336774
12143 -1336774 2975307 2378331 -3587880 -8912044 -8523411 -4078696 -292284 1001168
12135 1001168 615851 -844122 -2617612 -2976754 -1337438 691759 1789894 2007125 704014
12126 704014 -2793615 -5499589 -2661786 4608327 8832195 6102113 1099107 -1176168
12118 -1176168 -2500582 -5381109 -6213783 -1468080 4179712 3861437 -658106 -2201449
12110 -2201449 251036 1604944 812879 2205892 6517363 8858555 7030408 4580856
12102 4580856 3799515 2350379 -951633 -3113329 -2161244 -9021 2022740 5219128
12094 5219128 8765942 8529404 3484239 -1609124 -3150208 -3664128 -6238362 -8361994
12086 -8361994 -5886931 -267384 2698438 149318 -5062445 -8174079 -7006229 -3318255
12078 -3318255 -752680 -604739 149489 4584449 10215064 11207201 6486604 1629989 1420547
12069 1420547 4259763 5775411 4764244 3480922 4222294 6930020 8602996 5529993
12061 5529993 -1363051 -5051744 -758044 5975296 6075110 912412 881910 8681401 13717911
12052 13717911 7774634 -2411578 -5067258 684556 6356962 6816831 3912337 576215
12044 576215 -1808336 -2279761 -1995210 -4449631 -9262708 -9813521 -2929933 3619637 937536
12035 937536 -7379762 -10165250 -4814911 899655 2171929 2515760 4852757 6545179
12027 6545179 6016279 6463751 9513081 11589167 10091207 7767916 7674833 8483061 7742244
12018 7742244 5567889 2627133 -1318022 -4697766 -4488350 -1600569 -1263734 -5362773
12010 -5362773 -8997672 -7724977 -3763318 -1557586 -1465691 -1823213 -3300285 -6427965 -7757164
12001 -7757164 -3630111 3665555 7874294 6234319 1695755 -1467797 -1293033 1810500
11993 1810500 5661885 7098753 4377687 -945234 -5403182 -6486347 -4035086 -269173
11985 -269173 1377200 -540341 -3266095 -3247843 -1472870 -1752130 -3687725 -2528916 2484019
11976 2484019 5412665 2529369 -1397733 -324396 4050934 5980378 4899071 4834005
11968 4834005 6708128 7329446 5236193 2324297 102076 -1208236 -615576 2136633
11960 2136633 3887933 1469258 -3009593 -4885528 -3898227 -3262240 -2854118 425269 5534405
11951 5534405 7256200 4546567 2520753 3976576 5015123 2111297 -1961216 -2992990
11943 -2992990 -1500965 -77696 1494569 4384932 7126175 7752476 6896714 5450097
11935 5450097 2019169 -3833538 -8697912 -9337343 -6980224 -4243476 -1093175 2091862
11927 2091862 1307441 -5375245 -11700160 -9716375 -1264940 3826349 976078 -4452147
11919 -4452147 -6572060 -6232127 -6332194 -5958919 -3191936 420157 2182631 2251726 2045574
11910 2045574 1051313 -1871516 -6048513 -10251904 -14201781 -16663718 -14903482 -8990876
11902 -8990876 -4015449 -4382083 -7782402 -8513436 -5271403 -1757465 -598899 -859815 -1366009
11893 -1366009 -2415358 -3578192 -3374049 -2249642 -2920507 -6395566 -9956506 -10351624 -7232864
11884 -7232864 -2612322 1278651 2903036 2103901 649635 404544 623416 -767873 -2983377
11875 -2983377 -2673047 358164 1357794 -2541695 -6548475 -3545210 5809760 12740094
11867 12740094 10953422 4064517 432018 2911857 6512017 5566551 504145 -3614872
11859 -3614872 -3698109 -1643277 -678797 -786367 446534 3325705 4924279 3148631 -17360
11850 -17360 -841305 1626310 4859602 6124109 4981413 2783225 1138136 1096313 2610094
11841 2610094 4190728 3862940 1107376 -2504299 -4948913 -5515485 -4523822 -2118565 1413169
11832 1413169 4446808 5014049 3697871 3606415 5778586 6540767 2578265 -2556208 -1696535
11823 -1696535 5485142 10563986 7784901 2437083 2814781 7699721 8851331 4287298
11815 4287298 1101584 3945574 8086524 7226845 2496901 -488994 642107 4236910
11807 4236910 8085304 9788118 6737701 -316666 -6272535 -7811991 -7657011 -9015607
11799 -9015607 -9446087 -5498021 -386552 -370457 -4787956 -6468044 -2210584 3453079 6046622
11790 6046622 6819271 8540266 10612009 11163711 10344788 8968365 6763860 4112328 2990696
11781 2990696 4365353 6777796 8567575 8964330 6369885 -722979 -9398222 -12633290
11773 -12633290 -6903298 2859449 8484328 6981910 1810334 -2160721 -2599597 -226850
11765 -226850 2291175 2769539 2120904 3351022 7138039 10436000 10736858 9469055 9283061
11756 9283061 9861102 8675275 4843583 395101 -1845675 -911547 953373 -247681
11748 -247681 -5610904 -10490813 -9264193 -2971983 1634111 1374462 318730 2373819
11740 2373819 5360243 5968160 5878326 8001192 10235771 8699463 4791320 3100864 3776272
11731 3776272 3185282 1563653 3219416 7998950 9139825 2842079 -4971790 -5644582
11723 -5644582 1462232 9132858 11321409 8263753 3613248 370292 136971 3166543
11715 3166543 7263625 8319981 4186765 -2173105 -5082929 -2162026 3211575 5873038
11707 5873038 3879032 -1281159 -7516237 -12939539 -15108501 -12518592 -6894694 -1536016
11699 -1536016 2547820 6293775 8846395 7908368 4366503 2566318 4453809 6997340
11691 6997340 7048469 5016005 1857284 -3149560 -8595415 -9311161 -3049118 4385413 5547551
11682 5547551 767037 -3485322 -3903189 -3154614 -4239548 -6619152 -8108023 -7344785 -4519023
11673 -4519023 -1954817 -2674395 -5921649 -6365842 -1075113 5264963 6298448 2706389
11665 2706389 -22274 -270937 -695434 -1360937 610604 4357934 4946286 1153373 -2302197
11656 -2302197 -2275370 -1517449 -2851620 -3791047 -561373 5496308 8894186 6204467 -380590
11647 -380590 -5007681 -3640784 1379817 3443328 -60775 -4083003 -3410857 -340936
11639 -340936 88313 -938979 959468 3580086 257838 -8224836 -12975201 -10046452
11631 -10046452 -5516582 -4709246 -4920224 -3093373 -2611387 -6594267 -10999104 -10782031 -7882601
11622 -7882601 -6971057 -7477742 -5768935 -1811645 1752932 4170349 5432110 3790619
11614 3790619 -832448 -4056664 -2313078 2012489 4829010 6160194 7349981 6686270
11606 6686270 3308210 1542787 4852520 8424217 4720085 -5274881 -12829502 -12502845
11598 -12502845 -6629879 214669 5382390 7174029 5243157 2476871 2395795 4744545
11590 4744545 6935856 8536613 10394284 10864004 7502914 1668951 -2663679 -3812741
11582 -3812741 -2677903 77524 3298857 4000510 1162059 -1274359 233560 2878901
11574 2878901 1959041 -1282325 -2062273 -110579 918859 363654 561180 1452013 1552519
11565 1552519 2750478 7373485 11990472 11444989 7818166 7539741 10491598 10488719 6338004
11556 6338004 3392186 3534680 2941360 1116169 2339628 5633786 3403227 -5645817
11548 -5645817 -11627049 -7188909 1860217 5775912 3879377 1991437 2707598 4663547
11540 4663547 6878798 8042624 5511334 46405 -2544194 841695 5470808 5886985
11532 5886985 3589920 2918245 3921681 4326531 4104229 3101104 -1157072 -8003122 -10911118
11523 -10911118 -6175265 401365 1775249 -124273 591858 3213017 3016208 727703
11515 727703 646858 1801504 -183107 -3823691 -3067818 2584585 7180383 7318556 4588353
11506 4588353 -373393 -8030643 -14111402 -12387580 -4741494 -364207 -3023863 -6928162
11498 -6928162 -7259089 -6361133 -6179600 -3166153 4016938 9096615 6982128 2273795 2134990
11489 2134990 5037251 3896976 -2271338 -7084246 -6325920 -2497909 468322 1829954
11481 1829954 2214999 1287593 -828746 -2109445 -324486 4503446 9699202 11611324
11473 11611324 8371758 1878835 -3599422 -5435153 -4351120 -1986494 1048585 3571572
11465 3571572 2882294 -1977673 -7449263 -8651224 -4849455 334085 3642513 5074211
11457 5074211 6359413 8498827 10958351 12054537 10353449 6742379 4382528 5156137
11449 5156137 6961400 6397731 3487321 1415559 1779976 2785955 2836093 3303632 5961336
11440 5961336 9267469 9431353 5022126 -835578 -3238357 -304637 4597133 5719444
11432 5719444 1049404 -4623226 -4469231 2209642 8752243 9081755 4306807 -555541
11424 -555541 -3510242 -5540745 -5873314 -2696933 1639351 1918927 -1987760 -3974468 -1138713
11415 -1138713 1191260 -1863360 -6212062 -5211239 -784272 -328045 -4310660 -5647410
11407 -5647410 -2049144 -141167 -3969624 -7345170 -3535771 3122959 2798501 -5275622
11399 -5275622 -11266180 -8054730 -22567 3721765 793927 -3236989 -3430645 -1569813
11391 -1569813 -2355184 -5682401 -6107295 -720123 5817167 7076054 3455569 826121
11383 826121 1735448 2969785 2159132 1582083 3529081 6194534 6609828 4411640 858266
11374 858266 -2682923 -3981628 -1605953 1337650 -142865 -4780435 -5221963 810458
11366 810458 5791759 3289164 -2500483 -4115674 -2326807 -2818159 -5495337 -5598567 -3222419
11357 -3222419 -3130498 -5710207 -6205571 -3462684 -1970578 -3829071 -5394811 -3827488 -1027540
11348 -1027540 1020279 3276019 5650810 5269211 1840743 373799 4899310 12432468
11340 12432468 16366488 13931869 7981375 3082006 1757192 3322615 4994088 4805584
11332 4805584 3757806 4284314 7095018 10685345 12936797 11937631 7180326 1838859
11324 1838859 1083891 5165322 7281589 2382507 -5157434 -7871369 -5981305 -5146311
11316 -5146311 -6030260 -4398302 -647328 -232479 -3684596 -4921673 -1680525 634755
11308 634755 -1389266 -3486121 -1622803 1496393 2197074 1488476 351335 -3959378 -11321440
11299 -11321440 -14628404 -8993240 -305583 2348592 -821432 -2344832 634641 3572320
11291 3572320 2591346 -798019 -3284905 -3724739 -3186031 -3603483 -5775120 -7309901 -4892659
11282 -4892659 34962 1817182 -927919 -2463097 703643 3320485 73543 -4362978
11274 -4362978 -1752302 6439737 10632632 6732016 188012 -3350319 -3762723 -2042031
11266 -2042031 2355627 7424677 8177207 3454845 -1585891 -2733098 -2348123 -4660370
11258 -4660370 -8910941 -10788672 -8744674 -5709823 -5179443 -7622198 -10643418 -11668785
11250 -11668785 -10281794 -7837873 -4971249 -906953 4126218 7935711 9397343 10087320
11242 10087320 10638939 8399954 2517011 -1214279 3897506 15445642 23130688 20725810
11234 20725810 12185958 4781132 961540 -705354 -790038 999286 3034423 2325271
11226 2325271 -2209420 -8376307 -12404769 -11824213 -7562396 -3155172 -875089 622809
11218 622809 3141841 4745485 1996500 -3850375 -6832546 -3823123 1119090 2053072
11210 2053072 -1522723 -5040228 -5048989 -2537525 -547233 -580588 -1849596 -2925112 -3284603
11201 -3284603 -3336989 -3520096 -3876230 -4174738 -3557257 -420105 5573972 11104772 11231139
11192 11231139 5276201 -1366673 -3312429 -1427152 -764401 -3643673 -7313339 -7786439
11184 -7786439 -3936147 1561028 3896678 180787 -6504439 -9112021 -4828422 1224594
11176 1224594 3271564 2736891 4485636 8084041 8933719 6875850 6851121 10370930 12742641
11167 12742641 10621384 6590763 3762551 1220141 -1878374 -2600658 1014901 5196273
11159 5196273 5035405 1387565 -1016299 -338104 1545872 3206795 4267420 3020540
11151 3020540 -1854172 -7308627 -8174890 -4236752 -1014147 -1945903 -3524196 -853434
11143 -853434 4808633 7701877 5508888 1904024 884025 1840812 1798135 79686 -1658454
11134 -1658454 -2662844 -3576954 -4060725 -2689722 245669 2320501 2402323 2244481 3213134
11125 3213134 3689686 2025914 314462 2047026 6447134 8216774 3779047 -4318478
11117 -4318478 -10447388 -11998521 -10936427 -9746932 -7732609 -2742721 4130164 8137485
11109 8137485 6484387 2246091 285565 1045618 1757708 2191459 4249318 6347935 4335502
11100 4335502 -765217 -2357157 1654203 4752814 1836526 -2887524 -3475309 -1783986
11092 -1783986 -2407737 -3211013 437888 5514870 4957078 -304091 -2531070 37835 1237611
11083 1237611 -1430268 -2904344 -408676 1929607 1349067 708864 912252 -2259534 -9188890
11074 -9188890 -12758834 -9210324 -4519890 -3501488 -977026 7556704 14068306 8124423
11066 8124423 -5706818 -12615821 -8070249 -2145406 -3017133 -7063750 -7935414 -5771397
11058 -5771397 -3106272 535322 4859479 5798500 1655950 -2441114 -1397811 2403216
11050 2403216 3658291 2756970 3967784 7086196 7132522 2229025 -3597592 -6363580 -6454567
11041 -6454567 -5763759 -4581090 -3311389 -3799678 -6263035 -7486927 -4956738 -832045
11033 -832045 1130566 861578 753417 579423 -1989084 -6059824 -7507301 -5399912 -3881767
11024 -3881767 -5526273 -7184612 -5656437 -3459107 -4428868 -6639423 -5227177 -655049
11016 -655049 1682560 -138292 -2231403 -1783200 -864380 -1475632 -1708357 160638 1621507
11007 1621507 -416487 -4494968 -6622275 -5807920 -4446659 -4147916 -4033006 -2971610 -1309531
10998 -1309531 -24642 675335 1611558 3658171 6192094 6943099 4650818 1507970 951315
10989 951315 2971389 4076543 2479738 508759 467051 842444 -996455 -4318666 -6140732
10980 -6140732 -5829018 -5548051 -5927136 -4146797 1832946 8648906 10036945 4717745 -801201
10971 -801201 711 4694905 5114327 -424649 -3934533 304652 6277069 4425031 -4562539
10962 -4562539 -11326021 -11278697 -8718087 -7620708 -6294885 -3216752 -1179726 -2192244
10954 -2192244 -3562763 -2500183 -321093 866040 1632761 2714100 2970997 2278523 2367339
10945 2367339 2713289 498613 -2836953 -855396 7969502 15019238 11653804 670233
10937 670233 -7703478 -8267496 -4427769 -1985203 -3892141 -8899752 -11767508 -7694257
10929 -7694257 387286 3329570 -1673505 -5876329 -2035353 3619892 953672 -7470997
10921 -7470997 -9951357 -3520102 2801580 2761279 322693 375786 1660413 2355021 4300380
10912 4300380 7511148 7817130 4432382 3220918 7624069 12493257 12197565 9045355
10904 9045355 7582529 5841789 -340812 -8094243 -10664541 -7911883 -5907024 -6675336
10896 -6675336 -5944183 -1801292 1786876 2354690 3254231 7113342 10563753 9965414 7847787
10887 7847787 8298898 9341122 6130144 -112767 -3045723 -845868 1760169 2205907
10879 2205907 3966743 8769030 11386929 7265720 402916 -2423222 -1683409 -2694827
10871 -2694827 -5739444 -6061123 -2801016 -333174 -201581 942469 3915925 4761595 2444802
10862 2444802 1881424 5771395 9779593 10076873 9688907 12226508 14653983 12321693 7088718
10853 7088718 4322056 4935458 6081436 6796817 7294865 5612846 1102539 -1406463 2331047
10844 2331047 7695070 6116930 -2600487 -9822589 -9826312 -5395512 -1333560 1081219 1977916
10835 1977916 1142649 77734 977012 2576204 1802760 59558 2179017 8102577 11922901
10826 11922901 11274690 11089064 14433287 15862459 9405139 -1231209 -6762882 -4464179
10818 -4464179 -306745 364247 -1182041 -1402725 -318625 -348985 -1778537 -2621778 -2604208
10809 -2604208 -4238374 -8451132 -11347605 -8417757 -1376467 2839793 733965 -3729500
10801 -3729500 -5513196 -5113180 -5799165 -7721457 -8852435 -9237011 -9887011 -9400604 -6179027
10792 -6179027 -2308473 -612748 422275 3650657 6879385 5525927 703952 -1962764
10784 -1962764 -1528969 -2782165 -7266893 -10447838 -9876394 -9170371 -10665760 -10696468 -6580194
10775 -6580194 -2639298 -3934246 -8207248 -9495937 -6729738 -3573651 -2048337 -1394484
10767 -1394484 -1794635 -4344013 -7813137 -9536822 -9439695 -9717478 -10452223 -8789297 -3230421
10758 -3230421 3619005 7611219 7157028 4279969 2247609 2150442 1529353 -2928211 -10899233
10749 -10899233 -17737808 -19172271 -15713547 -11278935 -8254718 -5459271 -1040429 3976694
10741 3976694 6290757 4542415 1523734 661728 1282200 238511 -1898093 -654411
10733 -654411 4506770 7045250 2268085 -4660558 -5561221 -1249746 531174 -2081242
10725 -2081242 -2586797 2529779 8079610 8919753 7380484 7532168 7908817 5353382 1736630
10716 1736630 1089715 2933016 3808430 3319794 3535548 3951592 2136172 -1399340 -3702789
10707 -3702789 -4395622 -5647837 -7134241 -5753567 -1383120 1532276 165405 -2605443
10699 -2605443 -2955041 -1910391 -2872808 -5306454 -5153420 -1311266 2381241 2826900 1867609
10690 1867609 2576928 4200781 4024652 2412170 2124717 3426307 3905206 3160821 3497155
10681 3497155 5225791 5477399 3047662 283751 -1605415 -4713555 -9449675 -11860140
10673 -11860140 -9273334 -4576915 -1250400 1768975 6143161 9345647 8913413 7591733
10665 7591733 8484792 8703036 4508019 -202084 1878142 10358984 17620902 19386695
10657 19386695 17694840 14264541 8731084 3569967 2916573 5394740 5323871 2157919
10649 2157919 1297352 3995903 4443598 -137703 -4009607 -1802058 3321772 5211180
10641 5211180 3604750 2515434 3109711 2819414 -87552 -4200372 -6511507 -5236458
10633 -5236458 -2187324 -1656385 -4710972 -6450092 -2879074 1663851 -145441 -7068875
10625 -7068875 -10081713 -4827833 3646926 9311762 11130186 9273375 2831796 -5955395
10617 -5955395 -11560982 -12159832 -11473559 -11852455 -11366303 -9395946 -8554415 -8816432 -6292421
10608 -6292421 -440342 3861166 4093744 3682674 5211411 6448179 5849263 5581836 6244107
10599 6244107 4959949 1421839 -674182 -584228 -1753547 -3751584 -1185455 6008692
10591 6008692 9808439 6157730 1534696 2291676 5373505 5558642 4531777 6102770
10583 6102770 8580611 8350928 5904394 2993558 -867423 -4429116 -3380664 2098096
10575 2098096 4886795 1321247 -2349380 496259 7000342 10248011 8788899 5295336
10567 5295336 1395567 -954043 1353203 7080892 9977100 7724127 5121922 4648083
10559 4648083 1848100 -5095740 -9689340 -7018611 -1581340 680563 642498 831495 87351
10550 87351 -1143283 1156984 5635690 4080149 -5018341 -11430002 -8518506 -3158208
10542 -3158208 -2792447 -3504821 195824 4279716 3553376 1367106 1524714 195875 -4835991
10533 -4835991 -7044409 -2819818 270541 -3327437 -6691926 -3327289 944419 -272011
10525 -272011 -2059955 842251 3259558 997333 314154 4694513 6033289 561554
10517 561554 -2043971 2203555 1208478 -10185877 -16411693 -7356155 2222177 -1167498
10509 -1167498 -5676383 1736895 9351239 4026729 -1933864 5029526 11703294 4382882
10501 4382882 -1470550 8698209 16032295 4297463 -1985207 18326179 33994018 13924873
10493 13924873 -6254202 16681038 42288246 13203821 -7026665 108198785 331009119
10486 331009119 452523426 341697612 122582771 3774249 18899593 45603910
10480 45603910 17986325 -10752246 2266856 21633896 14071500 2851121 10812937
10473 10812937 18347073 8627107 212007 7106923 11725605 1984653 -4627200 3609292
10465 3609292 9423023 94406 -8629087 -3097112 3609376 -1601486 -7305020 -533154
10457 -533154 9000672 7538155 242938 -2271363 -2470996 -5227664 -5619516 -1614744 -2347915
10448 -2347915 -10634820 -13970594 -5692586 1932966 -1166653 -5926722 -2566510 874133
10440 874133 -5414146 -13267759 -10300498 -1551535 -145124 -5500790 -7220802 -3824183
10432 -3824183 -2546350 -5231064 -7361528 -7624809 -7868528 -6797751 -2340273 3056427
10424 3056427 6168903 7820783 8706849 6188892 605364 -1667578 2813468 8580018
10416 8580018 9308400 5691287 1070615 -3724749 -7084417 -5882088 -2234653 -2924522
10408 -2924522 -8101508 -9540643 -4413509 -723765 -3631937 -6867024 -4498750 -935676
10400 -935676 -1195924 -965571 4426159 9659996 7957818 2921520 1962433 3737369 1927878
10391 1927878 -2966594 -4980225 -2767452 -275982 345232 -82192 -1357634 -3090623
10383 -3090623 -2663507 1351645 6034468 7610010 5274987 -100076 -6497757 -8792756
10375 -8792756 -2744608 7122895 10929367 6971421 3631172 5261013 6039873 2073028
10367 2073028 -924505 1786959 5550774 5564559 5224707 7622815 8023089 3437972 740174
10358 740174 5565297 11368473 9901069 4951698 4531155 6406321 3619106 -1434018
10350 -1434018 -1449131 1612811 236222 -3485077 -140676 10036085 15668272 11439887
10342 11439887 5352799 5779081 10776254 13796675 12267897 7008245 -565238 -7274577
10334 -7274577 -8934976 -4880382 1426254 6912734 10546206 10983451 7208720 1668770
10326 1668770 -1486560 -1448916 -312899 1771316 6535398 12690032 15458358 12003065
10318 12003065 4565076 -2088479 -4407602 -2125132 1299048 1514528 -1620928 -3702629
10310 -3702629 -2202641 -188831 -1233273 -4076461 -5498340 -5131330 -4032668 -1908404
10302 -1908404 690772 1068271 -930298 -853502 3569999 7752096 7033643 3851906 2848937
10293 2848937 3213753 2055610 1285446 3971246 6998427 4964986 -591404 -3102107
10285 -3102107 -718860 2632141 4692058 6563951 7791758 6452668 4005585 4015288 6079445
10276 6079445 6426398 4179413 1789337 -86092 -2734453 -5051087 -4391167 -1218074
10268 -1218074 2003401 5286144 9119197 9778112 3433864 -5715396 -8498114 -2557476
10260 -2557476 5126321 8149534 7059601 4914562 2583874 409855 -351719 326997
10252 326997 1272228 2873167 6005911 8394396 6791892 2976716 2523192 6778378 10729742
10243 10729742 9889934 5180383 242994 -2115842 -321106 5078422 10336501 11862900
10235 11862900 10646051 10022156 10246059 9619525 9415984 11959388 14754539 12970029 7610759
10226 7610759 4531546 4973159 4235949 863262 -556048 1785949 2901417 -153575
10218 -153575 -2120947 2497289 10374368 13845785 10988409 6091842 2642832 715932
10210 715932 -176762 -921 387573 -279180 -1845571 -2943385 -2517071 -501834 1742862
10201 1742862 1565382 -2197302 -6514839 -7332419 -5711098 -6684624 -10888677 -12365551 -7627771
10192 -7627771 -2079340 -2552364 -6876075 -7049027 -1508618 2403699 -439821 -5214632
10184 -5214632 -4293524 1682640 5147039 2746628 -646898 -473580 402126 -2765410 -7827605
10175 -7827605 -8552802 -4553885 -1592087 -1663151 42416 5981873 10998504 10296231 6635040
10166 6635040 4517060 2735200 -1120397 -3656194 -663673 4410902 4954234 1832572
10158 1832572 1448709 4558837 5380589 1658431 -2439584 -4080513 -4798542 -4874009 -2389538
10149 -2389538 561880 -1509105 -8158685 -11589300 -7714864 -1878373 29494 -396613
10141 -396613 760907 2564189 2418165 1665701 2510824 2856140 -502599 -5795311 -7942623
10132 -7942623 -4952776 617751 5196270 6642856 4717850 1299533 -998024 -1398895
10124 -1398895 -643042 1480011 5026258 6766803 3031624 -3632609 -5973490 -1709320
10116 -1709320 3721195 5912571 6901390 8958110 9371457 5897378 1953940 1222715 1502090
10107 1502090 -906614 -4552450 -5627303 -3913230 -1221596 2357195 5739333 4532594
10099 4532594 -2733735 -9810363 -10522970 -7941615 -8828024 -12223031 -11907305 -8192644 -7857973
10090 -7857973 -12185447 -14243666 -10156158 -4896588 -3615830 -4399626 -3819982 -3360382 -5013373
10081 -5013373 -5437089 -802032 5317280 5201629 -2359805 -9752650 -9683280 -2965935 4166654
10072 4166654 7684843 8304400 7593668 4605356 -1867558 -8988089 -11032672 -6225653
10064 -6225653 -5593 1190645 -2049540 -3554965 -285608 4333720 6253517 5867645
10056 5867645 5418185 4932133 3657133 2875265 3730802 3925843 511331 -4631340 -6175827
10047 -6175827 -2792424 666891 115424 -2083848 -1217641 2638715 5451443 5822072 6271451
10038 6271451 7758988 7416844 3507574 -1096235 -2999904 -2864319 -2915936 -2632997 -655453
10029 -655453 1277181 822145 -111843 1792565 4384395 2103529 -4511699 -7933865 -4572657
10020 -4572657 -251861 -895075 -3606938 -2605950 758417 991621 -1654269 -2216927 -702746
10011 -702746 -2325275 -7252628 -8500886 -3197512 1529849 -978785 -6491616 -6401185 -539605
10002 -539605 3907364 4188084 4800383 8214513 10237453 7329617 2777165 1712559 3961480
9993 3961480 5829345 6116137 6276020 6562387 6113988 5844281 7456859 9960820 10489342
9984 10489342 8504134 6240754 5027801 4018511 2649752 1603853 1129077 907028
9976 907028 1546074 3656583 5798334 6236724 6096653 7217674 7712565 4503168 123098
9967 123098 1005551 7609454 12394616 10281909 5123128 2100153 -181596 -4648976 -8193441
9958 -8193441 -6148135 -865318 1454045 473148 1076470 3998241 4422444 605965 -2677434
9949 -2677434 -1323874 2504013 4347758 3482196 2876350 5291762 10407923 14323991 12473446
9940 12473446 5086858 -1667422 -2846842 -1140005 -2259456 -5974325 -7048944 -4140705
9932 -4140705 -1814454 -3215245 -6153846 -7687740 -7929519 -7936698 -7787515 -7793164 -8063219 -6600693
9922 -6600693 -1796048 3317467 4036973 1262941 452300 2832822 3596725 228329 -3384823
9913 -3384823 -3473687 -1520850 -189541 731532 1327696 -619442 -5342546 -8767376 -7883622
9904 -7883622 -4850314 -2771531 -1034386 2091888 5677792 8068941 9625532 10914738
9896 10914738 11071673 9985286 8821614 6784999 1576634 -5053836 -7248366 -3308431
9888 -3308431 1090008 1401880 833323 4327862 10917829 16955435 22228950 27004549 27059272
9879 27059272 18697286 6544172 -385704 314650 2929357 2533290 80944 -1601434
9871 -1601434 -2073965 -2218719 -2040156 -799541 2008631 5774375 8148167 6756706 2595219
9862 2595219 -427545 -589791 -205877 -837606 -378065 2379430 4034789 1323704 -3338709
9853 -3338709 -5205384 -3890135 -2652401 -2690783 -2070420 666552 4925229 9110695 11042558
9844 11042558 9005885 4397306 1103768 430365 -322813 -2273485 -2087259 2142599 6293889
9835 6293889 5683583 1808348 -463451 704399 4333332 9609611 14406695 14625166 9709117
9826 9709117 5118079 4591203 4340638 489565 -2683611 685847 7326609 9176674 5711045
9817 5711045 3184862 3466557 2802442 866339 1530975 4088544 3034418 -1542691 -2126696
9808 -2126696 4591680 11888071 12603242 8294112 5015781 5205454 7241931 8618640 6711967
9799 6711967 674631 -5137462 -4298380 2735546 7747612 5670619 1302560 1397333 4734043
9790 4734043 4975032 286568 -4973547 -6755408 -5321288 -3193302 -2175543 -2442075 -2609769
9781 -2609769 -715170 3627745 8037506 8988746 4932876 -1636290 -5174952 -1919038
9773 -1919038 5081317 7936811 3133588 -3522559 -4342522 110401 2722191 287056
9765 287056 -2903288 -2062313 2186878 6013109 6961837 5268153 3075167 2660731 3564529
9756 3564529 2525481 -1461125 -4303900 -2577234 502041 -221540 -3419993 -3536943 9157
9747 9157 2365100 1261524 -1092041 -3673097 -7195407 -9067401 -5450507 835669 2282381
9738 2282381 -1931480 -4495119 -2019825 -156658 -3365740 -7906590 -9641850 -11071082
9730 -11071082 -14910175 -17524599 -15154436 -10898635 -8960140 -7122881 -1886317 3418762
9722 3418762 3139836 -1293938 -3731278 -2702070 -1571293 -1248606 212539 1844267 623420
9713 623420 -1914820 -527179 5219568 9096163 6855955 2087956 882953 3905616
9705 3905616 6500077 5021910 816099 -1880453 -865962 1872910 3208735 2997142
9697 2997142 3195648 3518818 1473830 -2536712 -4171884 -1364034 2107225 2198727 419203
9688 419203 446910 1853532 1526240 -707665 -2428244 -3325975 -5014601 -6686331 -5432815
9679 -5432815 -1336943 1569078 470766 -2897254 -4945503 -3981615 -718034 2685592
9671 2685592 3361345 -303763 -6206280 -9511542 -7389552 -1948054 2524140 4414931
9663 4414931 5407723 6420293 5199012 -52007 -5937165 -6416383 -939092 3804307 2812549
9654 2812549 -269175 569548 3650125 2277742 -3678971 -6319463 -1375312 5243851
9646 5243851 5818417 711975 -3804725 -3864684 -544008 3148809 4769683 3981131 3493470
9637 3493470 6085445 9680595 8957290 3100910 -2378456 -3284701 -1397548 529590 2703175
9628 2703175 4066907 459542 -8010767 -13465412 -10432600 -4710280 -4781028 -8358218 -6246521
9619 -6246521 2355159 7922482 4910400 -485195 -83836 5142849 8058157 5483189
9611 5483189 779760 -2073415 -3207282 -5177956 -8465855 -10134129 -7326766 -1159654
9603 -1159654 4379329 7012820 7528703 6862269 5083488 3741973 5155882 7795506 6631135
9594 6631135 600204 -4423948 -3382127 1126586 3478549 2786069 1765764 1314028 1022932
9585 1022932 2160474 5086970 6226559 2749225 -1995718 -2911371 -797823 -125048 -1353402
9576 -1353402 -1494065 -528595 -708474 -645426 2845479 7289160 6303246 -137632 -4152075
9567 -4152075 -892309 5010473 6872761 4792349 3571620 5411569 8082880 8372647
9559 8372647 5065836 -225857 -4187127 -4953025 -4063512 -3834822 -3986002 -3159340 -1904337
9550 -1904337 -781224 2268626 7899831 10714343 4982865 -5613215 -10924758 -7768794
9542 -7768794 -3347991 -3369634 -4230875 -1141145 2542912 464957 -5975782 -8647265 -3647528
9533 -3647528 3826078 6313752 2709756 -1202327 294405 6267652 10222836 8266622
9525 8266622 4480465 5541679 11116525 13796472 9207114 1872464 -1210973 536467
9517 536467 2018049 265863 -1907864 -405142 3874908 4795399 -2101641 -12892222
9509 -12892222 -17907710 -12490987 -2660310 2451858 1192681 -1407752 -2613036 -4411983
9501 -4411983 -7377347 -8114934 -4610252 285588 2789676 2530421 1613754 2025011 4561787
9492 4561787 7654874 7532341 3018268 -625374 2514180 9664261 11720367 5762115
9484 5762115 -1087285 -2217802 529248 2600928 4055291 6453274 7607097 4965911
9476 4965911 727645 -1453802 -1899888 -2382526 -1265147 3473597 8592688 8559586 3225086
9467 3225086 -2136699 -3634825 -1449860 3017496 7920161 9652207 5939192 511456
9459 511456 -197822 4021995 6206033 1959741 -4179962 -5094005 -587924 3179377 2169041
9450 2169041 -1393682 -3319593 -2735887 -1772302 -1949359 -2845095 -3733353 -4638493 -5369773
9441 -5369773 -4983714 -3167636 -1214109 -579123 -1202974 -2256851 -3582634 -4935491 -4750838
9432 -4750838 -1794728 2312319 4551136 4718698 5846229 9454535 12386009 10145700
9424 10145700 2676137 -4733611 -6614249 -2790810 1858387 3093927 1762340 1588948
9416 1588948 3755343 6118971 7270478 7819137 7164201 3242374 -2827244 -6366070 -6063016
9407 -6063016 -6444200 -9694867 -10454965 -4588827 1846077 359427 -6583395 -9038979 -4865650
9398 -4865650 -1764747 -3737168 -5480663 -2931680 -426640 -2992132 -8404821 -11275632
9390 -11275632 -9534331 -3546327 5429310 12631101 11845528 4111974 -1254844 1590693
9382 1590693 7721827 9846861 8054468 6310671 5005462 2904480 1921484 3964615
9374 3964615 6558492 6718534 5599553 4710598 1844312 -4069258 -8433773 -7017677 -2597660
9365 -2597660 -28506 1140567 3175632 3667870 -540102 -6461386 -8867477 -7915565 -6416930
9356 -6416930 -3435210 2025253 5069228 1375277 -3750194 -2265602 3380427 4282230
9348 4282230 372021 -71437 3875466 3189678 -5126941 -11202333 -6734943 3147341 8444686
9339 8444686 6971806 2406572 -3553447 -10144601 -13423493 -10074727 -3023789 1601872
9331 1601872 1394581 -1460523 -3779927 -3349073 -3821 3185104 2576502 -941543 -2881386
9322 -2881386 -1725062 -8830 1525697 4713620 7727357 5506391 -796349 -2689526
9314 -2689526 2910275 7580690 3956455 -3044436 -5045341 -3485801 -4751452 -7288030
9306 -7288030 -4480881 2257364 4387250 -18527 -3691714 -2495370 -694838 -1409683
9298 -1409683 -906899 3279728 6166085 2797379 -3549483 -6083196 -3479562 632265
9290 632265 3721497 5155991 3855985 146456 -1938569 981874 5991762 7013739
9282 7013739 3160192 -225667 818764 4016962 4773925 2023780 -1528996 -3175125
9274 -3175125 -2506984 -821796 395434 442268 -349002 -810927 585059 4627811 9763032
9265 9763032 12185953 9329287 3287044 -1277035 -2799338 -3648791 -4784763 -3725749
9257 -3725749 -267723 155994 -6391711 -14897950 -17153035 -13431714 -11522318 -14038272
9249 -14038272 -14475554 -8589877 -2385885 -3447774 -9484816 -11928235 -8024103 -3029398
9241 -3029398 -1576600 -2544278 -2585040 -236220 3935141 7876385 8706694 5750132 2318508
9232 2318508 1538037 1715422 -471361 -3739265 -3956124 -1146206 759032 988637 2750142
9223 2750142 6088146 6068804 404959 -6335499 -8912683 -7440083 -4762867 -2206467 -622227
9214 -622227 -1377014 -3295870 -2515298 1780617 5375648 5331777 3799856 2753689 260811
9205 260811 -4136305 -5939754 -2798654 94648 -2161461 -5748869 -4668979 -1331041
9197 -1331041 -1956746 -4508996 -1262594 7278813 11259084 6039628 -1215556 -2831567
9189 -2831567 -588054 68374 -887430 -414675 769975 -359547 -3300986 -4596704 -3049934
9180 -3049934 -586145 1253198 2476284 2740124 1119452 -1848629 -3804584 -3138949 -1206198
9171 -1206198 -1068099 -3670312 -5993418 -4528045 -462242 1164029 -1581654 -4619114
9163 -4619114 -4151009 -2461386 -3706360 -6834761 -7634737 -5888063 -4899322 -4852824 -2623455
9154 -2623455 1558643 3104138 62885 -3867631 -4936612 -3596268 -1759154 -47603
9146 -47603 786635 -162983 -1161218 862926 4900850 6107507 2875217 -941879 -2489767
9137 -2489767 -3599694 -5818543 -6903348 -5267100 -3184649 -2323359 -747438 2030799
9129 2030799 1873610 -3492792 -9077827 -9038828 -5095506 -2912730 -2861276 -718882 3819825
9120 3819825 5876000 3134922 -582838 -1164061 362775 391872 -1749573 -3082978 -971368
9111 -971368 3590375 7035045 7334469 6164510 6129618 7104488 7506976 8016324 10432865
9102 10432865 13213809 12582552 8662529 5718676 5104019 3381022 -351013 -1182414 3765596
9093 3765596 9565428 10271657 6882666 3519986 280430 -4086870 -6547138 -4068504
9085 -4068504 -718363 -2832584 -8613217 -10085767 -4898058 1167491 3684202 4310906
9077 4310906 4814614 3342092 -788539 -4227685 -4395991 -2757781 -1076398 1246644 3792214
9068 3792214 3428530 -985637 -5578054 -6105801 -3074150 177257 2040452 2899964 2945632
9059 2945632 2226809 1710869 2513361 4755739 7829419 10714433 11934652 10704567 8039717
9050 8039717 5242452 2169478 -873575 -1118551 3183975 8365478 8830539 4526319 239863
9041 239863 -2229221 -5461938 -9426589 -9675877 -4829112 309616 2349860 4141823 7891688
9032 7891688 9256082 4064703 -3501503 -5919121 -2623240 861298 1817006 2039571 2123679
9023 2123679 501298 -2136764 -3238957 -3143662 -3946765 -3833757 1256448 9611177 13827559
9014 13827559 10813746 5745605 3608654 2893650 1306348 1711159 6811681 12275500
9006 12275500 11532718 4942221 -1725944 -6006562 -9671715 -12083648 -9693928 -3167918
8998 -3167918 1335103 364822 -2441397 -2823443 -2042636 -3265857 -5977540 -8021097 -9844147
8989 -9844147 -12207281 -12273924 -7046505 647609 4452618 2328064 -2026142 -4987889 -5888078
8980 -5888078 -4477305 -495646 3578201 3973998 908988 -1796169 -3070947 -5482749
8972 -5482749 -8555484 -7390876 -1038058 3775883 1992082 -1929931 -1430397 1288644
8964 1288644 -743402 -6999145 -9384692 -4227800 3159410 7048586 7656682 6886787 4096657
8955 4096657 -399552 -2768920 -982669 850092 -2037762 -7446058 -8397229 -2240778
8947 -2240778 5858155 8781951 4716425 -1825490 -5124030 -3951935 -1924049 -1940321 -1894482
8938 -1894482 1756863 7377213 9123565 4933295 -665162 -3190071 -3464644 -3861749 -3530531
8929 -3530531 -1215959 467700 -1583887 -5125827 -4957612 -503836 3478104 3847608 2585764
8920 2585764 2642345 4098474 5858288 7840105 9404507 8115710 2695391 -3969723 -7104944
8911 -7104944 -5234820 -1669652 -631746 -2742792 -4761498 -3522678 470100 3928585
8903 3928585 4850020 4308380 3846419 2977125 780030 -1604174 -2433154 -2486791 -4054629
8894 -4054629 -6879093 -7810193 -5182351 -1203460 1142486 1732654 2566782 4741988 7303549
8885 7303549 8137209 5446822 -255439 -5182653 -5438657 -2236288 -1383668 -5398792 -8703678
8876 -8703678 -4434763 5331597 10982191 7656756 1439408 652862 4699581 5944021
8868 5944021 1030326 -4754878 -5348822 -2068620 -1209181 -5617810 -11655636 -13992611 -10890776
8859 -10890776 -4447364 2182420 6582736 7550055 5646839 3217662 2506369 3242247 2856272
8850 2856272 -331540 -4718503 -7009599 -5899484 -3153417 -957159 570141 2506317
8842 2506317 4849613 6437203 6669051 5924632 4379249 1835596 -1059879 -2816704 -2790895
8833 -2790895 -1717433 -247785 1562681 2823638 1825674 -1235272 -3349831 -2371537 -124271
8824 -124271 421800 -215419 764633 3187022 3540385 762283 -1027878 2125959 8086446
8815 8086446 10762306 7340090 1066727 -2990046 -2987682 -842816 578745 -157565 -2600979
8806 -2600979 -5118073 -5874166 -3907826 -170140 2417863 1103687 -3396861 -6425668
8798 -6425668 -3924110 2443317 6416910 4027884 -2162758 -6543288 -6522155 -3759979 -942071
8789 -942071 455478 -14474 -1653168 -2192059 277210 4284691 5777529 2930231 -1368982
8780 -1368982 -2968690 -1011383 2283094 4972569 6509161 6390935 4303299 1800811
8772 1800811 1400620 2993250 3203458 -87509 -4164172 -4510045 -540177 3960356 5838093
8763 5838093 5563609 4728378 3031771 -432982 -4213084 -5062847 -1751627 2897946 4455991
8754 4455991 1221588 -4056590 -6852702 -5283445 -1647312 475351 -88587 -1824158
8746 -1824158 -2847763 -2184041 353655 3544458 4479284 1367673 -3213632 -4450319 -1244302
8737 -1244302 2602402 3922645 3768635 4018927 3892330 2444969 1430066 2297711 2985737
8728 2985737 1612510 987640 4577969 9516773 9248345 2959238 -3208767 -5127604 -5281390
8719 -5281390 -6575638 -7045926 -4179321 -311511 408657 -2223098 -5364022 -7554649 -8732350
8710 -8732350 -7745841 -3668653 1456319 4563624 5519697 6158519 6351241 4501282 1500153
8701 1500153 463911 2040510 3263549 2069199 93950 -389981 173968 191115 -63620
8692 -63620 730149 2011591 1514342 -1439571 -4382581 -4176331 -392401 4318157 6842026
8683 6842026 6069176 3100909 -44113 -1731303 -1758864 -1826752 -4030685 -7866537 -9789032
8674 -9789032 -7420843 -3320626 -2213023 -4834621 -7305077 -6775029 -4521140 -2569029
8666 -2569029 -737170 1094207 1166176 -818631 -1366803 2163395 6608039 6707646 2593425
8657 2593425 -561869 39409 1815084 1525156 -758082 -3248675 -4680452 -3802883 322871
8648 322871 5993027 9238047 8049384 4434197 1358658 -308419 -1028796 -1187127 -1588005
8639 -1588005 -3133158 -4953331 -5175204 -4367933 -5175287 -7247285 -6372561 -1276226 2475168
8630 2475168 -531665 -7296410 -9906087 -5879416 -259115 1933707 466073 -2871867
8622 -2871867 -6678104 -8562126 -6337605 -2541111 -3066618 -8570741 -11868180 -7832756
8614 -7832756 -1631381 -1458222 -5972164 -6053146 1432018 8993449 9685356 6339647 5358411
8605 5358411 6242188 3466833 -3363788 -7774769 -5609596 -809775 468057 -1904762
8597 -1904762 -2972066 -253535 3184971 3634014 1971965 1908269 3979371 4155932 -183396
8588 -183396 -5095249 -4308031 1648454 4838792 514981 -5693506 -5426548 372822 3104563
8579 3104563 -530582 -4240579 -2779814 -83037 -2089842 -6660986 -7155537 -3078882
8571 -3078882 10113 211003 1498649 5290765 7056696 4449088 2528705 5927482
8563 5927482 10453818 8700764 1447059 -3119619 -1042614 2762234 2667129 -379824 -2383894
8554 -2383894 -2756276 -3402683 -4017701 -2471329 1019908 3716180 4401917 4568768 4856602
8545 4856602 3061905 -2422621 -8626285 -9786348 -3523093 5917958 11472394 10120033
8537 10120033 5191878 1670069 450180 -1192896 -4142539 -5349538 -2528651 1488533
8529 1488533 1889480 -1650037 -4636581 -3854344 -799413 1751391 3553536 5132802 4429663
8520 4429663 -1338221 -10383539 -15813530 -12382009 -2994554 3626187 2647035 -1097192
8512 -1097192 631583 8059967 12285169 7499095 68334 387654 8123073 12560708
8504 12560708 7962835 1046928 52852 3301002 4289164 2834988 3594119 6398322 6324488
8495 6324488 3023351 2233404 6484540 10992544 11453169 10220590 11252233 13516837 13439602
8486 13439602 10576553 7013089 3631361 464891 -1435291 -1929667 -3713357 -8841144
8478 -8841144 -14719812 -16834830 -14317632 -9676292 -4232088 2455780 9041768 12047466
8470 12047466 9848437 4488097 -961458 -4641271 -5365028 -2569359 2064048 4881168
8462 4881168 3576692 -586943 -4484378 -6172838 -5877560 -4981377 -4703010 -5266185 -5925022
8453 -5925022 -5868979 -4908015 -3109108 -463431 2417847 3959045 3036885 510000 -1576853
8444 -1576853 -2271624 -2477707 -3341000 -4398199 -3819076 -787832 2714983 3796226 2752534
8435 2752534 3278415 6881865 9452373 6879877 2303803 2531951 7445559 9200511 3867167
8426 3867167 -2300456 -1944310 3382549 7083519 6779139 3955238 -1646674 -10196552 -16751383
8417 -16751383 -15641413 -9208689 -5275189 -6137325 -7008634 -5479926 -4679067 -5398080 -3040107
8408 -3040107 4101348 10453374 11458578 10214324 10823472 10739696 6092325 387590 553103
8399 553103 6274617 10065174 7498296 1640268 -2777447 -4360337 -3499252 -515812 3017063
8390 3017063 4459864 3221719 1553869 1508853 2988399 4771927 5236376 2427147 -3677999
8381 -3677999 -9049912 -9076712 -4735933 -2084476 -4592593 -9103152 -10819117 -9221564 -6887222
8372 -6887222 -4963228 -2540119 901348 4777938 8289087 10340285 9671905 6726679
8364 6726679 4219449 4015027 4521647 3162686 390842 -1109589 -528013 349038 336337
8355 336337 198646 517998 616176 225490 68054 5482 -1321903 -4075016 -6388364 -6993716
8345 -6993716 -6784098 -6739455 -6403788 -5698024 -5920964 -7218457 -7417107 -5498219 -3740528
8336 -3740528 -3690587 -2600119 2409386 8745508 11347064 9871150 8083821 7088927 4683013
8327 4683013 1257827 177511 1191412 -290628 -5073994 -7322865 -3234749 2683643
8319 2683643 4003238 474570 -4282031 -8547531 -11283935 -9684637 -3700571 572446
8311 572446 -1932627 -7594116 -9546932 -7729990 -6735266 -6411763 -2816043 2568222 3132233
8302 3132233 -2460605 -7672856 -7553130 -4367849 -2146231 -1652331 -2577738 -5080131 -7296643
8293 -7296643 -6489360 -4023491 -3981661 -6006697 -5473142 -1627801 1152207 1420234 2578584
8284 2578584 5027447 4560930 1231879 1070344 5168460 6164463 720159 -3800041 -1760054
8275 -1760054 835985 -2737148 -7678951 -6521693 -2837446 -4380244 -8329641 -6273683
8267 -6273683 -15824 1304522 -1913331 70186 8502952 12412241 6273673 -864115
8259 -864115 546979 7255450 10160032 6772202 665532 -5452585 -10527005 -13401588
8251 -13401588 -14360245 -14830457 -13820440 -9636462 -5832759 -8104635 -13603125 -12222227
8243 -12222227 -2046536 5783243 2961826 -4353725 -6836936 -6155540 -8613682 -11901228
8235 -11901228 -9325670 -2822484 -472656 -3148420 -4065667 -859363 1590507 489629
8227 489629 -1760234 -4397345 -9404984 -14377210 -12930681 -4813498 2154124 3231070
8219 3231070 2550263 4375120 5921434 3711304 724411 1338638 3842206 3898077 1976677
8210 1976677 1647805 3048822 3382781 1964236 -94858 -3297510 -7807713 -9793919 -5415647
8201 -5415647 2188910 5597044 3066864 338860 1538569 3918439 3889123 2901804 3456260
8192 3456260 3464944 -267732 -5257910 -5462842 228759 6410549 8689856 8458094 8574209
8183 8574209 8380320 6087392 3240306 2790200 3925521 2823871 -1374310 -4977673 -5072777
8174 -5072777 -3179767 -1869956 -601503 2458829 6461884 8840829 9335050 10061966 11722580
8165 11722580 12398386 10524948 6985469 3820830 2464399 3152696 4197584 2253259
8157 2253259 -4035265 -10726091 -12148289 -8239194 -4615329 -4230710 -3443644 991896 5586909
8148 5586909 5346961 2015777 1457221 4656821 7298690 7561409 8024398 9309975 8226380
8139 8226380 4107057 1077280 1316996 1649749 99051 34897 3298329 4982010 1338960
8130 1338960 -2071923 1842512 9186042 9676250 2566109 -2069352 716275 3480304
8122 3480304 -759400 -7035151 -6273573 1440957 8632812 11556104 12304399 11879646 8291456
8113 8291456 1828907 -3286242 -3923947 -1382449 1112070 1768435 728844 -798223 -1657745
8104 -1657745 -2023300 -2808012 -3125692 -447051 5233200 9943612 10648507 9075538 8183104
8095 8183104 7619761 5565298 2001963 -3122204 -11283807 -20636005 -23932009 -17148703
8087 -17148703 -6887946 -2343370 -2707040 -504821 4776538 6105331 1775101 -1347020
8079 -1347020 563951 3069932 3107764 4457483 8914056 10841442 6603433 1618070 1192679
8070 1192679 1552050 -2134258 -5325935 -1137921 6889027 9094041 4186234 -199099
8062 -199099 -189051 326921 -1560784 -3558508 -3803934 -3413584 -2114891 2106009 7754685
8053 7754685 10323330 9083268 7543389 6678219 4356236 2195159 5191388 12317943
8045 12317943 15254061 10029003 2813775 -84164 -928617 -3733710 -5280283 -431648
8037 -431648 7801536 11353041 8341524 4415385 3743952 4719139 4618183 3336813 1829187
8028 1829187 847026 1743280 5180098 8748661 8881741 5385067 1589709 184293 1198823
8019 1198823 3390044 4965124 3810321 55443 -2409179 -410062 3172562 2511323
8011 2511323 -2829784 -7041930 -6377503 -3907380 -4064809 -6381577 -7652517 -7455460 -7861771
8002 -7861771 -9048215 -8760740 -6208183 -3822799 -4286397 -7349419 -10496647 -11772984 -10824096
7993 -10824096 -7632330 -2070045 4182294 6817013 2886406 -4150184 -6592016 -1512764
7985 -1512764 5237279 6787973 4221171 3569457 5962531 6746690 4349232 3338151 6231327
7976 6231327 8314306 5027500 -257496 -1662907 -764301 -4102701 -11757003 -15871191
7968 -15871191 -12258265 -6873431 -6886118 -10241927 -9383022 -2561261 4318001 6455914 5361475
7959 5361475 4349895 3595684 2075617 831067 1020130 1081331 -651138 -2119008 -263557
7950 -263557 3207838 3258460 -754653 -3363077 -935278 2793019 2329150 -1741634 -4621384
7941 -4621384 -4639657 -3918132 -2910663 361501 5187980 7287303 4803314 1251904 469006
7932 469006 2014236 3646127 4879702 5401172 3241697 -1931175 -6183700 -5807462 -2697544
7923 -2697544 -1466293 -2647874 -2891632 -981973 840700 1516694 2642980 4539919 5082047
7914 5082047 3938534 4015656 6390340 7279671 3242116 -2983149 -5386687 -2305797 2195530
7905 2195530 4356185 4987274 6645027 8823851 8341169 4385837 1021039 2692111 7732300
7896 7732300 9159849 3420055 -4241959 -6276332 -3040493 -2009459 -6670438 -11206829
7888 -11206829 -8640741 -355115 6220987 7172197 5385357 5102184 6871538 8515382
7880 8515382 8515657 7133652 5331484 3699382 2410276 1803918 2325965 3288991 2496553
7871 2496553 -1351418 -6278073 -9008062 -9108598 -8775715 -8650290 -7071530 -3988831 -1852087
7862 -1852087 -1261572 314113 3411482 4396499 1595949 -436147 2851871 8714755 11035691
7853 11035691 9208001 7761323 8566688 8844296 6489829 2499090 -1822094 -5698335
7845 -5698335 -7208345 -5143313 -2295462 -2555929 -5104775 -5915165 -4249845 -2496406 -423265
7836 -423265 3969524 7904466 5460584 -2780758 -8913055 -8865525 -7163781 -7380368 -5621274
7827 -5621274 1126548 7002149 4872704 -2480720 -6018865 -2705297 2285425 3907385
7819 3907385 2094197 -653428 -1746451 481753 4405491 5323429 1580045 -2007819
7811 -2007819 -927931 1867200 870409 -2603299 -2386179 2634716 7237700 8214905 7640628
7802 7640628 7278238 5783859 2932380 1352192 2013730 2134295 -502447 -4364834 -6616474
7793 -6616474 -5951112 -2478550 2202071 4692087 2982844 129363 1153473 6015985
7785 6015985 9281281 7100221 1098186 -4627668 -6740868 -3391514 3879683 9203418
7777 9203418 8089525 3895345 3458615 6753016 7513802 4622846 4892856 11697660 18389371
7768 18389371 17763850 12032230 8032316 7455784 7571561 7772142 9308510 10898168 10144965
7759 10144965 8033946 7541209 8770782 9003235 6433367 1150053 -5685538 -10997824
7751 -10997824 -10737379 -4833628 1333475 3539245 3793842 5356114 6429755 3916602
7743 3916602 473512 1655038 7291098 11446701 10598044 6811261 2942735 -521850
7735 -521850 -3502872 -5339262 -6236708 -6557885 -5158831 -1699514 673469 -852563 -3478985
7726 -3478985 -2348486 1360285 1599255 -3042715 -6944929 -6025173 -3202520 -2912273 -4866653
7717 -4866653 -6221712 -6240901 -5756492 -4762995 -3259093 -2363147 -2429726 -1894232 355094
7708 355094 3200342 5031487 5392524 4205706 1650860 -569209 -447296 1231937 1820081
7699 1820081 1253050 2176038 5046972 7188664 7845990 9501861 12022340 10470697 2492534
7690 2492534 -6156353 -8048729 -3382754 1530757 2992290 2700568 3174084 4678334 6266043
7681 6266043 6544423 4052389 -167751 -1556277 2901335 9488918 11426821 7357368
7673 7357368 2427589 925980 1671740 1345913 -1206749 -5241191 -9635305 -12597847 -12202906
7664 -12202906 -8781223 -5145173 -3324595 -2447298 -505508 3186735 7621558 10623370
7656 10623370 9747972 4647146 -1427987 -4724618 -5507512 -6746112 -8532022 -7863502 -4780077
7647 -4780077 -3747843 -6349636 -7562701 -3817131 -467590 -4596395 -12699816 -13612620
7639 -13612620 -4377724 4636956 3777281 -3326009 -6477559 -3324121 -227048 -1149214
7631 -1149214 -2989151 -2348947 -657364 -437717 -1152293 -1374432 -1513547 -1626697 562771
7622 562771 6416033 13119989 16431729 15351315 12092271 9109500 7992192 9016775
7614 9016775 9506124 5334939 -2811270 -7534150 -3409562 4745203 7610130 3812179
7606 3812179 362492 1103957 2016929 -343198 -3016237 -2919153 -2626928 -4773861 -5851840
7597 -5851840 -1840378 3725261 4347473 1113768 1237477 6335613 9454161 5551350 -1222707
7588 -1222707 -3889954 -1787848 295902 -784554 -3754426 -5569702 -4133206 540477
7580 540477 5833840 8121839 6365660 3142398 1095331 -25775 -1446639 -2400416 -1287219
7571 -1287219 1283986 2778729 1681123 -1245400 -3965932 -4278044 -1161116 3296480
7563 3296480 4637322 1009920 -3536518 -3425879 1268979 5048937 4427583 1681552 125625
7554 125625 -719081 -2630302 -4131105 -2239408 2270323 5148311 4502110 3066908 3567364
7545 3567364 4721502 3875992 1508081 428072 1408659 2212240 1038599 -1096189 -1915006
7536 -1915006 -391577 2687206 5495448 6297490 5013533 3730590 4246883 5232239 3966007
7527 3966007 1135362 898260 4695687 8163009 7126505 4049369 4237557 7107621 6597063
7518 6597063 742740 -4557474 -3727264 1001442 3714954 2856960 893534 -1331541 -4707678
7509 -4707678 -7573689 -6738901 -2921296 -126850 1177566 4995927 11979855 16004170
7501 16004170 12266092 4624343 235081 -96189 -1034565 -4191272 -6229471 -5092241
7493 -5092241 -2718747 -855487 1033070 2478093 1252963 -2132934 -3301631 92309
7485 92309 4716459 6389050 5427498 4471340 4069115 3657898 4177274 6051876 6831250
7476 6831250 4656725 2112773 2577836 4514076 3924913 1122577 -84957 679724 -106095
7467 -106095 -2837724 -2884780 2350236 9087203 12182539 10628096 5979910 -596500 -6979980
7458 -6979980 -9640241 -7977311 -6116737 -7043364 -7846300 -4478380 1517003 5396906 6172136
7449 6172136 6306330 5890459 2575695 -2722839 -5384106 -3629809 -1032556 -629290 -559392
7440 -559392 1773354 4511228 3863261 -32467 -3308079 -3861170 -3643149 -5176890 -8120175
7431 -8120175 -10134327 -9690393 -7169610 -4146193 -2258753 -1956002 -1690402 709336 4825152
7422 4825152 6753667 3315189 -3021186 -5800256 -2161854 3353223 4350684 172786
7414 172786 -4475614 -6058738 -5073113 -2917120 249748 3629577 5059184 3738706 1278657
7405 1278657 -1101471 -3716936 -5613219 -4096112 643931 3708237 1531014 -2791853
7397 -2791853 -3819595 -1409038 -49644 -1843423 -4336231 -5017495 -4201499 -3218829 -2896789
7388 -2896789 -4002833 -6289566 -7068895 -3727912 2199434 6467604 7793036 8869126
7380 8869126 11207276 12424581 10128672 5761896 2707149 2182510 2383023 773833 -3205718
7371 -3205718 -6903054 -6519576 -1844673 2268686 1368994 -3111821 -6781481 -8794091 -10975228
7362 -10975228 -11914296 -8102895 -1352246 1409914 -2188538 -6379662 -6106711 -3639271
7354 -3639271 -2580289 -1041178 3691084 8141336 6868403 1212492 -2413926 -1682665
7346 -1682665 -107831 -302083 -899558 -425647 453156 1193561 2071589 2171545 126180
7337 126180 -2871531 -4048181 -3077013 -1894961 -812087 1417493 3732851 3245955 176976
7328 176976 -1945079 -2093782 -3418297 -7238961 -9500091 -6209433 425112 4356316 2558433
7319 2558433 -2634966 -6487889 -5442649 411669 6540485 7293908 2004936 -3615080
7311 -3615080 -3963805 -17588 2661148 1221009 -1408543 -448412 5298312 11968711 14011690
7302 14011690 9606294 2986512 193466 2250101 4387175 2688752 -972240 -2399793
7294 -2399793 -1290938 -1111177 -3470190 -5293424 -2315252 5586391 12922333 12759226 3567078
7285 3567078 -7955792 -12862259 -9563912 -5183554 -5957635 -9176809 -7669484 -192569
7277 -192569 6815066 7510122 2833353 -2344793 -5034288 -5455416 -4813435 -3861088 -2957660
7268 -2957660 -2254577 -1891090 -2115721 -2593757 -1800300 1639619 6784752 10738052 11529513
7259 11529513 9594774 6204374 1920107 -2587657 -5550897 -5509322 -3430638 -2156014
7251 -2156014 -3351362 -5672185 -6489159 -5131454 -3648609 -4150913 -6306996 -8370123 -9879609
7242 -9879609 -11654839 -13366040 -13385489 -11680591 -10492849 -10758902 -10151217 -6808611 -2965917
7233 -2965917 -1962827 -3116813 -3055208 -1393375 -1121075 -3011650 -3638610 -508802 4101245
7224 4101245 6609953 6918140 7215867 7741229 6489064 2591758 -2134832 -5083057 -5137313
7215 -5137313 -3210434 -1204637 -155122 761567 2588697 4155505 3095156 -284886
7207 -284886 -2451699 -1353801 347871 -1203466 -5703747 -9054108 -8299452 -4231320 351804
7198 351804 3009954 2495925 -916737 -5429444 -8806897 -9652188 -7762975 -4354802 -2152339
7189 -2152339 -3397824 -6853009 -8771985 -7993180 -7430037 -8565299 -7741480 -1711426 5623477
7180 5623477 7200359 2687950 -1038758 108479 2327113 871195 -2633765 -3321201
7172 -3321201 -375509 2703176 3564910 3297373 3703719 4873496 5595448 4712897 2144670
7163 2144670 -640390 -1721575 -879861 233771 438065 80032 -683584 -2538520 -4798143
7154 -4798143 -4761715 -1209909 3150958 4817298 3727003 2363496 1948635 1786839 1338175
7145 1338175 560645 -1039388 -3347587 -4326666 -2299114 861859 1452733 -1216118 -4257565
7136 -4257565 -5497528 -5399906 -4182051 -399729 5587313 9372215 6919454 451776 -3024884
7127 -3024884 230445 6032272 6999484 1109782 -6020272 -7657802 -3510081 399267
7119 399267 -1009366 -6204994 -9205255 -6457332 -595296 2611281 603025 -3073199
7111 -3073199 -2863650 1730632 4859967 1591483 -5287306 -8855225 -7577240 -6846988 -10171090
7102 -10171090 -13534748 -11444315 -4977189 -13464 230713 -2818148 -6806031 -10357414
7094 -10357414 -12364075 -12757976 -13106114 -13662521 -11551883 -5233417 1313002 3128330 1100031
7085 1100031 -694429 -2468882 -7065871 -11868210 -10354232 -2952094 1573991 -1411461
7077 -1411461 -5861756 -5188082 -2073685 -2297025 -4507786 -3529030 -200546 -205957 -4591197
7068 -4591197 -8290868 -7707180 -3989261 904052 5820918 8148780 5591859 896112
7060 896112 -441481 1897954 2633854 -392072 -2783542 -1333778 401145 -1611854 -4483260
7051 -4483260 -2685295 2745178 4969050 1004384 -4124247 -4048999 1320859 6366140 6048943
7042 6048943 375532 -6250147 -9115417 -7209407 -3716835 -2379043 -3696266 -5353473
7034 -5353473 -5620693 -4606962 -2252479 2461440 8779904 12457467 9546065 1818393
7026 1818393 -4142497 -4243033 -1237750 -352980 -2555628 -4663212 -4760223 -3975589 -2902829
7017 -2902829 -131679 4047881 5748020 2096889 -4209797 -7870403 -7326058 -5405050
7009 -5405050 -4465298 -3856939 -2131525 866399 4398883 7158212 7159744 3691065 -503703
7000 -503703 -1679549 -213039 -318127 -3664760 -6605830 -5836903 -3690996 -4489670 -7778939
6991 -7778939 -9201178 -7107650 -4044523 -1558249 2038511 7150450 10059287 7448253
6983 7448253 1160491 -4501391 -8020064 -9854546 -8553853 -2609475 4342603 5780100
6975 5780100 1365752 -1290703 2924074 8718678 7570827 -70502 -5414851 -3246996
6967 -3246996 2436818 5424510 4688154 2629977 403754 -1420866 -468832 4743978 10573706
6958 10573706 10787473 4333309 -2208702 -1854273 4532765 9518275 8378236 4342663
6950 4342663 3119952 4932468 5733720 4901389 6074311 9325865 8826905 2039456 -4425009
6941 -4425009 -3788657 844136 2625171 3005910 8117108 15302034 14697314 5393277 -1375281
6932 -1375281 1031127 5351792 3613830 -255973 1036513 5236959 5670238 3236572
6924 3236572 3285505 4715132 2261174 -2848468 -4109063 -325936 3645149 5681700 7563339
6915 7563339 8285825 4816950 -689744 -2820260 -2119180 -4073381 -8763558 -10391630 -7821958
6906 -7821958 -6194544 -6468009 -3325581 3441635 5492357 -1137805 -8456086 -7842559 -1620846
6897 -1620846 2667548 2788226 397735 -4462292 -10487018 -12227608 -7413646 -2669683
6889 -2669683 -4739780 -10063042 -10494881 -5733269 -1951830 -828395 1231782 4024232
6881 4024232 2604292 -3547153 -8052156 -6653695 -2792548 -1668207 -3571150 -5784795
6873 -5784795 -7083661 -7230052 -4838479 836726 6999461 8876971 4672080 -2087703
6865 -2087703 -5808352 -4355737 -668424 1427811 1542524 1320834 557413 -1957173 -4735672
6856 -4735672 -5073315 -4026069 -4980988 -7002314 -5621647 -1538271 -1438684 -6998055 -10308661
6847 -10308661 -5299362 2875440 6135285 5161312 5212127 5471904 1807329 -3122295 -2493256
6838 -2493256 2869390 4702939 41383 -4665149 -3896335 -160158 1664906 872657 -823385
6829 -823385 -2437185 -2616036 292209 4955865 7508919 6763610 5465687 5391037 4970063
6820 4970063 2891797 551838 -200726 1002962 3510237 5319544 3350654 -2324383
6812 -2324383 -6090503 -3325909 2292194 3683423 971284 195116 2374466 2291200 -1067199
6803 -1067199 -1771106 2689581 6653523 5796877 3767926 4481318 4694973 208845 -5988873
6794 -5988873 -7991040 -5407565 -1905006 1342483 5382545 9271419 10995602 10762872
6786 10762872 9743036 7713787 4943502 3565656 4054395 3426409 -73865 -3807686
6778 -3807686 -5033864 -4582359 -3588655 -1229531 1207727 -412299 -5621893 -7235635 -2062599
6769 -2062599 2545468 -214527 -5037461 -2944737 3563460 4350186 -1998000 -6743028
6761 -6743028 -5507598 -3393273 -4083299 -3926489 -248039 2908646 1574939 -2165855 -4653571
6752 -4653571 -5255978 -3521646 1908506 8041992 7815310 355873 -5113093 -1393632 5883960
6743 5883960 6354566 -147763 -4445510 -1805835 3015095 4724368 4288486 4538863 4660359
6734 4660359 2771333 539604 1177282 4153142 5264126 2048649 -3182948 -6343317
6726 -6343317 -5978167 -3724487 -1594280 -400880 -446397 -1821900 -3485144 -3784867 -3054961
6717 -3054961 -4187373 -8915490 -14544730 -16387231 -13091001 -7816497 -4299763 -3309843
6709 -3309843 -2921940 -921116 3007631 6431728 5957210 1017534 -4706702 -6800621 -4294224
6700 -4294224 567178 5092772 7102374 5153518 475074 -2774445 -1954622 718129
6692 718129 2060894 3120835 6564317 10784347 11858944 10476669 10926950 12982178 11339269
6683 11339269 4934838 345701 2392923 6753551 6432855 1513701 -2368401 -2351906 -357334
6674 -357334 1381423 2415410 2636086 2139453 1791094 1490837 -715786 -5425218 -9622196
6665 -9622196 -10302764 -8539642 -7247717 -6787543 -5529862 -2842810 1072259 5876974 8945514
6656 8945514 5914212 -2821310 -9742326 -9268394 -5739119 -6299324 -9131101 -6730810 934622
6647 934622 5795554 4570136 2955235 4680816 5442550 1910247 -1439607 -330219 1229698
6638 1229698 -2255388 -7857825 -8213120 -2036209 5791650 11647078 14208470 10936127
6630 10936127 1104966 -8741592 -9824276 -2291336 4604569 4303995 -341754 -2933370
6622 -2933370 -1035375 3416277 6947719 6775436 3820390 3396783 8573496 13576335 9881248
6613 9881248 -840961 -7116254 -3203857 2992514 1632679 -5845755 -10870275 -10176665
6605 -10176665 -7426923 -5231908 -2349729 1657678 4391591 4103674 2022074 713066
6597 713066 1853309 4990900 7228992 5726639 1706492 -548922 -26945 -588110 -3949794
6588 -3949794 -5563733 -1423927 5092212 8077086 7277636 6044524 4427046 655235
6580 655235 -3022298 -2863408 -359633 384649 531833 4358420 10171443 11519840 7674825
6571 7674825 4742174 5432601 6055178 5225803 6712821 10791522 11530784 6671680 1903893
6562 1903893 714899 -1600731 -8089429 -12668390 -9837031 -4435475 -3270505 -3441873
6554 -3441873 1506780 9028678 11533771 9260548 8528836 9415996 6136607 -976297 -4769823
6545 -4769823 -3472526 -3332310 -7030321 -9269993 -7136605 -5572174 -7930421 -9323922
6537 -9323922 -5133046 647301 1924768 80047 471083 3268224 4357736 3075273
6529 3075273 3023143 6097066 10429720 13818497 15556687 15415415 13858566 12614685 12425934
6520 12425934 11147722 6685354 937994 -1876292 -441166 2387475 3405635 2359674
6512 2359674 1297935 1706063 2544394 1323629 -2253669 -4693457 -2792930 1515654 3618332
6503 3618332 3097010 3678735 5679938 4139036 -2656199 -8102717 -5631089 1584071 4890616
6494 4890616 1925470 -1689465 -1518755 610949 1432848 1271917 2281152 4588456 5877278
6485 5877278 3405954 -3541188 -11411627 -13577975 -6989545 2675965 6234624 1927967
6477 1927967 -2577103 -389779 6082702 9208589 5857516 -121475 -3611214 -3209897
6469 -3209897 -781527 1255413 1379552 -675141 -3845079 -6508725 -8099880 -9803253
6461 -9803253 -12877669 -16037412 -15555694 -9421069 -1101238 2941194 381574 -4159024
6453 -4159024 -4836171 -1224699 2922627 5709003 8313506 10660235 9944259 4939645 -1085566
6444 -1085566 -3731796 -2008809 1944090 5820589 8003123 7110798 3234225 -827016
6436 -827016 -1661417 1183857 4894594 6493678 5143251 1720636 -2293234 -5096828 -4931630
6427 -4931630 -1145141 5004423 10640116 12663738 9934791 4797156 1600169 2549625
6419 2549625 5472314 6677027 5227605 2854828 557998 -1985411 -3503278 -972317
6411 -972317 5647560 11006031 9837846 3947274 556598 3323248 7690455 6544151
6403 6544151 -1178768 -9243917 -10956805 -5928537 254318 2450479 1081524 104885
6395 104885 734434 -220485 -4693095 -9026994 -8585212 -4899785 -3783442 -6655422 -8676184
6386 -8676184 -6539069 -2969204 -961124 1436599 6373195 10379850 8963726 4523038
6378 4523038 3462198 6306884 6954352 2399582 -2585430 -2420462 2277624 6938452 8472402
6369 8472402 6276236 1461529 -2385156 -980394 5191816 9820901 7915900 1617207
6361 1617207 -3575708 -5435719 -4749753 -1615414 3408101 6485482 4139505 -745143
6353 -745143 -1461537 3523821 8572435 8756626 5244970 1151076 -3316042 -8239173 -10351910
6344 -10351910 -6909985 -1478547 -723449 -5268334 -8399050 -5440014 -332930 244895
6336 244895 -3477457 -4887262 -443786 5569514 6841703 2447745 -3437121 -7041358
6328 -7041358 -7824324 -6900736 -5040452 -2441114 694875 3627434 5091219 4564186 3391615
6319 3391615 3072060 2474366 -620678 -4669574 -4791495 -57609 3714022 2092604 -896763
6310 -896763 791350 4745646 3221635 -4301889 -9641219 -8221415 -5163470 -5871764 -7522087
6301 -7522087 -5060262 -380940 772604 -1942983 -3403746 -951741 2780770 4774436
6293 4774436 5185368 5573956 6556750 7779688 8432980 7717370 5790632 3568220 1052891
6284 1052891 -2486653 -6149077 -7801117 -7722339 -8473354 -9718390 -7466655 -1068330 3738769
6275 3738769 2856743 497944 2501574 6870155 7677852 5621225 6662929 10915784 11244231
6266 11244231 4607329 -2509867 -3250275 700060 3224970 2542429 1584336 2233183 3259760
6257 3259760 3148096 2127463 1390322 1724976 2999302 4539431 5853811 6333585 4370035
6248 4370035 -886564 -5859423 -4265699 4243401 10590063 6569232 -3642012 -8454166
6240 -8454166 -4230197 1244311 985311 -2709078 -4088444 -1820675 2109347 6125653
6232 6125653 8494489 7557060 5301714 6143433 9662199 9905348 4995412 1360587 3849134
6223 3849134 7521793 5310753 -1135684 -5231016 -6036681 -7236360 -8296441 -5209811
6215 -5209811 832814 3845430 2710594 2793319 6413394 8967848 7122389 4237925 4047588
6206 4047588 4640657 3088254 1323854 2391112 4330541 3194364 12603 -632256 1849249
6197 1849249 3045283 591961 -2139786 -1057204 3089583 6273659 6343572 4484838 2730476
6188 2730476 2214321 3499493 6341358 8447911 6492997 199954 -5686057 -6016927 -1807851
6179 -1807851 622249 -1933095 -5154068 -3770915 278036 811158 -2582747 -3158637 2864752
6170 2864752 9913768 10359046 4657494 -372586 -1448254 -1891952 -4925781 -8711964 -9735804
6161 -9735804 -7722087 -5038825 -3481305 -3605705 -5441182 -7917375 -8942282 -7711136
6153 -7711136 -5648096 -3726998 -824160 3307844 5715603 4036947 906248 612385
6145 612385 2255797 879180 -4300819 -7793963 -5817677 -1894259 -1415950 -4149368 -5898462
6136 -5898462 -5124753 -3859421 -3487632 -3503124 -3743640 -4439524 -4523595 -3072861 -1920493
6127 -1920493 -3470343 -6212645 -6084490 -2556841 373310 166326 -910150 -57768 1588525
6118 1588525 1093784 -1870568 -5039170 -6451614 -5346515 -1534538 3817805 7387500
6110 7387500 5965062 108663 -5650393 -7061891 -4315634 -1250214 -279993 658107 4517697
6101 4517697 9436741 9974853 4876613 -366262 -1428865 -1805522 -6853311 -13881558 -14476294
6092 -14476294 -6305859 3483172 7666769 6241014 2638528 -1919448 -7189359 -11158199
6084 -11158199 -12070510 -10733020 -8509180 -5562582 -2664171 -1404987 -860541 2004696
6076 2004696 6322310 6266323 -380122 -6839487 -5424201 1957527 6649104 4815604 919947
6067 919947 206189 2463864 3948301 2202822 -1917406 -5257903 -5349094 -3305967 -2546063
6058 -2546063 -3774020 -3764271 -780486 2060644 1722247 429581 2114401 6161012 8854906
6049 8854906 9124718 8596168 7511405 4946835 2040210 996487 1729106 2803651 4139669
6040 4139669 5424158 4381411 909557 -59480 4487049 8530938 3954076 -6971845
6032 -6971845 -13825806 -12426686 -8891724 -8619764 -9741703 -9880320 -11216215 -14857034 -17053029
6023 -17053029 -15394999 -12794015 -11094946 -6956007 799951 5705347 1974103 -6265595
6015 -6265595 -10811203 -10881935 -11772488 -14656369 -15229676 -11648696 -6980917 -3479721 -233131
6006 -233131 2868457 4079073 3715569 4473271 6598278 6879665 3740874 -549637 -4128797
5997 -4128797 -7993576 -12126541 -13034955 -8603430 -2928839 -2203756 -6317470 -8352754 -3735142
5988 -3735142 2899220 2978993 -4526925 -10697233 -7828298 69053 2532491 -2745160 -6913369
5979 -6913369 -3526152 1357623 -1947589 -12137449 -18572346 -16158095 -10951977 -9646974
5971 -9646974 -10296570 -7141270 26527 5835913 6368176 2551453 -2190018 -4833391 -4205814
5962 -4205814 -1837469 -748433 -1885101 -2924251 -2017280 -843252 -1733936 -3607927 -3829869
5953 -3829869 -2890636 -3669050 -6463069 -8493812 -8600928 -8504857 -8426819 -5775451 -590583
5944 -590583 1718545 -2997100 -10970027 -14935417 -13418432 -10728016 -8792310 -4956469
5936 -4956469 1310430 5451595 4216602 322786 -2363620 -4058034 -5927761 -6002289 -2932450
5927 -2932450 -257533 -1386614 -3209664 -968097 2871230 2102949 -1985300 -1415782 5625165
5918 5625165 11508259 11341692 9642510 10314938 8646537 594139 -7009202 -5079356 3014248
5909 3014248 5433135 -986384 -7294741 -6597546 -2509288 -1025791 -1866667 -1798350 -472288
5900 -472288 1250154 4010697 6979264 6315909 703802 -5039691 -5849770 -2878119 -399874
5891 -399874 394796 316364 -1612721 -5415278 -6400651 -749944 6420017 5707885 -3346418
5882 -3346418 -10552395 -8562659 -1772894 1451911 -244426 -2501888 -2928639 -2011637 490383
5873 490383 4151277 4791430 -955819 -8484571 -8885728 -804106 7047695 7303967 2717089
5864 2717089 326625 1259538 905178 -3182289 -8169329 -10157781 -8213446 -4280898 -1301804
5855 -1301804 -1156903 -3001116 -4434615 -5254250 -7919661 -12601349 -14707096 -10696299 -4111628
5846 -4111628 -1610792 -4261876 -7140922 -6865582 -4883777 -3278932 -2091726 -1690804 -3348171
5837 -3348171 -6041376 -6746443 -5497492 -6076499 -9606642 -11492542 -7616493 -219796 5597759
5828 5597759 8446877 10185168 10942434 8530978 2511730 -3764664 -5622326 -1159813
5820 -1159813 6133715 9106125 3891803 -4489001 -6787436 -669423 6657095 8264519
5812 8264519 5156971 1607957 -1738621 -5557042 -7175570 -4197483 39484 585832
5804 585832 -1450720 -1275207 872256 -394977 -7012123 -14294577 -17015094 -14197932 -7755689
5795 -7755689 -907695 1988638 -1102914 -6015973 -6379770 -1827846 2323598 3527351
5787 3527351 4469686 6270260 5512806 617374 -4217465 -4791044 -2454893 -812378 -599447
5778 -599447 -783506 -1213757 -1245993 910027 4664806 6370661 5072790 5079501 9160257
5769 9160257 12981846 11000494 4980791 1464187 2586079 4589440 4555374 3539052 2816529
$$ [...]
##END NTUPLES=NMR SPECTRUM
##END=
