##TITLE=31Pdec_SR40_oil3
 CDCl3, 24 sc
 11.03.2021
##JCAMPDX= 6.0         $$ Bruker NMR JCAMP-DX V2.0
##DATA TYPE= NMR SPECTRUM
##DATA CLASS= NTUPLES
##ORIGIN= UXNMR, Bruker Analytische Messtechnik GmbH
##OWNER= root
$$ XWIN-NMR		Version 3.5
$$ Thu Mar 11 13:21:13 2021 Russian Standard Time (UT+4h)  she@DPX200
##.OBSERVE FREQUENCY= 81.013821
##.OBSERVE NUCLEUS= ^31P
##.ACQUISITION MODE= SIMULTANEOUS
##.ACQUISITION SCHEME= undefined
##.AVERAGES= 24
##.DIGITISER RES= 16
##SPECTROMETER/DATA SYSTEM= spect
##.PULSE SEQUENCE= zgpg30
##.SOLVENT NAME= MeOD
##.SHIFT REFERENCE= (INTERNAL, MeOD, 0, 248.564)
##AUDIT TRAIL= $$ (NUMBER, WHEN, WHO, WHERE, WHAT)
$$ ##TITLE= Audit trail, XWIN-NMR		Version 3.5
$$ ##JCAMPDX= 5.01
$$ ##ORIGIN= Bruker BioSpin GmbH
$$ ##OWNER= she
$$ F:/spectra/data/she/nmr/P31/1/pdata/1/auditp.txt
$$ ##AUDIT TRAIL=  $$ (NUMBER, WHEN, WHO, WHERE, WHAT)
(   1,<2021-03-11 13:19:38.89 +0400>,<she>,<DPX200>,
      <created by zg, POWCHK disabled, PULCHK disabled
       configuration hash MD5:
       00 E9 B6 7A A2 85 ED C7 34 08 36 98 17 FE 4E 26
       data hash MD5: 32K
       4E 80 AA 86 5C 2B 5F 25 60 98 AB 4A 36 27 0F ED>)
(   2,<2021-03-11 13:19:41.42 +0400>,<she>,<DPX200>,
      <Start of raw data processing
       efp BC_mod = 2 LB = 1 FT_mod = 6 PKNL = 1 PHC0 = -3864.364 PHC1 = -339.599 SI = 64K 
       data hash MD5: 64K
       EA 90 FB AF 28 99 91 13 38 F9 DB 78 BB 55 18 36>)
(   3,<2021-03-11 13:20:43.28 +0400>,<she>,<DPX200>,
      <pk PHC0 = -136.7826 PHC1 = 247.2001 
       data hash MD5: 64K
       93 BC 7D CF 04 36 95 F5 6E 16 0C 6B 38 47 9A B9>)
(   4,<2021-03-11 13:20:46.59 +0400>,<she>,<DPX200>,
      <abs ABSG = 5 
       data hash MD5: 64K
       E3 11 35 46 EF 2E 24 A8 20 B9 92 FE C0 4E 06 F9>)
$$ ##END=
$$ 
$$ hash MD5
$$ CA CC B1 EF 88 1A 0A C3 12 84 6B 9F 9F 2C B1 BE
##$RELAX= 
##$RELAX= 
##$RELAX= 
##$RELAX= 
##$RELAX= 
##$RELAX= 
##$RELAX= 
##$RELAX= 
$$ Bruker specific parameters
$$ --------------------------
##$DU= <F:/spectra>
##$EXPNO= 1
##$NAME= <P31>
##$PROCNO= 1
##$TYPE= <nmr>
##$USER= <she>
##$AMP= (0..31)
100 100 100 100 100 100 100 100 100 100 100 100 100 100 100 100 100 100 
100 100 100 100 100 100 100 100 100 100 100 100 100 100 
##$AQSEQ= 0
##$AQ_mod= 1
##$AUNM= <au_zg>
##$AUTOPOS= <>
##$BF1= 81.014009
##$BF2= 200.13
##$BF3= 200.13
##$BF4= 200.13
##$BF5= 200.13
##$BF6= 200.13
##$BF7= 200.13
##$BF8= 200.13
##$BYTORDA= 1
##$CFDGTYP= 0
##$CFRGTYP= 5
##$CHEMSTR= <none>
##$CNST= (0..31)
1 1 145 1 1 1 1 1 1 1 1 1 1 1 1 1 1 1 1 1 1 1 1 1 1 1 1 1 1 1 1 1 
##$CPDPRG= <waltz16>
##$CPDPRG1= <>
##$CPDPRG2= <waltz16>
##$CPDPRG3= <>
##$CPDPRG4= <mlev>
##$CPDPRG5= <mlev>
##$CPDPRG6= <mlev>
##$CPDPRG7= <mlev>
##$CPDPRG8= <mlev>
##$CPDPRGB= <>
##$CPDPRGT= <>
##$D= (0..31)
0 1 0 0 0 0 0 0 0 0 0 0.03 2e-05 3e-06 0 0 0 0 0 0 0 0 0 0 0 0 0 0 0 0 
0 0 
##$DATE= 1615454378
##$DBL= (0..7)
120 120 120 11 120 120 24 19 
##$DBP= (0..7)
150 150 150 150 150 150 150 150 
##$DBP07= 0
##$DBPNAM0= <>
##$DBPNAM1= <>
##$DBPNAM2= <>
$$ [...]
##$SUBNAM3= <"">
##$SUBNAM4= <"">
##$SUBNAM5= <"">
##$SUBNAM6= <"">
##$SUBNAM7= <"">
##$SUBNAM8= <"">
##$SUBNAM9= <"">
##$SW= 501.771253377433
##$SWIBOX= (0..15)
0 1 3 0 0 0 0 0 0 0 0 0 0 0 0 0 
##$SW_h= 40650.406504065
##$TD= 32768
##$TD0= 1
##$TE= 0
##$TE2= 300
##$TE3= 300
##$TEG= 300
##$TL= (0..7)
0 120 53 12 22 120 120 120 
##$TP= (0..7)
150 150 150 150 150 150 150 150 
##$TP07= 0
##$TPNAME0= <>
##$TPNAME1= <>
##$TPNAME2= <>
##$TPNAME3= <>
##$TPNAME4= <>
##$TPNAME5= <>
##$TPNAME6= <>
##$TPNAME7= <>
##$TPOAL= (0..7)
0.5 0.5 0.5 0.5 0.5 0.5 0.5 0.5 
##$TPOFFS= (0..7)
0 0 0 0 0 0 0 0 
##$TUNHIN= 0
##$TUNHOUT= 0
##$TUNXOUT= 0
##$USERA1= <user>
##$USERA2= <user>
##$USERA3= <user>
##$USERA4= <user>
##$USERA5= <user>
##$V9= 5
##$VALIST= <valist>
##$VCLIST= <CCCCCCCCCCCCCCC>
##$VD= 0
##$VDLIST= <DDDDDDDDDDDDDDD>
##$VPLIST= <PPPPPPPPPPPPPPP>
##$VTLIST= <TTTTTTTTTTTTTTT>
##$WBST= 1024
##$WBSW= 4
##$XGAIN= (0..3)
0 0 0 0 
##$XL= 0
##$YL= 0
##$YMAX_a= 6521
##$YMIN_a= -3173
##$ZGOPTNS= <>
##$ZL1= 120
##$ZL2= 120
##$ZL3= 120
##$ZL4= 120
##$ABSF1= 248.5645
##$ABSF2= -253.2056
##$ABSG= 5
##$ABSL= 3
##$ALPHA= 0
##$AQORDER= 0
##$ASSFAC= 0
##$ASSFACI= 0
##$ASSFACX= 0
##$ASSWID= 0
##$AUNMP= <proc_1d>
##$AZFE= 0.1
##$AZFW= 0.5
##$BCFW= 0
##$BC_mod= 2
##$BYTORDP= 0
##$COROFFS= 0
##$CY= -3
##$DATMOD= 1
##$DC= 0
##$DFILT= <>
##$DTYPP= 0
##$F1P= 0
##$F2P= 0
##$FCOR= 1
##$FTSIZE= 65536
##$FT_mod= 6
##$GAMMA= 0
##$GB= 0
##$INTBC= 1
##$INTSCL= 5.30512e-09
##$ISEN= 30
##$LB= 1
##$LEV0= 0
##$LPBIN= 0
##$MAXI= 10000
##$MC2= 0
##$MEAN= 0
##$ME_mod= 0
##$MI= 50
##$NCOEF= 0
##$NC_proc= -7
##$NLEV= 6
##$NOISF1= 182.463
##$NOISF2= 159.3651
##$NSP= 0
##$NTH_PI= 0
##$NZP= 0
##$OFFSET= 248.5645
##$PC= 4
##$PHC0= -4001.146
##$PHC1= -92.3989
##$PH_mod= 1
##$PKNL= yes
##$PPARMOD= 0
##$PSCAL= 0
##$PSIGN= 0
##$REVERSE= no
##$SF= 81.014009
##$SI= 65536
##$SIGF1= 159.3651
##$SIGF2= -187.1042
##$SINO= 113.3802
##$SIOLD= 16384
##$SREGLST= <1H.CDCl3>
##$SSB= 0
##$STSI= 65536
##$STSR= 0
##$SW_p= 40650.406504065
##$SYMM= 0
##$S_DEV= 0
##$TDeff= 32768
##$TDoff= 0
##$TI= <>
##$TILT= no
##$TM1= 0
##$TM2= 0
##$TOPLEV= 0
##$USERP1= <user>
##$USERP2= <user>
##$USERP3= <user>
##$USERP4= <user>
##$USERP5= <user>
##$WDW= 1
##$XDIM= 65536
##$YMAX_p= 306735616
##$YMIN_p= -35411520
$$ End of Bruker specific parameters
$$ ---------------------------------
##NTUPLES= NMR SPECTRUM
##VAR_NAME=  FREQUENCY,     SPECTRUM/REAL,   SPECTRUM/IMAG
##SYMBOL=    X,             R,               I
##VAR_TYPE=  INDEPENDENT,   DEPENDENT,       DEPENDENT
##VAR_FORM=  AFFN,          ASDF,            ASDF
##VAR_DIM=   65536,         65536,           65536
##UNITS=     HZ,            ARBITRARY UNITS, ARBITRARY UNITS
##FACTOR=    0.620285442955139, 1,           1
##FIRST=     20137.2065510759, 0,            0
##LAST=      -20513.1999529892, 0,           0
##MIN=       -20513.1999529892, -35411520,   0
##MAX=       20137.2065510759, 306735616,    0
$$ Real data points
##PAGE= N=1
##DATA TABLE= (X++(R..R)), XYDATA
$$ [...]
13016b227486N85484K186192P56813N3951Q08325k36147k373838p77850L806593
13007B582037M020919k259450p306712m843812J450404M917985M320264J128004
12999D009639m181605q392940n641929L176772Q307213M510748p37786O50493
12991A700605M591819K898899k430303l485626n24541o01259m300930m822068
12983f973404l23405K779260O11971k379400j209405K502157M168090K480949
12975A656813m57467k213134j778197k73436O9963p87444j30972K571654L284717
12966A942497l37703l761497j899624K325970K230671j731560k631301J603628
12958b258919M751457J782882m103395o444338l490291J056263K830133R98867
$$ y = [-2227486, -1642002, 544190, 1301003, 1354954, 2163279, 1927132, -446706, -1224556, 2582037, 6602956, 4343506, -2963206, -7807018, -6356614, -1438629, 2881635, 4009639, -171966, -8564906, -14206835, -11030063, -2722850, 1787898, 1050112, 1700605, 6292424, 9191323, 6761020, 3275394, 2750853, 2149594, -2151336, -6973404, -7296809, -4517549, -3905578, -6284978, -7494383, -4992226, -824136, 1656813, 1199346, -1013788, -2791985, -3065421, -2995458, -3782902, -3913874, -1342220, 1942497, 1604794, -2156703, -4056327, -1730357, 500314, -1231246, -3862547, -2258919, 2492538, 4275420, 172025, -6272313, -9762604, -8706341, -5876208, -4877341]
12950d877341j089981K06294L483821L369905j243521m176106r40195L737093
12942a530031L024054j360292k667355k13475J096246L21833Q93199K344784O17052
12933B526015l142884l028009J229365L089728K61345j859012l59933M49464j883422
12924b717343k795243N22425L064943M59011l312400k647915J045604L312341
12916c068577L795672L690739J527277k443366l192830J026217L141500k302520
12908B174112q361419m999607M453235P144849j12193o690995m739932N10770
12900a0621180J140657j368570n83661L869819O270526L457087j408480l190734
12892b434536k62719L891677L754152j990718p271388m835797L723299Q397125
$$ y = [-4877341, -5967322, -5761028, -2277207, 1092698, -150823, -4326929, -5267124, -1530031, 1494023, 133731, -2533624, -2747099, -1650853, -1329020, -435821, 1908963, 2526015, -616869, -3644878, -2415513, 674215, 935560, -923452, -1283385, -833921, -2717343, -5512586, -4990161, -1925218, -1466207, -4778607, -7426522, -6380918, -3068577, 727095, 4417834, 5945111, 3501745, 308915, 1335132, 4476632, 2174112, -6187307, -11186914, -6733679, 411170, 298977, -6392018, -11131950, -10621180, -9480523, -10849093, -11432754, -7562935, -1292409, 2164678, 756198, -2434536, -2697255, 1194422, 4948574, 2957856, -4313532, -9149329, -5426030, 2971095]
12884B971095L417093m742568n924497K64500M751749J730843m172852m833081
12876f537718R79623O729199O204380K60468m750274m348224p56445M04966k276706
12867d090731l962137l28027N886346P937933L580992k834563o559360p043822
12859g413369n604058k497547J471244L806547L776913M217683O469076O392291
12851A0618780K77479p303128p818802q77696M557444K765425j346664j025899
12843a53061J963869J478692k321940l280604Q66578N132944M608909L73332l319283
12834E349436m042682j836646J995052M758935L443957j774212o368926n830750
12826d305836q09926L542703L399203L07960j205372N39546K418312R63725k840622
$$ y = [2971095, 6388188, 1645620, -4278877, -4014377, 737372, 2468215, -1704637, -6537718, -5558095, 1171104, 7375484, 7635952, 2885678, -1462546, -2218991, -1814025, -4090731, -8052868, -8380895, -2494549, 5443384, 9024376, 6189813, -369547, -7413369, -13017427, -15514974, -14043730, -10237183, -6460270, -2242587, 4226489, 10618780, 10896259, 3593131, -4225671, -5103367, -545923, 2219502, 872838, -153061, 1810808, 3289500, 967560, -2313044, -1446466, 3686478, 8295387, 8668719, 5349436, 1306754, -529892, 1465160, 6224095, 9668052, 7893840, 1524914, -4305836, -5115762, -1573059, 1826144, 2134104, 928732, 1468278, 3886590, 4850315, 2009693]
12817B009693n118192m284830j989197K85124J974832J273198k912102o252218
12809a5013692k290997P124997J1155887M203250n208366o051842P0072L504778
12801b505913K022514J559105L332009J575707m377938o558684j116918M527811
12793a542307L143813j235708q09286L153019L209297j671101m742568k287050
12785b781891J297839Q18227k405449l249932r3925L258412K517683j640074l965068
12776f244178r07358M449839N631148P99571m928562n890542k172188J742370
12768g519900K529303P02513q82798q4493K109150K287981q55119l751024k513476
12759g977863Q26143R67805k069433k514223J772125N289136L136136j889933
$$ y = [2009693, -3108499, -7393329, -9382526, -9097402, -7122570, -5849372, -8761474, -15013692, -17304689, -10179692, 976195, 5179445, -28921, -6080763, -6010691, -2505913, -483399, 1075706, 4407715, 5983422, 1605484, -4953200, -6070118, -1542307, 1601506, 365798, -443488, 2709531, 5918828, 4247727, -494841, -2781891, -1484052, -665825, -3071274, -6321206, -6415131, -3156719, -639036, -2279110, -6244178, -7151536, -2701697, 2929451, 3729022, -1199540, -7090082, -9262270, -7519900, -4990597, -4288084, -5170882, -5255375, -3146225, -858244, -1713363, -5464387, -7977863, -7151720, -6183915, -8253348, -10767571, -8995446, -3706310, -570174, -2460107]
12751b460107m159178k745240l4116L067185N876900N566053J305413k086570
12743D330340q7231M192522M125420p98729n136997n900522m851384l224605m02538
12734g753724K104408J526992n89737L24324L873979M244059k66338l629349j328756
12725a494142K645787K513706o02364k084692j910698l100080m682320k897992
12717a1612795J503840L516808J719408J40826J340974L020992L053439K596592
12709E280084K010654r28692n475709n911817J25019N879550M118130j952962
12701C144257l536043K71283K143261p42568k700979k85442J779096k94949k170146
12692b392230N66200L685598J274991l394705k620183K866280M802498N19708
$$ y = [-2460107, -6619285, -9364525, -9398641, -6331456, -454556, 5111497, 6416910, 4330340, 4243109, 8435631, 12561051, 11762322, 6625325, 724803, -4126581, -7351186, -7753724, -5649316, -4122324, -4712061, -4387737, -513758, 3730301, 3463963, -165386, -1494142, 1151645, 3665351, 3062987, 978295, -932403, -4032483, -8714803, -11612795, -10108955, -6592147, -4872739, -4731913, -3390939, -369947, 2683492, 5280084, 7290738, 6362046, 886337, -5025480, -4900461, 979089, 5097219, 3144257, -391786, -120503, 2022758, 1280190, -1420789, -1706231, 72865, -222084, -2392230, -1826030, 1859568, 3134559, -260146, -2880329, -14049, 4788449, 5308157]
12684E308157l491681k296162R46302J630587L48523m33427j120158k756592l888045
12675e752496k970443j058958M34597J938426L547075L531943J329220n68170
12667D31194o2334J315502P56903j922271m403593m428730j223610L901919P588324
12658A953304O942334K728900j533174l542518l294448j103279K257996M074075
12650H483190K165781j380737k829554k502300l199178l792544p10559M004471
12642B38570L551872k736960o775947l460533J842624K095256j273891k493061
12634i012070o67880R55948J148479P28778l79472j463314K01237M406553N712818
12625A631077J010800m571914m766229j247819M41250K66487J874804M273639
$$ y = [5308157, 1816476, -479686, 466616, 2097203, 2445726, 2012299, 892141, -1864451, -5752496, -8722939, -9781897, -9347300, -7408874, -3861799, -329856, 999364, 431194, 368860, 1684362, 2441265, 518994, -3884599, -8313329, -9536939, -5635020, 1953304, 8895638, 11624538, 10091364, 6548846, 3254398, 2151119, 4409115, 8483190, 10648971, 9268234, 6438680, 3936380, 737202, -3055342, -3765901, 238570, 3790442, 1053482, -5722465, -9182998, -7340374, -5245118, -6519009, -9012070, -9679950, -8724002, -7575523, -6846745, -7226217, -8689531, -8488294, -4081741, 1631077, 2641877, -1930037, -6696266, -7944085, -7502835, -7236348, -5361544, -1087905]
12617a087905L156848q22036k560300q46379O20002L31808M21272R00099p36685
12608f23276l331211k258092K413738M316529J71183m682257l809338J367030
12600f435694M131541J441077l320658n291345k921255J828480N921504P327858
12592B681508N692920K125371j082711j458644J120281L213397J593423j781515
12584A2104030j945305J365049K573586j299302n778898n736153k703657j233989
12576b654639j672728j311446J55356J051793J261992J203599r5740j996042q81913
12567d939768L589083N092353m23621o328059l407956O226385J1432729P007775
12559A8248921j426368o920664p814197m715146J322338O173976M970567j010155
$$ y = [-1087905, 2068943, 1246907, -1313393, -2159772, -1539770, -1207962, -786690, 113409, -623276, -3954487, -6212579, -3798841, 517688, 688871, -3993386, -7802724, -6435694, -2304153, -863076, -4183734, -9475079, -12396334, -10567854, -4646350, 2681508, 8374428, 10499799, 9417088, 7958444, 9078725, 12292122, 13885545, 12104030, 10158725, 11523774, 14097360, 12798058, 7019160, 1283007, -1420650, -2654639, -4327367, -5638813, -5483457, -4431664, -3169672, -1966073, -2061813, -4057855, -4939768, -1350685, 3741668, 3318047, -3010012, -6417968, -191583, 11241146, 18248921, 16822553, 9901889, 2087692, -2627454, -1305116, 4868860, 9839427, 8829272]
12551H829272n170207m493072k410951j999417j819829J14718K984216N005553
12543A040283M965509K003978k487725m188409j459882Q02538j534870m010025
12535d868603n29788N076411M209013j721538k959379K165287M532897J08115
12527F012415l495039n83339L494316K473968j139050k613781k757414l145699
12519a753623j576678J802006J741789k685589m013192J715723P206428N429193
12511G866057O02847p20768j274777n684667q900800l946931M149971M820789
12503c088279r80670k864417J475404L653229L7451k537046N40992L905163J800882
12494A942709k788135l705429m12163L264114M773628L704685O14622k272529
$$ y = [8829272, 3659065, -834007, -3244958, -5244375, -7064204, -6949486, -3965270, 1040283, 6005792, 8009770, 5522045, 1333636, -126246, 676292, -858578, -4868603, -5398391, -321980, 3887033, 2165495, -793884, 1371403, 5904300, 6012415, 2517376, 1934037, 5428353, 7902321, 6763271, 4149490, 1392076, -1753623, -3330301, -1528295, 213494, -2472095, -6485287, -4769564, 2436864, 7866057, 8468904, 7748136, 6473359, 788692, -8112108, -12059039, -7909068, -3088279, -4068949, -6933366, -5457962, -1804733, -1767282, -4304328, -3763336, 141827, 1942709, -845426, -4550855, -4963018, -1698904, 3074724, 6779409, 7394031, 5121502]
12486E121502k332004l64367J9648j912074k690935n15668J570207O74268j245121
12477a674544o04947K232485L604780J711692j242658k060172l60404J278576
12469B884808Q94950k24191p4208k25744l927870r183581q675027L4328Q685617
12460i810918Q073339N59281l528003l17237L938497L734261J489754J451590
12452E590564K598967J604752j290041l489723m461155n202159n102064k847283
12444a2598142M65027K198384J907555J664918K569223L217020K280163O22703
12436B326851m22994j364815l130399m146503j698002L152874N049560J042636
12428H09208m494572m978960k72305L636385L018671K12876j239600q90388K78491
$$ y = [5121502, 2789498, 2425131, 2444779, 532705, -2158230, -2673898, -1103691, -429423, -1674544, -2279491, -47006, 3557774, 5269466, 4026808, 1966636, 1606232, 2884808, 3779758, 3555567, 3481359, 3255615, -672255, -9855836, -18530863, -18496535, -9810918, -1737579, -1178298, -4706301, -5023538, -1085041, 2649220, 4138974, 5590564, 8189531, 9794283, 8504242, 5014519, 553364, -4648795, -9750859, -12598142, -12133115, -9934731, -8027176, -6362258, -3793035, -576015, 1704148, 2326851, 1903857, 539042, -2591357, -6737860, -8435862, -5282988, -233428, 809208, -3685364, -8664324, -8936629, -5300244, -2281573, -2068697, -3308297, -4198685, -3920194]
12419c920194J736510K238653O65380q07581J136349M352993K466808m814015
12411C054903q997598m739328J728717K183626j038718K5404N300252P103895
12403D621153K933040j234526j219817o1591q79725j424133O95462K872221J756727
12394H058811j173548k260072j273373p67829j472633j636124m75314L07282r52280
12385a645080l034784k549775J993117P226535P649676K016158m759690p353880
12377d57723n718880l195136j247092Q78765K795598K863178J099925o33958j211767
12368d827090q14463M39184K200994K974422J682233o17458k368630l426959l486326
12359h244093r62484L733260O255762L356211k051261m593665l306833r62225
$$ y = [-3920194, -2183684, 54969, 720349, -87232, 1049117, 5402110, 7868918, 3054903, -5942695, -10682023, -8953306, -6769680, -7808398, -7782994, -2482742, 4621153, 7554193, 6319667, 5099850, 5038259, 4158534, 2734401, 3429863, 6302084, 8058811, 6885263, 4625191, 3351818, 2583989, 1111356, -524768, -1000082, -692800, -1645080, -4679864, -7229639, -5236522, 1990013, 9639689, 11655847, 6896157, -457723, -6176603, -9371739, -10618831, -9740066, -6944468, -4081290, -2981365, -3615323, -4827090, -5641553, -5202369, -3001375, -26953, 1655280, 1037822, -1330808, -4757767, -8244093, -9206577, -5473317, 782445, 4138656, 2087395, -2506270, -5813103, -6775328]
12351f775328J097372K778287K276234j055299k838317Q43661N493817L190486
12343E010913m789299q489034l593826L056544M890442M243540N081263M679439
12335A0089982p43151p315863p786619j907126L651820M308723J382332j934590
12327b54492l709796k976716l23402J504898P04821o54609K39624K179181J906182
12318a384309j93180o34569J040410J132346k088668n039166l815840K63727K781629
12309g937620K195068Q76172P72561Q58535k28234j097422P15482M404048N544150
12300F102740J403222m743835o738451k861233K102763K877822j79012k576542
12292d612526j820800M55678K107006L291155M516904M303433J253932k713871
$$ y = [-6775328, -5677956, -2899669, -623435, -1678734, -4517051, -3673390, 1820427, 5010913, 221614, -8267420, -11861246, -8804702, -3914260, 329280, 5410543, 10089982, 9346831, 2030968, -5755651, -7662777, -4010957, 297766, 1680098, -254492, -3964288, -6941004, -7264406, -5759508, -5054687, -5709296, -5469672, -3290491, -1384309, -1577489, -2212058, -1171648, -39302, -2127970, -7167136, -10982976, -10719249, -7937620, -5742552, -4866380, -4093819, -3235284, -3463518, -4560940, -3845458, 558590, 6102740, 7505962, 2762127, -3976324, -6837557, -4734794, -1856972, -2035984, -4612526, -6433326, -5977648, -3870642, -579487, 3937417, 8240850, 9494782, 6780911]
12284F780911m109570k751009j951366l148032l535022q31716K670978L728162
12276c146664L181127L550997L667280N98902l993299m943157j464999J420792
12268a129021P28330m30945J124468L391452K984225J88576k772574m866463m962783
12259e744735j501416L548965M787750R69739k081981k19393K408409P34189k303597
12250E97930j131594K298921J888906j706246k284411Q82155K060059n45870k017425
12241D2425q6661R05012j401808k199450K323210P327262N683151j226676m799577
12232F566888o34328N691611N450228k715789j0940088j1060468l920158K413200
12224i148904L022854P93576q8474J5020q9965J723674O177032Q219854L740039
$$ y = [6780911, 2671341, -79668, -2031034, -5179066, -8714088, -9545804, -6874826, -3146664, 34463, 3585460, 7252740, 7851642, 3858343, -1084814, -2549813, -1129021, -400691, -831636, 292832, 3684284, 6668509, 6857085, 4084511, -781952, -5744735, -7246151, -3697186, 1090564, 2060303, -21678, -241071, 2167338, 2901527, 597930, -533664, 1765257, 3654163, 1947917, -336494, 545661, 2605720, 2059850, 42425, -44236, 860776, -541032, -2740482, -417272, 6909990, 12593141, 11366465, 6566888, 5932560, 11624171, 17074399, 14358610, 3418522, -7641946, -11562104, -9148904, -6126050, -5332474, -5420948, -5405928, -5495893, -3772219, 2404813, 10624667, 14364706]
12215A4364706k889754m743868k609263j876774k307816J92808L721121K412934
12207F264094k088247j693010M344133O990094J571963n193907o113113k873992
12199A208015l11135P42869M40086k678812o502058m790809L043416Q431200N453631
12190E036403k58416m78780L557097M712723J068004l118621m562817l587163
12182B368430j802020j024894k198776l195398j209709J580064L31550l316086
12174h466839k134875M200956O718304J611856k790639l3637L449883J39047m926798
12165b232742l238858J951364J797120k300257j939819K869592M560778K153313
12157C620491J685139L365325J137218m394374n272745m40593J512461k718448
$$ y = [14364706, 11474952, 6731084, 4121821, 2245047, -62769, 130039, 3851160, 6264094, 4175847, 2482837, 6826970, 13817064, 15389027, 10195120, 4082007, 1208015, 896880, 1639749, 2079835, -598977, -7101035, -11891844, -8848428, -417228, 5036403, 4777987, 4299207, 7856304, 12569027, 13637031, 10518410, 5955593, 2368430, 566410, -458484, -2657260, -5852658, -7062367, -5482303, -5150753, -8466839, -10601714, -6400758, 317546, 1929402, -861237, -894874, 2555009, 2694056, -2232742, -5471600, -3520236, -1723116, -4023373, -5963192, -3093600, 1467178, 3620491, 5305630, 8670955, 9808173, 5413799, 141054, -299539, 1212922, -1505526]
12149a505526n062225N4653O168219N578238J032419o54831J20495j444145n043281
12140g55984n876762k469295J819447L888395L554243K157391J134984R34345
12132D386764J85936k202901m006314k064018K050324L207128N00545j237930
12124H19534N21160J943984j88148k731064j724422O43469j52952l057584k842719
12115f768742J680763N794383N517181K348324J80336n9637q06745l522430n793389
12106a429956m257312J35574K603954J352885L80794K621305M169842N14880m626337
12097A465629l912761J660342L774035P4373k609707n50159Q48538k143668l817389
12088e210767R71919O637728N295753m07390k333008m90433j372373n037213m679400
$$ y = [-1505526, -6567751, -6513098, -344879, 5233359, 6265778, 5610947, 5731442, 4287297, -755984, -6632746, -9102041, -7282594, -3394199, 160044, 2317435, 3452419, 4386764, 4572700, 2369799, -1636515, -3700533, -1650209, 1556919, 2057464, 819534, 1340694, 3284678, 3096530, 365466, -1358956, -715487, -868439, -3926023, -6768742, -5087979, 706404, 6223585, 8571909, 8752245, 8692608, 7885863, 4363433, -1429956, -5687268, -5551694, -2947740, -1594855, -1214061, 1407244, 5577086, 6091966, 1465629, -2447132, -786790, 2987245, 3061618, 451911, -98248, 750290, -1393378, -5210767, -4238848, 2398880, 7694633, 7287243, 4954235, 4463802, 3091429, -1945784, -6625184]
12079f625184R12353M762328L330599J350666K193723K238075r74463l017148
12071D170949m85329K170442l048l810274l372393J45451J372047j2082j82911
12062g148Q89254j82620l007942l697710j882238o61282P0079K910879N483389
12053h5339K057747n669440q100393j565779N517063N134897O48453q24508K46300
12044b640999j39507k43183L301979O436472K862469m146211n396102l05211K566431
12035B296138l6528j664983J440358L738352N62234l833221l936576j579243j009860
12026d023329j267916M94677K758683K468018M49368q79412j651882k160267m63889
12017d275949L177868M003144j35149l934402k448608R79154R54236n41497J274582
$$ y = [-6625184, -5712831, -950503, 2380096, 3730762, 5924485, 8162560, 7188097, 4170949, 3685620, 5856062, 5853014, 2042740, -1329653, -1184202, 187845, 175763, -7148, 882106, 699486, -2308456, -6006166, -7888404, -8549686, -8479607, -5568728, -85339, 1972408, -3697032, -11797425, -13363204, -7846141, -2711244, -2062791, -2887299, -2640999, -2780506, -3023689, 278290, 6714762, 9577231, 5431020, 34918, -270293, 2296138, 2259610, 594627, 2034985, 5773337, 6335571, 2502350, -1434226, -3013469, -4023329, -5291245, -4796568, -2037885, 430133, 879501, 89, -1651793, -3812060, -4275949, -1098081, 2905063, 2769914, -1164488, -3613096, -2633942, -1679706, -2221203, -946621]
12008i46621M011877J908803k841316k585496K486380L762332j527912n387421
12000a119374k179974K129735j32108n796735n643459J702757P986484O873852
11992C821178J304768k121688j771395r87811j615409j448356J092119L075578
11984A348984R39491l487826m991433k616011n30636n71093M87714L954737N442237
11975b3836K166622j298991L1069L317964K763492r85747k989995k496675k088339
11966a604436r19050L268630P018197M543370k133142m833213j582919R49532
11958D706969j206219l704501k230037Q42545J525763L5488j515911k182541q37256
11949d565700L098247O238168M363116j27278q33158J695380L32527n291751o224757
$$ y = [-946621, 3065256, 4974059, 2132743, -452753, 2033627, 5795959, 4268047, -1119374, -3299348, -1169613, -1301721, -7098456, -12741915, -11039158, -3052674, 3821178, 5125946, 3004258, 1232863, 245052, -1370357, -2818713, -1726594, 1348984, 2288475, -1199351, -6190784, -8806795, -9337431, -9908524, -9420810, -5466073, -23836, 2142786, 843795, 874864, 4192828, 6956320, 5970573, 2980578, 483903, -1604436, -2523486, 745144, 7763341, 12306711, 10173569, 5340356, 3757437, 4706969, 3500750, -203751, -2433788, -1591243, -65480, -29992, -1545903, -3728444, -4565700, -1467453, 4770715, 9133831, 9006553, 8173395, 9868775, 10201302, 4909551, -1315206]
11940a315206N11073M881431m00575o969059l808375M703017N830835j428829
11932B004312o072129k871092J837902K546218J652018J962888J608457m05478
11924B263096j362421o58630j543949m185893l877336N90694L663887K141773
11916b968779P49772L399742N288853O45626o494542p287572j151670M143183
11908c675387M319456K668953K001407L25588l205387m853443k415017N61018
11900d272812O16988j81118R97294J926619k97653k663634o24849L241997K450776
11891A193608k286813l353055J188015L785786k15328m369918j433474M515548
11883i75631M380087j485838m254448q16158K220858J34920k693173r59543K810792
$$ y = [-1315206, -804133, 4077298, 3676723, -3292336, -7100711, -2397694, 3433141, 2004312, -4067817, -6938909, -5101007, -2554789, -902771, 1060117, 2668574, 2263096, 900675, 242045, -1301904, -5487797, -9365133, -8774439, -5110552, -2968779, -2219007, 1180735, 6469588, 7115214, 620672, -6666900, -7818570, -3675387, 644069, 3313022, 5314429, 5640017, 2434630, -2418813, -4833830, -4272812, -3655824, -3836942, -2839648, -913029, -1210682, -3874316, -4499165, -1257168, 1193608, -1093205, -4446260, -3258245, 527541, 312213, -4057705, -5491179, -975631, 3404456, 1918618, -2335830, -3151988, -931130, -796210, -3489383, -4448926, -1638134]
11874a638134L061333L10963n45913J280610J741189o43981k233348o53138Q59362
11865A538943j361329m941240m417255M59575L907872K328296r22631j172485
11857d580254R48316K049808J965248K403030J933169j704615n380889l536946
11849e903133K295266M324346N73359j785424J388246L912609K1838n027922l168848
11840c369663L138211M982074J090383j537982L87038K775646K458028J158156
11832A1081891L76796p93045j906549j381471q03136k867721n158544k865257
11824d317036K167923K817291j835088m428215j012173L022319K195657r53090
11816b342412j396656O44614K150660K670455K752669J057871k625122m697084
$$ y = [-1638134, 1423199, 1734162, 1188249, 2468859, 4210048, 3566067, 1332719, 679581, 1538943, 177614, -4763626, -9180881, -8721306, -4813434, -2485138, -3407769, -4580254, -3631938, -1582130, 383118, 2786148, 4719317, 3014702, -2366187, -5903133, -3607867, 716479, 1289838, -495586, 892660, 4805269, 4827107, -200815, -3369663, -231452, 4750622, 5841005, 4303023, 4690061, 7465707, 9923735, 11081891, 11458687, 10665642, 8759093, 7377622, 6574486, 3706765, -1451779, -4317036, -2149113, 668178, -1166910, -5595125, -6607298, -3584979, -1389322, -2342412, -3739068, -3094454, -943794, 1726661, 4479330, 5537201, 2912079, -1785005]
11808a785005k043136L260563O405227N038992M22133m032314m464771j07850
11800B693839M244522L167648j701785l675656r80124J279920J63250r18121N79058
11791D852551J669203j27350k139263j772944r30221j457082j474423Q7041O74406
11782f18082n33576k23600K230508J919729k849816n566903j360185M268366L748074
11773A014515o65925j311840K383621M243204K030570k29461l5964L67761j040817
11764F755664l123359m091166l302614q75471J752406K266889Q93557Q95773L136708
11755D308387L707818L01833l120758k312716N56668J025031n90290j484554k076057
11746C15362l651736l654092L61024M717087L988720o29244l434359k823371j670471
$$ y = [-1785005, -3828141, -567578, 5837649, 10876641, 11298774, 7266460, 2801689, 2693839, 6938361, 10106009, 8404224, 4728568, 3748444, 5028364, 5191614, 4273493, 4852551, 6521754, 6394404, 4255141, 2482197, 1551976, 94894, -1379529, -1292488, -618082, -1151658, -1375258, 855250, 2774979, -74837, -5641740, -7001925, -2733559, 1014515, 348590, -963250, 1420371, 5663575, 7694145, 7464684, 7428720, 7796481, 6755664, 3632305, -458861, -3761475, -4636946, -2884540, -617651, 275906, 1171679, 4308387, 8016205, 8318038, 5197280, 2884564, 3441232, 4466263, 3875973, 2391419, 315362, -3336374, -6990466, -6629442, -1912355, 2076365, 1447121, -1987238, -4810609, -6481080]
11737f481080q06829J435942M008901L529483j52051l570717m506398l344002
11729i886751p94013K013057K966040K039076K272204M207969L386623k097347
11721D106858o418300m434885m00577q84157l529197j648760L517615M858965
11713d832438J555948n73703L26147Q41400Q32461L368015O084413K772571n165782
11704E209032q555393l808077K462442M334626L372758K119242m68309l849049
11696H17272m125192q18369J672873J907927L130633M950104K104929n077839
11688D562338q149165l302360J983248R04301k223086n69578L278073K365461
11680a150768k604590m717640j604133K430206L591588K290022N60058j71962
$$ y = [-6481080, -7287909, -5851967, -1843066, 1686417, 1534366, -2036351, -6542749, -9886751, -10680764, -8667707, -5701667, -3662591, -1390387, 2817582, 6204205, 4106858, -2311442, -6746327, -7146904, -8031061, -11560258, -13209018, -9691403, -4832438, -3276490, -3850193, -3524046, -2682646, -1850185, 1517830, 7602243, 10374814, 5209032, -3346361, -7154438, -4691996, -357370, 3015388, 5134630, 4666321, 817272, -3307920, -4126289, -2453416, -545489, 2585144, 7535248, 9640177, 4562338, -3586827, -6889187, -4905939, -4001638, -6224724, -6794302, -3516229, -1150768, -3755358, -8472998, -10077131, -7646925, -4055337, -1765315, -1205257, -1377219]
11672a377219K89576K09052k049643m020822j208236N088817P413069K642658
11664F987252k883856k882854m9223j22610k212251j562535J742476L462443K211364
11655D690206j0705k260103m365827m242980o31546L255360L556225J348041j9215
11646A319456o66622k253759k904878K1129L943842M033138R78680m64934J16940
11637D122992j304079m655349m399620J092315N272209K367978m092320o211630
11629g807504k238168K420398L327063J722387P18759N45416k29876r00518O87716
11620a754327L778774M401110J026275k377974j804374P57766P90491j221538
11612C596203j220593L74665j069903n172642n216705P16627M824787J321537
$$ y = [-1377219, -1087643, -878591, -2928234, -6949056, -8157292, -3068475, 4344594, 6987252, 4103396, 1220542, 1171319, 1048709, -1163542, -2726077, -983601, 2478842, 4690206, 4679501, 2419398, -1946429, -6189409, -6820955, -3565595, -9370, 1338671, 1319456, 652834, -1600925, -4505803, -4484674, -540832, 3492306, 4470986, 4006052, 4122992, 2818913, -1836436, -6236056, -5143741, 128468, 2496446, -1595874, -7807504, -10045672, -7625274, -4298211, -2575824, -1857065, -1311649, -1541525, -2442043, -1754327, 2024447, 6425557, 7451832, 5073858, 3269484, 4027250, 4817741, 3596203, 2375610, 2750275, 1680372, -3492270, -8708975, -7992348, -3167561, -1846024]
11604a846024l546362r44836N975903O513990o48410n187634j091464M525615
11596C750778K878034l369473m847045N13792N121821K973243k438747l729745
11588H52658K01095L260855R24262l655101m301976l92088K659623J105793k576222
11579a921101l908090k052418O46910K309656K542512J607642N15120N38061J283805
11570A562097R34478o21666j288736m80690k95224j468259j755738m40653k71511
11561d125902j889392j022951M204357P763802L878002k873329l405444J892260
11553D421403L857998o69556m094550q31920L735454K260079l229327n481955
11545c2374l039146k68330P97543J660489J681088j653635o208526n681367J014622
$$ y = [-1846024, -5392386, -6337222, -361319, 6152671, 5504261, 316627, -774837, 3750778, 6628812, 3259339, -1587706, -1073914, 4047907, 7021150, 4582403, 852658, 1053753, 4314608, 5238870, 1583769, -2718207, -3110295, -450672, 655121, -1921101, -5829191, -7881609, -7234699, -4925043, -2382531, -774889, -259769, 278292, 1562097, 2496575, 1874909, 586173, 105483, -189741, -1658000, -3413738, -3854391, -4125902, -6015294, -7038245, -2833888, 4929914, 8807916, 5934587, 2529143, 4421403, 8279401, 7609845, 3515295, 2683375, 6418829, 8678908, 5449581, -32374, -3071520, -3339850, -2542307, -881818, 799270, -854365, -7062891, -12744258, -11729636]
11536a1729636O592179N274832R82091N71301K701185M95720n924486p722008
11528h758822n56539P550792O812003o58927m478125q58445L534399K628776j289167
11519C925945l161832k553612j705351o58263J268298K239684P02462p19818J245636
11510E83149M449402L635964j452108n113631l724665k98455R60830P70006K161797
11501A972289M414849L849727K6654l006447k648706j357072k048903k841634
11493a639243j77138M343050N058934N78325l797550l818638j866003j714881
11485c033144k168509n67492J061921n69485k916891r16595L725737M235401J68935
11476i80122j015711L833693P643426L821617l663759o583623l912515r12886
$$ y = [-11729636, -5137457, 137375, 1119466, 1690767, 4391952, 4887672, -1036814, -8758822, -9315361, -1764569, 5047434, 4388507, -89618, -948063, 2586336, 5215112, 3925945, 764113, -1789499, -3494850, -4153113, -2884815, -645131, 57331, -662487, 583149, 5032551, 8668515, 7216407, 2102776, -1621889, -1920344, -959514, -189508, 1972289, 6387138, 10236865, 10263519, 7257072, 4608366, 3251294, 1202391, -1639243, -1816381, 2526669, 7585603, 8163928, 4366378, 547740, -1318263, -3033144, -5201653, -5769145, -4707224, -5276709, -8193600, -9110195, -5384458, -1149057, -980122, -1995833, 1837860, 9481286, 13302903, 9639144, 3055521, -856994, -1769880]
11468a769880k72947l21739M4598L43729J218362L239359L928213O16353m277018
11459B749030n312446j521454K105403J402786j734469k175272J927181O472507
11451C913266N570576j013835n815809k184280N753565O906811j686277r895382
11443A548635q307777p93232K639291L46396j361284J07772J028306l90689j227740
11434f410322j18803N30247j06005K82285J933660J864368m98222j890830j170583
11425e584205j326306l249150k786706K609987Q559222Q978256L901920j292654
11417I810364k617973p68074J018748M84192j506676j878425M37350K138385J60107
11408G277998k589978p68865M335077N212370p06418o329078m879840N48013K267537
$$ y = [-1769880, -2042827, -2364566, -2319968, -1976239, -757877, 2481482, 6409695, 7026048, 2749030, -2563416, -4084870, -1979467, -576681, -2311150, -4486422, -2559241, 3913266, 9483842, 8470007, 2654198, 469918, 6223483, 13130294, 11444017, 1548635, -6759142, -7552374, -4913083, -4566687, -5927971, -5820199, -4791893, -5182582, -6410322, -6529125, -5998878, -6104883, -5822598, -3888938, -2024570, -2522792, -4413622, -5584205, -6910511, -10159661, -12946367, -10336380, -1777158, 7201098, 11103018, 9810364, 7192391, 6424317, 7443065, 7927257, 6420581, 4542156, 4979506, 7117891, 7277998, 4688020, 3919155, 8254232, 13466602, 12760184, 6431106, 1551266, 2099279, 4366816]
11399D366816r23144l505951k114963P54222J617209L05557j179825j274586J87348
11390a767317J828951J662627m59781k061408j134064J042137J811493P89691
11382A712329j62539K81655J692738K575446J290866k230251m895679l087615
11374b823050J745877L511320m6266l210062p84312L179272J558371l477419k750089
11365c096358M934773R165778L103189n570205n470439K084980N671046L82173
11357A1204937o621386p801129m820263l239377l401292j606592K529217N005270
11349h750615L414749K81430n18957J524388L718992M060240L509636L914248
11341A1154111M533640K507862k455433o034871m477242m21626J79892l318032
$$ y = [4366816, 3443672, -62279, -2177242, -1423020, 194189, 499746, -680079, -1954665, -1767317, 61634, 1724261, 1264480, -796928, -1930992, -888855, 922638, 1712329, 1549790, 1831445, 3524183, 6099629, 7390495, 5160244, 264565, -2823050, -1077173, 2434147, 2387881, -822181, -1606493, 1572779, 3131150, -346269, -3096358, 1838415, 11004193, 14107382, 8537177, 3066738, 5151718, 10822764, 11204937, 4583551, -3217578, -8037841, -11277218, -14678510, -16285102, -13755885, -8750615, -5335866, -5054436, -5573393, -4049005, -330013, 3730227, 7239863, 11154111, 15687751, 18195613, 15740180, 9705309, 5228067, 4806441, 4986333, 1668301]
11333A668301n209735k167832J746295J626433r42607j246422J034360K578625
11325i12582K675892L444177M624335L333693o77418l944196m139056k317879
11317B086966n332K160876K572417m05094m773902o098115l365750K8830J895829
11308e903275L591703N518893M878470L44804m627859n772503k799420J356768
11300c412419L558265J973748k288767m632527j814652K597905K423756j464644
11292c059335k033886K388508N073194K015937j780181j364731M47485j80744
11284A506247r31365P42730J470458j044819j738237K768873N596159J20539o973491
11275A517094n037331K676871L865066k576127n506838q04637K946282P47650
$$ y = [1668301, -3541434, -5709266, -3962971, -2336538, -3279145, -4525567, -3491207, -912582, 1763310, 5207487, 9831822, 13165515, 12488097, 8543901, 4404845, 2086966, 2081634, 4242510, 6814927, 6409833, 1635931, -4462184, -7827934, -7799104, -5903275, -2311572, 3207321, 8085791, 8430595, 3802736, -1969767, -4769187, -3412419, 145846, 2119594, -169173, -4801700, -6616352, -4018447, -1594691, -3059335, -5093221, -2704713, 2368481, 4384418, 2604237, 1239506, 1686991, 1506247, 574882, 1317612, 2788070, 1743251, 5014, 2773887, 8370046, 8490585, 1517094, -3520237, -843366, 3021700, 445573, -5061265, -5865902, -2919620, -2171970]
11267b171970q63040K635697M924610P87271l792952j801147L131945L802463
11259F652877J215677P11665J936003J180517n73471m8194J161356p16349m305486
11250G214595n195147l146346j107813N71272K964072M050036J522215k049353
11242D823531k869300k458957m271578o152623l364445K458974M981208L080700
11234c772490J440694J330345j040146n714900o683202j332860M709552N843129
11226e219878L736417K454930J723914l30947j994969n85324K399526L183759
11218E367428J098051j353702k333891j896972r41212j028352l298429n808938
11210a0196017m576536P69018N423407N743361L708207K496966J708494M00759
$$ y = [-2171970, -3035010, -399313, 4525297, 5312568, 1519616, -281531, 2850414, 6652877, 7868554, 8580219, 10516222, 11696739, 11123268, 11075074, 12236430, 11520081, 7214595, 2019448, -1126898, -2234711, -1663439, 1300633, 5350669, 6872884, 4823531, 1954231, -504726, -4776304, -10928927, -14293372, -11834398, -6853190, -3772490, -2331796, -1001451, -2041597, -7756497, -14439699, -15772559, -11063007, -5219878, -1483461, 971469, 2695383, 2364436, 369467, -215857, 2183669, 5367428, 6465479, 5111777, 2777886, 880914, -60298, -1088650, -4387079, -10196017, -14772553, -14003535, -8580128, -2836767, 871440, 3368406, 5076900, 5477659]
11202E477659L56329J764758M21215m820979o742299m819P528283M357304n942576
11193B394875q244573R16063P394418J669021o269348l432797N642086P222754
11185G292499J13616m593052k272809J31282k042366m107137j508272K875431
11177d110808M229463J785606k800616o868936n763070K453790J0652972R254211
11169H832612L57271m083680l02552J988364l156147p107786j375951P032464
11161B184595O255011j488268m280571l8361J443581m185221q536401l864211
11153a2509846N272509Q727044L754749l297805n644224l034316m76194j206345
11145h414428k130644J418215O940705O351617j454542o500950j745131N227360
$$ y = [5477659, 5833988, 7598746, 8019961, 3198982, -3543317, -3548136, 3980147, 8337451, 2394875, -5849698, -4933635, 2460783, 4129804, -2139544, -5572341, 69745, 7292499, 7406115, 2813063, 540254, 671536, -1370830, -5477967, -6986239, -4110808, 118655, 1904261, -896355, -7765291, -13528361, -11074571, -421599, 8832612, 9189883, 5106203, 4803651, 6792015, 3635868, -3471918, -4847869, 2184595, 8439606, 6951338, 2670767, 2632406, 4075987, -109234, -8645635, -12509846, -7237337, 1489707, 5244456, 1946651, -3697573, -6731889, -7208083, -8414428, -10545072, -9126857, -2186152, 4165465, 2710923, -3790027, -5535158, -307798]
11137c07798K990625n874498q261119j20718Q404095Q491689L208305m91931j652713
11128F385937k666541l344086k566782j490961j226858o42829R44353K164960
11120b442807K374982K470836J918421o86834l237173j675540K539998K639274
11112C901157k999833o745913k413657N180919O882670J723212l187934l328061
11104i87440j396889j216575j905264k04314L795834N811484K616585l144797
11096C368624n370809k146994J614502J123833j510590j060349K497092M292306
11088B807615K183399j080634l156873m461057m800867k659317J163871L630865
11080f372998M030453M251174M171471J618178k523816m366087l117405j910163
$$ y = [-307798, 2682827, -3191671, -11452790, -11573508, -3169413, 5322276, 8530581, 8038650, 6385937, 3719396, 375310, -2191472, -3682433, -4909291, -5552120, -4607767, -2442807, -67825, 2403011, 4321432, 3634598, 397425, -1278115, 1261883, 3901157, 901324, -5844589, -8258246, -3077327, 3805343, 5528555, 2340621, -987440, -2384329, -3600904, -5506168, -5710482, -1914648, 3896836, 6513421, 3368624, -2002185, -4149179, -2534677, -1410844, -2921434, -3981783, -1484691, 2807615, 4991014, 3910380, 753507, -3707550, -8508417, -11167734, -10003863, -6372998, -2342545, 1908629, 6080100, 7698278, 5174462, 808375, -2309030, -4219193]
11072d219193j620961L33192L574422L421015j387224n379707m128037l99698
11064i806191J009059L70497J207685M361428P020706O037722J059261l971520
11056G288647l497420K285045N175168n63993q429952q188683j546217J111876
11048f365529j664265r83064M918861O336326j26755m013550J096323N907212
11040E105559J666119m593067l262775P81100j379869m910513j99825P585565
11032G92294N712852l530028n716796J482521N104684l70139m561359k11416N051538
11023C754151L156630j351493j212607J083965k85451l567250l579303r49569
11015b950927L43965Q3700R4913m06353k091990k154778J013208L578680J849930
$$ y = [-4219193, -5840154, -5506962, -1932540, 1488475, 101251, -5278456, -9406493, -9806191, -8797132, -8426635, -7218950, -2857522, 4163184, 10200906, 11260167, 7288647, 3791227, 6076272, 11251440, 10687447, 2257495, -5931188, -7477405, -6365529, -8029794, -9012858, -4093997, 2242329, 2115574, -1897976, -801653, 5105559, 6771678, 2178611, -1084164, -303064, -1682933, -6593446, -6793271, 792294, 6505146, 2975118, -2741678, -1259157, 3845527, 3475388, -1085971, -1297387, 3754151, 6910781, 5559288, 4346681, 5430646, 5145195, 1577945, -2001358, -2950927, -2606962, -2523262, -2428349, -2834702, -4926692, -7081470, -6068262, -2489582, -639652]
11006f39652j483839j754780M50728J608493J596381K176718J797007k039336
10998A711720o646642o386797r69279L627056L295790N76925r6901J492354K126167
10989a269607J54581k408264k575277p3962K255191J881526k23763q78944J061694
10980b076825L299004L199186P19955k300582m150204l800414j190827J846558
10972d454149K428181p7105k587931j768057J631507L560346J796675j287966
10964g58499j820057Q31710L745236M485356L668399K900311K042215K49688j655422
10955A3688937k241228k048962k456504k667992j082956Q20598N5084k314743
10947A752234k019444J008639J572222k152186m637030j513839L148667L150731
$$ y = [-639652, -2123491, -3878271, -3427543, -1819050, -222669, 1954049, 3751056, 1711720, -4934922, -11321719, -12290998, -8663942, -5368152, -4791227, -4888128, -3395774, -1269607, -1115026, -3523290, -6098567, -6172529, -3917338, -2035812, -2259575, -3138519, -2076825, 1222179, 4421365, 5141320, 2840738, -1309466, -5109880, -6300707, -4454149, -2025968, -2103073, -4691004, -6459061, -4827554, -1267208, 529467, -758499, -2578556, -1746846, 1998390, 6483746, 10152145, 13052456, 15094671, 15344359, 13688937, 11447709, 9398747, 6942243, 4274251, 3191295, 4011893, 4066977, 1752234, -267210, 741429, 2313651, 161465, -4475565, -5989404, -2840737, 309994]
10939C09994m71650k055152m5393K601016M080932M162056J524943l348704n147869
10930A610173k40121N880667M995045j405477m138823m57961K469585l85892m648588
10921C678608m407488n28664K564947L076698J551473r98518k110549M74797M176594
10912G477898L602128r60213l054423n57662K34649m728468r263407n910770K269113
10903a0891155O113687L340484j23230j06681J417711J761151J392307J418031
10895D322305J541685J501121J380987K28082k689356n352180m838241j708600
10887e614197N21533M08590l6708O01827Q76795n88455k372126j949043J278408
10878f873376N437488P492396M979716j742799q437311r954998n311890J217235
$$ y = [309994, -161656, -2216808, -2262201, 338815, 4419747, 8581803, 10106746, 6758042, 1610173, 1370052, 7250719, 12245764, 10840287, 6701464, 6243503, 8713088, 8327196, 3678608, -728880, -1257544, 1307403, 4384101, 5935574, 4937056, 2826507, 3301304, 7477898, 11080026, 10119813, 7065390, 6507728, 6742377, 2013909, -7249498, -13160268, -10891155, -4777468, -1436984, -1560214, -1666895, -249184, 1511967, 2904274, 4322305, 5863990, 7365111, 8746098, 8974180, 6284824, 932644, -3905597, -5614197, -5092664, -4684074, -4720782, -4118955, -3242160, -3830615, -6202741, -8151784, -6873376, -1435888, 6056508, 11036224, 9293425, 856114, -9098884, -14410774, -13193539]
10870a3193539M621023L682829O81949j817253k761804k232873o60200J582765
10862a0097103M214987O505967O903819M266522j91321l317393l188360j077942
10854D019176M16140K60814q83567k272532l283223k814441m44260K018440K127456
10845h55997J58056j006882K55021K457134L568919L343377K198738m9351k975891
10836G093124m908706m821539l197804l40233L503309N518856J978692n123628
10828b97929p656867j689396N822492O019005L08994k968647j353257J11536j028466
10819b732535j362119O99422J856172O54640L04530K202901L019000R93940q23611
10810D812340m03272j1435j002811j229820l04287j215405l880622l782145k31329
$$ y = [-13193539, -8572516, -4889687, -4207738, -6024991, -8786795, -11019668, -11679868, -10097103, -5882116, 623851, 7527670, 11794192, 11602871, 8285478, 5097118, 4019176, 4435316, 4696130, 3812563, 1540031, -1743192, -4557633, -5001893, -2983453, -855997, -697941, -1704823, -1449802, 1007332, 4576251, 7919628, 10118366, 10069015, 7093124, 2184418, -2637121, -5834925, -6175158, -2671849, 2847007, 4825699, -297929, -7954796, -9644192, -3821700, 2197305, 2506299, -462348, -1815605, -1704069, -2732535, -4094654, -3395232, -1539060, -884420, -579890, 1623011, 4642011, 5635951, 4812340, 4409068, 4397633, 3394822, 2165002, 1860715, 645310, -3235312, -7017457, -7248786]
10801g248786J270780j198213j691567L041393O594365L024374l161742m379201
10793c748597j087746J756006L327924M404451K225418l769247o694948j640713
10785e227452M826248L939390j361220j948625K291105L760493P79723j088142
10777E971520K28020J380872J218216J131768l51837m248396n246083P55105O536316
10768G375501K670159o150295p162565r2233L075097j178216l198905J359234
10760c302223M172080M13292k406480J280387M995058K319842k324134l219677
10752A928145l194399n333662m718567J956117P043937K632670n945142p514208
10744a3145109j237332M095895L609661O22214n72768P41757L034134L650937
$$ y = [-7248786, -5978006, -7176219, -8867786, -5826393, 767972, 3792346, 630604, -3748597, -4836343, -3080337, 247587, 4652038, 6877456, 3108209, -3586739, -5227452, -401204, 3538186, 2176966, 228341, 2519446, 6279939, 7059662, 5971520, 6199540, 7580412, 8798628, 9930396, 9578559, 5330163, 84080, 839185, 7375501, 10045660, 3895365, -3267200, -3359433, -284336, -1462552, -4661457, -3302223, 869857, 1283149, -1123331, 157056, 5152114, 7471956, 5147822, 1928145, -1266254, -6599916, -11318483, -9362366, -2318429, 314241, -5630901, -13145109, -14382441, -10286546, -6676885, -6054671, -6627439, -5885682, -2851548, 799389]
10736G99389O79376l156114k243435L302534O057321K027948l078452l027844
10728A360723k34458o150j532390j261464k50427j216825k349766p17236J685103
10719d522890J497946K45198J099977K672240J751188q07978k168283k253280
10711b485882j732778O72585M060820L445406k384206o371892l122501K068090
10703e850358J734755j572046q06013K486314J444983k580211j666062L986831
10695b821807M964916j718607p004359l947033K121609L237916O57892K05209
10687d304264J784494J274081p80883k43258K259287J521212l024363m948570
10679f462264l41760N585105N541080K45881l454391k580988o56229o97816j154976
$$ y = [799389, 1478765, -1677349, -3920784, -618250, 5439071, 7467019, 4388567, 1360723, 1126265, 1120115, -412275, -1673739, -1924166, -3140991, -5490757, -6207993, -4522890, -3024944, -2779746, -1679769, 992471, 2743659, 1935681, -232602, -2485882, -4218660, -3546075, 514745, 3960151, 1575945, -4795947, -7918448, -5850358, -4115603, -5687649, -6493662, -4007348, -2562365, -5142576, -6808638, -2821807, 2143109, 424502, -6579857, -10526890, -8405281, -5167365, -4509473, -4304264, -2519770, -1245689, -2026572, -2269830, -10543, 1510669, -1513694, -6462264, -6804024, -1218919, 4322161, 4568042, 1113651, -1467337, -2123566, -2821382, -3976358]
10670c976358n1463J753710L238158M549444M012728p71463o646887o277956O50755
10661c519332M890485J346695k631975K29252M701290K915024j151178N02660
10653G282921L965717R8775p087826n302901M238353P195990m51057o516651l674469
10644b51148L43217q71529j834709J703579L778079O53029j242148J653824K164146
10635F096340l478954o680429j647393L212411N5690m433088j852513K694413
10627f033523J231992j906687N17835L712021P4016n063512k289301M310898M075759
10618a370502j428035k270538J557025J522224k592149k643118K163156L814940
10610a246997j17138l278916k208836r1177J331455L421943M451951J285442l230325
$$ y = [-3976358, -4027821, -2274111, 964047, 5513491, 9526219, 8754756, 2107869, -4170087, -3519332, 1371153, 2717848, 85873, 315125, 5016415, 7931439, 6780261, 7282921, 11248638, 11347413, 4259587, -1043314, 3195039, 10391029, 9939972, 3423321, -251148, 92069, -779460, -2614169, -910590, 2867489, 3520518, 2278370, 3932194, 6096340, 2617386, -4063043, -5710436, -2498025, -2442335, -6875423, -8727936, -6033523, -4801531, -6708218, -6190383, -2478362, -2404346, -7467858, -9757159, -5446261, -1370502, -2798537, -5069075, -3512050, -1989826, -4581975, -7225093, -5061937, -1246997, -1364135, -4643051, -6851887, -6943064, -5611609, -2189666, 2262285, 3547727, 317402]
10601C17402l363494O2980J609240P37880J082441K420427J617240p43144k196895
10592A544077l612046n464936l742959K698886O641130L060897j473965L68130
10584A9214L842975J183863m048965m082231j138148j320331j678755K371992
10576d850386M425009k169071q455154k725154P473347O119854l693056m784932
10568h659543M315106P636253J61772m934405p89583K880950m80403l557962n97802
10559d025617L398146M693298O272039O716923j65886j0203227j0239689K09149
10551c344864N796566k19182n725597j330747M809423L074101j874062j780119
10543e94481J332695J824657N74959K00950o55251j987619m37946K839243J987927
$$ y = [317402, -3046092, -2983112, -1373872, -635992, 446449, 2866876, 4484116, 3740972, 1544077, -2067969, -7532905, -11275864, -8576978, -1935848, 1125049, -348916, 19214, 3862189, 5046052, 997087, -3085144, -4223292, -5543623, -7222378, -4850386, -425377, -2594448, -11049602, -13774756, -6301409, -181555, -3874611, -8659543, -4344437, 3291816, 3453588, -1480817, -2270400, 610550, 130147, -3427815, -4025617, -627471, 4065827, 10337866, 17054789, 16888903, 6685676, -3554013, -3344864, 2451702, 2232520, -3493077, -4823824, -14401, 3059700, 1185638, -594481, 738214, 2562871, 3137830, 3338780, 2683529, 695910, 257964, 3097207, 5085134]
10534E085134k571803l533364L13687J925397q16209j783956J249370L183555
10526C051811K067828J201925M17639k630048m065576P5430L101159j685776n695793
10517d161401Q79165P501553o30198j2765219p669868P730663Q396095l849447
10509d568657l618058R762602R632585p234513j2102074L183971J1039382m3324
10501F051914n624687M734055O690261p871087j0644130O345146R355007j0631715
10493a595236j2182669J5951123J9584885j8041469j5602138P6756491J55003184
10486B19874171Q6861445p7995973j55884582q2500406J4539655K0200761k0890435
10479D204636j8547845J4767233J5507243j0296422j1594034R662869J0917683
$$ y = [5085134, 2513331, -1020033, -706346, 1219051, 402842, -1381114, -131744, 3051811, 5119639, 6321564, 6739203, 4109155, 43579, 119009, 3220168, 1534392, -4161401, -3282236, 4219317, 3589119, -9176100, -16845968, -9115305, -719210, -4568657, -8186715, 1575887, 11208472, 3973959, -8128115, -4944144, 6095238, 6051914, 427227, 5161282, 11851543, 3980456, -6663674, -318528, 9036479, -1595236, -13777905, 2173218, 21758103, 3716634, -11885504, 64870987, 219874171, 306735616, 228739643, 72855061, -9645345, 4894310, 25095071, 4204636, -14343209, 424024, 15931267, 5634845, -5959189, 3703680, 14621363]
10472A4621363q173556j0605951O440978J0861089k493859p056338K681041M830836
10464A1105603m796381o814926K024820M040021l186715l148666N235124M578584
10456I037464o853916j0680120j826920L981348M07304o19511M882671N382467
10448C710787j461598k525192N133193O665397l969655j1912204n653339N578728
10440d433883Q330070K924653l280226o801436n834150K14538M929286J203700
10432b747448n084301k171267O453844N612428n176680q852042R18237R120400
10424a926829M956338j697988j44775K899048j737994p704695m927202K331803
10416g952294L739796J69891p87524P97585p2114k164108j096613J375352J234222
$$ y = [14621363, 6447807, -4158144, 2282834, 13143923, 10650064, 3593726, 6274767, 11105603, 6309222, -505704, 1519116, 5559137, 2372422, -776244, 4458880, 9037464, 2183548, -8496572, -10323492, -6342144, -5934840, -6554351, -1671680, 3710787, 2249189, -276003, 4857190, 11522587, 7552932, -4359272, -10012611, -4433883, 3896187, 6820840, 3540614, -3260822, -9094972, -8880434, -3951148, -2747448, -7831749, -10003016, -3549172, 2063256, -3113424, -11965466, -11047229, -1926829, 3029509, 1331521, 1186746, 4085794, 2347800, -5356895, -10284097, -7952294, -4212498, -4042607, -4830131, -4032546, -4104660, -6268768, -7365381, -5990029, -4755807]
10407d755807L84335J709739J571320l110967o060376o86251O976108O016857
10399B044958k021622n572333j171936K839935J161969j317679J55922K429017
10391a451769J171012j908042k987845j991565o37489J171829L493172M197684
10383A056987J969434r41342j709936p81561l40530n89277p2388J208292J454335
10374A254014q1592j718866j520480J77713J328800Q26881m64763j349680j678064
10365c226037j520834l88459J482869K363609J309129Q7843O47164J634421K27263
10356B616968l052164m486666k339231J061815K925430K948198K074512R54384
10348B703246L10277M95323M31311o22289p79757J626215L680604J150678l933367
$$ y = [-4755807, -4371472, -2661733, -1090413, -4201380, -10261756, -10948007, -3971899, 2044958, 23336, -5548997, -6720933, -3880998, -2719029, -4036708, -3880786, -1451769, -280757, -2188799, -5176644, -7168209, -7805698, -6633869, -3140697, 1056987, 3026421, 2085079, 375143, -406418, -746948, -1336225, -1408613, -200321, 1254014, 1172422, -546444, -2066924, -1889211, -560411, 266470, -198293, -1547973, -3226037, -4746871, -5135330, -3652461, -1288852, 20277, 108120, 755284, 2389705, 2616968, -435196, -4921862, -7261093, -6199278, -3273848, -325650, 1748862, 2703246, 3013523, 3508846, 3940157, 3317868, 2538111, 4164326, 7844930, 8995608, 5062241]
10339E062241m783346n3890L809052K676448M18304Q56965J062117j894218m043666
10330C110007j434686J697434k6765k679515O45648O527290N493646j747024m491066
10321G094969L92327L369473j463117o576269l810573K866610N111550K598667
10313I583637n32532m349445r097575q922600k12786Q486380O339321k878941
10305a584541n625184R08725N658290K120733k677502j542279J923616J828504
10297A010362J20334Q94960J864693o79393l747855k213574K244548L893578J974976
10288E362629M58011P02594M09661j228242k511324k652961k139562p55068J299863
10279a054399K048335Q30103L50357K009945K227061j995346o784273o200427
$$ y = [5062241, 278895, 225005, 4034057, 6710505, 7128809, 7985774, 9047891, 7153673, 3110007, 1675321, 3372755, 3345990, 666475, 1312123, 7839413, 13333059, 11586035, 7094969, 7487296, 10856769, 9393652, 2817383, -993190, 1873420, 6984970, 9583637, 9051105, 4701660, -4395915, -13318515, -13531301, -5044921, 1294400, -1584541, -7209725, -6301000, -642710, 1478023, -1199479, -2741758, -818142, 1010362, 1130696, 2025656, 3890349, 3210956, -536899, -2750473, -505925, 3387653, 5362629, 5820640, 6523234, 6932895, 5704653, 3193329, 540368, -1599194, -2354262, -1054399, 993936, 1824039, 2174396, 4184341, 6411402, 4416056, -2368217, -8568644]
10271h568644j122729K481578K527499J988241K121956Q74785j812667k889331
10263d399312j256708P71791J715819K361495K582768R47456j947944l421097
10255b645732k349023O3939K536117L801577K179534j306278j775439K928006
10247C432701P227870N072902o53149k925727j999316l306765n790128k930286
10239a871898M074705N377378k083101q515874n653981J746356M829116L347031
10231A249732K433685K727954J272317j522251k503960j182514M31165J424006
10223D330134J827124J173799o6564l56104k54886k049734m775899m473861j079344
10214e725335P60420j95537L56785L525165M100049J88893k309834k76228J81039
$$ y = [-8568644, -9691373, -7209795, -4682296, -2694055, -572099, 302686, -1509981, -4399312, -5656020, -4884229, -3168410, -806915, 1775853, 2723309, 775365, -2645732, -4994755, -4930816, -2394699, 1406878, 3586412, 2280134, 504695, 3432701, 10660571, 15733473, 15080324, 12154597, 10155281, 6848516, 1058388, -1871898, 2202807, 7580185, 5497084, -3018790, -8672771, -6926415, -2097299, 1249732, 3683417, 6411371, 7683688, 6161437, 3657477, 2474963, 2906128, 4330134, 6157258, 7331057, 7264493, 6908389, 6653503, 4603769, -172130, -4645991, -5725335, -4964915, -5160452, -4803667, -1278502, 2821547, 3010440, 700606, 424378, 605417]
10205F05417m987499q465622k890825N621299O164909P0039k367043J106333K873852
10196b269140m68185l536223k535618m50478o0972J57194J292012J787387J238487
10187d845536P86444k59395k555641k721667K085476P137880N614823m5588j263710
10178C933086K594072L265376k154735o444558m699782j590530j721707j849925
10170h668703J514330M557952K883339l63504J30928K999705L176778K35110k140912
10161D325023k406919j741984n30483J179994J502037q88018l471223k513613
10153d545186J788829N248711M200307j018923o003400n730346j42325M538906
10145a663427L312914l44841J71281L663616L133220j634433l104074L91070P69914
$$ y = [605417, -4382082, -12847704, -15738529, -10117230, -3952321, -3882282, -6249325, -5142992, -2269140, -2737325, -6273548, -8809166, -9259644, -9320616, -9163422, -7871410, -6084023, -4845536, -4059092, -4318487, -6874128, -9595795, -7510319, -372439, 5242384, 5196796, 3933086, 6527158, 9792534, 7637799, 1193241, -3506541, -5097071, -6818778, -8668703, -7154373, -2596421, 286918, -76586, 54342, 3054047, 6230825, 6465935, 4325023, 1918104, 176120, -354363, 825631, 2327668, 1439650, -2031573, -4545186, -2756357, 2492354, 6692661, 5673738, -329662, -6060008, -6202333, -1663427, 1649487, 1304646, 1475927, 5139543, 8272763, 6638330, 3534256, 3925326, 4695240]
10136D695240n225481q383460j823898O270186N198612q78038p16951M399734
10128C535944L351942m566551p274759J13403O836710L444636m244470n627470
10120d430615j026199J698747L04810r61626m20029n77466j706077r02325J938233
10111f082547K938373M00030k329544j953953L56515J794303K267317L096724
10103D87218L298590P64393l108594l606770R31977N666056M834658p75791n039618
10094C452119m378412r77451J728902K752888J928521j009240l773588k386478
10086b662739K325735L580950j726251o581820l141305M822479O524011l9451
10078C101609n466114l293255J443614J613440j227945j057470K487586M357133
$$ y = [4695240, -530241, -8913701, -10737599, -4467413, 731199, -146839, -863790, 3535944, 6887886, 2321335, -4953424, -4840021, 1996689, 5441325, 1196855, -4430615, -5456814, -3758067, -3453257, -4414883, -4834912, -5412378, -7118455, -8020780, -6082547, -3144174, -2744144, -5073688, -7027641, -6671126, -4876823, -2609506, 487218, 3785808, 4550201, 1441607, -2165163, -1233186, 4432870, 9267528, 8491737, 3452119, -926293, -1903744, -174842, 2578046, 4506567, 3497327, -276261, -2662739, -337004, 3243946, 1517695, -5064125, -8205430, -3382951, 3141060, 3101609, -2364505, -5657760, -4214146, -2600706, -3828651, -4886121, -2398535, 1958598]
10070A958598J900888k779838o639701p501843l784316L102763P450764N027057
10062a265628o40917k455007L26054J726213r40867k770355M58415N067693M991699
10053D497300Q97513j487830l27595O36424p47615j659293J75117K213136J425111
10044E622268n83473o41750K92378q92284l220664k694785M16222J105535j896727
10035b493280k969711J487677O107808L996236k385777m386532K87031M935341
10027D578793M027518k71327l229843l665576k600354m79342J570519J536694
10019A467082j1852Q1334K017690J799688j855159m154217j572396K034886J560944
10010A368000j064782n68578K618152L458832Q62168j277869j106073q77225j707791
$$ y = [1958598, 3859486, 1079648, -5560053, -13061896, -16846212, -13743449, -6292685, -1265628, -1906545, -4361552, -4035498, -2309285, -3250152, -6020507, -5562092, -494399, 4497300, 5394813, 3906983, 3579388, 4215812, 3468197, 1808904, 1984021, 4197157, 5622268, 5038795, 4397045, 4689423, 3797139, 576475, -2118310, -1702088, -596553, -2493280, -5462991, -3975314, 2132494, 6128730, 3742953, -643579, -356548, 4578793, 8606311, 8334984, 5105141, 1439565, -1160789, -1640131, -69612, 1467082, 1455230, 1536564, 3554254, 5353942, 3498783, -655434, -2227830, -192944, 1368000, 303218, -265360, 2352792, 5811624, 6673792, 5395923, 4289850, 3412625, 1704834]
10001A704834j695433j50280R39118O09370J61223J45395k96855j059384j518046
9992a160058k531580m088312k793915K913626P162252L621792l231336k960193
9984c067724M437543P463933J002685n834008m896753j125549j697287l090252
9976f807412N37365M259913L93818n988750l719048M882372O060841k850569p872133
9967a1103603j52356R931509Q697288r32882n780676k225790J469868J02694j804817
9958a798765M58233L866765L070148j212409l556258j543943J555530J747999
9950B587300n92104j817799j07732K234706J936330j022858l395288k396699J405695
9941a168449M658656M174815j20886m722383n744160k903345P49009L068054M683235
$$ y = [1704834, 9401, -140879, 798239, 1407609, 1568832, 1714227, 1417372, 357988, -1160058, -3691638, -7779950, -10573865, -7660239, -497987, 3123805, -107531, -3067724, 1369819, 8833752, 9836437, 4002429, -894324, -2019873, -3717160, -6807412, -6270047, -2010134, -1616316, -7605066, -11324114, -6441742, -380901, -3231470, -11103603, -11255959, -1324450, 7372838, 6439956, 659280, -1566510, -96642, 6052, -1798765, -1340532, 2526233, 5596381, 4383972, 827714, -716229, 839301, 2587300, 1995196, 177397, 69665, 2304371, 4240701, 3217843, -177445, -2574144, -1168449, 3490207, 7665022, 7544136, 2821753, -2922407, -5825752, -5076743, -2008689, 2674546]
9932B674546O024732N310895J453086l238555n562546n059145l276178j266475
9924b939640K76332M64689j72530K80724J658034J149856j685039k970688m17932
9915d356194K820205L676571M013401N471291M520045j244152o580218n879503
9907B441446k879829m389721p666553m371090M451608Q461070L802335j714717
9899a865451j377641K050110L607257L107539J628234j152777l192417j021200
9891A783654L345460M023627J181360O62430K673243J297188l103004l124764
9883H739194J522765L091000K668932J0712536K3217207J7306410j4486147m3207442
9875I564455l7658807p317168J2098149P891121l27361K193340O193290J654601
$$ y = [2674546, 8699278, 14010173, 15463259, 12224704, 6662158, 1603013, -1673165, -2939640, -2663308, -2198619, -2371149, -2090425, -432391, 717465, -967574, -3938262, -4356194, -1535989, 2140582, 6153983, 11625274, 16145319, 14901167, 8320949, 2441446, -438383, -4828104, -12494657, -16865747, -12414139, -3953069, -150734, -1865451, -3243092, -1192982, 2414275, 5521814, 7150048, 5997271, 2804854, 1783654, 5129114, 9152741, 10334101, 10996531, 13669774, 14966962, 11863958, 8739194, 10261959, 13352959, 16021891, 26734427, 49951634, 67258044, 52771897, 9564455, -28094352, -35411520, -23313371, -15422250, -15749611, -13556271, -7362981, -5708380]
9867e708380l906084j556504K647757J30042m409759k147804M394145O531304
9859d025283L280717J22783q69685j250038r52369J09524o04147l323986l050671
9850a0563155K645716P837020O280588N18107l080173l538136l226161j557082
9842d683276K084864L562936J2436l073404P52322P264621O528190j916683q184385
9833B347621o533939j731438N65097J199096K276727K098524l83105j932690l72488
9824b466595J120941o17786l238518l196367j768926j789886j675754J539417
9816a2093474N548641N512635K317652J374359L111887J915951l626521o801336
9808b740206l133033J888626J446496j501803M68758O139364O910642N74694n252812
$$ y = [-5708380, -9614464, -11170968, -8523211, -8393169, -12802928, -14950732, -10556587, -4025283, -744566, -621783, -1491468, -2741506, -3693875, -3584351, -4188498, -7512484, -10563155, -7917439, -80419, 6200169, 6718276, 3638103, 99967, -3126194, -4683276, -2598412, 964524, 976960, -2096444, -1344122, 5920499, 12448689, 10532006, 2347621, -4186318, -5917756, -5352659, -4153563, -1876836, 221688, -161417, -2094107, -2466595, -1345654, -1963440, -5201958, -8398325, -10167251, -11957137, -13632891, -12093474, -6544833, -1032198, 1285454, 2659813, 5771700, 7687651, 4061130, -2740206, -5873239, -3984613, -2538117, -4039920, -3571162, 2568202, 9478844, 10053538, 4800726]
9799D800726n163691k952681l090167k942970J074605N707969N733218K409169
9791E576178N70532L67213j526567m515707m558155j341263R79309L32454j018321
9782e134327j063195m71450r8120J82238J46861m7631J270937M177815M667274
9773C630402l607n161852l858303K540356N432334J177105m268016m534341p12787
9764e758709K380497K696515R70959j536207k776798r74179K065658K197534r95430
9755a730160l211340j954002J60242L66236k96081j25653K30979J80189Q10642
9746e568948K101025K250742J388522J697925K474047L18630l850228m185425
9738c373710O23121L844737J113582k222917j89192L415552J511190l879163m767286
$$ y = [4800726, -362965, -3315646, -6405813, -9348783, -8274178, -2566209, 3167009, 5576178, 6146710, 6513923, 4987356, 471649, -4086506, -5427769, -4448460, -4116006, -5134327, -6197522, -6668972, -6767092, -6584854, -6437993, -6485624, -5214687, -1036872, 3630402, 3626795, -1535057, -5393360, -2853004, 2579330, 3756435, -511581, -5045922, -5758709, -3378212, -681697, 289262, -1246945, -4023743, -4997922, -2932264, -734730, -1730160, -4941500, -6895502, -6735260, -6369024, -6665105, -6790758, -6559779, -6379590, -5568948, -3467923, -1217181, 171341, 1869266, 4343313, 4661943, 811715, -3373710, -2750589, 1094148, 2207730, -15187, -204379, 3211173, 4722363, 843200, -3924086]
9729c924086l47631K293729L19947j000339J682155L968601J527287k543287k897896
9720i21520k90690L20094k156102l563805j001560L074651M493411K734007N81740
9711C270226n10167j883566l832516l433327Q97136M978919L641885r48849j562996
9702F16745K685524L978243j909875p719365n131096K198816M031316j051852
9694b301544m602796k037864J752136K253363K025382L491412K783952k827676
9686E36365p125752k705717O356804Q336677M43010o706361m001272L830537O058793
9677E023084J138735l016561j892930K35727j029387l030869j412239K105708
9669a878732K459747o76335k631004q17692K241271L088278J094576k161364m397611
$$ y = [-3924086, -4271717, -1977988, -1658041, -2658380, -976225, 2992376, 4519663, 1976376, -921520, -1212210, -892116, -3048218, -6612023, -7613583, -4538932, -45521, 2688486, 3270226, 2760059, 876493, -2956023, -6389350, -5492214, -513295, 3128590, 2179741, 616745, 3302269, 7280512, 5370637, -2348728, -7479824, -5281008, -1249692, -2301544, -6904340, -8942204, -7190068, -4936705, -2911323, 580089, 3364041, 536365, -6589387, -9295104, -2938300, 5398377, 5841387, -864974, -4866246, -1035709, 5023084, 6161819, 3145258, 1252328, 1488055, 458668, -2572201, -3984440, -1878732, 581015, -95320, -2726324, -3544016, -1302745, 1785533, 2880109, 718745, -3678866]
9660c678866l584741j70683K088312N32337k009092j012147K437194L077925P0962
9651b248799j672232J47065J727517M74083m49739J228497J585935k590644o381845
9642h180162l183672M285261O857857J953852l304172k782152J142393K888787
9634c22008J394388n85835j336373r94952K88162J933489K013565m03878k709749
9625g23191j458093K241110L066607j231297n502860l345047L680406P313177
9617D040812L708876j516807k075118j45630j571731n268775m605769J383417
9609f050725N709209L962272L73808K29297K048536J626039n97486j067096P98935
9600G032789K386076J984512r3207k748431m087808k478677M01395O67471j608746
$$ y = [-3678866, -7263607, -7434290, -5345978, -4813641, -6822733, -7834880, -5397686, -2319761, -2248799, -3921031, -3773966, -2046449, -1572366, -2022105, -793608, 792327, -1798317, -8180162, -11363834, -7078573, -220716, 1733136, -1571036, -4353188, -3210795, -322008, 1072380, 486545, -849828, -1844780, -1556618, 376871, 2390436, 1986558, -723191, -2181284, 59826, 3126433, 1895136, -3607724, -6952771, -3272365, 4040812, 7749688, 6232881, 4157763, 4012133, 2440402, -2828373, -7434142, -6050725, -341516, 3620756, 3994564, 4223861, 6272397, 7898436, 7300950, 6233854, 7032789, 9418865, 11403377, 11310170, 8561739, 4473931, 1995254, 2396649, 3064120, 1455374]
9591A455374j526560K482672M640414N52594m802950m072789J054071K728152
9583B510978o95602k899435k21420L178800K564600o71902k228828j001770N31729
9574A067150j33222l008730n340365l901157R61392M631641L620900N3963j782301
9565c830729j190952N0247K016353N043827N808507R59522n988131p560768k602859
9556g294983K223977K344997Q27357J868602M085938L629542J81426l390769m768993
9547b92906l230499N68658L896314L468390m87034l859459l760402j708596n37750
9538e943284p20329j168429j209193l29357J767907L673071L182935O97915p80889
9529h29653J20562J645592K230129K029520M90725l429334p279477o070676L54065
$$ y = [1455374, -71186, 2411486, 7051900, 7604494, 2801544, -1271245, -217174, 2510978, 1815376, -1084059, -1305479, 1873321, 4437921, 3766019, 1537191, 535421, 1067150, 933928, -2074802, -7415167, -11316324, -10354932, -5723291, -2102391, -2048428, -3830729, -5021681, -4971434, -2955081, 2088746, 7897253, 8856775, 2868644, -4692124, -7294983, -5071006, -2726009, -1898652, -30050, 4055888, 7685430, 7866856, 4476087, -292906, -3523405, -2954747, 941567, 4409957, 3922923, 63464, -3696938, -5405534, -5943284, -6663613, -7832042, -9041235, -9370592, -7602685, -3929614, -746679, -48764, -829653, -709091, 936501, 3166630, 5196150, 5686875, 2257541, -5021936, -11092612, -10738547]
9520a0738547N541533N174094K836696K886559K576376k384107q111857o514967
9512h734220J964121P608365M779096j057725k478271j56083N01286j799905l899816
9503c273152m020037k938613p45680K822009N256003L112276k300884n067954
9495g156032k037377L131209N094526L217221O18454p58526j236153j077943j91838
9486c96459L10847j031245l461303m353733k423908Q84359L195552L122107Q56347
9477c297436j647421j650365J529689N205291O392474N139200K960211k35846
9469A4395797m565322p143973m972650l19624J367186q60151k504183r78944J116829
9460d465035J467727J552226K307589J299170k444424n091380l359218K60730
$$ y = [-10738547, -5197014, -22920, 2813776, 5700335, 8276711, 5892604, -2219253, -8734220, -6770099, 838266, 5617362, 4559637, 2081366, 1925283, 2426569, 626664, -3273152, -7293189, -10231802, -10977482, -8155473, -2899470, 212806, -2088078, -7156032, -9193409, -6062200, -967674, 2249547, 2868001, 2109475, 873322, -204621, -396459, -85612, -1116857, -4578160, -8931893, -11355801, -10471442, -7275890, -4153783, -3297436, -4944857, -6595222, -5065533, 139758, 6532232, 11671432, 14631643, 14395797, 9830475, 2686502, -2286148, -2605772, -1238586, -2098737, -4602920, -5581864, -4465035, -2997308, -1445082, 862507, 2161677, -282747, -5374127, -8733345, -8472615]
9452h472615J426792J08815q11100l63122O00189J816595K785735K149605O33485
9443a25621J256693L767623L238694j928932n506776k335181K869519K425786
9435C661805k226353l282186P09305L303328J021312k186448k428832r81664j82546
9426b592279J02324K22785k45408j16764K180034M410751K594903k088673l861220
9417F06453r01866K164629J903682O25511R98985J362487m53690k864288l350198
9408I1705k319590j417756p53155j4969K68144L30580J334349K583329J677868
9399A780505j135450k213070j893K072014O39064k453787k772847O12471M024116
9390E51123L500130q97463m739613l537792J705395M716869J636278l622945m771422
$$ y = [-8472615, -7045823, -6937008, -7748108, -8111230, -7511041, -5694446, -2908711, -759106, -125621, 1131072, 4898695, 8137389, 6208457, 701681, -1633500, 1236019, 3661805, 1435452, -1846734, -1137429, 2165899, 3187211, 1000763, -1428069, -2409733, -2592279, -2489955, -2267170, -2512578, -2629342, -449308, 3961443, 6556346, 4467673, 606453, -295413, 1869216, 3772898, 4398409, 5397394, 6759881, 6306191, 3441903, 91705, -2227885, -3645641, -4398796, -4413765, -4145621, -3815041, -2480692, 102637, 1780505, 645055, -1568015, -1569908, 502106, 1141170, -1312617, -4085464, -3472993, 551123, 4051253, 3153790, -1585823, -5123615, -3418220, 1298649, 2934927, -688018, -5459440]
9381e459440j528559J726934L365344M747127M611724K79436n536784o315220
9373d109438j366387K773558K165793N7802k37443j22255o93953K35126K711075
9364A413878K677931q20402k705166j17671K584538J379690j182127k033568l233807
9355b036704n835933m846541K413333Q747673O287954j151235l642721K22440
9347A58266L239751J967599P2140l5686l63368j664922j995859j554608k313385
9338b490072k620906Q97237N732349N284493n70771m289887k069257J094412O97299
9329A664897m72586Q15559J596882j196576l706011j119450L412129L219642j072738
9320C141748k794707k39697J308454q12711k578905j259178m24395k672564l426229
$$ y = [-5459440, -6987999, -5261065, -1895721, 2851406, 7463130, 7742566, 2205782, -4109438, -5475825, -2702267, -536474, -478672, -716115, -838370, -1532323, -1297197, 1413878, 4091809, 3271407, 566241, 448570, 3033108, 4412798, 3230671, 1197103, -2036704, -7872637, -12719178, -10305845, -1558172, 4729782, 3578547, -64174, 158266, 3398017, 5365616, 5437756, 5402070, 5038702, 3373780, 1377921, -176687, -2490072, -5110978, -4213741, 1518608, 6803101, 6232330, 1942443, -126814, 967598, 1664897, 1192311, 2007870, 3604752, 2408176, -1297835, -2417285, 994844, 4214486, 3141748, 347041, 107344, 1415798, 603087, -1975818, -3234996, -3659391, -6331955, -9758184]
9311i758184J708476P709344O164849j323688m436166L82055M511171Q23449n338851
9302D42455n245971m67296J144235p79900N02863N564285O410449j69977o221408
9293A179735m456081J076726K417729j12139o13299J381767Q06244l325999n858188
9284g503505l794080l31494J135480J670434K897455L048196O10100j287957J277747
9275b277624O050259O168665m39654p182185o833354p93881L298854J968398n72150
9266f12672J38978K529530K753198R40777j42173j14156m63584p65415L24573
9257D589056J556547Q35504o11377k49009O59654j127017m698175n930046m006268
9248h981131j559107Q83125M243330N548669J156412m599664l288652L499805
$$ y = [-9758184, -8049708, -340364, 5824485, 4500797, 64631, 446686, 4957857, 5781306, 442455, -4803516, -5270812, -4126577, -4906477, -4403614, 1160671, 7571120, 7401143, 1179735, -3276346, -2199620, 218109, 105970, -507329, 874438, 1680682, -1645317, -7503505, -11297585, -11629079, -10493599, -8823165, -5925710, -2877514, -2267414, -3555371, -2277624, 3772635, 9941300, 9501646, 2319461, -4513893, -5307774, -2008920, -40522, -612672, -473694, 2055836, 4809034, 5749811, 5607638, 5493482, 5029898, 4264483, 4589056, 6145603, 6981107, 6369730, 6120721, 6780375, 5653358, 955183, -4974863, -8981131, -10540238, -9657113, -5413783, 134886, 1291298, -3308366, -6597018, -3097213]
9240c097213M383107l705431q901035k794752N401205L476735l753758k514371
9232a1505513O850905R903704J081601p566728m889326L499410N069335j368362
9224A075026n684468j612234N619582P313555J974679m275523n629250k333959
9216c552592J242685J940780m4684k544605k838452Q01114O218786P608020K399756
9207A1230808l673491l486440R14576J529552k353514l098266J381349K834606
9199E279180l317212q812823m973320L580658O629152L638523J580981J979537
9191E584676M32985l351360m747105k523672J74017K175081M250430M380062P06193
9182G081307k570096l57468L945565K906047k513770m388424j006344J366808
$$ y = [-3097213, 1285894, -2419537, -11320572, -14115324, -8714119, -5237384, -8991142, -11505513, -4654608, 5249096, 6330697, -1236031, -6125357, -2625947, 2443388, 1075026, -4609442, -6221676, -602094, 6711461, 8686140, 4410617, -1218633, -3552592, -2309907, -369127, -413811, -2958416, -5796868, -4995754, 1223032, 8831052, 11230808, 7557317, 4070877, 4985453, 6515005, 4161491, 1063225, 2444574, 5279180, 1961968, -6850855, -11824175, -8243517, -1614365, 2024158, 3605139, 5584676, 6017661, 2666301, -2080804, -4604476, -4430459, -2255378, 1995052, 6375114, 7081307, 4511211, 4153743, 8099308, 11005355, 8491585, 4103161, 3096817, 4463625]
9174D463625K14206p6990J688920O81219l688513m539307J082494O298742M950954
9165A1075350N33113p34288P44611R46863p71721k743252m613304n682166l829705
9156e074499L46792K627396J463056M58397J669295J779054j597844n230947n773994
9147i333294m649369l384124L21977O899974J0553396O567581r44022m348862
9139A683257k387399M83379J521314J094752o64549l152656l218800J107802O246236
9130B713336O839547K638697k013209l846271k476471J102675M200374L086653
9122A2245331k177687o067695m556686p90183L89148O307J584857L577031K034750
9113F245173j304171j142292J964649K027010k105203m583139k421642p0619r82474
$$ y = [4463625, 4677831, 4600841, 6289761, 6970980, 3282467, -1256840, -174346, 6124396, 11075350, 11608463, 10874175, 11618786, 12565649, 11793928, 9050676, 4437372, -1244794, -5074499, -4727707, -2100311, -637255, -178858, 1490437, 3269491, 1671647, -3559300, -9333294, -13982663, -17366787, -17044810, -10144836, 408560, 6976141, 6032119, 1683257, -704142, -220763, 1300551, 2395303, 1730754, -1421902, -4640702, -3532900, 2713336, 9552883, 12191580, 10178371, 6332100, 3855629, 4958304, 9158678, 12245331, 10067644, 3999949, -556737, -1346920, -957772, -951465, 633392, 4210423, 6245173, 4941002, 3798710, 5763359, 7790369, 5685166, 1102027, -1319615, -1390234, -2372708]
9104b372708j526589J949601N691276M188936o30371k402804l60304L61895j966170
9095B932762k759038P61720M297648K869239j530827l068163n59112J724891Q63830
9086E532950j464798k728335k551378j184585J282222K936269J071502k998424
9078a04577m072228n10301K511622O92941k477490j313817K921891M357527J708900
9069C714468j235585k834217m367930m274971O40055P348512P837005P58104n389050
9060B196391m275794j81216J75970j984179j298479K282663M465739M055899L124023
9051H561017J681301j759221n255809m752839m44962K876613K378394K20290n69209
9042B935575J43445Q83848R67690N56342p274l06617l41140q36640k151521l369629
$$ y = [-2372708, -3899297, -1949696, 3741580, 7930516, 7300145, 4897341, 4537037, 4898932, 2932762, 173724, 935444, 5233092, 8102331, 6571504, 3503341, 2944229, 4669120, 5532950, 4068152, 1339817, -1211561, -2396146, -1113924, 1822345, 2893847, -104577, -4176805, -4687106, -2175484, -1482543, -3960033, -5273850, -2351959, 2005568, 3714468, 2478883, -355334, -4723264, -8998235, -8358180, -1009668, 6827337, 7585441, 2196391, -2079403, -2260619, -2084649, -4068828, -5367307, -3084644, 1381095, 5436994, 8561017, 10242318, 8483097, 3227288, -1525551, -1970513, 906100, 3284494, 3504784, 2935575, 3079020, 3962868, 4930558, 5486900, 5479626, 5173009, 4831869, 3995229, 1843708, -1525921]
9032a525921l334191j840765P43181L678785N128630L308594o00288k986919k530151
9023D0955j779766k495949k590729j23087K819290L398863K383720J706251M33335
9014C792883k598771m570686k184911K142279K996687J94317j260614M43211J387335
9005C41730q79117l129768k106773J84512K75594j044027n23099K237847M695022
8996E1921N093613L346131l45350m589594n751762j526831M652198O436059K410622
8987I777007k215160k885577j240494j246567k867472k955908o05789K064851
8979b175109L580513L968076K518364j263109m373949k568300K828530M914244
8971G429260L89910n424728n917107j743035J794108K532489J975522P54151j135991
$$ y = [-1525921, -4860112, -6700877, -5957696, -2278911, 2849719, 6158313, 5558025, 2571106, 40955, -1738811, -4234760, -6825489, -6948576, -4129286, -730423, 1653297, 3359548, 3792883, 1194112, -3376574, -5561485, -3419206, -422519, -228202, -1488816, -1045605, 341730, -537387, -3667155, -5773928, -5589416, -5313822, -6357849, -6880948, -4643101, 51921, 5145534, 8491665, 8146315, 3556721, -2195041, -3721872, 930326, 7366385, 9777007, 7561847, 4676270, 3435776, 2189209, -678263, -3634171, -4239960, -2175109, 1405404, 5373480, 7891844, 6628735, 2254786, -313514, 2515016, 7429260, 7819170, 2394442, -3522665, -5265700, -3471592, -939103, 1036419, 1790570, 654579]
8962F54579j325058K180293O054465M800015j282105o121366n897986k453336
8954c390499J141898L515856L413231L13990k821771k308078L54486L91483k217764
8945a607168k549632O71151K845475J586839L09653J080726O14041k842742m926162
8936d817819k201385J631371J783442P196O61909K967685K948347M24799j308478
8927B097067j003000j92299j6967r11257l406199n967981m723472R97777N662860
8918g463471M197988q25314k906571l77237K792624L224470J187897j258862j944081
8909c372557J47164K856815K438659p42315j788714P17978J205970l942790q979583
8900a1459373o651994M81924M026980K407584J454365L373575L558988l40067
$$ y = [654579, -670479, 1509814, 7564279, 12364294, 11082189, 4960823, -937163, -3390499, -2248601, 1267255, 4680486, 4994476, 2172705, -135373, 219113, 610596, -1607168, -4156800, -3485649, -640174, 946665, 1256318, 2337044, 2951085, 108343, -4817819, -7019204, -5387833, -3604391, -3597195, -2935286, 32399, 2980746, 3405545, 2097067, 1094067, 901768, 884801, -26456, -3432655, -9400636, -14124108, -13126331, -7463471, -3265483, -4090797, -6997368, -7374605, -4581981, -1357511, -169614, -1428476, -3372557, -3225393, -368578, 2070081, 1327766, -460948, 257030, 1463000, -2479790, -11459373, -18111367, -17629443, -13602463, -11194879, -9740514, -6366939, -2807951, -3148018]
8892c148018l582149j667652K698766L573277k60990m261706l797568Q99350N241976
8883d304714N422612K648596R30152J102596K73263k268812l133369q77136Q76015
8874F69203l53511j432797K87037J185412k616007p345837o258022J81591N057013
8865a0625918M564124J425073j71235J328589M434379N116145M45198n596417
8857I19938m899244K521127N958026l76131p017993l415327M969903N494881j298649
8848B856531l961257J63024K140986j789828m791742k731087j21248N9968P67794
8839g406859K251350N16800k683166k48110O487240O966332j055183o220166j871361
8830c263123L477794J748956j554310L63418K291063j972468n777652o17065P186340
$$ y = [-3148018, -6730167, -8397819, -5699053, -2125776, -2386766, -6648472, -10446040, -9546690, -4304714, 1117898, 3766494, 4696646, 5799242, 6072505, 3803693, 670324, -206812, 669203, 315692, -1117105, -830068, 355344, -2260663, -9606500, -15864522, -15682931, -10625918, -6061794, -4636721, -4807956, -3479367, 955012, 6071157, 6516355, 919938, -3979306, -1458179, 4499847, 4123716, -2894277, -6309604, -1339701, 4155180, 2856531, -1104726, -941702, 1199284, -590544, -5382286, -8113373, -8234621, -8174653, -7406859, -5155509, -4638709, -7321875, -7569985, -1082745, 5883587, 4828404, -1391762, -3263123, 214671, 1963627, 409317, 772735, 3063798, 1091330, -4686322, -5303387, 1882953]
8821A882953N640789k701575m991878N72648L041876j905922n562170j928140
8813e951419K835721J726877k145933j983228K041684M356489K289236j627711
8805A541716l499481j695161J848511L131720N70327k445853j772776J712319
8797f08678L538685J848875j101174k759465k306737K07824L474124M633380K550988
8788I477822J35243J82857O39524k099236o688017q099866m720868n3724K443099
8779h783166K702442K384931K688007L475077K812323j033945n637757n766310
8771g158398j115974J804085n83474k492513J980601Q122471P191282K94812l568607
8762D474285j626951K04500j163120j855849N1227Q56831o89080k94104L133044
$$ y = [1882953, 7523742, 4822167, -169711, 402937, 3444813, 1538891, -4023279, -5951419, -3115698, -1388821, -3534754, -5517982, -3476298, 880191, 3169427, 1541716, -1957765, -3652926, -1804415, 1327305, 1897632, -548221, -2320997, -608678, 2930007, 4778882, 3677708, 918243, -1388494, -1180670, 2293454, 6926834, 9477822, 9613065, 9795922, 10435446, 8336210, 1648193, -6451673, -11172541, -11226265, -8783166, -6080724, -3695793, -1007786, 2467291, 5279614, 4245669, -1392088, -7158398, -8274372, -6470287, -7053761, -9546274, -7565673, 556798, 7748080, 8042892, 4474285, 2847334, 3051834, 1888714, 32865, 84092, 940923, 251843, -42261, 3090783]
8753C090783L769590j250655n516416k787799L065716L952578q25976m962921
8745a465100m289786k52008L668887M781585K403604n58463J23616L517357L333441
8736A1263133k381089o405741k534279M110777M159086j864974m868776j397196
8728H0941K302468J394606p49805L1772J599541N00235j275701K1060K936517
8719F841634L072532L34052j407313j087014j674943m089511m681028q69437M217096
8710F56068N561883K623121q70967k182098j822423j102592k44588N76902N14312
8701C709618o00496j505078r49419R15361K850207L301046J083568l069595n696415
8692C8797l573806J918640N659560M858280J843900k23806j335826k377625k189232
$$ y = [3090783, 6860373, 5609718, 93302, -2694497, 371219, 4323797, 3497821, -1465100, -5754886, -6006894, -2338007, 2443578, 4847182, 4288719, 4412335, 7929692, 11263133, 8882044, 2476303, -57976, 4052801, 8211887, 6346913, 1478137, 80941, 2383409, 3778015, 3028210, 3059982, 4659523, 5159758, 3884057, 3905117, 6841634, 9914166, 10248218, 8840905, 7753891, 6078948, 1989437, -2691591, -3561028, 656068, 6217951, 8841072, 7970105, 5788007, 3965584, 2862992, 2618404, 3195306, 3709618, 3109122, 1604044, 654625, 1569986, 4420193, 7721239, 8804807, 5735212, 38797, -3535009, -1616369, 4043191, 8901471, 10745371, 10521565, 9185739, 6808114, 4618882]
8683D618882q0838J404767J00369j620405p13525M12049k763325q143119q097460
8674a4882605n74281O912031P296916K941416O80009J856775K243987k05389k618739
8665C650120k271618n82501o99458k929534l960902p28647N143407P871859M029860
8656I522586k387328m297247p19899K251430N59062k339980j770571O61683K81460
8647A761196k685447l442010r6651L581728L273712r09282m813328l957830K182068
8638e105844Q033721O324619k784229r776333o918693J435482N005785J753560
8630b031932j175806N5109R97173j473778k774097J241214O056957M856846q66996
8621D884690l721386j290932J814227K108047J318149J434949R40300j639534
$$ y = [4618882, 4538044, 5942811, 6043180, 4422775, 3709250, 4121299, 1357974, -6785145, -14882605, -15456886, -8544855, -1247939, 1693477, 2373486, 4230261, 6474248, 6268859, 3650120, 1378502, 796001, 96543, -2832991, -6793893, -7522540, -2379133, 5492726, 9522586, 7135258, 2838011, 2118112, 4369542, 4928604, 2588624, 818053, 1479736, 1761196, -924251, -4366261, -4462912, -881184, 2392528, 1483246, -3330082, -7287912, -5105844, 2927877, 9252496, 6468267, -3308066, -10226759, -8791277, -3785492, -2031932, -3207738, -3152629, -2155456, -3629234, -6403331, -5162117, 894840, 5751686, 4884690, 1163304, -127628, 1686599, 3794646, 5112795, 6547744, 7488044, 5848510]
8613E848510m001926k879752J085889L820492K797183k14923j812857j289614
8605C353002r98982k332461l185215j143718K245565L365678K085041J655129
8597E044039K775081K233921j008169l129137j667695O2418j370389l622859l106119
8588c788909j526812k032612k173342K051003P202052N730406j909429o807418
8580c255061m639979j047889j180108j763514J608671N854021N335042J060374
8572A971557j392593n49793K46553n27539n83911J443703L332573K343738j117743
8563E166545l582300j867029L014547N724999K601524k725322l517284K42659
8555E058339J640712k040616m522798p80737M118188K627997l353286n511346
$$ y = [5848510, 1846584, -1033168, 52721, 3873213, 6670396, 6455473, 4642616, 3353002, 2354020, 21559, -3163656, -4307374, -2061809, 1303869, 3388910, 5044039, 7819120, 10053041, 9044872, 5915735, 4248040, 4310458, 2940069, -682790, -3788909, -5315721, -7348333, -9521675, -7470672, -268620, 5461786, 3552357, -3255061, -7895040, -8942929, -10123037, -11886551, -10277880, -4423859, 911183, 1971557, 578964, 29171, 275724, -251815, -835726, 607977, 3940550, 6284288, 5166545, 1584245, -282784, 2731763, 8456762, 11058286, 8332964, 4815680, 5058339, 6699051, 4658435, 135637, -645100, 3473088, 6101085, 2747799, -2763547]
8547b763547j559225K708788K970257J185862M05985N48328O19740P58545Q24859
8538E699592J29739r11728j386616j659172k032339j060511J770214L642330K324437
8529F515946J48427j68158p01646l748485n212006j15045P275882P756142J286269
8520A3037326k780415q09754R8619m217324o757434j580776M541611K083992n355092
8511a739247n709545L181592J0081038O442334k423262n914119k099693J879295
8503C698393P17684k830897l243139k77282J081056k037072o236723o486950k526216
8494a8141146J844285M116950M509802L255532M20262j788314n72264K982244
8486c372649M535702K335487q86473k447291k667064k541472j923361r29190o3698
$$ y = [-2763547, -4322772, -1613984, 1356273, 2542135, 2948120, 3496448, 4116188, 4874733, 5699592, 5829331, 4917603, 3530987, 1871815, -160524, -1221035, 549179, 4191509, 6515946, 6664373, 6496215, 5794569, 2046084, -3165922, -3280967, 3994915, 11751057, 13037326, 10256911, 9447157, 9545776, 5328452, -1428982, -3009758, 1531853, 3615845, -1739247, -7448792, -4267200, 5813838, 12256172, 9832910, 3918791, 1819098, 3698393, 4416077, 1585180, -1657959, -1935241, -854185, -2891257, -9127980, -15614930, -18141146, -16296861, -12179911, -7670109, -4414577, -3994315, -5782629, -6354893, -3372649, 1163053, 3498540, 2612067, 164776, -2502288, -5043760, -6967121, -7896311, -7960009]
8477g960009J432365M112889N574705L374579J63320N54524L065153J728820l553408
8468H492938n806923k244645J150607j31206k163499q47414M30609k060518m284079
8459g464130j248655L455608L424866N80305J470710N215229M645152j359858
8451H719227n666580l791221O63684K863117K450671Q68978j204787k168105m06171
8442B328813J833391N32434l038188k864889K406904O201160L179162k998141
8434G580646m961517j468226K097559J412954k107031m079395k338318J135177
8426b728151K736029J319610p14314o63024J298903L053058L182907J366783k049435
8417F802366m981743m184525M60546M193197L121108j15338k97990K271599K410828
$$ y = [-7960009, -6527644, -2414755, 3159950, 6534529, 6697849, 7252373, 10317526, 12046346, 8492938, 2686015, 441370, 1591977, 1460771, -702728, -1550142, -1119533, -3180051, -7464130, -8712785, -5257177, -1832311, -1252006, 218704, 5433933, 10079085, 8719227, 3052647, -738574, -74890, 2788227, 5238898, 6107876, 4903089, 2734984, 2328813, 4162204, 4694638, 1656450, -1208439, 1198465, 7399625, 10578787, 7580646, 2619129, 1150903, 3248462, 4661416, 2554385, -1525010, -3863328, -2728151, 7878, 1327488, 613174, -49850, 1249053, 4302111, 7485018, 8851801, 6802366, 1820623, -2363902, -1903356, 2289841, 5410949, 5295611, 4997621, 7269220, 9680048]
8408I680048j557928m980677l484358J488252N215621M898876J218310k862499
8400I615645m010844j371011J993158K324100l34671k919954l859674l917809
8392b481060l117761m25947L146882M468240K226441j542837m308157n010950
8384g045149l265177L38875K867596J390870k328343k700425K493492Q315506
8376F7245Q099524J206943o237609p629168k104947M887070O908938K838973k415591
8367E621378l749545j082501K078647L295619K480347K47404k448106m008043
8359B435200l739296k816903k062831m53194K241008L639423K247052L79494L76032
8350B245985L55924k230993m973433l269418K322526O192030M933614O91512k437172
$$ y = [9680048, 8122120, 3141443, -342915, 1145337, 6360958, 11259834, 12478144, 9615645, 5604801, 4233790, 6226948, 8551048, 8216377, 5296423, 1436749, -2481060, -5598821, -6024768, -2877886, 1590354, 3816795, 2273958, -2034199, -7045149, -10310326, -9971451, -7103855, -5712985, -8041328, -10741753, -8248261, 67245, 8166769, 9373712, 3136103, -4493065, -6598012, -1710942, 5197996, 8036969, 5621378, 1871833, 789332, 2867979, 6163598, 8643945, 8891349, 6443243, 2435200, -1304096, -4120999, -6183830, -6637024, -4396016, -756593, 1490459, 1869953, 2245985, 2601909, 370916, -4602517, -7871935, -5549409, 642621, 5576235, 6267747, 3830575]
8341C830575k125966J242498M379394L251790j638837m446761j771633J988122
8333D709182J404033j678335k321260j148548j673095k319291M73443L656735
8325A102864J456206l582215l425727J991955M644228K237235R86591K770651
8317H181788J301807n039318p957926k484857M617838N933787L606398K023176
8309A0182693m27246m826512n827362q32044K912743m68083m639421j467351M575653
8300h16930L792437k306158m206978o14263R69132j594783k335402J105527L886455
8291b120963L449499K959696L608439K352401q05492j652435J23053k17171l347743
8282D349284l912240m83218R53932k448740m430208J62737N975062M845030j790880
$$ y = [3830575, 1704609, 2947107, 7326501, 10578291, 8939454, 4492693, 2721060, 4709182, 6113215, 4434880, 2113620, 965072, -708023, -3027314, -2553871, 1102864, 2559070, -1023145, -4448872, -2456917, 2187311, 4424546, 5411137, 8181788, 9483595, 4444277, -3513649, -5998506, -1380668, 4553119, 8159517, 10182693, 9755447, 4928935, -898427, -1730471, 1182272, 714189, -3925232, -5392583, -816930, 2975507, 669349, -3537629, -4151892, -3182760, -4777543, -7112945, -6007418, -2120963, 1328536, 4288232, 7896671, 10249072, 9443580, 7791145, 7914198, 7697027, 4349284, 437044, -46174, 907758, -1540982, -5971190, -5808453, 166609, 5011639, 3220759]
8273C220759n318131k197007K690888M078709K322331Q77679J404072K434532
8265I513832J385611k305045n650017m903919m21576L158669K561299l20191j513151
8256A505512J42882K675565L745815K202164j530977n135647n848793l466620
8248e710099n90317Q98945J705984K535144K173823N4732j539563m74794J583057
8239F36912J429258o65183j347026M52329J715419M327k636985k445926Q56320
8230b000555L842166L830799J474012j191302l209472m389469m241829k679654
8222h565304q38877N1124m7903n65489r74330j62959K678060N165481K847083
8213d13114l820426p032803j248164P372975Q066370R44229l036016J203867N427134
$$ y = [3220759, -2097372, -4294379, -1603491, 2475218, 4797549, 5675228, 7079300, 9513832, 10899443, 8594398, 2944381, -1959538, -2381114, 777555, 3338854, 3018663, 1505512, 1648394, 4323959, 8069774, 10271938, 8740961, 3605314, -2243479, -5710099, -6300416, -5401471, -3695487, -1160343, 1013480, 1068212, -471351, -946145, 636912, 2066170, 1400987, 53961, 506290, 2221709, 2226036, -410949, -2856875, -2000555, 1841611, 5672410, 7146422, 5955120, 2745648, -1643821, -5885650, -8565304, -9404181, -9353057, -9400960, -9966449, -10940779, -11103738, -8425678, -3260197, -413114, -4233540, -11266343, -12514507, -5141532, 2924838, 3869067, 833051, 2036918, 7464052]
8204G464052J642245n493728o858817k810057l23446o33045Q52993M379220M920708
8195C140125J487448r45366m3515O44799j069785k130456j59517K357272K631229
8186E912234J564047N65948j172801l579362m105061k094340q25602k192817l104433
8177i032187n63877L058213L643102J483980j12761k24243k42839L680J737468
8168b49464L443482J858598k651480n274262k830584J842514L559786J337876
8160A036466j008700m90250J265407J095353o24500p10190J375941K239769P1048
8151D250344j934488n21408K086525J685984q09799q58281J818818K472083p75666
8142G414112l915163m018339l758267n430113n350532M50019Q020313R178988
$$ y = [7464052, 9106297, 3612569, -3246248, -6056305, -6379751, -7012796, -6159803, -1780583, 3140125, 4627573, 3682207, 3638692, 4283491, 3213706, 1083250, 923733, 3281005, 5912234, 7476281, 8042229, 6869428, 3290066, -814995, -2909335, -3734937, -5927754, -9032187, -9596064, -6537851, -2894749, -1410769, -1523530, -1747773, -1990612, -1986932, -249464, 3194018, 5052616, 2401136, -2873126, -5703710, -3861196, -301410, 1036466, 27766, -462484, 802923, 1898276, 1273776, 563586, 1939527, 4179296, 4250344, 2315856, 1794448, 3880973, 5566957, 4757158, 3898877, 5717695, 8189778, 7414112, 3498949, -519390, -4277657, -9707770, -15058302, -14608283, -6587970, 2591018]
8134B591018K773572l326272k547632K537462M817542J854750k463152l897507
8126B339781k441521q24578o81583j383820j638041q95005O03820J988033J906559
8117a026355j68574k389726j826043J702344M550904L490938k22898k781561k644645
8108a315616j250920J14891J385076J861062J63877l270842n715369m960625j372334
8099a4360800K873513N314864M529826J711641K52641J780360L615488K608037
8091H325570N6210o78287r3892j337411l615730k580965J782644L690531M06245
8082E954915l108538k016915R95310Q16509j805894k579943j189987n68892o19538
8073d122973J151352L502907K202121k480039m745814j578336K719139K872104
$$ y = [2591018, 5364590, 2038318, -509314, 2028148, 6845690, 8700440, 6237288, 2339781, -101740, -926318, -1607901, -2991721, -4629762, -5524767, -4920947, -2932914, -1026355, -1194929, -3584655, -5410698, -3708354, 842550, 4333488, 4110590, 1329029, -1315616, -2566536, -2451645, -1066569, 794493, 958370, -2312472, -8027841, -12988466, -14360800, -11487287, -6172423, -1642597, 69044, 321685, 2102045, 5717533, 8325570, 8381780, 7703493, 7609601, 6272190, 2656460, 75495, 1858139, 5548670, 5954915, 2846377, 829462, 1824772, 2641281, 835387, -1744556, -2934543, -3503435, -4122973, -2971621, 531286, 2733407, 253368, -4492446, -6070782, -3351643, -479539]
8065d79539l11529k372531j891417j144684j418293j169773Q75902L259508L570072
8056a082284J619087l33762m40711N74292P76610l0076j08374J232543K106826
8047D314151O73748j911003k789322j085135J219559J870931N32001j500705k692778
8038a368553k410094j357389o21997O3175K066016N074355O032958K610100l139213
8029F949358o512209n275514j513444J271552J433257n2256p08526J081240L708322
8020C81780L466573m47834l802043k682021Q10771J829467L34499M96582K848160
8011C235934K871898j057625m195478l055172j066998j968102k442584K119096
8003e559031P922652O880042n80438n206069k653534P24712p11153k455651J892015
$$ y = [-479539, -791068, -3163599, -5055016, -6199700, -7617993, -8787766, -7911864, -4652356, -1082284, 536803, 203041, -237670, 336622, 1113232, 1083156, 974782, 2207325, 4314151, 4987899, 3076896, 287574, -797561, 421998, 2292929, 2824930, 1324225, -1368553, -3778647, -5136036, -5758033, -5694858, -3628842, 1445513, 7478471, 10088571, 6949358, 437149, -4838365, -6351809, -5080257, -3647000, -3699256, -4407782, -3326542, 381780, 3848353, 3400519, -401524, -3083545, -2272774, -443307, -108808, 387774, 3235934, 6107832, 5050207, 854729, -2200443, -3267441, -5235543, -7678127, -5559031, 2363621, 9243663, 8663225, 3457156, 803622, 1528334, 817181, -1638470, 253545]
7994B53545Q570623Q056280p07939q381839p791844j816591K693578L127773Q53585
7985D857171k390538m525535l052200J595283M961567L797290L22388j468252
7977D097174j497255k218535l389534k398446P58293K877685K416175J481893
7969B127450J877247K140954L03292k523838l399544j439175J164658J698912
7961A949956l76072l018144l443259p91803K767050M094547K383225k45280j504638
7952A815582j300487q38091m10829O81742K200232K294240l43761m171184n846756
7943e919312l848552k8887K856317L806735K899845n7725l948172n092221j144711
7934a0476683M348365N376877J748271n72413J434603L535109J710886j218439
$$ y = [253545, 8824168, 16880448, 16172509, 7790670, -1174, -1817765, 875813, 4003586, 4857171, 2466633, -2058902, -5111102, -3515819, 1445748, 5243038, 5565426, 4097174, 2599919, 381384, -3008150, -5406596, -4648303, -1770618, 645557, 2127450, 4004697, 6145651, 6448943, 3925105, 525561, -913614, 251044, 1949956, 1573884, -1444260, -4887519, -5679322, -2912272, 1182275, 3565500, 3320220, 1815582, 515095, -322996, -733825, -52083, 2148149, 4442389, 4098628, -72556, -5919312, -9767864, -9796751, -6940434, -3133699, -233854, -291579, -4239751, -9331972, -10476683, -6128318, -751441, 996830, 424417, 1859020, 5394129, 7105015, 5886576]
7926E886576q85364R74082j29078l323267l871842j218988P12166O23342J035239
7917a97134K269283J493815j171311j631032J198674K935818P73716k095445k103163
7908A473221p75673j112546k408691k410030j425468o23896R80294M117766O143975
7899C958952M084559p30104m231674m494551k524255R8652J754797P76599k332763
7890c639788m265808l039868r69721r12961j648815k31665K806523M245783L149216
7881d507104J629395J214144J457863J779853K050236J712857N42949l53030k91392
$$ y = [5886576, 5001212, 5975294, 5846216, 2522949, -1348893, -2567881, -1855715, -1232373, -197134, 2072149, 3565964, 2394653, 763621, 1962295, 4898113, 5671829, 3576384, 1473221, 697548, -414998, -2823689, -5233719, -6659187, -7283083, -6302789, -2185023, 3958952, 8043511, 7313407, 3081733, -1412818, -3937073, -3838421, -2083624, -1307025, -3639788, -7905596, -10945464, -11915185, -12828146, -14476961, -14708626, -11902103, -7656320, -4507104, -2877709, -1663565, -205702, 1574151, 3624387, 5337244, 5880193, 5527163, 5235771]
$$ [...]
##END NTUPLES=NMR SPECTRUM
##END=
