##TITLE=31Pdec_SR40_oil2
 CDCl3, 24 sc
 2.03.2021
##JCAMPDX= 6.0         $$ Bruker NMR JCAMP-DX V2.0
##DATA TYPE= NMR SPECTRUM
##DATA CLASS= NTUPLES
##ORIGIN= UXNMR, Bruker Analytische Messtechnik GmbH
##OWNER= root
$$ XWIN-NMR		Version 3.5
$$ Tue Mar  2 09:59:43 2021 Russian Standard Time (UT+4h)  she@DPX200
##.OBSERVE FREQUENCY= 81.013821
##.OBSERVE NUCLEUS= ^31P
##.ACQUISITION MODE= SIMULTANEOUS
##.ACQUISITION SCHEME= undefined
##.AVERAGES= 24
##.DIGITISER RES= 16
##SPECTROMETER/DATA SYSTEM= spect
##.PULSE SEQUENCE= zgpg30
##.SOLVENT NAME= CDCl3
##.SHIFT REFERENCE= (INTERNAL, CDCl3, 0, 248.564)
##AUDIT TRAIL= $$ (NUMBER, WHEN, WHO, WHERE, WHAT)
$$ ##TITLE= Audit trail, XWIN-NMR		Version 3.5
$$ ##JCAMPDX= 5.01
$$ ##ORIGIN= Bruker BioSpin GmbH
$$ ##OWNER= she
$$ F:/spectra/data/she/nmr/P31/1/pdata/1/auditp.txt
$$ ##AUDIT TRAIL=  $$ (NUMBER, WHEN, WHO, WHERE, WHAT)
(   1,<2021-03-02 09:58:23.71 +0400>,<she>,<DPX200>,
      <created by zg, POWCHK disabled, PULCHK disabled
       configuration hash MD5:
       00 E9 B6 7A A2 85 ED C7 34 08 36 98 17 FE 4E 26
       data hash MD5: 32K
       91 69 37 F7 DB AE 2A C8 6B 23 39 3B 8F 23 C1 74>)
(   2,<2021-03-02 09:58:26.85 +0400>,<she>,<DPX200>,
      <Start of raw data processing
       efp BC_mod = 2 LB = 1 FT_mod = 6 PKNL = 1 PHC0 = -3049.408 PHC1 = 185.4025 SI = 64K 
       data hash MD5: 64K
       26 3F A4 C5 0A A3 26 F9 41 97 0E 1E 25 86 4C 6E>)
(   3,<2021-03-02 09:58:59.25 +0400>,<she>,<DPX200>,
      <pk PHC0 = -50.32436 PHC1 = 204.8002 
       data hash MD5: 64K
       F5 0E 30 7A 81 60 65 2F 36 46 D1 A2 BF D3 10 B7>)
(   4,<2021-03-02 09:59:17.53 +0400>,<she>,<DPX200>,
      <abs ABSG = 5 
       data hash MD5: 64K
       E4 D5 DB 44 4C 76 5D DB 34 0F FE EF 05 F3 5E 17>)
$$ ##END=
$$ 
$$ hash MD5
$$ BA 99 EE 0B 2A DC A3 3A FD C9 3F 47 E3 DD 6F 1C
##$RELAX= 
##$RELAX= 
##$RELAX= 
##$RELAX= 
##$RELAX= 
##$RELAX= 
##$RELAX= 
##$RELAX= 
$$ Bruker specific parameters
$$ --------------------------
##$DU= <F:/spectra>
##$EXPNO= 1
##$NAME= <P31>
##$PROCNO= 1
##$TYPE= <nmr>
##$USER= <she>
##$AMP= (0..31)
100 100 100 100 100 100 100 100 100 100 100 100 100 100 100 100 100 100 
100 100 100 100 100 100 100 100 100 100 100 100 100 100 
##$AQSEQ= 0
##$AQ_mod= 1
##$AUNM= <au_zg>
##$AUTOPOS= <>
##$BF1= 81.014009
##$BF2= 200.13
##$BF3= 200.13
##$BF4= 200.13
##$BF5= 200.13
##$BF6= 200.13
##$BF7= 200.13
##$BF8= 200.13
##$BYTORDA= 1
##$CFDGTYP= 0
##$CFRGTYP= 5
##$CHEMSTR= <none>
##$CNST= (0..31)
1 1 145 1 1 1 1 1 1 1 1 1 1 1 1 1 1 1 1 1 1 1 1 1 1 1 1 1 1 1 1 1 
##$CPDPRG= <waltz16>
##$CPDPRG1= <>
##$CPDPRG2= <waltz16>
##$CPDPRG3= <>
##$CPDPRG4= <mlev>
##$CPDPRG5= <mlev>
##$CPDPRG6= <mlev>
##$CPDPRG7= <mlev>
##$CPDPRG8= <mlev>
##$CPDPRGB= <>
##$CPDPRGT= <>
##$D= (0..31)
0 1 0 0 0 0 0 0 0 0 0 0.03 2e-05 3e-06 0 0 0 0 0 0 0 0 0 0 0 0 0 0 0 0 
0 0 
##$DATE= 1614664703
##$DBL= (0..7)
120 120 120 11 120 120 24 19 
##$DBP= (0..7)
150 150 150 150 150 150 150 150 
##$DBP07= 0
##$DBPNAM0= <>
##$DBPNAM1= <>
$$ [...]
##$SUBNAM3= <"">
##$SUBNAM4= <"">
##$SUBNAM5= <"">
##$SUBNAM6= <"">
##$SUBNAM7= <"">
##$SUBNAM8= <"">
##$SUBNAM9= <"">
##$SW= 501.771253377433
##$SWIBOX= (0..15)
0 1 3 0 0 0 0 0 0 0 0 0 0 0 0 0 
##$SW_h= 40650.406504065
##$TD= 32768
##$TD0= 1
##$TE= 0
##$TE2= 300
##$TE3= 300
##$TEG= 300
##$TL= (0..7)
0 120 53 12 22 120 120 120 
##$TP= (0..7)
150 150 150 150 150 150 150 150 
##$TP07= 0
##$TPNAME0= <>
##$TPNAME1= <>
##$TPNAME2= <>
##$TPNAME3= <>
##$TPNAME4= <>
##$TPNAME5= <>
##$TPNAME6= <>
##$TPNAME7= <>
##$TPOAL= (0..7)
0.5 0.5 0.5 0.5 0.5 0.5 0.5 0.5 
##$TPOFFS= (0..7)
0 0 0 0 0 0 0 0 
##$TUNHIN= 0
##$TUNHOUT= 0
##$TUNXOUT= 0
##$USERA1= <user>
##$USERA2= <user>
##$USERA3= <user>
##$USERA4= <user>
##$USERA5= <user>
##$V9= 5
##$VALIST= <valist>
##$VCLIST= <CCCCCCCCCCCCCCC>
##$VD= 0
##$VDLIST= <DDDDDDDDDDDDDDD>
##$VPLIST= <PPPPPPPPPPPPPPP>
##$VTLIST= <TTTTTTTTTTTTTTT>
##$WBST= 1024
##$WBSW= 4
##$XGAIN= (0..3)
0 0 0 0 
##$XL= 0
##$YL= 0
##$YMAX_a= 3441
##$YMIN_a= -4657
##$ZGOPTNS= <>
##$ZL1= 120
##$ZL2= 120
##$ZL3= 120
##$ZL4= 120
##$ABSF1= 248.5645
##$ABSF2= -253.2056
##$ABSG= 5
##$ABSL= 3
##$ALPHA= 0
##$AQORDER= 0
##$ASSFAC= 0
##$ASSFACI= 0
##$ASSFACX= 0
##$ASSWID= 0
##$AUNMP= <proc_1d>
##$AZFE= 0.1
##$AZFW= 0.5
##$BCFW= 0
##$BC_mod= 2
##$BYTORDP= 0
##$COROFFS= 0
##$CY= -3
##$DATMOD= 1
##$DC= 0
##$DFILT= <>
##$DTYPP= 0
##$F1P= 0
##$F2P= 0
##$FCOR= 1
##$FTSIZE= 65536
##$FT_mod= 6
##$GAMMA= 0
##$GB= 0
##$INTBC= 1
##$INTSCL= 5.30512e-09
##$ISEN= 30
##$LB= 1
##$LEV0= 0
##$LPBIN= 0
##$MAXI= 10000
##$MC2= 0
##$MEAN= 0
##$ME_mod= 0
##$MI= 50
##$NCOEF= 0
##$NC_proc= -7
##$NLEV= 6
##$NOISF1= 182.463
##$NOISF2= 159.3651
##$NSP= 0
##$NTH_PI= 0
##$NZP= 0
##$OFFSET= 248.5645
##$PC= 4
##$PHC0= -3099.732
##$PHC1= 390.2027
##$PH_mod= 1
##$PKNL= yes
##$PPARMOD= 0
##$PSCAL= 0
##$PSIGN= 0
##$REVERSE= no
##$SF= 81.014009
##$SI= 65536
##$SIGF1= 159.3651
##$SIGF2= -187.1042
##$SINO= 113.3802
##$SIOLD= 16384
##$SREGLST= <1H.CDCl3>
##$SSB= 0
##$STSI= 65536
##$STSR= 0
##$SW_p= 40650.406504065
##$SYMM= 0
##$S_DEV= 0
##$TDeff= 32768
##$TDoff= 0
##$TI= <>
##$TILT= no
##$TM1= 0
##$TM2= 0
##$TOPLEV= 0
##$USERP1= <user>
##$USERP2= <user>
##$USERP3= <user>
##$USERP4= <user>
##$USERP5= <user>
##$WDW= 1
##$XDIM= 65536
##$YMAX_p= 399759961
##$YMIN_p= -29494685
$$ End of Bruker specific parameters
$$ ---------------------------------
##NTUPLES= NMR SPECTRUM
##VAR_NAME=  FREQUENCY,     SPECTRUM/REAL,   SPECTRUM/IMAG
##SYMBOL=    X,             R,               I
##VAR_TYPE=  INDEPENDENT,   DEPENDENT,       DEPENDENT
##VAR_FORM=  AFFN,          ASDF,            ASDF
##VAR_DIM=   65536,         65536,           65536
##UNITS=     HZ,            ARBITRARY UNITS, ARBITRARY UNITS
##FACTOR=    0.620285442955139, 1,           1
##FIRST=     20137.2065510759, 0,            0
##LAST=      -20513.1999529892, 0,           0
##MIN=       -20513.1999529892, -29494685,   0
##MAX=       20137.2065510759, 399759961,    0
$$ Real data points
##PAGE= N=1
##DATA TABLE= (X++(R..R)), XYDATA
$$ [...]
13019c667191N855338K254764j145918j175906R1953P06982J589964K466797O47470
$$ -3667191 2188147 4442911 3296993 2121087 2213040 2920022 4509986 6976783 7624253
13010G624253l445997m573545l35678L682806J323250m625735n999368q79642
$$ 7624253 4178256 -395289 -730967 2951839 4275089 -350646 -6350014 -7229656
13002g229656M232978M022044O67746j015664k92316J96068j031919k904338l459931
$$ -7229656 -2996678 1025366 1693112 677448 385132 581200 -450719 -3355057 -6814988
12993f814988j662519J184279J872207o75055k393558J173418P141140P410698
$$ -6814988 -8477507 -7293228 -5421021 -6096076 -8489634 -7316216 -175076 7235622
12985G235622J85472o156880m319423J753149L337800j72960j792281J094299
$$ 7235622 7421094 1264214 -3055209 -1302060 2035740 1862780 70499 1164798
12977A164798K855208p48514n421357m616702J023926M989341L871346P12153
$$ 1164798 4020006 3271492 -2149865 -6766567 -5742641 -753300 3118046 3830199
12969C830199o21454n60520j469540k751622j600410J905773L929825K226424
$$ 3830199 3208745 2648225 1178685 -1572937 -3173347 -1267574 2662251 4888675
12961D888675o09157j271170l50936O0586O05306K347426K577366j579069o671712
$$ 4888675 4279518 3008348 2657412 2717998 3323304 5670730 8248096 6669027 -2685
12952b685o393480j291945J876603J058895J338193M535028N016321k3085m396841
$$ -2685 -6396165 -7688110 -5811507 -4752612 -3414419 1120609 6136930 6113845 1717004
12943A717004k815382N84636L72366p10438J491387L036465j099700n999209l824014
$$ 1717004 -1098378 -513742 -141376 -851814 639573 3676038 2576338 -3422871 -7246885
12934g246885K124723K245129k965551l967607J123767L948230J162942p29047
$$ -7246885 -5122162 -2877033 -5842584 -9810191 -8686424 -4738194 -3575252 -4304299
12926d304299J233379J075935l261927l991928K657344P672602L026252m992464
$$ -4304299 -3070920 -1994985 -5256912 -9248840 -6591496 1081106 4107358 -885106
12918h85106n861156p82507J707729L23078M23153K513114J975796j301926k542041
$$ -885106 -6746262 -7528769 -5821040 -5497962 -5074809 -2561695 -585899 -1887825 -4429866
12909d429866q56586j06736j144149r56847L77326l77465k140348P4968N564147
$$ -4429866 -5286452 -5393188 -6537337 -7494184 -7116858 -7494323 -9634671 -9559703 -3995556
12900c995556O699530O76883m721879k230475L743775L650995k892616o647507
$$ -3995556 2703974 3380857 -1341022 -3571497 172278 3823273 930657 -5716850
12892e716850k191187M852019O279903K121979j085576l15778N90495k138606
$$ -5716850 -7908037 -3056018 3223885 5345864 4260288 3944510 4535005 2396399
12884B396399o191928o507457k088529L388679O373263O023676L009220j112310
$$ 2396399 -3795529 -10302986 -12391515 -9002836 -2629573 3394103 6403323 5291013
12876E291013l620858k777498l66602N10899j35826j7916P37353j05052j714250
$$ 5291013 1670155 -1107343 -1473945 -963046 -1098872 -1116788 -379435 -484487 -2198737
12867b198737l44592L754759M707962m37462n768562l740295M070144Q367974
$$ -2198737 -2543329 1211430 5919392 5481930 -286632 -4026927 43217 8411191
12859H411191L915911m168803p054324k611369K904371L156964n37302j975850
$$ 8411191 12327102 8158299 1103975 -1507394 1396977 4553941 4016639 2040789
12851B040789L76494J080699l056895o511663k967964M051528N716163J128363
$$ 2040789 2417283 3497982 441087 -6070576 -9038540 -4987012 729151 1857514
12843A857514k160571n48125J520844J048555Q50937J669190o44329n609776n242137
$$ 1857514 -303057 -851182 669662 1718217 2569154 4238344 3594015 -2015761 -7257898
12834g257898K856351Q367737K723725o757140p333332J37777L995411M53598
$$ -7257898 -4401547 3966190 6689915 -67225 -7400557 -7262780 -3267369 -2813771
12826b813771k394279Q55006N276811N107422K247255J391441K546062K280485
$$ -2813771 -5208050 -4353044 923767 6031189 8278444 9669885 12215947 14496432
12818A4496432q31544m546394n199832j400940L275573L249430j380068l788975
$$ 14496432 13664888 9118494 3918662 2517722 5793295 9042725 7662657 3873682
12810C873682o11942J808940k556818q115303n294489L627208O998857J533784
$$ 3873682 3261740 5070680 2513862 -5601441 -10895930 -7268722 -269865 1263919
12802A263919l482780j544719K189405J428824j265169p95713J617756K143537
$$ 1263919 -2218861 -3763580 -1574175 -145351 -1410520 -2206233 -588477 1555060
12794A555060J132891L37609j618065n169398n872448q09056M908594M589735
$$ 1555060 2687951 3025560 1407495 -3761903 -9634351 -10443407 -5534813 -945078
12786i45078l8919j955078L07808K035940J377661J439533K773430J190711m259680
$$ -945078 -983997 -2939075 -2631267 -595327 782334 2221867 4995297 6186008 1926328
12777A926328p395984l326626L589316N302574J093869k315489q94642J865903
$$ 1926328 -5469656 -8796282 -5206966 95608 1189477 -1126012 -2020654 -154751
12769a54751J495782p87640j035889R25798J925173R27587O5277L99592M05685
$$ -154751 1341031 553391 -482498 443300 2368473 3296060 3361337 3760929 4166614
12760D166614p04429j519775j359978j569108k494528k072528Q54032M262987
$$ 4166614 3462185 1942410 582432 -986676 -3481204 -5553732 -4699700 -436713
12752d36713N529627M008744J86648m657788p108842m105853J614818L320412
$$ -436713 5092914 9101658 9288306 4630518 -2478324 -6584177 -4969359 -1648947
12744a648947j66272k195251J037344L844167N55551m378670l480257J190315
$$ -1648947 -1815219 -4010470 -2973126 871041 1426592 -2952078 -6432335 -5242020
12736e242020J671739k422166l783183r255L180076K192873L38720O04195J501216
$$ -5242020 -3570281 -5992447 -9775630 -9784885 -6604809 -4411936 -4073216 -3469021 -1967805
12727a967805K096669L682469M451713M07079n840788n594224K669403Q784055
$$ -1967805 128864 3811333 8263046 8670125 2829337 -2764887 -95484 8688571
12719H688571M995196k952867n329891k312635o04394j519192j276950P8838r78908
$$ 8688571 13683767 10730900 5401009 3088374 2483980 964788 -312162 -233324 -1212232
12710a212232l500712k760477R94500K125348q10588k048239K145994P020005
$$ -1212232 -4712944 -7473421 -6478921 -4353573 -5164161 -7212400 -5066406 1953599
12702A953599O026492J21960l842455k157860J988612L435393J041877j923995
$$ 1953599 7980091 8102051 4259596 2101736 4090348 7525741 8567618 6643623
12694F643623k132374k47J012440j253998m761515n534610k402695J819608M029048
$$ 6643623 4511249 4511002 5523442 4269444 -492071 -6026681 -8429376 -6609768 -2580720
12685b580720M159685L823829L063815P23761k186253k451971N11127K424923
$$ -2580720 1578965 5402794 8466609 9190370 7004117 4552146 5063273 7488196
12677G488196k50925m309558l590540J828028N213847K776332j557955l066322
$$ 7488196 7237271 2927713 -662827 1165201 6379048 9155380 7597425 4531103
12669D531103k601886k582849j709967J400834L507320J384112k078856k331647
$$ 4531103 1929217 -653632 -2363599 -962765 2544555 3928667 1849811 -481836
12661d81836p24915j134843j879419J225554N493674L779760l648226q142097
$$ -481836 -1206751 -2341594 -4221013 -2995459 2498215 6277975 2629749 -5512348
12653e512348n043630O75781L153693K746066J870080N74263o61907L25287K946349
$$ -5512348 -10555978 -9880197 -6726504 -3980438 -2110358 -1536095 -2198002 -1872715 1073634
12644A073634L564028J679031N33055O9803l345892q016916o440331K187975P836205
$$ 1073634 4637662 6316693 6849748 6919551 3573659 -4443257 -10883588 -8695613 -859408
12635h59408L922782k481957k134566K124416J652237l187590m682218r73704
$$ -859408 3063374 581417 -1553149 571267 2223504 -964086 -5646304 -6620008
12627f620008K295843K239287J702857K102893J217425j068001j540242O05605
$$ -6620008 -4324165 -2084878 -382021 1720872 2938297 1870296 330054 935659
12619I35659K330241K068035J629428J924573J266662r93111k898966k982506
$$ 935659 3265900 5333935 6963363 8887936 10154598 9161487 6262521 3280015
12611C280015k021996j180256p13087m50277L55651K717207N531642N359243J065839
$$ 3280015 1258019 77763 -635324 -1085601 -729950 1987257 7518899 12878142 13943981
12602A3943981l522889m545855l186959k428953j671215Q58141K871538Q25617
$$ 13943981 10421092 5875237 2688278 259325 -1411890 -553749 2317789 3143406
12594C143406l287992l620745J033669N288472M431212r8844l298316k117492
$$ 3143406 -144586 -3765331 -2731662 2556810 6988022 6889178 3590862 1473370
12586A473370J914739M167520J858340j898183j848902Q59737p50251p714264
$$ 1473370 3388109 7555629 9413969 7515786 5666884 6526621 5776370 -1937894
12578a937894j0773599l548709O295316P241052M40624l504193r65169K069844
$$ -1937894 -12711493 -16260202 -9964886 -2723834 -2283210 -5787403 -6752572 -4682728
12570d682728K249366K707250M154973K680132j607386l315526j470791j171878
$$ -4682728 -2433362 273888 4428861 7108993 5501607 2186081 715290 -456588
12562d56588l075010j268649M598485N599750k048771q568045m663444L979633
$$ -456588 -3531598 -4800247 -201762 5397988 3349217 -5218828 -9882272 -5902639
12554e902639N595243j64736l724850j096985K182291J743246O0388K10554Q89750
$$ -5902639 -307396 -472132 -4196982 -5293967 -3111676 -1368430 -1308042 -1097488 -207738
12545b07738o24j431819j281604L79988J751993J799020J409799K103675L362948
$$ -207738 -208362 -1640181 -2921785 -2541797 -789804 1009216 2419015 4522690 7885638
12536G885638K375742j516798l740075k27937M734902K931677m837327q151946
$$ 7885638 10261380 8744582 5004507 4776570 9511472 12443149 7605822 -546124
12528e46124k224378M696106M358760N94254P89888K793505K56500m481089m115402
$$ -546124 -2770502 1925604 6284364 6878618 7668506 10462011 10718511 6237422 2122020
12519B122020L09762J329006j471740j668890Q60879n08913n241686m331480L433755
$$ 2122020 2431782 3760788 2289048 620158 1481037 972124 -4269562 -8601042 -5167287
12510e167287O801537m4276o756296k736768O181537P516852J074026l379222
$$ -5167287 1634250 1589974 -5166322 -7903090 -1721553 5795299 6869325 3490103
12502C490103k362017r85129j631103j299351M40743M11638j226756j316985o41181
$$ 3490103 1128086 142957 -1488146 -2787497 -2346754 -1935116 -3161872 -4478857 -5120038
12493e120038k217870l309156J474124Q814373Q756844K03211n981654l094389
$$ -5120038 -7337908 -10647064 -9172940 -358567 8398277 8601488 2619834 -474555
12485d74555K123486J665523j639987j391866R66071N23781j246184J21570L107237
$$ -474555 1648931 3314454 1674467 282601 1248672 1772453 526269 647839 3755076
12476C755076L177047J442016J982268L238061O96996l744645m060276q67636
$$ 3755076 6932123 8374139 10356407 13594468 14291464 10546819 6486543 5618907
12468E618907q16139m852588o186903j798056K555827J953764n57622m06124J319876
$$ 5618907 4802768 -49820 -6236723 -8034779 -5478952 -3525188 -4082810 -4488934 -3169058
12459c169058J606102J200697J852174J901235p46105m082918m454112j587657
$$ -3169058 -1562956 -362259 1489915 3391150 2645045 -1437873 -5891985 -7479642
12451g479642J791404L549488L170757J220521m76107k09256R72540N60148r26158
$$ -7479642 -5688238 -2138750 1032007 2252528 1776421 1567165 2539705 3099853 2173695
12442B173695l67887K181567K598588o89502l646969k599256Q19323L151282L488335
$$ 2173695 1805808 3987375 6585963 5896461 2249492 -349764 469559 3620841 7109176
12433G109176J853962k364621p200042p559496j702564N117093O954099M028869
$$ 7109176 8963138 6598517 -601525 -8161021 -9863585 -4746492 2207607 6236476
12425F236476M23317j481895j317915O54528K150863P7328m002518m352239j9332
$$ 6236476 6659793 5177898 3859983 4514511 6665374 6742702 2740184 -1612055 -1631387
12416a631387K585943N5323j955912J183722M108086O57988m290819k418995L173293
$$ -1631387 954556 1009879 -946033 237689 4345775 5003763 712944 -1706051 1467242
12407A467242K409037m534709o752995j95474N885485L450933l102277n080656
$$ 1467242 3876279 -658430 -7411425 -7606899 -1721414 1729519 -1372758 -6453414
12399f453414j348906L120727M945172L757845J57881l574968l924634o37398
$$ -6453414 -7802320 -4681593 263579 4021424 4179305 604337 -3320297 -3957695
12391c957695J920200M02629l192059m879272l590136p58133K313586M579359
$$ -3957695 -2037495 -1634866 -4826925 -9706197 -13296333 -14054466 -11740880 -7161521
12383g161521M857425L222296J469953J065470J573413J420031n08741l368874
$$ -7161521 -2304096 918200 2388153 3453623 5027036 6447067 5938326 2569452
12375B569452l932741J71111N748985O252357R89509k669250k35739K425900j084573
$$ 2569452 -1363289 -1192178 4556807 10809164 11798673 9129423 8893684 11319584 10235011
12366A0235011o102606m313343J454403J295375m660800n791289J283878P031596
$$ 10235011 4132405 -180938 1273465 2568840 -2091960 -7883249 -6599371 432225
12358D32225M702318J20309K28894K050476L9662l911719n196333m453429l848762
$$ 432225 5134543 5254852 5483746 7534222 7573884 3662165 -1534168 -5987597 -9836359
12349i836359j508417L455430O020301K423604k665017k976229l9052R71012J97418
$$ -9836359 -11344776 -7889346 -1869045 554559 -2110458 -5086687 -5125739 -4154727 -3957309
12340c957309Q32706K053415J489949J011078K765732L117228j749007p448810
$$ -3957309 -3124603 -1071188 418761 1429839 4195571 7312799 5563792 -1885018
12332a885018o795213r41758L074431L510290L946587M232277J110671k916364
$$ -1885018 -8680231 -9621989 -6547558 -3037268 909319 5141596 6252267 3335903
12324C335903j552168L683238L876894k980370p805214m372132J328667J024129
$$ 3335903 1783735 5466973 9343867 6363497 -1441717 -5813849 -4485182 -3461053
12316c461053l694088n330341j507190L844725O765914N814064J314079l698101
$$ -3461053 -7155141 -12485482 -13992672 -10147947 -3382033 2432031 3746110 48009
12308D8009m562164p70687K241165O26348j975914l79799L588753L896070l54221
$$ 48009 -4514155 -5284842 -3043677 -2417329 -4393243 -4773042 -1184289 2711781 2357560
12299B357560m041502l809842j522701K58807J576437K863339L218523K245768
$$ 2357560 -1683942 -5493784 -7016485 -6757678 -5181241 -2317902 900621 3146389
12291C146389R28224j73502j258616j586414j51974J711129J424279p34865j867766
$$ 3146389 4074613 3901111 2642495 1056081 904107 2615236 4039515 3304650 1436884
12282A436884j279237j253260k090872r54509K291805L041124p03943l615252
$$ 1436884 157647 -1095613 -3186485 -4140994 -1849189 1191935 487992 -3127260
12274c127260p02234M212205L935692r93066l823573k562309j457236j831829
$$ -3127260 -3829494 382711 4318403 3325337 -498236 -3060545 -4517781 -6349610
12266f349610p4871L833615M574068J181998k16977K433560K244702m176089q358905
$$ -6349610 -6424481 -2590866 1983202 3165200 2948223 5381783 7626485 3450396 -4908509
12257d908509k847467N171580M139501l402664n065513J546881O355104M004399
$$ -4908509 -7755976 -2584396 1555105 -1847559 -6913072 -5366191 988913 4993312
12249D993312O98769J519414K686987O54314j309100o88483r37470l702025m079259
$$ 4993312 5692081 7211495 9898482 10552796 9243696 8555213 7617743 3915718 -163541
12240a63541L37019L258649o09281o183385n666994l50829K738950J915254J163123
$$ -163541 173478 3432127 2822846 -3360539 -9027533 -9378362 -6639412 -4724158 -3561035
12231c561035K219167L040511K332363K33556l392151o760955n356374J620873
$$ -3561035 -1341868 1698643 4031006 4264562 872411 -5888544 -11244918 -9624045
12223i624045P313803N437536n93927k883725n70116P35086r52451j852870J1170
$$ -9624045 -2310242 3127294 2533367 -350358 -920474 -185388 -1137839 -2990709 -2979539
12214b979539J893498J703675Q21252O39636P06513Q18959J200174P06418j481932
$$ -2979539 -1086041 617634 1438886 2078522 2785035 3603994 4804168 5510586 4028654
12205D028654l029427j281726J810701J910401j027109k654839p64483K148758
$$ 4028654 999227 -282499 1528202 3438603 2411494 -243345 -1007828 1140930
12197A140930L067482J707614n32799k000387j514789q1507o08002l444824m518029
$$ 1140930 4208412 5916026 5383227 3382840 1868051 1786544 1178542 -2266282 -6784311
12188f784311j126325L274318M186384K776264K333576J426475k667503o362995
$$ -6784311 -7910636 -4636318 -449934 2326330 4659906 6086381 3418878 -2944117
12180b944117l760412K804073M787883M93055k475679L46108L765706K391684
$$ -2944117 -6704529 -3900456 887427 1380482 -1095197 -749089 3016617 5408301
12172E408301q35813o04371J906041J743145j728363m502723l809647o09943K455608
$$ 5408301 4572488 3968117 5874158 7617303 5888940 1386217 -2423430 -3033373 -577765
12163e77765L061036M71845l315841m964071l359719l41925K304067M257545M985678
$$ -577765 2483271 2955116 -360725 -5324796 -8684515 -9026440 -6722373 -2464828 2520850
12154B520850L702145J591098J053644J971802J602446j103303l934275m860504
$$ 2520850 6222995 7814093 8867737 10839539 12441985 11338682 7404407 2543903
12146B543903m343620l651323l263652l050317j925107J619203O001809N906583
$$ 2543903 -1799717 -5451040 -8714692 -11765009 -13690116 -12070913 -6069104 -162521
12138a62521n16930o318211l815791L713076N985989P87468l603020k053892Q09424
$$ -162521 -679451 -6997662 -10813453 -7100377 -1114388 -326920 -3929940 -5983832 -5174408
12129e174408P22118R91556M137788M841633j199488p794229o137970J966540
$$ -5174408 -4452290 -3460734 677054 5518687 4319199 -3475030 -9613000 -7646460
12121g646460P062339N614933K579445J573965L62027k944319n582200m414043
$$ -7646460 -584121 5030812 7610257 9184222 9546249 6601930 1019730 -3394313
12113c394313o02184K054861J350824j679158l856799k518126J676840M960344
$$ -3394313 -3996497 -1941636 -590812 -2269970 -6126769 -8644895 -6968055 -2007711
12105b007711M419894R16004k524361l665138j877982J746310M267620L356367
$$ -2007711 2412183 3328187 803826 -2861312 -4739294 -2992984 1274636 4631003
12097D631003O47957k42837M96834q30156m385414n321337j843863P50641j781663
$$ 4631003 5278960 5036123 5532957 4702801 317387 -5003950 -6847813 -6097172 -7878835
12088g878835n237182k966027M201916R476724R188442N298244P01189l092057
$$ -7878835 -13116017 -16082044 -11880128 -2403404 6785038 12083282 12784471 9692414
12080I692414m706342l563935j253571M38928J422467J391582q51659l841761
$$ 9692414 4986072 1422137 168566 607494 2029961 3421543 2569884 -1271877
12072a271877l464304L05594J770683j213358k419933K252689N984711J439790
$$ -1271877 -4736181 -4430587 -2659904 -3873262 -6293195 -4040506 1944205 3383995
12064C383995n547355l820370M783196P452132L35673o168763m332548N46515
$$ 3383995 -2163360 -5983730 -1200534 6251598 6587271 418508 -3914040 -3367525
12056c367525J235548l42196O55469K799222K194277l87903j997364k267003j139144
$$ -3367525 -2131977 -2474173 -1818704 980518 3174795 2786892 789528 -1477475 -2616619
12047b616619K817082P392426O048096k404959r179536o653368J011211M767429
$$ -2616619 200463 7592889 13640985 11236026 2056490 -4596878 -3585667 1181762
12039A181762L208409J053278k76541k255022k753753J160923N690513M246960
$$ 1181762 4390171 5443449 5166908 2911886 158133 1319056 7009569 11256529
12031A1256529j741657m343893j486497O44597j310051k799567q7483L352309
$$ 11256529 9514872 5170979 3684482 4329079 3019028 219461 131978 3484287
12023C484287L039406L20374r12192J31791J973485L343261K462942j719869n621548
$$ 3484287 6523693 6844067 5931875 6063666 8037151 11380412 13843354 12123485 6501937
12014F501937l854117J602144J833530n345733r687014l189172O379262O181500
$$ 6501937 2647820 4249964 6083494 737761 -8949253 -12138425 -5759163 422337
12006D22337k172568n455349L11707M465060k57221o170359l689713L280351M236373
$$ 422337 -1750231 -7205580 -6893873 -2428813 -2686034 -8856393 -12546106 -9265755 -5029382
11997e029382j070073k874161K859832Q293062N496500k442562o274189k902021
$$ -5029382 -6099455 -8973616 -6113784 2179278 7675778 5233216 -1040973 -3942994
11989c942994J672145J121010k976834l674776J482603O240823L737505l202916
$$ -3942994 -2270849 -1149839 -4126673 -7801449 -6318846 -78023 3659482 456566
11981D56566m978412J027887N881317K038654n045633n069047J426378M564171
$$ 456566 -4521846 -3493959 2387358 4426012 -619621 -5688668 -4262290 301881
11973C01881J034979j715951Q95053L003542m46617l788078l9337O282014N525473
$$ 301881 1336860 -379091 515962 3519504 3072887 -715191 -754528 5527486 11052959
11964A1052959j662843n629119l045943l64074j065355k30691M439368O131986
$$ 11052959 9390116 3760997 715054 350980 -714375 -945066 3494302 9626288
11956I626288L1467o861039n300814K129683N466341K546839K39786J676143K070851
$$ 9626288 9657755 2796716 -2504098 -374415 5091926 7638765 7878551 9554694 11625545
11947A1625545j192195l295823o45091K389008M48553m320802o056656l641699
$$ 11625545 10433350 7137527 6492436 8881444 9329997 5009195 -1047461 -4689160
11939d689160k87686K263135M028982L806387J143699o59451J158544L256119
$$ -4689160 -4976846 -2713711 1315271 5121658 6265357 5605906 6764450 10020569
11931A0020569P58710l957697l969856Q17138K705280j579308n408493k811623
$$ 10020569 10779279 6821582 2851726 3668864 6374144 4794836 -613657 -3425280
11923c425280K431431L777327K217569K600005L853114J096336m411114n917915
$$ -3425280 -993849 2783478 5001047 7601052 11454166 12550502 8139388 2221473
11915B221473k111830M97703j801804m029462r25197M508712N712655J815491
$$ 2221473 109643 607346 -1194458 -5223920 -6149117 -1640405 4072250 5887741
11907E887741k765693n089539n091676k436480K528735N695061K841232l220009
$$ 5887741 3122048 -1967491 -7059167 -9495647 -6966912 -1271851 1569381 -1650628
11899a650628m686522M13366M771066K271776k838959k201640M271937Q249855
$$ -1650628 -6337150 -5923784 -1152718 1119058 -1719901 -3921541 350396 8600251
11891H600251M533890k844754o961565n609457r59727L897682N628379J984460
$$ 8600251 13134141 10289387 3327822 -2281635 -3241362 656320 6284699 8269159
11883H269159m230569o040838r73174M345372K778223l156675n467005k727335
$$ 8269159 4038590 -2002248 -2975422 1369950 4148173 991498 -4475507 -7202842
11875g202842p13681j588406o01082M414868P800273M452002k263032n643294
$$ -7202842 -7916523 -9504929 -10106011 -5691143 2109130 6561132 4298100 -1345194
11867a345194m397890j778826L57109K112589L084377L304857L959757M114285
$$ -1345194 -5743084 -7521910 -7164801 -5052212 -1967835 1337022 5296779 9411064
11859I411064N91167n493107p204379j736015L585472J889250j954217O36043
$$ 9411064 10002231 4509124 -2695255 -4431270 -845798 1043452 -910765 -274722
11851b74722O885093O427722j707862p420445n415783j497088o71692k6280K373859
$$ -274722 6610371 13038093 11330231 3909786 -1505997 -3003085 -3674777 -3701057 -1327198
11842a327198J992029k699143m512393J185896P203457M842625k674250n801930
$$ -1327198 664831 -2034312 -6546705 -5360809 1842648 6685273 4011023 -1790907
11834a790907k779458Q41278K884331N200772O037081J662343m821854n625838
$$ -1790907 -4570365 -3729087 -844756 4356016 10393097 12055440 7233586 1607748
11826A607748k41853L155921J42635m031282l808657j242717l58507P5698K686986
$$ 1607748 1365895 4521816 4664451 633169 -3175488 -4418205 -4776712 -4701014 -2014028
11817b014028N030316L124461j137753k133476P54048K037168j446248n581103
$$ -2014028 3016288 6140749 5002996 2869520 3623568 5660736 4214488 -1366615
11809a366615m719879N83465M504555L321433r21772l929397l742686j131922
$$ -1366615 -6086494 -5503029 -998474 2322959 1401187 -2528210 -6270896 -7402818
11801g402818K140995L800075J870868k474294m364504o24359N152670O416120
$$ -7402818 -5261823 -1461748 409120 -2065174 -6429678 -7054037 -1901367 4514753
11793D514753K082900k854810n009729n805359n980174k851528L691754P741560
$$ 4514753 6597653 3742843 -1266886 -7072245 -13052419 -15903947 -12212193 -4470633
11785d470633M745446j397054l621187j119878J604332K378144K305810J159661
$$ -4470633 274813 -1122241 -4743428 -5863306 -4258974 -1880830 424980 1584641
11777A584641j827302l642103n59293M577028M803457l85801l613831p44072L146904
$$ 1584641 -242661 -3884764 -4444057 132971 4936428 4550627 936796 192724 3339628
11768C339628K359635o92828k86490L176256M147414M34658m229029n689353l767909
$$ 3339628 5699263 5006435 4719945 7896201 12043615 12478273 8249244 2559891 -1208018
11759a208018j052827J54721m09986o48018J958423O569773Q224843L103495n836701
$$ -1208018 -2260845 -2106124 -2516110 -3164128 -1205705 5364068 13588911 16692406 10855705
11750A0855705j0779424p179487J342253O789356M775912j615409n538020l480390
$$ 10855705 76281 -7103206 -5760953 1028403 5804315 4188906 -1349114 -4829504
11742d829504J696961M757428L935160J568794r7386j279355k588512l211139
$$ -4829504 -3132543 1624885 5560045 7128839 7031453 5752098 3163586 -47553
11734d7553k552259j771925j881190j715687J49087K463213K706384J125531P09886
$$ -47553 -2599812 -4371737 -6252927 -7968614 -7819527 -5356314 -2649930 -1524399 -814513
11725h14513K474901L421427J126577j729457p49050K950134L160197k287201
$$ -814513 1660388 5081815 6208392 4478935 3729885 6680019 9840216 7553015
11717G553015p051697m702341J564472L269839o81116k725322Q72967L870235
$$ 7553015 501318 -4201023 -2636551 633288 -47828 -2773150 -1900183 1970052
11709A970052N30371m420152l134165K584228M149371j96197l400513j538156
$$ 1970052 2500423 -1919729 -5053894 -2469666 1679705 1483508 -1917005 -3455161
11701c455161Q35479k44671j475870R23331M027119L404076Q25484N60226J327996
$$ -3455161 -2619682 -2864353 -4340223 -3416892 610227 4014303 4839787 5400013 6728009
11692F728009j121951n120110m250812K006652N833627J985594m548205n901313
$$ 6728009 5606058 485948 -3764864 -1758212 4075415 6061009 1512804 -4388509
11684d388509k053637R71712Q47051P10415J934326J665112q54295j584449J169742
$$ -4388509 -6442146 -5470434 -4623383 -3912968 -1978642 -313530 -1167825 -2752274 -1582532
11675a582532K182322k756432q296754o024806K361895O369997J703845m021618
$$ -1582532 599790 -2156642 -10453396 -16478202 -14116307 -7746310 -6042465 -10064083
11667a0064083l144107J858002M387437L580020K470333J318212q62530j780502
$$ -10064083 -13208190 -11350188 -6962751 -3382731 -912398 405814 -456716 -2237218
11659b237218O40419K965166Q20085l441503m071925j126871K98259j254134k405226
$$ -2237218 -1596799 1368367 2188452 -1253051 -5324976 -6451847 -6153588 -7407722 -9812948
11650i812948j605906l74668J416623M676819O259870K498461k801923k163273
$$ -9812948 -11418854 -11793522 -10376899 -5700080 559790 3058251 256328 -1906945
11642a906945L436605N169328L69159l604767k092500J88325o38323n49040L233903
$$ -1906945 1529660 6698988 7068147 3463380 1370880 1559205 920882 371842 3605745
11633C605745N106698O53410m319015k735847K038126K258228j568662l220764
$$ 3605745 8712443 9365853 5046838 2310991 4349117 6607345 5038683 1817919
11625A817919j921739j687463k345196m16652K696925K242257r59831j477220
$$ 1817919 -103820 -1791283 -4136479 -4553131 -1856206 386051 -573780 -2051000
11617b051000J004516J048532k711837m832920k012976J812865J960176m27339
$$ -2051000 -1046484 2048 -2709789 -7542709 -9555685 -7742820 -5782644 -6209983
11609f209983r84121J944598N868366O883123L600959n75462r34569J528060O89425
$$ -6209983 -7194104 -5249506 618860 7501983 11102942 10527480 9592911 11120971 11810396
11600A1810396m466710o295248n69658M613108O91162o358729m524185M153656
$$ 11810396 7343686 1048438 478780 5091888 5783050 -575679 -5099864 -946208
11592i46208N728262l368545j0359496o048668K283597M260175J662786J993901
$$ -946208 4782054 1413509 -8945987 -14994655 -12711058 -8450883 -6788097 -4794196
11584d794196N106367N404822K124285q54452k122794k854601k387596L98249
$$ -4794196 312171 5716993 7841278 6986826 4864032 2009431 -378165 20084
11576B0084L168316K506170j090634m036668l980707j082343K726146M139152
$$ 20084 3188400 5694570 4603936 567268 -3413439 -4495782 -1769636 2369516
11568B369516J233161k915927l241679k16520P26522j592358j946380J988529
$$ 2369516 3602677 686750 -2554929 -2771449 -2044927 -3637285 -5583665 -3595136
11560c595136N231322L862079Q36499o13879k232640m648510l580454J896629
$$ -3595136 1636186 5498265 6334764 5720885 3488245 -1160265 -4740719 -2844090
11552b844090M647508J26536n069357l115374K939146N466073M550130M504173
$$ -2844090 1803418 1929954 -3139403 -6254777 -3315631 2150442 6700572 11204745
11544A1204745L660600j636055p077081n729011m83460O4385l828813m049514
$$ 11204745 14865345 13229290 6152209 423198 -60262 4123 -3824690 -7874204
11536g874204Q84455L917791K179073L65091M51059j036845l807866k587560K413571
$$ -7874204 -6989749 -3071958 -892885 -527794 -76735 -1113580 -4921446 -7509006 -5095435
11527e095435L993160j11833l410496j819306Q79527J885133L792144O369821
$$ -5095435 -1102275 -1214108 -4624604 -6443910 -5564383 -3679250 112894 6482715
11519F482715M144874k839945n845161j062410L116600m30491n781624m130335
$$ 6482715 10627589 7787644 1942483 880073 3996673 3566182 -2215442 -6345777
11511f345777J896027L508493k74385l258359k767809j164208N10080K784929
$$ -6345777 -4449750 -941257 -1215642 -4474001 -7241810 -8406018 -7895938 -5111009
11503e111009L778993J513793j669950k391529j471475j048745J90341L604106
$$ -5111009 -1332016 181777 -1488173 -3879702 -5351177 -6399922 -6209581 -2605475
11495b605475N950429L939175K44476p75454j57473j224663k678998j292378J234505
$$ -2605475 3344954 7284129 7528605 6753151 6595678 5371015 2692017 1399639 2634144
11486B634144Q39238j472805j309957J377195K363786J08175k599048l161165
$$ 2634144 3473382 2000577 690620 2067815 4431601 4539776 1940728 -1220437
11478a220437j207259K335232M667063K410239k876383m434100J87142M361441
$$ -1220437 -2427696 -92464 4574599 6984838 4108455 -325645 -138503 4222938
11470D222938K453673j225196n82322J232372j851516o662059n757181r02893
$$ 4222938 6676611 5451415 4869093 6101465 4249949 -2412110 -8169291 -9072184
11462i072184M8831k523126j059941M612738O375385K309653l48261J057531K24338
$$ -9072184 -9023353 -11546479 -12606420 -7993682 -1618297 691356 343095 1400626 1624964
11453A624964n006502o971650j086807N858802O459102K855281J60274j792266
$$ 1624964 -3381538 -10353188 -11439995 -5581193 877909 3733190 3893464 2101198
11445B101198l812448k634740K142215L836970j107988n541890k281798L922228
$$ 2101198 -1711250 -4345990 -2203775 1633195 525207 -5016683 -7298481 -3376253
11437c376253M176571R311r8530M352139N144649p45416o280324n450618j366418
$$ -3376253 800318 809629 711099 5063238 10207887 9462471 3182147 -2268471 -3634889
11428c634889K06863m42308P43162L869726M446567J97228m948540n524262j736919
$$ -3634889 -3428026 -3870334 -3127172 742554 5189121 5386349 437809 -5086453 -6823372
11419f823372Q63155o12547k146834P80812N613320O096037J502116k850387l693097
$$ -6823372 -5960217 -6572764 -8719598 -7938786 -2325466 3770571 5272687 2422300 -1270797
11410a270797k849658k020270k73589K175217K958002J677868M05412n59257k368604
$$ -1270797 -4120455 -6140725 -6414314 -4239097 -1281095 396773 802185 242928 -2125676
11401b125676k986478R18681O839064P971175L059734k157021m322248n567185
$$ -2125676 -5112154 -4193473 2645591 10616766 13676500 11519479 7197231 1630046
11393A630046o093320k666588L143006M688396J408673M41641L451219K921641
$$ 1630046 -4463274 -7129862 -3986856 701540 2110213 2551854 6003073 8924714
11385H924714l315884n961077n587N504869K882863r41281J808827M211700k605865
$$ 8924714 5608830 -352247 -357834 5147035 8029898 7088617 8897444 13109144 10503279
11376A0503279j0866948p266271L988709P184439K15616m427499k055696p28535
$$ 10503279 -363669 -7629940 -3641231 3543208 3758824 -668675 -2724371 -3452906
11368c452906k996865j040897O175624P980128L49827n909479k724968K932691
$$ -3452906 -6449771 -7490668 -1315044 6665084 7014911 1105432 -1619536 1313155
11360A313155K488121o95952m68270J56409l445222o610628k829996M194558O056284
$$ 1313155 3801276 3105324 2637054 2793463 -651759 -7262387 -10092383 -5897825 158459
11351A58459K552946q3344n3242m38262j601962j000814J367218L731119O322353
$$ 158459 2711405 2628061 2574819 2136557 534595 -466219 900999 4632118 10954471
11342A0954471Q554756N936832l238788j1275919r192500K62080N751518K797257
$$ 10954471 19509227 25446059 22207271 10931352 1738852 2000932 7752450 10549707
11334A0549707k050136k910950k044326k984977l550368l98929M175326N011078
$$ 10549707 8499571 5588621 3544295 559318 -2991050 -3389979 785347 5796425
11326E796425J292150k920575m040529j885097J644240M107584L424773k57392
$$ 5796425 7088575 4168000 127471 -1757626 -113386 3994198 7418971 7161579
11318G161579l718017l735599r96052R71225O58475o1117J28265k34862j873674
$$ 7161579 3443562 -292037 -1288089 -316864 341611 280494 408759 173897 -1699777
11309a699777k014169J541801N608796N129701O29844k444764j808487p11619
$$ -1699777 -3713946 -2172145 3436651 8566352 9196196 6751432 4942945 4231326
11301D231326j325893j222825J260365L328291K666277J401769J446483N10691
$$ 4231326 2905433 1682608 2942973 6271264 8937541 10339310 11785793 12296484
11293A2296484k880778m997520k793443R5714o85630k257875L24986M332436L271024
$$ 12296484 9415706 4418186 1624743 1720457 1034827 -1223048 -898062 3434374 6705398
11284F705398j355492j495669M072146O957307K020307m887134n732757q58897
$$ 6705398 5349906 3854237 7926383 14883690 16903997 12016863 6284106 5425209
11276E425209L260151K586174j658447n799600o674254l743332K92857K428440
$$ 5425209 8685360 11271534 9613087 3813487 -2860767 -6604099 -6311242 -3882802
11268c882802K775854L153540L463909K336380L8172k316020m651599n950305
$$ -3882802 -1106948 2046592 5510501 7846881 7885053 5569033 917434 -5032871
11260e032871l390574K505668N682906K757090q82400L45335K483914o02828n084217
$$ -5032871 -8423445 -5917777 -234871 2522219 1639819 1985154 4469068 3866240 -1217977
11251a217977l311745J721138J019421l532197j630489O089924P166156j250545
$$ -1217977 -4529722 -2808584 -1789163 -5321360 -6951849 -861925 6304231 5053686
11243E053686o272387n53251N739671K733321l407346l083721N83367J54557j763307
$$ 5053686 -1218701 -1771952 3967719 6701040 3293694 209973 793340 947897 -815410
11234h15410O85060L690986Q00680l644100j359341M431460L714393l219951o408877
$$ -815410 -130350 3560636 4361316 717216 -642125 3789335 7503728 4283777 -2125100
11225b125100k669560Q35871j69190j425217M59923K419132J506781k87819n70951
$$ -2125100 -4794660 -3958789 -4127979 -5553196 -5093273 -2674141 -1167360 -1455179 -2026130
11216b026130l46050j080696k096544k259203j306489O46329K521681K321437
$$ -2026130 -2372180 -3452876 -5549420 -7808623 -9115112 -8468783 -5947102 -3625665
11208c625665J28816r88687M68287J852525R85476k59551N4462M99303k9366O5885
$$ -3625665 -3496849 -4485536 -4017249 -2164724 -1179248 -1438799 -1384337 -885034 -914400 -848515
11198h48515O18867j325394m480623k458402N132328Q770017K932296m182641
$$ -848515 -229648 -1555042 -6035665 -8494067 -3361739 5408278 8340574 4157933
11190D157933l202947J974905K282910j063744p92593K265142J572891k299499
$$ 4157933 954986 2929891 5212801 4149057 3356464 5621606 7194497 4894998
11182D894998l244690j225482r48666j610762P39035L315336P01284l787743k835755
$$ 4894998 1650308 424826 -523840 -2134602 -1395567 1919769 2621053 -1166690 -4002445
11173d002445J439092J436800j311082N24269M409587J259587o430123o505673
$$ -4002445 -2563353 -1126553 -2437635 -1913366 2496221 3755808 -2674315 -9179988
11165i179988J770095N775358J353237j102163K959655L783830l411726p975553
$$ -9179988 -7409893 -1634535 -281298 -1383461 1576194 5360024 1948298 -6027255
11157f027255k527376L436247K29887n396879l132413L016046L302014o08904
$$ -6027255 -8554631 -5118384 -4888497 -10285376 -13417789 -10401743 -7099729 -7708633
11149g708633o54936K626644K973584O67907K60750R09623m06801r04339K591321
$$ -7708633 -8363569 -5736925 -2763341 -2095434 -1834684 -925061 -1331862 -2236201 355120
11140C55120N235008J460308m079663l355384J592617K693279m55338j686083
$$ 355120 5590128 7050436 2970773 -384611 1208006 3901285 3445947 1759864
11132A759864l3760J71716j300675j044946J95375m93299r70759J878106M015857
$$ 1759864 1726104 1897820 597145 -447801 -252426 -745725 -1716484 161622 4177479
11123D177479M06396l983948r04408N974671N403820k848042p244036l306550
$$ 4177479 4583875 599927 -304481 5670190 11074010 8225968 981932 -2324618
11115b324618L63664k031417m506877j386539K885341K569887K10621O39707K586323
$$ -2324618 -1960954 -3992371 -8499248 -9885787 -7000446 -4430559 -4219938 -3580231 -993908
11106i93908K510487R92247n283j068131k256140j398441R26041O00102k351240
$$ -993908 1516579 2508826 2503543 1435412 -820728 -2219169 -1293128 -693026 -3044266
11097c044266k079160K901706N317967N97159m663297l033764J552858J028039
$$ -3044266 -5123426 -2221720 3096247 3693406 -969891 -4003655 -2450797 -1422758
11089a422758k438050m7529P764455J0223688K398495o989897p796400j537371
$$ -1422758 -3860808 -3908337 3856118 14079806 16478301 9488404 1692004 154633
11081A54633K738984J153978j975041k068244j82659L3557j796787k461397j08628
$$ 154633 2893617 4047595 2072554 4310 -178349 -144792 -1941579 -4402976 -4511604
11072d511604K947563L597689K264330J489483J459696L70306j163216m12924
$$ -4511604 -1564041 2033648 4297978 5787461 7247157 7617463 6454247 6041323
11064F041323J885161J070230l947191p359317m454140R50160J959180j399088
$$ 6041323 7926484 8996714 5049523 -2309794 -6763934 -5813774 -3854594 -5253682
11056e253682l333210j765478l23833q66120l44983K934786N205847K665524k497171
$$ -5253682 -8586892 -10352370 -10676203 -11542323 -11887306 -8952520 -3746673 -1081149 -3578320
11047c578320m964817l126541p2200J026258J06626n61186J230351N257204P963059
$$ -3578320 -8543137 -11669678 -11741878 -10715620 -10608994 -11170180 -9939829 -4682625 3280434
11038C280434N479881j170839n830259m143251J028492L611621K045756k82726
$$ 3280434 8760315 7589476 1759217 -2384034 -1355542 2256079 4301835 4019109
11030D019109j088227j379098j596970k40946K184933K255143p82414k567432
$$ 4019109 2930882 1551784 -45186 -286132 1898801 4153944 3371530 804098
11022H04098l50680J736056p74102m076839j085360O214644P734738K48037o836672
$$ 804098 453418 2189474 1415372 -2661467 -3746827 2467817 10202555 10450592 3613920
11013C613920n014402J143468J990351k371567l732738M08039L760059K255824
$$ 3613920 -1400482 -257014 1733337 -638230 -4370968 -3962929 -202870 2052954
11005B052954j37440Q70228K988766J838725k270351n558664n536892k096939
$$ 2052954 1915514 2785742 5774508 7613233 5342882 -215782 -5752674 -7849613
10997g849613K924702N421671K147570l773593m895680M06231M782358K417560
$$ -7849613 -4924911 496760 2644330 -1129263 -6024943 -5618712 -836354 1581206
10989A581206k603383l409880p50516L52336K77998L011615O878590N810284j77849
$$ 1581206 -1022177 -4432057 -5182573 -4830237 -4552239 -1540624 5337966 11148250 10970401
10980A0970401l949399k051455P60226o0648k538995l044875j642876L68979L011304
$$ 10970401 7021002 4969547 5729773 5669125 3130130 85255 -1557621 -1188642 1822662
10971A822662M840778K719779k649440n889275m511977k140475j324889P22531
$$ 1822662 6663440 9383219 6733779 844504 -3667473 -5807948 -7132837 -6410306
10963f410306N227740P130205K862272k656418l030475L35173K239295K216499
$$ -6410306 -1182566 5947639 8809911 6153493 3123018 3458191 5697486 7913985
10955G913985K228791N96501l935433o446585k838108J485186l51489l846578
$$ 7913985 10142776 10739277 6803844 357259 -2480849 -995663 -1347152 -5193730
10947e193730O6299Q027389P728859j663309p026072k002050M007982K708796
$$ -5193730 -5127431 2899958 10628817 8965508 1939436 -62614 3945368 6654164
10939F654164r35393q00656r56313n158902o398150J205504R232571O729801j856307
$$ 6654164 5718771 4918115 3961802 -1197100 -7595250 -6389746 2842825 9572626 7716319
10930G716319m123458J90715R71743l658171n560288k702221k077754m819003
$$ 7716319 3592861 3783576 4755319 1097148 -4463140 -7165361 -9243115 -14062118
10922a4062118k903794N195813R168931L514907k540238N5776N750173M659720
$$ -14062118 -16965912 -11770099 -2601168 913739 -1626499 -1570723 4179450 8839170
10914H839170j107726k694942k64838j294441n766050n279974K369765Q508075
$$ 8839170 7731444 5036502 4771664 3477223 -2288827 -7568801 -5199036 3309039
10906C309039O482238M80480k684129l122934l806685l156271J230766N349078
$$ 3309039 9791277 10271757 7587628 4464694 658009 -2498262 -1267496 4081582
10898D081582L184340l017947m704719M8283L205133o83481n682035l675996L013559
$$ 4081582 7265922 4247975 -456744 -408461 2796672 2113191 -3568844 -7244840 -4231281
10889d231281N533765J979110j168145l33085O84995j042369k563901j383593
$$ -4231281 1302484 3281594 2113449 1780364 2465359 1422990 -1140911 -2524504
10881b524504j21099q75306r31769J287721J718235k233332n221886j447927N429439
$$ -2524504 -2645603 -3520909 -4452678 -3164957 -1446722 -3680054 -8901940 -10349867 -4920428
10872d920428P362517L926148J300344J309378J63652k467474k198062J056137
$$ -4920428 2442089 6368237 7668581 8977959 9141611 6674137 4476075 5532212
10864E532212J471736k556837m674451r82069K950628R27785l747949l562510
$$ 5532212 7003948 4447111 -227340 -1209409 1741219 2669004 -1078945 -4641455
10856d641455J471998M289569J597966k089547j879583J014934K299145J008675
$$ -4641455 -3169457 1120112 2718078 628531 -1251052 -236118 2063027 3071702
10848C071702Q7371J478901L180562K165708j213127l777001m107310l889560
$$ 3071702 3159073 4637974 7818536 9984244 8771117 4994116 886806 -3002754
10840c002754m048503k849617J99736K000239O02085r42752L70901J834862k4572
$$ -3002754 -7051257 -9900874 -9701138 -7700899 -7098814 -8041566 -7670665 -5835803 -5860375
10831e860375j718203K463497R232366Q700497p04050q537865p074090j615381
$$ -5860375 -7578578 -5115081 4117285 12817782 12113732 3575867 -3498223 -5113604
10823e113604o33659k658235o24124N272087P685958L666858j571517k989091
$$ -5113604 -5747263 -8405498 -9029622 -3757535 3928423 7595281 6023764 3034673
10815C034673j596946m07679L47303J348863J272081j013032l346262k540967
$$ 3034673 1437727 1030048 1377351 2726214 3998295 2985263 -360999 -2901966
10807b901966Q35223K587686K94089l395164m126443j278558J794832K475296
$$ -2901966 -2066743 520943 815032 -2580132 -6706575 -7985133 -6190301 -3715005
10799c715005J578627R21800N48636k54766j093143j349001j428455j515087p59918
$$ -3715005 -2136378 -1214578 -665942 -920708 -2013851 -3362852 -4791307 -6306394 -7066312
10790g066312N99125M35438j716983k671490j64099K790617J904659j673224k844977
$$ -7066312 -6467187 -6031749 -7748732 -10420222 -10584321 -7793704 -5889045 -7562269 -10407246
10781a0407246J82626M199389N928113M801487J471452k523218m243885k466893
$$ -10407246 -10224620 -6025231 -97118 4704369 6175821 3652603 -591282 -3058175
10773c058175m94882j723249l690068j651348L012061M204500R12377j092109
$$ -3058175 -3553057 -5276306 -8966374 -10617722 -7605661 -3401161 -2488784 -3580893
10765c580893J379125M296594L520563Q35718j95928K06559k04955j858575l677944
$$ -3580893 -2201768 2094826 5615389 6451107 6255179 6461738 6256783 4398208 720264
10756G20264m391289k420439K135350N132169K586636k465720l022825J202339
$$ 720264 -3671025 -6091464 -3956114 1176055 3762691 1296971 -1725854 -523515
10748e23515K967007p27719l648289q75927L028662J993155j623165j826673Q35189
$$ -523515 2443492 1715773 -1932516 -2808443 220219 2213374 590209 -1236464 -401275
10739d01275J139270j598431l139882j786556n4578O42291J620373L023569K796859
$$ -401275 737995 -860436 -4000318 -5786874 -5841452 -5199161 -3578788 -555219 2241640
10730B241640L73666j916975k029706o26403K54528l39989j321172p01934J636721
$$ 2241640 2615306 698331 -1331375 -1957778 -1703250 -2043239 -3364411 -4066345 -2429624
10721b429624K667575j93266m314299l968383J848327P334596P434498L910348
$$ -2429624 237951 44685 -4269614 -8237997 -6389670 944926 8379424 12289772
10713A2289772J295887J60381j881359m621919m941674j771450J809453K303600
$$ 12289772 13585659 13746040 11864681 7242762 2301088 529638 2339091 4642691
10705D642691L2738j422577J68675K590703J994561j486169l586774k282060p47827
$$ 4642691 4675429 3252852 3421527 6012230 8006791 6520622 2933848 651788 -96039
10696i6039j583733k065568Q49909M515563M710677K403245O35447j712695o004881
$$ -96039 -1679772 -3745340 -2895431 1620132 6330809 8734054 9369501 7656806 1651925
10687A651925p445471j614267N386426L913131l443456m784493K119676O423418
$$ 1651925 -5793546 -7407813 -2021387 1891744 -1551712 -6336205 -4216529 2206889
10679B206889K219492k859920j794046J135734L37375j237386K5728J04716m530254
$$ 2206889 4426381 1566461 -227585 908149 1245524 8138 33866 138582 -4391672
10670d391672q300002m747574K713476O155981M048327J86785k843077l166159
$$ -4391672 -12691674 -17439248 -14725772 -8569791 -4521464 -4334679 -7177756 -10343915
10662a0343915J352125P622108P471667n43680o624812l752147J559324N28875
$$ -10343915 -8991790 -1369682 6101985 5558305 -1066507 -4818654 -3259330 -2730455
10654b730455l679986k753621K326862M334744K568687K101865L557526L218342
$$ -2730455 -6410441 -9164062 -6837200 -2502456 66231 2168096 5725622 8943964
10646H943964Q49698r13826k319753m215448l602510R98926L913155J23901n486256
$$ 8943964 9793662 8879836 6560083 2344635 -1257875 -258949 3654206 3778107 -1708149
10637a708149n171525l45442K311160K380117L593417M228472L56232m249337
$$ -1708149 -6879674 -7225116 -4913956 -2533839 1059578 5288050 5644282 1394945
10629A394945k537241L272430M469385J41815k188120l0624Q60357k099420l961977
$$ 1394945 -1142296 2130134 6599519 6741334 4553214 4522590 5382947 3283527 -678450
10620f78450j757041N94478Q2115j78490K814498O203162N319343j13207o042982
$$ -678450 -2435491 -1841013 -1758898 -1937388 877110 7080272 12399615 12286408 6243426
10611F243426p988858m349901J975504N664315M394070P67025k241979m414098
$$ 6243426 -1745432 -6095333 -4119829 1544486 5938556 6705581 4463602 49504
10603D9504n349503l237064Q13729K408661P65223K38701K155748K208285o76514
$$ 49504 -5299999 -8537063 -7723334 -5314673 -4549450 -4310749 -2155001 53284 -623230
10594f23230j344147J364500J054951l893751n168510Q41741M620677o07061n892724
$$ -623230 -1967377 -602877 452074 -3441677 -8610187 -7768446 -3147769 -3754830 -9647554
10585i647554j324183O704112O636276R58733o02034Q81099j794808n705202k797602
$$ -9647554 -10971737 -4267625 2368651 3327384 2725350 3606449 1811641 -3893561 -6691163
10576f691163L476799K962600k979738l960729J003685K979464l14843k080046
$$ -6691163 -3214364 -251764 -3231502 -7192231 -6188546 -3209082 -3523925 -5603971
10568e603971L9115J399779P91511J424173K760962K177564J892928L849121K826894
$$ -5603971 -5564856 -4165077 -3373566 -1949393 811569 2989133 4882061 8731182 11558076
10559A1558076l927041p272827L1287P899467L253620p675286r328650k432589
$$ 11558076 7631035 358208 389495 8288962 11542582 3867296 -5461354 -7893943
10551g893943K282l144695j876001L613807L600308j314828j521730K230694Q62242
$$ -7893943 -7891661 -11036356 -12912357 -9298550 -5698242 -7013070 -8534800 -6304106 -5441864
10542e441864l902430k751127J773498J77271l408422J559800Q484453K899727
$$ -5441864 -9344294 -12095421 -10321923 -10144652 -13553074 -11993274 -3508821 -609094
10534f09094q183721m681951J0201818J2649953j216311r182652j957563L565956
$$ -609094 -8792815 -13474766 -3272948 9377005 8160694 -1021958 -2979521 586435
10526E86435k220911n959395M61653M940211O4380l603144k46685O23303l748871
$$ 586435 -1634476 -7593871 -7132218 -2192007 -2127627 -5730771 -5977456 -5354153 -9103024
10517i103024k275833N864065O318277k667447m880643L375594O229454n92787
$$ -9103024 -11378857 -5514792 803485 -1863962 -6744605 -3369011 2860443 2267656
10509B267656k294096L681707K020865p022033m583002Q274929Q378197m695526
$$ 2267656 -26440 3655267 5676132 -1345901 -5928903 2346026 10724223 6028697
10501F028697n486533O434851K840014j4364228r305866J6435424J6391163j2579315
$$ 6028697 542164 6977015 9817029 -4547199 -13853065 2582359 18973522 6394207
10493F394207j3379506K3157148K5170761k4525610k0647148R6761760J95432585
$$ 6394207 -6985299 16171849 41342610 16817000 -3830148 92931612 288364197
10486B88364197J11395764r4296642j95926187j10483784J1603653K7533687j8554215
$$ 288364197 399759961 305463319 109537132 -946652 10657001 38190688 19636473
10479A9636473k1491307J1283293J1095171j6598267j5887689J0902027J4516466
$$ 19636473 -1854834 9428459 20523630 3925363 -11962326 -1060299 13456167
10472A3456167q272114j4948437L515849J3221508J369248q470678m004011R24893
$$ 13456167 5184053 -9764384 -6248535 6972973 8342221 -128457 -4132468 -3207575
10464c207575m90501K62354K524611k438306q234258j793628R196656O556616
$$ -3207575 -3698076 -3435722 -911111 -3349417 -11583675 -13377303 -4180647 2375969
10456B375969n674755p679715J553147M777057j474979l365429K757340N491266
$$ 2375969 -3298786 -10978501 -9425354 -4648297 -6123276 -9488705 -6731365 -1240099
10448a240099J570374J38541K622852K57010o456560o069548L281307R574960
$$ -1240099 330275 468816 3091668 3348678 -3107882 -9177430 -5896123 3678837
10440C678837O135247l08621l152324l641649l102503J77485M443184M992949
$$ 3678837 9814084 9505463 6353139 2711490 -391013 -213528 4229656 9222605
10432I222605J938989o88394k092490l424194k811670N22156J824068j538183
$$ 9222605 11161594 10473200 8380710 4956516 2144846 2667002 4491070 2952887
10424B952887l729990M245M301141L039851k1478L23995K01926m441659p172772
$$ 2952887 -777103 -772858 3528283 6568134 6546656 6870651 7072577 2630918 -4541854
10415d541854j789889M476396K001974m284517l101186M302722P688025M963406
$$ -4541854 -6331743 -1855347 146627 -4137890 -7239076 -2936354 4751671 9715077
10407I715077J965331n0023l261517m356093P1169L976062P00445l998143j242316
$$ 9715077 11680408 11630385 8368868 4012775 4083944 8060006 8760451 4762308 3519992
10398C519992M455988K837079l270705k972608K724864K891333l424015o041952
$$ 3519992 7975980 10813059 7542354 4569746 7294610 10185943 6761928 719976
10390G19976k090786L45069k071348l403379j289544o62097k571480j811518K219572
$$ 719976 -1370810 -1025741 -3097089 -6500468 -7790012 -8452109 -11023589 -12835107 -10615535
10381a0615535L814761J864049J556680L778459L428649k97790k073631j28669
$$ -10615535 -6800774 -4936725 -3380045 398414 3827063 3529273 1455642 1326973
10373A326973J618885J640931J882928J207837k650209n589350k010435L906309
$$ 1326973 2945858 4586789 6469717 7677554 5027345 -562005 -2572440 1333869
10365A333869L085975l058859m349349R73929L730669O4605k660161M84283M207438
$$ 1333869 4419844 1360985 -2988364 -2014435 1716234 1780839 -879322 -395039 3812399
10356C812399L146961l60039k766769m439597m701591o11096N784910P428934
$$ 3812399 6959360 6599321 3832552 -607045 -5308636 -5919732 -134822 7294112
10348G294112K865963j192631q83478l99209k899947m695076k732413l06876o44085
$$ 7294112 10160075 8967444 8083966 7684757 4784810 89734 -2642679 -2949555 -3593640
10339c593640j212070J013908L899542L867993J174921j536248k590725j621373
$$ -3593640 -4805710 -3791802 107740 3975733 5150654 3614406 1023681 -597692
10331e97692J94059P7008k547649l436194N59595N057714L884213q12705j759032
$$ -597692 -403633 -326625 -2874274 -6310468 -5750873 -693159 3191054 2378349 619317
10322F19317J558836K625654r22833m401718m686016l499400j584892K313647
$$ 619317 2178153 4803807 3880974 -520744 -5206760 -8706160 -10291052 -7977405
10314g977405O030550N526354K390546J862747L297091J239067l869531n573304
$$ -7977405 -1946855 3579499 5970045 7832792 11129883 12368950 8499419 2926115
10306B926115k771360j292391k687064j765715K327859L100804j612333m882944
$$ 2926115 154755 -1137636 -3824700 -5590415 -3262556 -161752 -1774085 -6657029
10298f657029k054032K173861K731632J803549K525179K895236J041346m74432
$$ -6657029 -8711061 -6537200 -3805568 -2002019 523160 3418396 4459742 3985310
10290C985310k07683r07747l016508k319672J760500L141800q87014m142718j435635
$$ 3985310 3777627 2869880 -146628 -2466300 -705800 2436000 1548986 -2593732 -4029367
10281d029367L145307L667890J480791P39045P73614o46720j529805N17923K842833
$$ -4029367 -884060 2783830 4264621 5003666 5777280 5130560 3600755 4118678 6961511
10272F961511J860663r74784k263082k194386k615204l053681k476486j498680
$$ 6961511 8822174 7847390 5584308 3389922 774718 -2278963 -4755449 -6254129
10264f254129K591L131277N537194K582113m114556o111529k62169N641903M493123
$$ -6254129 -6251538 -3120261 2416933 4999046 884490 -5227039 -5489208 152695 4645818
10255D645818k0777j313455q79147l221326n606866k457454L572797M578237l3307
$$ 4645818 4625041 3311586 2432439 -788887 -6395753 -8853207 -5280410 -702173 -735480
10246g35480k875532m29314K537484J710494n23649j76540K026070K631819R25135
$$ -735480 -3611012 -4040326 -1502842 207652 -315997 -492537 1533533 4165352 5090487
10237E090487n34615m4903N56723j666025n899718p234562l019234K536570L708016
$$ 5090487 4555872 4510969 5067692 3401667 -2498051 -9732613 -12751847 -10215277 -6507261
10228f507261J411087Q52260K332447J400028j747478j434528K780729L472036
$$ -6507261 -5096174 -4243914 -1911467 -511439 -2258917 -3693445 -912716 2559320
10220B559320k277931o490658k555574L855160M030311q0087o23691K457985K638646
$$ 2559320 281389 -6209269 -8764843 -4909683 -879372 -959459 -1583150 874835 3513481
10211C513481q07755j762308J706158M369421K996688O13144k27512j474162m265577
$$ 3513481 2705726 943418 2649576 7018997 10015685 10628829 10401317 8927155 4661578
10202D661578n424455k560711J544903K803444J133143o13193p84616J12893R76940
$$ 4661578 -762877 -3323588 -1778685 1024759 2157902 1544709 760093 872986 1849926
10193A849926R96725M7050q84097o11178M78346O41007q27368k307267j512624
$$ 1849926 2846651 2893701 2009604 1398426 1876772 2517779 1690411 -616856 -2129480
10184b129480J711540M417517L113669j731163m767118j799145L732354M065409
$$ -2129480 -417940 3999577 7113246 5382083 614965 -1184180 2548174 6613583
10176F613583k168506o869946k962347N599385Q566866K305506o435226r335527
$$ 6613583 4445077 -2424869 -5387216 212169 8779035 11084541 4649315 -4686212
10168d686212n224560Q68057M358214M717963L612246J840775n85124k282819
$$ -4686212 -9910772 -9042715 -4684501 33462 3645708 5486483 4901359 2618540
10160B618540j011088K601185M355593J859041j647138k060794p67018j690102
$$ 2618540 1607452 4208637 8564230 10423271 8776133 6715339 5948321 4258219
10152D258219l825494k712514J151611K170347j013407k884861j93522K782949
$$ 4258219 432725 -2279789 -1128178 1042169 28762 -2856099 -3049621 -266672
10144b66672J682156j092153j380465r6968q5010k97025J549765L569967K248754
$$ -266672 1415484 323331 -1057134 -1154102 -1239112 -1536137 13628 3583595 5832349
10135E832349j543672l676819k630776n40535M97883J74149q74290j427727n12088
$$ 5832349 4288677 611858 -2018918 -2559453 -2061570 -1887421 -2761711 -4189438 -4701526
10126d701526Q43659P50907M0423J378423L982152L626960n18527l914178l590474
$$ -4701526 -3857867 -3106960 -3066537 -1688114 2294038 5920998 5402471 1488293 -2102181
10117b102181j952763j251324J22962K810378L841735K357706J912485L319188
$$ -2102181 -4054944 -5306268 -5183306 -2372928 1468807 3826513 5738998 9058186
10109I058186J977654l210211n848329k651969O2583k318164l471467K321797
$$ 9058186 11035840 7825629 1977300 -674669 -612086 -2930250 -6401717 -4079920
10101d079920P582310K764943o289642o072531L064052P771571K902862k826564
$$ -4079920 3502390 6267333 -22309 -6094840 -3030788 4740783 7643645 4817081
10093D817081l328620k876441m180015k368627L728521O204996O98389n486078
$$ 4817081 1488461 -1387980 -5567995 -7936622 -4208101 1996895 2695284 -2790794
10085b790794m796522m55214Q40005m90929p68005o22633j386303o4882M561858
$$ -2790794 -7587316 -8042530 -7202525 -7693454 -8461459 -9084092 -10470395 -10535277 -5973419
10076e973419O433804Q58151o108166n536503P39281L415595M04859j229861K106084
$$ -5973419 460385 1318536 -4789630 -10326133 -9586852 -6171257 -5766398 -6996259 -4890175
10067d890175M998666K357660k787113m298811j055169L227292N258267M578612
$$ -4890175 108491 2466151 -320962 -4619773 -5674942 -2447650 2810617 7389229
10059G389229K578068J002161M23281l98492k426872l888082k044334K440096
$$ 7389229 9967297 10969458 11392739 10994247 8567375 4679293 2634959 5075055
10051E075055N318560L749196m59994l446051l455795j554479K10447K34304j717235
$$ 5075055 10393615 14142811 13682817 10236766 6780971 5226492 5436939 5671243 3954008
10042C954008l775791l306431k97105J783090L68153k024063q51305L379218M852051
$$ 3954008 178217 -3128214 -3425319 -1642229 -1274076 -3298139 -4149444 -770226 4081825
10033D081825Q26682l579260k566302J451495J566509k410901l260060J979086
$$ 4081825 4908507 1329247 -1237055 214440 1780949 -629952 -3890012 -1910926
10025a910926O467266L395407m004537p178568l268800L397391P725103O971193
$$ -1910926 4556340 7951747 3947210 -3231358 -6500158 -3102767 4622336 11593529
10017A1593529N81874p616648r818367k929743N374824N790102L22042j722588
$$ 11593529 12175403 4558755 -5259612 -8189355 -2814531 2975571 3297613 1575025
10009A575025R88749M86790n633612q732105k921815M890189N505735J018037
$$ 1575025 2563774 3050564 -2583048 -11315153 -14236968 -9346779 -3841044 -2823007
10001b823007M511L780661N817750K835628j190301k129779p11885N73001J023795
$$ -2823007 -2818496 962165 6779915 9615543 8425242 6295463 5583578 6156579 7180374
9992G180374Q10054k87906j890884k747735k234499r58212J28603L00907n98826
$$ 7180374 7990428 7702522 5811638 3063903 829404 -128808 -205 300702 -298124
9983b98124j433852m74042K028306L281443J378446j991379l715388k903858r16983
$$ -298124 -1731976 -2206018 -177712 3103731 4482177 2490798 -1224590 -4128448 -5045431
9974e045431R55071K179048K288871J067154q99048k390612j805781K055571P601802
$$ -5045431 -4090360 -1911312 377559 1444713 545665 -1844947 -3650728 -1595157 6006645
9965F006645R789585N232250k277729n592587l893210l240442o062426o662468
$$ 6006645 15796230 21028480 18750751 13158164 9264954 6024512 -37914 -6700382
9957f700382j046017N097065M438792o53152k208792R46373K879296J217335j70375
$$ -6700382 -7746399 -2649334 1789458 1136306 -1072486 -126113 2753183 3970518 3800143
9948C800143N27650J87063j952120j719310J980867L598082N0371k830357O82708
$$ 3800143 4327793 4514856 2562736 843426 2824293 6422375 6472746 3642389 4325097
9939D325097N664570L206483m840026p194384j77534N809318J399239p683038
$$ 4325097 9989667 13196150 8356124 1161740 984206 6793524 8192763 509725
9931E09725r284385k840765R86386k349627m913354m06479N135411L677955j277776
$$ 509725 -8774660 -11615425 -10629039 -12978666 -17892020 -18298499 -13163088 -9485133 -10762909
9922a0762909r16887L837322M311809p43172l285293k9724K715444J070629j86244
$$ -10762909 -11679796 -7842474 -3530665 -4273837 -7559130 -7588854 -4873410 -3802781 -3989025
9913c989025K091485L039594k88612k189829J119075L264182j196009n951384
$$ -3989025 -1897540 1142054 853442 -1336387 -217312 3046870 1850861 -4100523
9905d100523l411811J825771J622916p87246J981420N539000P46488p531421o244971
$$ -4100523 -7512334 -5686563 -4063647 -4850893 -2869473 2669527 3416015 -4115406 -10360377
9896a0360377K909803N123706j922697l886171M433961R212885J655170p096426
$$ -10360377 -7450574 -2326868 -4249565 -8135736 -3701775 5511110 7166280 69854
9888F9854o140920k201667l621178m061833J815033L009125p322296j1040803
$$ 69854 -6071066 -8272733 -11893911 -15955744 -14140711 -11131586 -18453882 -29494685
9880b9494685R566698L5673368L1355015l062593k7773872j8825975K302931O278174
$$ -29494685 -19927987 15745381 47100396 44037803 16263931 -2562044 -259113 6019061
9872F019061l025126m035886N225507Q730280J440458n242917m087601k76793
$$ 6019061 2993935 -1041951 4183556 12913836 14354294 9111377 5023776 4746983
9864D746983J180776K042238L100662J301040k912723m342304j557058O32944
$$ 4746983 5927759 7969997 11070659 12371699 9458976 5116672 3559614 4192558
9856D192558o89364k403938j584232k88543j465201m188007n369231l455142R42790
$$ 4192558 3503194 1099256 -484976 -773519 -2238720 -6426727 -11795958 -15251100 -14308310
9847a4308310N637175P325468L992968k208120o311696n402757j041743K896829
$$ -14308310 -8671135 -1345667 2647301 439181 -5872515 -11275272 -12317015 -9420186
9839i420186L630361J322384j303539j769540o39120j78952m79836K30190J332435
$$ -9420186 -5789825 -4467441 -5770980 -7540520 -8179640 -8358592 -8838428 -8608238 -7275803
9830g275803J59268k304771j309726L496148N416848N01082n226488m043436K153172
$$ -7275803 -7116535 -9421306 -10731032 -7234884 -1818036 -1316954 -6543442 -10586878 -8433706
9821h433706N348509L152630R7593q51684j073491j343670n52011O55149L98996
$$ -8433706 -3085197 67433 165026 -686658 -1760149 -3103819 -3655830 -3000681 -2601685
9812b601685m25975M60733K046896J637679O952k57626p6358j787069l416243
$$ -2601685 -3027660 -2566927 -520031 1117648 1124600 866974 790616 -996453 -4412696
9803d412696j643906J037171l26690l648319k117342L979931O748342L191223
$$ -4412696 -6056602 -5019431 -5346121 -8994440 -11111782 -7131851 -383509 2807714
9795B807714p43941o92792M88838L91564J292237L058547R28338m924570o620310
$$ 2807714 2063773 1370981 1859819 2251383 3543620 6602167 7530505 2605935 -4014375
9786d014375j130598L248365K641m547371j950988M153382M751546O45067k25802
$$ -4014375 -5144973 -1896608 -1893967 -6441338 -8392326 -4238944 512602 1157669 931867
9777I31867K908919L265012r50740m009336k811068m85058Q12289K453055L778817
$$ 931867 3840786 7105798 6155058 2145722 -665346 -1150404 -338115 2114940 5893757
9768E893757J773287k395331l732665j676975q80195k256410r09172M320665O818152
$$ 5893757 7667044 5271713 1539048 -137927 -1018122 -3274532 -4183704 136961 6955113
9759F955113K113866m383422m970522n08145J949519l08949k921830j612765K022482
$$ 6955113 9068979 4685557 -284965 -793110 1156409 847460 -2074370 -3687135 -1664653
9750a664653K800819j542433o842548o220608J589692R020055P732283q73426
$$ -1664653 1136166 -406267 -7248815 -13469423 -11879731 -2859676 4872607 3999181
9742C999181p149609n179935J245004N388836N269479K571718j217022m191924
$$ 3999181 -3150428 -8330363 -7085359 -1696523 3572956 6144674 4927652 735728
9734G35728l467966P45554L260818Q0895n485281o629018j630713M728227P302837
$$ 735728 -2732238 -1986684 1274134 1355029 -4130252 -10759270 -12389983 -7661756 -358919
9725c58919N059157L63877l143979k637363J058841L240108O68306l540382l560212
$$ -358919 4700238 5064115 1920136 -717227 341614 3581722 4250028 709646 -2850566
9716b850566R57597M119789J978556k221400l039506k24638J860465O67277j887772
$$ -2850566 -1892969 2226820 4205376 1983976 -1055530 -1280168 580297 1247574 -640198
9707f40198k975269k126029j56068K634784N324919N206001O12842n348729o796631
$$ -640198 -3615467 -5741496 -5897564 -3262780 2062139 7268140 7880982 2532253 -4264378
9698d264378j867918M649444O983392M773399J799246J67955j042612k110224
$$ -4264378 -6132296 -1482852 5500540 10273939 12073185 12241140 11198528 9088304
9690I088304j498887O88671J344435j500612n281738n913205k906329O49990K322588
$$ 9088304 7589417 8278088 9622523 8121911 2840173 -3073032 -5979361 -5329371 -3006783
9681c006783K321729J648432O04735l53268j64468J305160K327542J093278j911492
$$ -3006783 -685054 963378 1568113 1214845 1050377 2355537 4683079 5776357 3864865
9672C864865m152404l651717r03664J731238K227689O49005r95467q50243O16594
$$ 3864865 -287539 -3939256 -4842920 -3111682 -883993 -234988 -1230455 -2080698 -1464104
9663a464104J145244n8693o64804J484394M115180K559133l153427o660434l400407
$$ -1464104 -318860 -377553 -1042357 442037 4557217 7116350 3962923 -2697511 -6097918
9654f097918K433792L282659j024713l248112L12037M598793L898264R3269j250186
$$ -6097918 -3664126 -381467 -1406180 -4654292 -4342255 256538 4154802 4248071 2997885
9645B997885N70419J712818O53068l82000l20144q22867k229160j894102J687955
$$ 2997885 3568304 5281122 5934190 5552190 5232046 4409179 2180019 285917 1973872
9636A973872N685876N754496R57746n090857p437311m177899J536874M292448
$$ 1973872 7659748 13414244 14371990 9281133 1843822 -2334077 -797203 3495245
9628C495245K021075k093555m172933m202115m182660l959563k118177L90630
$$ 3495245 5516320 3422765 -750168 -4952283 -9134943 -13094506 -15212683 -14822053
9620a4822053J277653R33795J692510L364878L387903J537551N13330J326268
$$ -14822053 -13544400 -12610605 -10918095 -7553217 -4165314 -2627763 -2114433 -788165
9612g88165K126559K344454L594829N123976L093581l087161p967498o894462
$$ -788165 1338394 3682848 7277677 12401653 15495234 12408073 4440575 -2453887
9604b453887k222488P71174J081380J155543J456055M17059j474315j864336m48947
$$ -2453887 -4676375 -3905201 -2823821 -1668278 -212223 204836 -1269479 -3133815 -3582762
9595c582762P82875R87324J080053J186303M38949q22633j421753j698747k689482
$$ -3582762 -2799887 -1812563 -732510 453793 892742 70109 -1351644 -3050391 -5739873
9586e739873l256571j340169J722065J763851k036195m734672j625815N293853
$$ -5739873 -8996444 -10336613 -8614548 -6850697 -8886892 -13621564 -15247379 -9953526
9578i953526R241833O353421k19786l949205j893052K321393K834889j227657
$$ -9953526 -711693 5641728 5421942 1472737 -420315 1901078 4735967 3508310
9570C508310m502869k521010J989645K834863q81382l739095j913926K034004
$$ 3508310 -994559 -3515569 -1525924 1308939 427557 -3311538 -5225464 -3191460
9562c191460L670610K267492k60151k703756m124607k872963P46706L043844J594951
$$ -3191460 479150 2746642 2486491 -217265 -4341872 -7214835 -6468129 -3424285 -1829334
9553a829334n55990Q01326M010036L428191j897045o143677m475818R78671M747849
$$ -1829334 -2385324 -1583998 2426038 5854229 3957184 -2186493 -6662311 -5683640 -935791
9544i35791M592818K314607J87480j075286j765430k182640k001756n88378J295856
$$ -935791 3657027 5971634 6159114 5083828 3318398 1135758 -865998 -1454376 -158520
9535a58520J142578j774343l632304m51331N116762O124165J366810k266809p7163
$$ -158520 984058 -790285 -4422589 -4873920 242842 6367007 7733817 5467008 5389845
9526E389845L145495O55791n568362p624480l045952K584429L933265J668705
$$ 5389845 8535340 9191131 3622769 -4001711 -7047663 -4463234 -529969 1138736
9518A138736o04265j014960m5395O90730k28594k058937k036908M54881J867223
$$ 1138736 534471 -480489 -525884 164846 -63748 -2122685 -4159593 -3704712 -1837489
9509a837489k44193k416106l03458L687717L676080l7276j383563J306482K695064
$$ -1837489 -2081682 -4497788 -4801246 -1113529 2562551 2525275 1141712 2448194 5143258
9500E143258m00450l991533l802210j229640P83746K459424M209797L846761O27428
$$ 5143258 4742808 751275 -3050935 -4280575 -3496829 -1037405 3172392 7019153 7646581
9491G646581k153460k317064k453124m727105o233161l723212P87420L423469
$$ 7646581 5493121 3176057 722933 -4004172 -10237333 -13960545 -13173125 -9749656
9483i749656L995526L968759K485606r92209l358632j953772Q80509J726257J331124
$$ -9749656 -5754130 -1785371 700235 -291974 -3650606 -5604378 -4723869 -2997612 -1666488
9474a666488J399720N6100l845237n633416r07941O018249P088627K172645j639222
$$ -1666488 -266768 -210668 -4055905 -9689321 -10597262 -4579013 2509614 4682259 3043037
9465C043037j340621q50989k413324k756375M84656M648059O201045M288518n82928
$$ 3043037 1702416 851427 -1561897 -4318272 -3833616 814443 7015488 11304006 10721078
9456A0721078o518907q761001l888018L964784O832302L507018L93890J110783
$$ 10721078 4202171 -4558830 -8446848 -4482064 2350238 5857256 6251146 7361929
9448G361929K097907K64385k089986k784445l473199m471130k511373K078884
$$ 7361929 9459836 9724221 7634235 4849790 1376591 -3094539 -5605912 -3527028
9440c527028K548295m157982r993291n590055O109163J3148604R675747J237192
$$ -3527028 -978733 -5136715 -15130006 -20720061 -14610898 -1462294 8213453 9450645
9432I450645m269891m763698k500786K51963K026737J868516K54730j112336j243616
$$ 9450645 5180754 417056 -2083730 -1831767 194970 2063486 2318216 1205880 -37736
9423c7736o44949k06003l36103q95247j094761r8890J480272J753954K03653j182613
$$ -37736 -682685 -888688 -1224791 -2120038 -3214799 -3313689 -1833417 -79463 124190 -1058423
9413a058423p48291K70872j76000j489542j320468N22387J469577M681j873020
$$ -1058423 -1806714 -1535842 -1711842 -3201384 -4521852 -3999465 -2529888 -2525207 -4398227
9404d398227j342914J145160K346712R03077m73114R93860L520474K987659o72410
$$ -4398227 -5741141 -4595981 -2249269 -1346192 -1819306 -825446 2695028 5682687 5010277
9395E010277k871714r52451K285397L327686K467668J158798j131229l934357
$$ 5010277 2138563 1186112 3471509 6799195 9266863 10425661 9294432 5360075
9387E360075l695280O53667L735280J051711l063844j728882K914919K758441
$$ 5360075 1664795 2318462 6053742 7105453 4041609 2312727 5227646 7986087
9379G986087k746034n310985j068662L826218L533186M02601j191940j681329
$$ 7986087 5240053 -70932 -1139594 2686624 6219810 6622411 5430471 3749142
9371C749142k457839j438307K445094N172743K887009k485120o493017p214229
$$ 3749142 1291303 -147004 2298090 7470833 10357842 7872722 1379705 -5834524
9363e834524m310604J969211P645190O528060r09911n685766k076685M206292
$$ -5834524 -10145128 -8175917 -530727 5997333 5087422 -598344 -2675029 1531263
9355A531263M925974Q50905j979130k359631k810645k496536N99816L295315J181193
$$ 1531263 6457237 7308142 5329012 2969381 158736 -2337800 -1737984 1557331 2738524
9346B738524k957910k759623J051697J902756j301529k693965l559J854054j37309
$$ 2738524 -219386 -2979009 -1927312 -24556 -1326085 -4020050 -4023609 -2169555 -2306864
9337b306864k139744p96976J204959Q58853M15076K684762N229000M085276K26011
$$ -2306864 -4446608 -5243584 -4038625 -3179772 -2764696 -79934 5149066 9234342 9460353
9328I460353k244979k262472k052948k620856k796933k148224j537174r26040
$$ 9460353 7215374 4952902 2899954 279098 -2517835 -4666059 -6203233 -7129273
9320g129273N33548K041676J450244j136484k312096M35104M765078N706923J604873
$$ -7129273 -6595725 -4554049 -3103805 -4240289 -6552385 -6117281 -1352203 4354720 5959593
9311E959593l919732o306478m695618j381942J611183L602706M054392K637808
$$ 5959593 2039861 -4266617 -8962235 -10344177 -8732994 -5130288 -1075896 1561912
9303A561912L24351j380831k086574j967570n24733K040265L391652J856311l49054
$$ 1561912 1886263 505432 -1581142 -3548712 -4073445 -2033180 1358472 3214783 2865729
9294B865729j33891J125602l85427l890380m262143k19859L039969J510903k088475
$$ 2865729 2731838 3857440 3472013 -418367 -4680510 -4900369 -1860400 -349497 -2437972
9285b437972l140870j313389J031842K895354L975669L049789K2783k784506l502809
$$ -2437972 -5578842 -6892231 -5860389 -2965035 1010634 4060423 4083206 1298700 -2204109
9276b204109k480896j94832L140588N126896K974817j125172j790841R98330J502959
$$ -2204109 -4685005 -4879837 -1739249 3387647 6362464 5237292 3446451 4444781 5947740
9267E947740j667954k728035N75160J879677k664624o437655k920674L042251
$$ 5947740 4279786 1551751 2126911 4006588 1341964 -5095691 -8016365 -4974114
9259d974114L276123m87310r95875J672809J822054n75849m65427K274403K823077
$$ -4974114 -1697991 -2185301 -3181176 -1508367 313687 -262162 -727589 1546814 4369891
9250D369891K75350j972193l289313n081921m947868k84726M319609K780888j303670
$$ 4369891 4645241 2673048 -616265 -5698186 -10646054 -10930780 -6611171 -3830283 -5133953
9241e133953L21523N699440M708863l567876p996074k788734L776180K706979
$$ -5133953 -4812430 887010 5595873 2027997 -5968077 -8756811 -4980631 -2273652
9233b273652l319027o183165l189923K892071Q038736P886179J080759n919391
$$ -2273652 -5592679 -11775844 -14965767 -12073696 -4034960 3851219 4931978 -987413
9225i87413m750733K314991M412506j238543n064732j347179K547500l90726m574901
$$ -987413 -5738146 -3423155 989351 -249192 -5313924 -6661103 -4113603 -4504329 -9079230
9216i079230j789430M808413O301611J897892j905388k035362p08901M77709J684663
$$ -9079230 -10868660 -6060247 241364 2139256 233868 -1801494 -2510395 -2032686 -348023
9207c48023K428754K730654L511375K853973k596865r382461q372451Q59885O106538
$$ -348023 2080731 4811385 8322760 11176733 8579868 -802593 -9175044 -8315159 -2208621
9198b208621L80755o061084j911962O151762M444098m328407n033459M853798
$$ -2208621 -1827866 -7888950 -9800912 -3649150 794948 -3533459 -8566918 -3713120
9190c713120J0924953M575844m876743n984932r93724J040566j781350m261518
$$ -3713120 7211833 11787677 6910934 926002 -67722 972844 -808506 -5070024
9182e070024k710707K012903O524713O901664K227452k571149k092414R66083
$$ -5070024 -7780731 -5767828 756885 7658549 9886001 7314852 5222438 6188521
9174F188521r28938p413892q888720r04382Q219617R071384L400363j214943k749620
$$ 6188521 5259583 -2154309 -11043029 -11947411 -3727794 5343590 8743953 7529010 4779390
9165D779390l644819l156105R03831N127118L354436l462071p083824l075826
$$ 4779390 1134571 -2021534 -1117703 4009415 7363851 3901780 -3182044 -6257870
9157f257870L265867M302189m19613m669513l519795J532275M964821L442766
$$ -6257870 -2992003 1310186 890573 -3778940 -7298735 -5766460 -801639 2641127
9149B641127q21723l003938j467939O87148J72060k149842k732361k2017L704026
$$ 2641127 1819404 -1184534 -2652473 -1965325 -1793265 -3943107 -6675468 -6697485 -2993459
9140b993459M718959J497243l334581m786858p51391M706533N649413J917588
$$ -2993459 1725500 3222743 -111838 -4898696 -5650087 -943554 4705859 6623447
9132F623447q58950L12302J693587m18636l364229k959770j048570k244232n135690
$$ 6623447 5764497 6076799 7770386 7351750 3987521 1027751 -20819 -2265051 -7400741
9123g400741l630288K842616P260739N060921L20106j186685k4781j88963k152108
$$ -7400741 -11031029 -8188413 -927674 4133247 4453353 3266668 3241887 3052924 900816
9114I00816l363320k947196j665083N31874K922718K509582j390597l591194M28513
$$ 900816 -2462504 -5409700 -7074783 -6542909 -3620191 -1110609 -2501206 -6092400 -5663887
9105e663887O501678O798277J633155j285011N61040J178736k611487n296336
$$ -5663887 837791 7636068 9269223 7984212 8545252 9723988 7112501 1816165
9097A816165k523494J110760L51524j415151J162901M803414K635462l547196
$$ 1816165 -707329 403431 754955 -660196 502705 5306119 7941581 4394385
9089D394385n543106j801707J101495J23853k72608K431141L891496Q17807l177496
$$ 4394385 -1148721 -2950428 -1848933 -1725080 -1997688 433453 4324949 5142756 1965260
9080A965260l663577j767952n88377m3111Q79148R98911j32888K193K488496L830332
$$ 1965260 -1698317 -3466269 -4054646 -4097757 -3218609 -2219698 -2352586 -2350393 138103 3968435
9070C968435J013393l303405m406652j846317J256076K919087L161410K233682
$$ 3968435 4981828 1678423 -2728229 -4574546 -3318470 -399383 2762027 4995709
9062D995709Q33604K55838K86332p40499k335818j793493N06962K54989l577367
$$ 4995709 5829313 6085151 6371483 5630984 3295166 1501673 2008635 2263624 -1313743
9053a313743n676375k477751J716428J817924K98006J926686M253473J381149
$$ -1313743 -6990118 -9467869 -7751441 -5933517 -5635511 -3708825 544648 1925797
9045A925797m952041o544592r02937N345039O218933K989410l64331k271887k333711
$$ 1925797 -3026244 -9570836 -10473773 -5128734 1090199 4079609 3715278 1443391 -890320
9036h90320l18719J636718N36292k168078j610775K499305M227044L01443m430412
$$ -890320 -1209039 427679 963971 -1204107 -2814882 -315577 3911467 4212910 -217502
9027b17502l992468M36034L222403K184885j40190j018622J47959K540024M273663
$$ -217502 -4209970 -3773936 -551533 1633352 1493162 474540 622499 3162523 7436186
9018G436186L357750K83165j955238j925322j548941k263111k424302q44507L08840
$$ 7436186 10793936 11077101 9121863 7196541 5647600 3384489 960187 115680 424520
9009D24520p18678j591409J97621K283849P82048l095127m532952k279778L49674
$$ 424520 -294158 -1885567 -1687946 595903 1377951 -1717176 -6250128 -8529906 -8180232
9000h180232J167128J126323O93782r49420k504926j217736J924260K562793K27841
$$ -8180232 -7013104 -5886781 -5192999 -6142419 -8647345 -9865081 -7940821 -5378028 -5150187
8991e150187l3700L902489O514338K862849k935509l461444O72304K128489j409148
$$ -5150187 -5183887 -1281398 5232940 8095789 5160280 1698836 2371140 4499629 3090481
8982C090481l915547q90995L638309L361340j300786m547119l417802p40420j65732
$$ 3090481 -825066 -1716061 1922248 5283588 3982802 -564317 -3982119 -4722539 -4888271
8973d888271j244498p31047K246774M165697J701610k520691k228259L174039
$$ -4888271 -6132769 -6863816 -4617042 -451345 1250265 -1270426 -3498685 -324646
8965c24646N973640Q19178o072997n064771K079109M331727j601773o342779k968066
$$ -324646 5648994 6468172 395175 -4669596 -2590487 1741240 139467 -6203312 -9171378
8956i171378K656092K638433k89534Q72374M755924M832128J230734k32954J400602
$$ -9171378 -6515286 -3876853 -4166387 -3294013 1461911 6294039 7524773 7291819 8692421
8947H692421J821801L92263O72968K385807J351077k317685m112938l558426m350407
$$ 8692421 10514222 10906485 11579453 13965260 15316337 12998652 8885714 5327288 976881
8938I76881n552644j955797N017171O518945q1479n915571l748142J893347L320624
$$ 976881 -4575763 -6531560 -1514389 5004556 4923077 -992494 -4740636 -2847289 473335
8929D73335R10295p01091j245278k692527l451407j337627J534635K452197K739662
$$ 473335 1383630 682539 -562739 -3255266 -6706673 -8044300 -6509665 -4057468 -1317806
8920a317806L649795K337636k471043n700244l121274J337300K189547J498913
$$ -1317806 2331989 4669625 2198582 -3501662 -6622936 -5285636 -3096089 -1597176
8912a597176L647856N576386J592281n123744n969595p13337K215040l93910k159191
$$ -1597176 2050680 7627066 9219347 4095603 -1873992 -2587329 -372289 -766199 -2925390
8903b925390J233347M924496L291829j526478l973565k918214j052760m6614K44676
$$ -2925390 -1692043 3232453 6524282 4997804 1024239 -1893975 -2946735 -2993349 -2748673
8894b748673J76050K91296J062704J614180P72216m99871l93342L84882r7264
$$ -2748673 -2572623 -2281327 -1218623 395557 1167773 667902 274560 659442 562178
8885E62178q98575M06145K505385J454586k486463m303936j866642R58763Q89802
$$ 562178 -336397 69748 2575133 4029719 1543256 -2760680 -4627322 -3668559 -2778757
8876b778757N9280J342286L104012K327234q9441j019204j58413J73408p39187
$$ -2778757 -2719477 -1377191 1726821 4054055 3964614 2945410 2786997 2960405 2221218
8867B221218j113143J18994J555710J376855q3083o67835O85344K001829M25715
$$ 2221218 1108075 1227069 2782779 4159634 4076551 3408716 4094060 6095889 6521604
8858F521604l558654n968340m435899j293848K75609P15893J882143K742221J324798
$$ 6521604 2962950 -3005390 -7441289 -8735137 -8459528 -7743635 -5861492 -3119271 -1794473
8849a794473o41276K16885K810389K564621j009694k695993P16494N277690N108355
$$ -1794473 -2435749 -2218864 591525 3156146 2146452 -549541 166953 5444643 10552998
8840A0552998K7456m721395m850982j048206K668185L199237J009914j068551
$$ 10552998 10580454 5859059 1008077 -40129 2628056 5827293 6837207 5768656
8832E768656j331219n88600j11269j24822r09215k774805l885023j519690K715368
$$ 5768656 4437437 3848837 3737568 3612746 2703531 -71274 -3956297 -5475987 -2760619
8823b760619L202210j254823m192159j097532K914618J357862k481285j045980
$$ -2760619 441591 -813232 -5005391 -6102923 -3188305 -1830443 -4311728 -5357708
8815e357708M229954N079788M91646j862347R99277K962937L23106k130722n73371
$$ -5357708 -1127754 3952034 4443680 2581333 3580610 6543547 6866653 4735931 4162560
8806D162560J165349n85163k691252k021741j735918m414127n318247J92091P536525
$$ 4162560 5327909 4742746 2051494 29753 -1706165 -6120292 -11438539 -11246448 -3709923
8797c709923Q812113M169335l5341j498733k769688l678968j003042M123808N620706
$$ -3709923 5102190 9271525 9236184 7737451 4967763 1288795 285753 4409561 10030267
8788A0030267J138330m118071m717480k089631j250202k956350k783419J846924
$$ 10030267 11168597 7050526 2333046 243415 -1006787 -3963137 -6746556 -4899632
8780d899632O562970M732635k975774p546527k926587M926299N604124j026454
$$ -4899632 1663338 6395973 3420199 -4126328 -7052915 -2126616 3477508 2451054
8772B451054m878174p73343M651412M148921N0938j988910k447962l980410l592774
$$ 2451054 -2427120 -3200463 1450949 5599870 5650808 3661898 1213936 -2766474 -6359248
8763f359248K351688Q568074N983365m029887r703578m925946K755094L639647
$$ -6359248 -4007560 4560514 10543879 6513992 -3189586 -8115532 -5360438 -1720791
8755a720791j244158l815005r51077L139554M612544M263171L645658J677899
$$ -1720791 -2964949 -6779954 -7731031 -4591477 21067 4284238 7929896 9607795
8747I607795k406292n651852m516338n65861O52351k747159n868287l726211J777270
$$ 9607795 7201503 1549651 -2966687 -3532548 -2880197 -5627356 -11495643 -15221854 -13444584
8738a3444584M815632L544078J154506K82284O15253J530938K764977K583315
$$ -13444584 -8628952 -5084874 -3930368 -3648084 -3032831 -1501893 1263084 3846399
8730C846399l00348l055415j849766J311759O47287l678007m509048J253503P122699
$$ 3846399 3546051 490636 -1359130 -47371 599916 -3078091 -7587139 -6333636 789063
8721G89063O363184J128263k305002k458721j734245q00264N85848L44997k886811
$$ 789063 7152247 8280510 5975508 3516787 1782542 982278 1568126 1913123 -973688
8712i73688n744107m064219Q57254M048001L206179j17203l461761m405591j305134
$$ -973688 -6717795 -10782014 -9924760 -5876759 -2670580 -2787783 -6249544 -10655135 -11960269
8703a1960269L694205N516376L124418J572386L548988M159183o12579n720011
$$ -11960269 -8266064 -2749688 374730 1947116 5496104 9655287 9042708 3322697
8695C322697m565505j91855l71055m546093n068240j82611L691338K989725J366982
$$ 3322697 -1242808 -1434663 -1805718 -6351811 -11420051 -11602662 -7911324 -4921599 -3554617
8686c554617J540376J127381q42440q26492K413018M372656K041470q61110P6552
$$ -3554617 -2014241 -886860 -1729300 -2555792 -142774 4229882 6271352 5410242 5486794
8677E486794L127909L733583J278397j228390j867778j059528K02373R98850N99210
$$ 5486794 8614703 12348286 13626683 12398293 10530515 9470987 9673360 10672210 11271420
8668A1271420p18951k112424l614661n275388n266654j721927L596003O566766
$$ 11271420 10552469 8440045 4825384 -450004 -5716658 -7438585 -3842582 2724184
8660B724184N726470K994654j69750l574595n554036l876819J04226K360140J761601
$$ 2724184 8450654 11445308 11275558 7700963 2146927 -1729892 -1625666 734474 2496075
8651B496075P45991M12818l24056o69834J327042L419371R29076m649950n751338
$$ 2496075 3242066 3654884 3330828 2660994 3988036 7407407 8336483 3686533 -2064805
8642b064805j72568M608328K593402k024777k687054q04438j422001l440703k082742
$$ -2064805 -2237373 2370955 4964357 2939580 252526 -551912 -1973913 -5414616 -7497358
8633g497358J882917L381670K040709K265009M600191M477873O12898k242755
$$ -7497358 -5614441 -2232771 -192062 2072947 6673138 11151011 11763909 9521154
8625I521154j203535P5036k085162m990242l821445Q41283L934864K835983k01309
$$ 9521154 8317619 8392655 6307493 1317251 -2504194 -1662911 2271953 5107936 4906627
8616D906627k033264k116261j579308q23880P24722K858639L539745P22743m294383
$$ 4906627 2873363 757102 -822206 -1646086 -921364 1937275 5477020 6199763 1905380
8607A905380o710370l319556K810696N284016K257295j419559j091583J619118
$$ 1905380 -4804990 -8124546 -5313850 -29834 2227461 807902 -283681 1335437
8599A335437K064944m53193k559474k551303k171856k336185j166307K022847
$$ 1335437 3400381 2947188 387714 -2163589 -4335445 -6671630 -7837937 -5815090
8591e815090M271226L192083R91485J060509K533193J946409r20732k946534k962099
$$ -5815090 -1543864 1648219 2639704 3700213 6233406 8179815 7259083 4312549 1350450
8582A350450k899225l335893k252206O24657K453575K036067J854497L047747
$$ 1350450 -1548775 -4884668 -7136874 -6512217 -4058642 -2022575 -168078 2879669
8574B879669K560178j365445m721215l120069J349890L511008L004362L329557
$$ 2879669 5439847 4074402 -646813 -3766882 -2416992 1094016 4098378 7427935
8566G427935M383681K145182l792554q085061o841394k467587Q50520K605678
$$ 7427935 11811616 13956798 10164244 2079183 -4762211 -7229798 -6379278 -3773600
8558c773600M155100M605482K143430j900110l672247j702579J019652Q34564
$$ -3773600 381500 4986982 7130412 5230302 1558055 -144524 875128 1709692
8550A709692j872317l246782j298760J212246Q19303j390040j740754k73864l92496
$$ 1709692 -162625 -3409407 -4708167 -3495921 -2676618 -4066658 -5807412 -6081276 -6473772
8541f473772j862270k14548M524650N367338m90413m833961l81176O196288L593163
$$ -6473772 -8336042 -8550590 -4025940 1341398 850985 -3982976 -4364152 1832136 5425299
8532E425299n390497p081532J376152P272595K872116k680079M29098O070816
$$ 5425299 34802 -7046730 -5670578 1602017 4474133 1794054 2223152 8293968
8524H293968K870000o389125q907045j761959M775168L426718j567429l753299
$$ 8293968 11163968 4774843 -4132202 -5894161 -1118993 2307725 740296 -3013003
8516c013003k857426r62312J704469L525151R83184m464104n345608J043938O618910
$$ -3013003 -5870429 -6832741 -5128272 -1603121 -619937 -5084041 -10429649 -9385711 -2766801
8507b766801L487017l813091m760852J421698N343934K324348j504118m87387
$$ -2766801 720216 -3092875 -7853727 -6432029 -1088095 1236253 -267865 -755252
8499g55252J576982r34280n346329n318331j516723K56369m11334J641951O592110
$$ -755252 821730 -112550 -5458879 -10777210 -12293933 -12037564 -12448898 -10806947 -4214837
8490d214837P495856J564775l998491k289517L076044L983436k49181l597454
$$ -4214837 3281019 4845794 847303 -1442214 1633830 5617266 5368085 1770631
8482A770631l302060k180971j944886q25481J552824K590723J395639M61121J157604
$$ 1770631 -1531429 -3712400 -5657286 -6482767 -4929943 -2339220 -943581 -482460 675144
8473F75144J560250L73119p27051o11310j182297l866753o226783m887222l99162
$$ 675144 2235394 2608513 1881462 1270152 87855 -3778898 -10005681 -14892903 -15292065
8464a5292065L363916M157023L611402M112143M895539K967636j830600m888114
$$ -15292065 -11928149 -7771126 -4159724 -47581 4847958 7815594 5984994 1096880
8456A096880k435266K414203L435849O56732Q7751K917644K462565l989008q100524
$$ 1096880 -1338386 1075817 4511666 5168398 5256149 8173793 10636358 6647350 -1453174
8447a453174k663089N638369N490299j494159l988039N15755L072434l30676k778405
$$ -1453174 -4116263 1522106 7012405 5518246 1530207 2045962 5118396 4787720 2009315
8438B009315j57168J445616k178896m878260j281048K993127J112374k764382
$$ 2009315 1852147 3297763 1118867 -3759393 -5040441 -2047314 -934940 -3699322
8430c699322r84691L847502L416661j630984k611156K511946N597935J130857
$$ -3699322 -4684013 -836511 2580150 949166 -1661990 849956 6447891 7578748
8422G578748n666264o747731j700459L281590L797372J526624P79346K357884
$$ 7578748 1912484 -4835247 -6535706 -3254116 543256 2069880 2849226 5207110
8414E207110K296280j912011n663266k490043N208948P450676J064545m698011
$$ 5207110 7503390 5591379 -71887 -2561930 2647018 10097694 11162239 6464228
8406F464228j972129L608021K387510l543915m165075J834571N085470N52237
$$ 6464228 4492099 8100120 10487630 6943715 2778640 4613211 9698681 10250918
8398A0250918n262112m871056P1946L004715J477671j750269l250037j840190
$$ 10250918 4988806 117750 189696 3194411 4672082 2921813 -328224 -2168414
8390b168414Q94960J779184m40574l008679k937268j519989j549670j742880J022903
$$ -2168414 -1273454 505730 65156 -2943523 -5880791 -7400780 -8950450 -10693330 -9670427
8381i670427M890835M454306o01905m220083k722556O21650J711061J117158R07188
$$ -9670427 -4779592 -325286 -927191 -5147274 -7869830 -7248180 -5537119 -4419961 -3512773
8372c512773O22075m26173o44686Q17910J671593K14197j325828l41873J727995
$$ -3512773 -2890698 -3316871 -3961557 -3143647 -1472054 -1257857 -2583685 -2925558 -1197563
8363a197563J964144R68696J450736K884195J768966k323107m767083k021940
$$ -1197563 766581 1735277 3186013 6070208 7839174 5516067 748984 -1272956
8355a272956K810684L733592J39141k576876j487782p57331m367803q057215m645784
$$ -1272956 1537728 5271320 5410461 2833585 1345803 588472 -3779331 -11836546 -16482330
8346a6482330M206427R009599N912698J362569P76841Q45700j940866l146662
$$ -16482330 -12275903 -3266304 2646394 4008963 4785804 5631504 3690638 543976
8338E43976J567061O589308L856334l947061p324574m389574j468430r09704J214849
$$ 543976 2111037 8700345 12556679 8609618 1285044 -3104530 -4572960 -5482664 -4267815
8329d267815N075602N139786K54998l503687k724442j148987j578758j348099
$$ -4267815 807787 5947573 6202571 2698884 -25558 -1174545 -2753303 -4101402
8321d101402R95627K207997R58134N61104J779538N48449l456443m122662O52818
$$ -4101402 -3105775 -897778 60356 621460 2400998 2949447 -506996 -4629658 -3976840
8312c976840M080953J652485j044048J400331M020597K14874n871021n567008
$$ -3976840 104113 1756598 712550 2112881 6133478 6348352 477331 -5089677
8304e089677K68814L465552J906254Q30171K230733K404585J15650j206091l04854
$$ -5089677 -4820863 -1355311 550943 1381114 3611847 6016432 6132082 4925991 4621137
8295D621137Q5173p38299j90994J689466J277160k139151m424076k968525k23919
$$ 4621137 4706310 3968011 3777017 5466483 6743643 4604492 180416 -2788109 -3012028
8286c012028Q41412N59776J94462m66803j518436j979552j581518r86117P7304
$$ -3012028 -2170616 -1610840 -1416378 -1883181 -3401617 -5381169 -6962687 -7948804 -7871500
8277g871500K192362L965268L371826J074614n98692j180344j354728k99434K094582
$$ -7871500 -5679138 -1713870 1657956 2732570 2133878 953534 -401194 -700628 1393954
8268A393954K225762k442942p030140m494735L042492N906891R48518m083961
$$ 1393954 3619716 1176774 -5853366 -10348101 -7305609 -1398718 -450200 -4534161
8260d534161l048374q6900q39730k306497J375930P978376R778414M628993k344541
$$ -4534161 -7582535 -7669435 -8509165 -10815662 -9439732 -1461356 8317058 12946051 10601510
8251A0601510o480864o835174l217831L251118P085984L042040n110969p157924
$$ 10601510 4120646 -2714528 -5932359 -2681241 4404743 7446783 2335814 -4822110
8243d822110j56709O769388N130743j317705l368086k23691J079116j880834l694142
$$ -4822110 -4978819 1790569 6921312 5603607 2235521 2011830 3090946 1210112 -2484030
8234b484030j479594k5973k489381l341052K470541Q714081N577292m140769p184468
$$ -2484030 -3963624 -3989597 -6478978 -9820030 -7349489 1364592 6941884 2801115 -4383353
8225d383353N39998P197792K775683n931492o351867Q43231M410505P28592k274575
$$ -4383353 -3843355 3354437 6130120 198628 -6153239 -5310008 -899503 -170911 -2445486
8216b445486K90076K657629q54650o048176n516932L68437M959570M688036K000041
$$ -2445486 -2155410 502219 -352431 -6400607 -11917539 -11549102 -6589532 -1901496 98545
8207I8545N89970J432882K808077K156971j151241m135068l289887K80138J952623
$$ 98545 688515 2121397 4929474 7086445 5935204 1800136 -1489751 -1209613 743010
8198G43010L68883r62958m831P23805m65669j172773k37714r44831m421226n077055
$$ 743010 1111893 148935 144104 867909 402240 -770533 -1008247 -1953078 -6374304 -11451359
8188a1451359J241307Q713163Q436509J295999l665276k538096m16381j567496
$$ -11451359 -10210052 -1496889 6939620 8235619 4570343 2032247 1615866 48370
8180D8370l212548j426970K518628M607771L015156j304804n640652o166685j288495
$$ 48370 -3164178 -4591148 -2072520 2535251 5550407 4245603 -1395049 -7561734 -8850229
8171h850229M792825N756012J200890l014275l007911p25904J211694K948707
$$ -8850229 -4057404 1698608 2899498 -114777 -3122688 -3848592 -2636898 311809
8163C11809L880282J449140l583430n811063k570315J941623L293686K716460
$$ 311809 4192091 5641231 2057801 -3753262 -6323577 -4381954 -1088268 1628192
8155A628192K548064R96870l437711o899813n479402j917462q76927q46335K396035
$$ 1628192 4176256 5173126 1735415 -5164398 -10643800 -12561262 -13438189 -14284524 -11888489
8146a1888489O845703O397678P56539m064129m782311l479907j413045K460404
$$ -11888489 -5042786 1354892 2111431 -1952698 -6735009 -10214916 -11627961 -9167557
8138i167557O135458N230775P06033j130807J493855K916742k20385l506546k927577
$$ -9167557 -3032099 2198676 2904709 1773902 3267757 6184499 5964114 2457568 -470009
8129d70009j510804k630469l055932P89874M852909L340165j002415p07283M022957
$$ -470009 -1980813 -4611282 -7667214 -6877340 -2024431 1315734 313319 -393964 3628993
8120C628993N052435r97240p139922n646938J919542P408832N743503o79825n562721
$$ 3628993 8681428 7684188 544266 -5102672 -3183130 4225702 9969205 9289380 3726659
8111C726659m965980o44620K457128K164262J061588J540396J649981j116147
$$ 3726659 -1239321 -1883941 573187 2737449 3799037 5339433 6989414 5873267
8103E873267m373812l767043k02425R31194j988479m320373k352165J388106K428299
$$ 5873267 1499455 -2267588 -2470013 -1538819 -3527298 -7847671 -10199836 -8811730 -6383431
8094f383431O51235n86043L66443J837504J650381j68384j369925J71347L577133
$$ -6383431 -5732196 -6318239 -5951796 -4114292 -2463911 -2632295 -4002220 -3830873 -253740
8085b53740N027679K166010k335478l860876j842964K54822N17182L69902M96539
$$ -253740 4773939 6939949 4604471 743595 -1099369 -844547 -327365 42537 539076
8076E39076n98864k409157j370208L046839N279738J056627n163065n535473j65729
$$ 539076 -59788 -2468945 -3839153 -792314 4487424 5544051 380986 -5154487 -5320216
8067e320216K999190J49531k803265J70132N200816L954791l247332o755637j188849
$$ -5320216 -2321026 -2171495 -4974760 -4804628 396188 4350979 1103647 -5651990 -6840839
8058f840839O622274P222052J366036k565542j268173N48910m06034j338767k91833
$$ -6840839 -218565 7003487 8369523 5803981 4535808 5084718 4678684 3339917 3048084
8049C048084m06468l056883l334344J612324N387633J271657n811834n449465
$$ 3048084 2641616 -415267 -3749611 -2137287 3250346 4522003 -1289831 -6739296
8041f739296K234399O656326K986421j805436j434073P91094O958j597275k63436
$$ -6739296 -4504897 2151429 5137850 3332414 1898341 2689435 2696393 1099118 835682
8032H35682J746816O59081j592768j145055O75912L65720q70860L06787K467820
$$ 835682 2582498 3241579 1648811 503756 1179668 1545388 674528 981315 3449135
8023C449135J653768j182931j488295J050885K221927N82264r42151j071104k004950
$$ 3449135 5102903 3919972 2431677 3482562 5704489 6286753 5344602 4273498 2268548
8014B268548m153854m298067q72017L121539M393944L227416J529414P7012q85801
$$ 2268548 -1885306 -6183373 -7055390 -3933851 460093 3687509 5216923 5293935 4408134
8005D408134r71828p80472j417225k219601j389358P02055J583380N87099j54039
$$ 4408134 3436306 2655834 1238609 -980992 -2370350 -1668295 -84915 502184 348145
7996C48145O45028J500113P98777r88034k476531k738392j334774R17710J692299
$$ 348145 993173 2493286 3292063 2304029 -172502 -2910894 -4245668 -3327958 -1635659
7987a635659K41568l76982K184563M247290P52009n325731n305129J948220O812853
$$ -1635659 -1394091 -1771073 413490 4660780 5412789 87058 -5218071 -3269851 3543002
7978C543002K901915l029660j544652M939537O456965R81390l694969l007715
$$ 3543002 6444917 3415257 1870605 6810142 13267107 14248497 10553528 7545813
7970G545813j398869k941388m243302j170480L261352L401441j14267j672970
$$ 7545813 6146944 3205556 -1037746 -2208226 1053126 4454567 4340300 2667330
7962B667330O63794L064768K313218k84089k205981l069018l120733j636837R77225
$$ 2667330 3331124 6395892 8709110 8425021 6219040 3150022 29289 -1607548 -630323
7953f30323K078961M69834q67301J033462L694198K145231k997908n241696j530904
$$ -630323 1448638 1918472 1051171 2084633 5778831 7924062 4926154 -315542 -1846446
7944a846446K721068J226439m031132n752081j517176L811200N368704L327208
$$ -1846446 874622 2101061 -1930071 -7682152 -9199328 -5388128 -19424 3307784
7936C307784K19751k312052k729112L24888M809721N498851L75675n547332n940983
$$ 3307784 3527535 1215483 -1513629 -1188741 3620980 9119831 9495506 3948174 -1992809
7927a992809j148176K677052J645235j746188k849054p40476J426341R40185r82379
$$ -1992809 -3140985 -463933 1181302 -564886 -3413940 -4154416 -2728075 -1787890 -2770269
7918b770269r29858J738992L331849P51612l466544m072466n51567K246604J508751
$$ -2770269 -3700127 -1961135 1370714 2122326 -1344218 -5416684 -5968251 -3721647 -2212896
7909b212896l5535J05056j90756k562450l248532J147295O165353M649907j933993
$$ -2212896 -2248431 -2143375 -2334131 -4896581 -8145113 -6997818 -832465 3817442 1883449
7900A883449m758242p74927K877421K89762m182622l105834K684659N787699K793122
$$ 1883449 -2874793 -3649720 -772299 -482537 -4665159 -7770993 -5086334 701365 3494487
7891C494487k353970m722009l598218j198642M44394P89436R51215K348240M000113
$$ 3494487 1140517 -3581492 -7179710 -8378352 -7933958 -7144522 -6193307 -3845067 155046
7882A55046K925976q66158k518875J080914N426516M049708j615578m031696q75431
$$ 155046 3081022 2214864 -304011 776903 6203419 10253127 8637549 4605853 3730422
$$ [...]
##END NTUPLES=NMR SPECTRUM
##END=
