##TITLE=31Pdec_SR40-k2
 CDCl3, 51 sc
 1.03.2021
##JCAMPDX= 6.0         $$ Bruker NMR JCAMP-DX V2.0
##DATA TYPE= NMR SPECTRUM
##DATA CLASS= NTUPLES
##ORIGIN= UXNMR, Bruker Analytische Messtechnik GmbH
##OWNER= root
$$ XWIN-NMR		Version 3.5
$$ Mon Mar  1 11:31:05 2021 Russian Standard Time (UT+4h)  she@DPX200
##.OBSERVE FREQUENCY= 81.013821
##.OBSERVE NUCLEUS= ^31P
##.ACQUISITION MODE= SIMULTANEOUS
##.ACQUISITION SCHEME= undefined
##.AVERAGES= 52
##.DIGITISER RES= 16
##SPECTROMETER/DATA SYSTEM= spect
##.PULSE SEQUENCE= zgpg30
##.SOLVENT NAME= CD3CN
##.SHIFT REFERENCE= (INTERNAL, CD3CN, 0, 248.564)
##AUDIT TRAIL= $$ (NUMBER, WHEN, WHO, WHERE, WHAT)
$$ ##TITLE= Audit trail, XWIN-NMR		Version 3.5
$$ ##JCAMPDX= 5.01
$$ ##ORIGIN= Bruker BioSpin GmbH
$$ ##OWNER= she
$$ F:/spectra/data/she/nmr/P31/1/pdata/1/auditp.txt
$$ ##AUDIT TRAIL=  $$ (NUMBER, WHEN, WHO, WHERE, WHAT)
(   1,<2021-03-01 11:29:34.96 +0400>,<she>,<DPX200>,
      <created by zg, POWCHK disabled, PULCHK disabled
       terminated by command 'halt'
       configuration hash MD5:
       00 E9 B6 7A A2 85 ED C7 34 08 36 98 17 FE 4E 26
       data hash MD5: 32K
       7A 0D B8 C1 5D BB A2 1B AA F6 5C 70 E1 4B CF EA>)
(   2,<2021-03-01 11:29:48.89 +0400>,<she>,<DPX200>,
      <Start of raw data processing
       efp BC_mod = 2 LB = 1 FT_mod = 6 PKNL = 1 PHC0 = -2923.156 PHC1 = -105.3975 SI = 64K 
       data hash MD5: 64K
       69 8C 47 43 78 E5 B4 FB B6 18 37 BE 7E BC 02 25>)
(   3,<2021-03-01 11:30:20.60 +0400>,<she>,<DPX200>,
      <pk PHC0 = 74.17794 PHC1 = 0 
       data hash MD5: 64K
       61 22 78 56 C5 C9 0C A5 8C 2A 57 FC 8C 1C 37 87>)
(   4,<2021-03-01 11:30:29.87 +0400>,<she>,<DPX200>,
      <abs ABSG = 5 
       data hash MD5: 64K
       E9 FF 32 B1 41 7B E9 A1 83 91 E8 52 DC BF 0C 30>)
$$ ##END=
$$ 
$$ hash MD5
$$ F6 69 D1 CE DA 4F 1A E5 1F 80 29 15 FA 9A 15 CA
##$RELAX= 
##$RELAX= 
##$RELAX= 
##$RELAX= 
##$RELAX= 
##$RELAX= 
##$RELAX= 
##$RELAX= 
$$ Bruker specific parameters
$$ --------------------------
##$DU= <F:/spectra>
##$EXPNO= 1
##$NAME= <P31>
##$PROCNO= 1
##$TYPE= <nmr>
##$USER= <she>
##$AMP= (0..31)
100 100 100 100 100 100 100 100 100 100 100 100 100 100 100 100 100 100 
100 100 100 100 100 100 100 100 100 100 100 100 100 100 
##$AQSEQ= 0
##$AQ_mod= 1
##$AUNM= <au_zg>
##$AUTOPOS= <>
##$BF1= 81.014009
##$BF2= 200.13
##$BF3= 200.13
##$BF4= 200.13
##$BF5= 200.13
##$BF6= 200.13
##$BF7= 200.13
##$BF8= 200.13
##$BYTORDA= 1
##$CFDGTYP= 0
##$CFRGTYP= 5
##$CHEMSTR= <none>
##$CNST= (0..31)
1 1 145 1 1 1 1 1 1 1 1 1 1 1 1 1 1 1 1 1 1 1 1 1 1 1 1 1 1 1 1 1 
##$CPDPRG= <waltz16>
##$CPDPRG1= <>
##$CPDPRG2= <waltz16>
##$CPDPRG3= <>
##$CPDPRG4= <mlev>
##$CPDPRG5= <mlev>
##$CPDPRG6= <mlev>
##$CPDPRG7= <mlev>
##$CPDPRG8= <mlev>
##$CPDPRGB= <>
##$CPDPRGT= <>
##$D= (0..31)
0 1 0 0 0 0 0 0 0 0 0 0.03 2e-05 3e-06 0 0 0 0 0 0 0 0 0 0 0 0 0 0 0 0 
0 0 
##$DATE= 1614583774
##$DBL= (0..7)
120 120 120 11 120 120 24 19 
##$DBP= (0..7)
150 150 150 150 150 150 150 150 
##$DBP07= 0
##$DBPNAM0= <>
$$ [...]
##$SUBNAM3= <"">
##$SUBNAM4= <"">
##$SUBNAM5= <"">
##$SUBNAM6= <"">
##$SUBNAM7= <"">
##$SUBNAM8= <"">
##$SUBNAM9= <"">
##$SW= 501.771253377433
##$SWIBOX= (0..15)
0 1 3 0 0 0 0 0 0 0 0 0 0 0 0 0 
##$SW_h= 40650.406504065
##$TD= 32768
##$TD0= 1
##$TE= 0
##$TE2= 300
##$TE3= 300
##$TEG= 300
##$TL= (0..7)
0 120 53 12 22 120 120 120 
##$TP= (0..7)
150 150 150 150 150 150 150 150 
##$TP07= 0
##$TPNAME0= <>
##$TPNAME1= <>
##$TPNAME2= <>
##$TPNAME3= <>
##$TPNAME4= <>
##$TPNAME5= <>
##$TPNAME6= <>
##$TPNAME7= <>
##$TPOAL= (0..7)
0.5 0.5 0.5 0.5 0.5 0.5 0.5 0.5 
##$TPOFFS= (0..7)
0 0 0 0 0 0 0 0 
##$TUNHIN= 0
##$TUNHOUT= 0
##$TUNXOUT= 0
##$USERA1= <user>
##$USERA2= <user>
##$USERA3= <user>
##$USERA4= <user>
##$USERA5= <user>
##$V9= 5
##$VALIST= <valist>
##$VCLIST= <CCCCCCCCCCCCCCC>
##$VD= 0
##$VDLIST= <DDDDDDDDDDDDDDD>
##$VPLIST= <PPPPPPPPPPPPPPP>
##$VTLIST= <TTTTTTTTTTTTTTT>
##$WBST= 1024
##$WBSW= 4
##$XGAIN= (0..3)
0 0 0 0 
##$XL= 0
##$YL= 0
##$YMAX_a= 11163
##$YMIN_a= -3645
##$ZGOPTNS= <>
##$ZL1= 120
##$ZL2= 120
##$ZL3= 120
##$ZL4= 120
##$ABSF1= 248.5645
##$ABSF2= -253.2056
##$ABSG= 5
##$ABSL= 3
##$ALPHA= 0
##$AQORDER= 0
##$ASSFAC= 0
##$ASSFACI= 0
##$ASSFACX= 0
##$ASSWID= 0
##$AUNMP= <proc_1d>
##$AZFE= 0.1
##$AZFW= 0.5
##$BCFW= 0
##$BC_mod= 2
##$BYTORDP= 0
##$COROFFS= 0
##$CY= -3
##$DATMOD= 1
##$DC= 0
##$DFILT= <>
##$DTYPP= 0
##$F1P= 0
##$F2P= 0
##$FCOR= 1
##$FTSIZE= 65536
##$FT_mod= 6
##$GAMMA= 0
##$GB= 0
##$INTBC= 1
##$INTSCL= 5.30512e-09
##$ISEN= 30
##$LB= 1
##$LEV0= 0
##$LPBIN= 0
##$MAXI= 10000
##$MC2= 0
##$MEAN= 0
##$ME_mod= 0
##$MI= 50
##$NCOEF= 0
##$NC_proc= -7
##$NLEV= 6
##$NOISF1= 182.463
##$NOISF2= 159.3651
##$NSP= 0
##$NTH_PI= 0
##$NZP= 0
##$OFFSET= 248.5645
##$PC= 4
##$PHC0= -2848.978
##$PHC1= -105.3975
##$PH_mod= 1
##$PKNL= yes
##$PPARMOD= 0
##$PSCAL= 0
##$PSIGN= 0
##$REVERSE= no
##$SF= 81.014009
##$SI= 65536
##$SIGF1= 159.3651
##$SIGF2= -187.1042
##$SINO= 113.3802
##$SIOLD= 16384
##$SREGLST= <1H.CDCl3>
##$SSB= 0
##$STSI= 65536
##$STSR= 0
##$SW_p= 40650.406504065
##$SYMM= 0
##$S_DEV= 0
##$TDeff= 32768
##$TDoff= 0
##$TI= <>
##$TILT= no
##$TM1= 0
##$TM2= 0
##$TOPLEV= 0
##$USERP1= <user>
##$USERP2= <user>
##$USERP3= <user>
##$USERP4= <user>
##$USERP5= <user>
##$WDW= 1
##$XDIM= 65536
##$YMAX_p= 396660802
##$YMIN_p= -46847187
$$ End of Bruker specific parameters
$$ ---------------------------------
##NTUPLES= NMR SPECTRUM
##VAR_NAME=  FREQUENCY,     SPECTRUM/REAL,   SPECTRUM/IMAG
##SYMBOL=    X,             R,               I
##VAR_TYPE=  INDEPENDENT,   DEPENDENT,       DEPENDENT
##VAR_FORM=  AFFN,          ASDF,            ASDF
##VAR_DIM=   65536,         65536,           65536
##UNITS=     HZ,            ARBITRARY UNITS, ARBITRARY UNITS
##FACTOR=    0.620285442955139, 1,           1
##FIRST=     20137.2065510759, 0,            0
##LAST=      -20513.1999529892, 0,           0
##MIN=       -20513.1999529892, -46847187,   0
##MAX=       20137.2065510759, 396660802,    0
$$ Real data points
##PAGE= N=1
##DATA TABLE= (X++(R..R)), XYDATA
$$ [...]
##PAGE= N=2
##DATA TABLE= (X++(I..I)), XYDATA
14986 13242116 11037876 6663701 2200998 1576295 3517840 2576013 -1187019 -880892
14978 -880892 5845340 11457768 9146398 2203179 -2832163 -6460312 -12720308 -19907574
14970 -19907574 -22364011 -18943695 -13131152 -7058857 -1449517 1286257 367774 144400
14962 144400 3389776 4584646 -1689693 -9044044 -6679814 3200497 7662343 3384578
14954 3384578 1445542 7935953 12988534 6776069 -4537746 -8958460 -6821155 -7458206
14946 -7458206 -12362379 -13234966 -6036012 2589237 4591571 -93737 -5194083 -5222701 -175530
14937 -175530 4382595 2543032 -4617430 -9118382 -6165170 -970766 -1338942 -6510294
14929 -6510294 -9226830 -7372251 -6938820 -12375232 -19361966 -20030845 -12634291 -3366427
14921 -3366427 786529 -579128 -1812861 1086579 5269623 5662439 2823645 1686310
14913 1686310 3221387 3505280 2013670 3494541 8347030 8802829 569103 -8444519
14905 -8444519 -8949297 -4591232 -5801405 -12376268 -13111625 -3180164 8333722 11420333
14897 11420333 7474438 4026518 3333364 1948777 -1796124 -5525958 -7374628 -8871866
14889 -8871866 -12309605 -16916153 -19046662 -16609548 -12413395 -11098263 -12774720 -13097982
14881 -13097982 -10966066 -11520754 -17622081 -22528205 -17360578 -3884321 6908914 8648992
14873 8648992 5358633 2621032 197584 -3171067 -3635137 3082030 13145289 16430657
14865 16430657 7888483 -6102574 -14669525 -14322947 -11279103 -11442581 -11532653 -4346469
14857 -4346469 8589279 16192067 11951225 2848352 -672211 1071145 -495175 -7989467
14849 -7989467 -13895176 -11151071 -2202923 4264609 2308067 -6305059 -13653162 -12548250
14841 -12548250 -4122085 2905074 2976690 871056 4181332 11785827 15594494 11851719
14833 11851719 4461561 -1911524 -5786521 -6429610 -3823007 -1228586 -1917645 -3251784
14825 -3251784 190673 7815185 13643793 15528667 16682043 17793455 15530735 10281113
14817 10281113 7329417 7869303 6692120 2129448 594338 6663399 15261292 18741345
14809 18741345 16275741 11569920 6487021 1791866 -353755 671333 2284687 3337131
14801 3337131 5807713 8934804 7818163 2034649 -1049307 2749789 6598726 2878365
14793 2878365 -4454466 -6190986 -2287441 -600685 -3522536 -5363399 -2914600 8078
14785 8078 83859 -614155 204177 357404 -3257496 -9532189 -13756077 -11901379 -3978905
14776 -3978905 5401160 10433211 9616586 6639124 4683142 2744148 -362254 -2373767
14768 -2373767 -1808261 -2044692 -6036085 -9888907 -7618005 -498552 4184272 2702898
14760 2702898 -2084953 -6082303 -6895182 -2729950 5527220 11760249 10388165 4497338
14752 4497338 1976472 3773028 3237215 -2101755 -6202161 -4696677 -1812519 -2662153
14744 -2662153 -5049761 -4615536 -3150942 -5190154 -9325678 -9685631 -5213558 -1574813
14736 -1574813 -3068291 -7081680 -8073706 -4049380 2425776 7486104 8661496 5779056
14728 5779056 1030229 -2082720 -1270619 2300239 4554802 1982455 -5008467 -12185183
14720 -12185183 -14934450 -11671644 -4573955 2061349 4534641 2440412 -829027 -1390736
14712 -1390736 1061442 3686216 4656067 4547197 3419417 -173153 -5686092 -9175158
14704 -9175158 -7915929 -4186198 -1864048 -1229742 59658 2368600 3317053 905339
14696 905339 -4332576 -9237577 -9416019 -3382712 3794591 5158485 1972930 3445143
14688 3445143 12432220 18014086 9678992 -6118721 -13304301 -7740769 -883925 -1688686
14680 -1688686 -5709724 -5491781 -2107847 -515042 -644615 79149 204699 -2950064 -6868747
14671 -6868747 -6468542 -1869785 1664993 1153117 -992538 -1462585 -294115 162297 -1601197
14662 -1601197 -4817270 -6959602 -5353443 808545 9291235 15434956 14680042 6434445
14654 6434445 -3683666 -7650033 -3194559 3533171 5608798 3295123 1363324 1435061
14646 1435061 1837472 2870093 6137688 9455604 8498700 3388410 -2057794 -6889396
14638 -6889396 -12134964 -14324769 -8680895 626725 3280728 -1724322 -3818071 1834233
14630 1834233 5956121 1156659 -4409073 189614 10294864 12261235 3731118 -4524830
14622 -4524830 -4596453 1490442 9155970 15465659 16700095 11596206 6913999 10318805
14614 10318805 17664556 17143475 6721977 -2905304 -4596675 -3468835 -5963566 -10351044
14606 -10351044 -13030051 -15147559 -17095944 -14678606 -7430914 -3384159 -8002975 -14547764
14598 -14547764 -13452055 -6132421 -932248 519270 3367772 8041954 8359040 1769952
14590 1769952 -6317613 -10165540 -9635771 -6936708 -2857251 1626722 4213580 3903413
14582 3903413 1851641 -1469223 -6798496 -12780952 -15595552 -13765774 -10764806 -10784611
14574 -10784611 -13559988 -15145181 -12784314 -7488220 -2138666 1754082 4791175 7438580
14566 7438580 8333589 6123670 1976265 -2064155 -6421265 -12174667 -16237570 -13447689
14558 -13447689 -4825993 1780348 1999194 190029 754663 700675 -3377608 -7338329 -6559741
14549 -6559741 -5479414 -10041054 -14746672 -9367800 3095591 8460993 2560588 -2998334
14541 -2998334 -10356 4571030 2569277 -1861542 -1772290 -415487 -3734313 -7436789
14533 -7436789 -3531842 4963588 7549016 2111844 -3094888 -2089460 3308731 9397267
14525 9397267 13433414 11803824 4022222 -2519306 -616614 5021814 3701051 -4364323
14517 -4364323 -8071378 -3173339 1886603 1124065 225080 4679721 9106369 6712318
14509 6712318 1730844 3234032 11220810 17358715 17038641 13543021 11453341 11486076 11336801
14500 11336801 8019933 442726 -8049808 -11952683 -10243633 -7306353 -5441054 -1466362
14492 -1466362 6171417 12548711 13206781 10886360 9891287 8475743 3318204 -2371419
14484 -2371419 -2622019 1774367 4585327 3490503 1405311 -475058 -4101877 -9000077
14476 -9000077 -11531935 -10738159 -9996220 -11842549 -14892635 -16302723 -14319197 -9109253
14468 -9109253 -3994076 -3968704 -9306613 -13093779 -9669967 -2748667 417845 41319 1973835
14459 1973835 7147055 11000990 12343908 13878069 13845283 6970922 -4133684 -8319713
14451 -8319713 -1130915 7690369 7657133 1511506 -920058 2622372 5858356 4561238
14443 4561238 1023494 -1150392 -1269810 -572764 -634488 -2499176 -4887609 -4188557 1544473
14434 1544473 9683028 15733458 17204600 13441132 4740076 -5500168 -10570267 -6615094
14426 -6615094 1953021 6811787 5327701 2809626 4860121 10075392 11717943 5593490
14418 5593490 -5008176 -12456177 -12308467 -6944637 -1988531 -868406 -3434538 -7370472
14410 -7370472 -9015337 -5231829 2635593 8607994 8889533 6677070 6871089 8912189
14402 8912189 9320237 8096923 6766313 3434174 -2547888 -4093201 5271383 17774203
14394 17774203 17979477 4526447 -6838699 -5576057 741021 1799668 194173 2203755
14386 2203755 3783739 -1809953 -9716842 -9791812 -2996751 516777 -3042313 -8594837
14378 -8594837 -12965527 -16907492 -17638998 -10816192 -313942 4501568 2219819 253033
14370 253033 1545387 1053639 -2776089 -4254987 -1696826 -1445055 -5444287 -5255589 4217715
14361 4217715 14066704 13582474 6600421 5865812 14932402 24821120 26668313 19603780
14353 19603780 7364413 -4967973 -10859369 -6508139 3093505 8009619 5213238 1849819
14345 1849819 4753634 11329265 13918275 9897422 3838893 1184205 2735548 5023898
14337 5023898 4314594 351741 -3235303 -3071316 -694939 -817221 -3932752 -4168817 1977097
14328 1977097 7667261 2757897 -11220401 -20191529 -14798617 -2331895 3977448 2394712
14320 2394712 1672875 5755285 9100515 7502186 4197718 2461035 375959 -2979858
14312 -2979858 -3672061 -328858 1454635 -1802891 -4278064 93595 6764170 6927391
14304 6927391 633418 -4816822 -6325122 -6303354 -5335971 -2657791 -1957893 -7226327 -14044702
14295 -14044702 -14593079 -10249671 -8847844 -10304008 -7157947 39501 1801900 -2613570
14287 -2613570 -1254883 10309284 19084006 14771047 6965619 9287826 16665446 14125638
14279 14125638 1843356 -5285919 -828465 6333991 9037759 10821519 14425247 14735003
14271 14735003 9349727 5498751 9136950 15286385 16495540 14061425 13006840 11462224
14263 11462224 4168800 -6175074 -10043755 -3898275 4907122 7437232 2504796 -4589543
14255 -4589543 -8398053 -6779142 -1652232 1606319 -1514809 -8404775 -9755932 300414
14247 300414 15312385 21464852 12553672 -2737406 -10873808 -9112689 -7469481 -14545447
14239 -14545447 -25338185 -26830410 -14205137 3173961 13043255 13208556 10043384 7517809
14231 7517809 3728535 -1848981 -4391001 -795391 3763306 1904943 -5327700 -9721247
14223 -9721247 -7434482 -3389329 -2956433 -5002765 -5869450 -5155080 -3915388 -1564515 1283557
14214 1283557 1104573 -2685823 -4540249 -1282345 689237 -5489831 -14557230 -15638471
14206 -15638471 -9500000 -7501114 -12406996 -13273909 -4365822 3327968 -1471479 -12089501
14198 -12089501 -13687199 -5163015 1276752 -263357 -2770153 -222435 3105845 1204288
14190 1204288 -3967139 -6334169 -4075770 182259 3847241 5348921 3478141 -760961
14182 -760961 -3219128 -294882 6980470 13928230 16665314 14869698 10878465 6686844
14174 6686844 2087164 -3381289 -7014793 -4442685 4114399 12591452 16709233 18871195
14166 18871195 21373400 19471590 8456778 -5421766 -10452505 -5639337 -1786387 -4744965
14158 -4744965 -7763923 -4925478 -2115005 -6634329 -13686305 -13538184 -7610805 -6324881
14150 -6324881 -12328747 -16755242 -13627417 -8179638 -7081977 -8580955 -7839558 -5842969
14142 -5842969 -6424762 -8507606 -8151812 -6089003 -6431554 -8551844 -6886264 189809 7312476
14133 7312476 10202681 11446184 14774360 18156772 17345096 13117014 9669547 7916042
14125 7916042 6243340 6637248 12850347 21529482 22628040 12266824 -823922 -6392014
14117 -6392014 -5061986 -4001390 -4921171 -4162837 -2076150 -3298766 -7467818 -8176453 -3401219
14108 -3401219 725372 180823 55891 5952365 13961497 15829326 10663643 4952333
14100 4952333 2991568 3508029 4457718 4857344 2314995 -4730210 -11551425 -10255439 -398235
14091 -398235 9044889 10893450 7770237 5752274 5291752 3191566 -615343 -4089365
14083 -4089365 -8087769 -14110896 -18653122 -16521806 -9815217 -7010383 -11538380 -17061953
14075 -17061953 -16449959 -10053792 -1991681 6384604 14542051 18524230 14731077 6024327
14067 6024327 -1350110 -5913608 -11059053 -17625332 -21491359 -19165196 -11763935 -3047109
14059 -3047109 2986153 3089932 -1961073 -5193103 -4618 10211519 14772287 9663461
14051 9663461 2479280 460967 417746 -3953757 -10349463 -11132493 -5582417 -1129213 -2613132
14042 -2613132 -6827684 -8728649 -7676030 -5667490 -3500290 -1105777 647095 454400
14034 454400 -1804780 -4206926 -3208294 3393919 12381824 16314543 11621603 3499385
14026 3499385 -494677 440848 1538869 366834 -1662207 -3954458 -6838570 -7822402
14018 -7822402 -4275850 256523 -446755 -4772794 -4344449 2036869 4251536 -4189728
14010 -4189728 -14717615 -14710889 -4669910 3968514 5190490 3939723 5812160 9267120
14002 9267120 10240134 8752618 7643240 7707221 6824676 3083594 -2211817 -4686004 -1239729
13993 -1239729 5050922 6920381 1946452 -3186355 -939995 6922135 11936189 10136957
13985 10136957 5455581 2428234 1212012 1040578 3409856 8969398 14554788 16148801
13977 16148801 13068219 7637409 2455866 -884260 -2151226 -2501318 -2774032 -1911783
13969 -1911783 739026 2285834 -759678 -6246596 -7768041 -3753316 -363419 -2571888
13961 -2571888 -7016139 -7892510 -5988521 -6201325 -8460755 -7629780 -2301283 2357005 2210504
13952 2210504 -124761 320679 4205183 8323251 10112968 8769434 3711929 -4539780
13944 -4539780 -12145654 -13638708 -7307500 2193283 7902327 7367634 4861450 6294992
13936 6294992 12268086 17511890 17744096 15129237 14841961 17688765 19564642 17917439
13928 17917439 14515830 10656728 4438464 -3741143 -7091487 295450 13537878 20554727
13920 20554727 16410883 8643085 6183225 8059814 7087532 1245079 -3849971 -2909607
13912 -2909607 2932989 8570500 10612243 9772452 9146130 10577178 12299371 11140875
13904 11140875 7540956 5797801 7434663 7569185 1763821 -6191656 -8770283 -5403148
13896 -5403148 -2131387 -928548 2640096 9029754 10566454 3139858 -4967676 -3737176
13888 -3737176 3629332 5195799 -2367983 -9926060 -9547989 -3586247 1969858 5635461
13880 5635461 8169271 8210472 5051196 1977957 2472732 5576971 8338791 10274974 12097549
13871 12097549 12356974 8878365 2232563 -4604293 -8554552 -7162618 -208701 7426238
13863 7426238 8621094 3035002 -841938 3163258 10048271 11519286 8538556 8322270
13855 8322270 11401811 10713502 3577893 -4014314 -6747139 -6122241 -5253137 -4693119 -5711116
13846 -5711116 -10296087 -15019751 -12683278 -3787251 1955566 407758 48867 6941666
13838 6941666 12122173 5023637 -7779514 -10934259 -3498725 1031156 -2799700 -5354133
13830 -5354133 -538833 3353843 -1150987 -6817432 -3255581 6079142 9789232 6571869
13822 6571869 5947415 12143622 17284700 12800824 939476 -8325804 -8664455 -3379194
13814 -3379194 -848571 -4484292 -8004919 -3058677 8950010 17502889 16632120 11738286
13806 11738286 9513167 8062818 3169418 -1955281 -1922317 157676 -2531074 -7158028
13798 -7158028 -3930081 7191993 13696958 8024589 -2147377 -6727189 -7472155 -11402105
13790 -11402105 -16553470 -14640559 -5670612 147706 -3140732 -8580245 -6354647 2193181
13782 2193181 6236581 285466 -7824033 -6618198 3665235 10051660 2540277 -13010906
13774 -13010906 -21677779 -17265427 -8157529 -5030381 -8069271 -9401156 -4573310 2817899
13766 2817899 6932601 6270096 3524007 1108646 -1255470 -4514814 -7263636 -6556759
13758 -6556759 -2189732 1719656 1318038 -1724741 -1661697 4621334 13576562 17478366 10720151
13749 10720151 -4455095 -17603081 -18513582 -8309571 1041316 1162007 -3120394 -3313985
13741 -3313985 -1104910 -3923418 -9757643 -8044934 2901023 10817517 6924695 -1167391
13733 -1167391 -1495355 4451103 5105282 -3679925 -13404866 -14762295 -8080561 -991044
13725 -991044 213367 -4006016 -7598536 -5525620 385098 4081917 3642357 2877186 3986286
13716 3986286 4409882 3113670 3285278 4912416 1783376 -8255573 -16712250 -15692340
13708 -15692340 -10035037 -9286428 -12125638 -9242109 616742 8288662 7889946 3233128
13700 3233128 -346360 -1793020 -778483 3034377 5436925 877883 -7383924 -8732308
13692 -8732308 -63288 8926272 9497589 5120982 3582878 4952451 4483878 2487406
13684 2487406 3538022 8056586 11298528 10395818 7762742 7196982 9336827 11108113
13676 11108113 8645706 1689148 -4846085 -5955040 -3157121 -2694998 -6965145 -11950876
13668 -11950876 -13802619 -12997571 -10461364 -4775886 4143149 12784267 17574251 16908438
13660 16908438 9357068 -4002341 -14621463 -12295580 638018 9364783 5755375 -1216855
13652 -1216855 -704139 3697810 2570696 -2376400 -2539731 1446025 1591608 -1554547 913843
13643 913843 9380358 12869402 6830644 1172722 4395151 10546052 10196303 5868882
13635 5868882 6692703 12971854 16108232 11789428 4489700 -968904 -4735630 -7381366
13627 -7381366 -6316530 28522 8117219 12673410 12441864 10088393 7421583 3622545
13619 3622545 -1253763 -3917551 -1863352 1408848 -753015 -9167242 -16801609 -18042973
13611 -18042973 -15646145 -14531366 -13271900 -8330851 -3361846 -5251474 -11614900 -12325986
13603 -12325986 -5659632 -2595774 -9738931 -17442526 -13561895 -2078631 2768373 -2589517
13595 -2589517 -7430149 -4082121 1868174 2165641 -1691947 -2130025 3444127 10517193
13587 10517193 13582044 10330006 2043736 -6383555 -8504338 -2274090 6490556 9608442
13579 9608442 5443763 62538 -235955 4961819 11794761 17147794 20219974 20325274
13571 20325274 15692175 5864588 -5251432 -10713529 -6714671 2775036 9377966 9010949
13563 9010949 5629394 5230650 8114847 9732362 8264019 7558626 11129525 16290033
13555 16290033 17462185 14216944 12433151 16575791 23623939 26815586 23817088 18380606
13547 18380606 14194360 10248215 3954963 -3297352 -6786089 -4609293 -475200 978007
13539 978007 -358715 -1488356 -1844848 -3952606 -8017791 -9437027 -4468839 3535082
13531 3535082 6973195 2719457 -4890049 -9794631 -9840569 -6090764 -56524 6221823
13523 6221823 9910727 9980289 8667922 8104499 7014448 3404625 -832520 -1391728 2631919
13514 2631919 7490133 9586622 8740342 6265095 2899483 11825 186113 4244473
13506 4244473 8951574 9906100 6621065 3335124 4364599 9175448 12612141 10323004
13498 10323004 3554740 -2477658 -4778640 -5080464 -5553481 -4890337 -1005949 4596075
13490 4596075 8248467 8490931 6316606 3137269 1808512 6609360 16633441 21649899
13482 21649899 12418544 -5014678 -13923354 -7875856 1322778 379748 -9214237 -17427682
13474 -17427682 -20302033 -20086418 -16720620 -9036223 -1451789 -72295 -3341835 -4833416
13466 -4833416 -4118450 -6204773 -10844902 -12031769 -9203532 -9277681 -14634446 -18067310 -14107109
13457 -14107109 -7553387 -5366892 -6603569 -6257409 -3792446 -1886784 -883908 -37618
13449 -37618 -571921 -2293701 -816301 6534001 15449834 20363554 21564578 21099192 16361038
13440 16361038 5555995 -4190703 -3910745 3207976 4792828 -2845888 -9547998 -7093169
13432 -7093169 -1065007 -1098119 -5973396 -6050439 2350186 11879886 13539382 6665076 -1499937
13423 -1499937 -3895744 -239780 3910064 4142677 2113035 2291446 5206092 6763119
13415 6763119 3947470 -1802924 -6989753 -8902148 -6197655 -131898 4600734 4136179
13407 4136179 1149146 2149316 8110492 12402978 9909939 3660497 -251413 -252479 1235119
13398 1235119 2237094 1989696 581097 710270 6020710 14425767 17482659 10995546
13390 10995546 2206297 647426 4945158 5407235 -1958578 -11001545 -14860416 -13351534
13382 -13351534 -9900472 -6778270 -5320981 -6461295 -8917312 -9869471 -8506226 -6099404
13374 -6099404 -2707609 2106240 5203762 1933593 -5924898 -9462275 -3284040 6856756
13366 6856756 10702906 5133864 -4168317 -10346859 -10943920 -7372005 -2831380 -769011
13358 -769011 -2322233 -4555518 -3290879 1485734 4602939 1383967 -6318216 -11402834
13350 -11402834 -9443161 -3803062 -834241 -1028415 1085410 7317973 11143767 6581114
13342 6581114 -2332301 -6993077 -6707848 -8201515 -13022224 -13949722 -6768615 1822040
13334 1822040 3051492 -2476052 -7600412 -8919873 -8577478 -8401227 -7983376 -7370751 -6891243
13325 -6891243 -5255353 -2049652 -789032 -4624593 -9757185 -8525337 307055 9257307
13317 9257307 11677692 9381647 8391614 10427987 11800459 9155595 3493303 -1355233
13309 -1355233 -2641582 -1004931 286410 -1762731 -7362256 -13907220 -18004687 -17687052
13301 -17687052 -13577378 -8204114 -3434356 1246569 6592871 10405899 9454898 4926314
13293 4926314 2030311 2416190 1344282 -4105334 -8269416 -4065338 5628879 10593109
13285 10593109 6842764 772010 -1451884 -1796756 -4286471 -6797683 -4526884 1316085
13277 1316085 4190215 1424144 -1819991 819001 9074787 16732774 18806565 16031521
13269 16031521 12160335 8773586 4762519 363318 -1440166 790932 3746126 3391888
13261 3391888 736567 136573 2545851 4376326 3498831 2473448 4169007 7252397
13253 7252397 8318040 6608631 4520962 4341970 5759720 6090380 2847522 -2915259
13245 -2915259 -6529776 -5075482 -2000508 -3116733 -8298371 -11460899 -9524615 -6432925
13237 -6432925 -6040282 -6069617 -3204488 -31394 -1242316 -5075939 -4635999 2179727 9252528
13228 9252528 10276509 6526518 4448349 7533719 12509248 13074469 6779994 -1693228
13220 -1693228 -4805821 -439450 5415581 5832925 1418765 -882762 3279493 10742643
13212 10742643 14974403 12803305 6716118 2464909 4551903 11961970 18034080 16669072
13204 16669072 9131604 2583547 1396261 2603833 1452812 -1131853 270034 7514439
13196 7514439 15021699 15449476 8115575 51875 -1551387 3539789 10167655 14894647
13188 14894647 18518653 21492116 20956625 15076846 7507400 3706276 4211406 5430524
13180 5430524 6110484 8379063 12101431 13047700 8609306 1740109 -2940397 -4183799
13172 -4183799 -3602816 -3146276 -4783053 -9292943 -13289057 -11391519 -4341787 -553077
13164 -553077 -5014749 -10837688 -8343721 492482 5036821 2453816 1368619 6677334
13156 6677334 10504551 4722725 -4985975 -6739426 -292703 2746907 -3567095 -11127462
13148 -11127462 -10064846 -2133117 3558854 3648776 2978917 5358189 7775956 5416422
13140 5416422 -1121445 -6302807 -6321013 -3159524 -1508038 -2852417 -4242431 -3165473
13132 -3165473 -1656705 -3432620 -7802123 -9520257 -5635953 71654 1523598 -2189066
13124 -2189066 -5962452 -4983746 -155328 3186572 1210503 -4190499 -7252519 -4429392
13116 -4429392 2141423 7866383 10806488 11488408 9346807 3680484 -1821000 -863672
13108 -863672 6695722 12550615 10227511 3817534 1664401 4523133 6012425 3065232
13100 3065232 -798022 -2649085 -4130534 -6705808 -8404465 -7598784 -5743272 -4370193
13092 -4370193 -3279575 -3178486 -5554591 -8160161 -5902952 941291 4812720 1145909
13084 1145909 -4491828 -4496364 170541 3491940 4508375 6540967 8740760 6498938 -60302
13075 -60302 -5429462 -7196635 -8269349 -9603038 -8082110 -4129437 -4092256 -10452872 -15526299
13066 -15526299 -10833326 950993 9343742 9253316 5254305 3461285 4357706 4698503
13058 4698503 2926989 868001 1357879 4997672 8946491 9391701 5504797 -156512
13050 -156512 -5196713 -9073448 -10858730 -8863218 -4481399 -2870976 -6458044 -10579887
13042 -10579887 -9637687 -5421222 -4588095 -9013851 -13661321 -14095509 -11411184 -8651495
13034 -8651495 -6340621 -3379975 328248 3795594 5944726 6093981 4611614 2540354
13026 2540354 -633505 -6704626 -13871340 -15474603 -8226016 1468438 5851597 7613353
13018 7613353 14536303 24068707 24947543 15743470 8759517 10237076 9955605 -221239
13010 -221239 -9837525 -5542002 5960183 7333053 -2058595 -6227336 810881 6497260
13002 6497260 1251002 -7824126 -11091059 -10009767 -8579784 -3684717 6346472 13809422
12994 13809422 12441190 7760496 6989461 7117437 3543243 2076342 9280676 17389957
12986 17389957 13495616 177859 -7602268 -4652819 -249124 -566244 -827067 2408279
12978 2408279 4333788 1644162 -2034898 -4799570 -9859459 -15644109 -13357496 -536611
12970 -536611 12650518 17177020 16075942 14914949 11251767 2529946 -4404780 -2756389
12962 -2756389 1637787 -1335447 -9560559 -12133227 -6661354 -1691811 -2646416 -6000215
12954 -6000215 -7997367 -9323119 -9603098 -6324902 -1515353 -1147315 -5037986 -5243558 1793437
12945 1793437 8908487 8796927 4403893 2828691 4063916 2853152 -1298773 -3332218
12937 -3332218 -1228124 1056592 405367 -855004 474795 2988754 2880467 -440676
12929 -440676 -4021683 -5637076 -5375626 -3330504 839030 5146294 5445941 490294 -5840808
12920 -5840808 -9757343 -12098829 -14359655 -13453050 -5835079 5019908 11482679 11532898
12912 11532898 9454013 7239664 2783882 -2687506 -3919706 -891930 -257040 -3857139
12904 -3857139 -4723566 380619 4043198 1372687 667191 10327054 22680119 23724319
12896 23724319 14257229 7620682 8716626 9482447 5616403 3564999 7137327 9520004
12888 9520004 4573950 -3304467 -6629100 -4773372 -1245342 2399485 5018614 4226881
12880 4226881 854516 -429861 1189244 478628 -4164671 -5701285 847749 8482493
12872 8482493 6483799 -4627463 -13286641 -10866752 -463812 7620009 5837836 -4177371
12864 -4177371 -12959781 -12389207 -4450014 1739197 1600908 -1010208 -2228282 -3695415
12856 -3695415 -6648889 -7287716 -3180722 995848 -129643 -4436409 -6073972 -4215280
12848 -4215280 -2765236 -3799640 -5893634 -6806290 -4234561 3192188 12256790 16118685
12840 16118685 12589875 7411471 5657789 5189515 3412322 4102083 10041657 14403274
12832 14403274 9222859 -592189 -2085150 7500225 17002394 16981806 10257841 4447124
12824 4447124 1952968 1293341 2166570 4422019 5871640 5310512 5313907 8686344 13637106
12815 13637106 15255688 11418945 5613375 3514874 6885638 11246202 10687941 4804216
12807 4804216 -1369602 -4403231 -5727182 -6462474 -3671454 4613737 14256643 19269700
12799 19269700 18659730 15209128 10432954 5207551 2464361 3885654 5863583 3845073
12791 3845073 -1054423 -4716205 -7143865 -11050302 -14758922 -13080741 -5664469 1044210
12783 1044210 1566467 -2500906 -5053530 -1956984 4930929 9182409 7060844 3614499
12775 3614499 6919869 15227931 17296186 9088744 1112294 2315323 6042696 2335606
12767 2335606 -4139894 -2167122 5616431 5985810 -3317983 -10793235 -10237109 -7727478
12759 -7727478 -7615404 -5904636 -1210253 844114 -1506590 -2904185 -2299368 -5330987
12751 -5330987 -11310532 -11055486 -2897793 2662599 641551 37804 6676500 11510231
12743 11510231 6172925 -2595403 -5526604 -6098440 -10800968 -14999293 -12122222 -7345330
12735 -7345330 -7848140 -8324998 -1537502 4913556 -368563 -10976839 -10696387 406905
12727 406905 6630479 2216879 -2305893 -500100 1426291 11491 1548616 8126627
12719 8126627 11751605 8973586 7787026 12820730 16352292 12152721 6686208 7464907
12711 7464907 10353175 8087481 2829550 402963 -631074 -4194870 -7269016 -5407259
12703 -5407259 -2561390 -5006164 -9334976 -7263774 -160537 2154209 -2938229 -6726863
12695 -6726863 -2952202 2977486 2610211 -3884881 -9281380 -8813862 -4068686 648992
12687 648992 2594911 1914896 757911 1070364 2584844 3325608 2215278 325386 -724341
12678 -724341 -540952 708016 3894274 9954457 16575134 17899605 10604509 104401
12670 104401 -3179695 4218847 13695894 14429763 5889917 -2974127 -4752256 509052
12662 509052 8507983 14435510 14093014 6742005 -2404568 -6871903 -6475974 -6028792 -6938258
12653 -6938258 -5639533 -835028 3816438 5862511 7118845 8475178 7406194 3374003
12645 3374003 112297 -669418 -2307114 -6143946 -7085679 -1160425 7144896 10530038
12637 10530038 8218976 4620715 2376675 2205146 6025344 13633487 18669857 14831793
12629 14831793 5165122 -1117433 -679866 1096884 -547730 -3603220 -3893645 -916482
12621 -916482 2872143 5116601 4519172 1598011 -819934 -613770 146398 -1931823 -5422835
12612 -5422835 -5183521 -336626 3494602 1965014 -1944490 -2417979 1679342 6696181
12604 6696181 9246435 8310861 4074544 -1894575 -5896335 -4724520 244890 3538008
12596 3538008 1115363 -5449171 -10813179 -11241757 -7677762 -3867769 -2246664 -2322668 -2927244
12587 -2927244 -4553935 -7950557 -11060163 -9850167 -3244384 4616941 8859292 9406090
12579 9406090 9726652 10855828 10094657 6455854 3604217 4484751 5967614 3362173 -1243709
12570 -1243709 -900995 5311522 9251146 4386164 -5455278 -11926150 -12499314 -10156518
12562 -10156518 -6485532 -1279744 3130992 3631936 1697468 1396094 2897126 3629039
12554 3629039 4424504 7471260 9379232 5198883 -507855 2760664 14070431 18591627
12546 18591627 8523920 -4118207 -4623465 3440467 6000321 966040 -858652 4690819
12538 4690819 8653742 4409597 -2015614 -2265307 2228027 4527332 2854986 930816
12530 930816 1088619 2331260 3439356 3848967 2461509 -971365 -3685265 -2184027 2719299
12521 2719299 5515357 2466593 -2581961 -1707865 6689095 14008028 11480447 2034896
12513 2034896 -3324343 -429012 3956318 4669551 6354597 13802944 21458448 20640719
12505 20640719 12446779 4940430 947123 -2506137 -5366139 -5089575 -4672558 -9657628
12497 -9657628 -16881392 -16938824 -9580493 -5570238 -9497625 -11749694 -3885911 7646470
12489 7646470 11544689 8085604 6152749 8626942 10281669 8042309 4712727 2711381
12481 2711381 1169427 186615 2557911 9542017 17938344 22346178 19133833 9325067
12473 9325067 -906084 -4674922 -1342437 3208138 4793120 5521527 7371398 6134287
12465 6134287 -2610068 -14598537 -20309551 -16034353 -6143920 4250766 12736199 16327986
12457 16327986 11991944 2560673 -3494280 -1514890 3729783 4795292 886012 -3009292
12449 -3009292 -4342979 -6055834 -10611963 -14212468 -10349274 763419 9787034 8457687
12441 8457687 437644 -2837630 2543657 7488166 2557286 -9046533 -16235008 -14420882
12433 -14420882 -9200117 -7263142 -9748310 -14689158 -20229142 -23462125 -20339464 -9671207
12425 -9671207 4411365 15410424 19017957 15088966 7154921 89694 -3550000 -5000850
12417 -5000850 -6197310 -6630642 -5266152 -3741471 -4263803 -5176874 -2285784 5187478 12874455
12408 12874455 15936531 13609048 9484912 8918641 14652198 22623808 23967886 14278255
12400 14278255 -866577 -12633274 -18352330 -20053679 -17376767 -9019388 662506 4596853
12392 4596853 2631675 908132 1665363 1859317 2117805 6806633 12832322 9859406 -2745200
12383 -2745200 -10309542 -2809169 9209205 9767380 977818 -1870583 5706271 12749199
12375 12749199 11383169 6054683 2172232 -1706135 -6018403 -5837054 -320758 3109793
12367 3109793 839713 613888 9012441 19044484 19954228 13651702 10457987 11987446
12359 11987446 10057453 2008607 -4552771 -4542194 -2618381 -3635468 -4999859 -3989086
12351 -3989086 -4439204 -8744845 -9969184 -1447848 9814083 10073527 -1505260 -10620597
12343 -10620597 -7589905 157866 493435 -6203719 -10020913 -7333106 -4855091 -8327445
12335 -8327445 -14640817 -17335833 -14672484 -9347709 -3998283 -398721 -564936 -4586208
12327 -4586208 -8035449 -5376986 2892328 9223192 7446615 888311 -1059710 5089891
12319 5089891 11775475 9950971 1335586 -3661391 164886 6830190 9038603 7816850
12311 7816850 7371091 5787183 -982106 -8517978 -7234136 2775482 9837896 7228588
12303 7228588 2444516 3938407 7261932 3906035 -2477449 -1117547 7152831 9800300
12295 9800300 2814383 -2400371 2037236 6993040 1634069 -7272117 -4915989 7358025
12287 7358025 12433014 2805244 -8383225 -7001839 2835990 7730244 4955990 2688887
12279 2688887 4404868 4510500 -22722 -3328890 575700 9165367 15403173 15875115
12271 15875115 11617487 4921455 -863498 -1642967 2962136 7491628 6906136 3278392
12263 3278392 2184739 3881202 3090061 -2306180 -7324896 -6551618 -1254666 2585929
12255 2585929 1279936 -3461603 -6833996 -4882201 2257104 9610935 11482860 7840844
12247 7840844 4848118 7064058 10915947 8905940 -528130 -10673718 -14303272 -10662678
12239 -10662678 -3772332 2915541 7546270 7897179 2521972 -5843267 -11239404 -10413146
12231 -10413146 -6021584 -2837737 -2857480 -5792889 -11764743 -19793157 -24786068 -20858357
12223 -20858357 -8942286 2726012 7755735 7845941 7390932 5872219 555993 -5738920
12215 -5738920 -6230510 -21343 5671367 5415209 2529525 2563627 4220545 2198982 -3245265
12206 -3245265 -5802867 -2472079 2030330 2310235 -445468 -1444887 368090 1931456
12198 1931456 1650654 1094850 1004203 -149783 -2044079 -949584 4441780 8757707 6337986
12189 6337986 291182 -780966 4565244 7959476 4174065 247056 5612577 17467106
12181 17467106 23765731 19233677 10504282 5034615 2965747 2324379 4397923 9017454
12173 9017454 10781802 6481523 2025577 4840475 11904471 13013742 5591959 -1176442
12165 -1176442 1149383 9663010 15213024 13787369 8971248 5575462 4653128 4238428
12157 4238428 2320999 -1358820 -5339021 -7857276 -8168266 -6228603 -1984638 3541793
12149 3541793 7109352 5631863 196364 -4346999 -4686241 -2315994 -760206 -1282612
12141 -1282612 -2516253 -2907248 -2045973 -306159 1653740 3337221 5026005 7691102
12133 7691102 11940468 17137456 21312004 21812218 17219669 9702888 4215658 3548605
12125 3548605 5185161 5069561 3008215 1223257 -1010334 -6397948 -13055770 -14330534
12117 -14330534 -7551850 1325014 4879889 2620730 -927083 -3273995 -5207828 -7299491
12109 -7299491 -9166809 -10882436 -11937967 -10384004 -5967163 -2021816 -881143 114641
12101 114641 3892811 7572905 6546174 2733504 2421506 6565392 9849912 9597129 8756973
12092 8756973 8887669 7151751 2531609 -1682259 -4438042 -9092509 -15361122 -16364378
12084 -16364378 -9178111 -1714533 -2171009 -7175155 -8287418 -5514841 -5092633 -7165452
12076 -7165452 -6294196 -3367572 -6164595 -16155652 -24200111 -22675250 -13895010 -3047017
12068 -3047017 9055199 21034358 26111496 19556148 6957534 -1425111 -2259104 -121297
12060 -121297 653231 -63238 -1051016 -2083307 -3543543 -5974315 -8878774 -8975676 -3012842
12051 -3012842 5771823 8546671 1823233 -6779607 -8150158 -2995191 1665062 3284091
12043 3284091 4419404 5409759 3854762 467284 -1042874 525197 3909328 9365745
12035 9365745 16348702 19144862 12764936 2536335 -641478 4974066 10548096 10726541
12027 10726541 9361799 8969905 5299306 -2525455 -6643668 -2623788 1771796 -1129687
12019 -1129687 -5439649 -1326648 7432286 8151437 -535847 -5919225 -275217 8619408
12011 8619408 10428195 6734394 6218807 11167835 15710465 14979433 10104177 4348798
12003 4348798 -1156164 -6211755 -8648864 -5663326 1289154 5317445 1067805 -7392862
11995 -7392862 -9754409 -2059424 8013681 11203342 7701596 4018230 3088296 3441940
11987 3441940 4909526 7833012 8522114 3545338 -2261428 -1031817 4356387 2061342
11979 2061342 -9879319 -17271998 -9560569 3060245 2808383 -10754753 -20815596 -16849429
11971 -16849429 -6238991 -123688 1588941 4976358 9618741 9957679 5787947 2990374
11963 2990374 3819626 3644295 -463106 -3808749 -868962 5943681 9363758 7047007
11955 7047007 3048439 543938 -1072290 -1443003 1862879 7229952 8037361 2116916
11947 2116916 -3498142 -3064377 -2007103 -8212085 -17528432 -18662751 -11405080 -7797792
11939 -7797792 -12466933 -14088612 -3518316 9816636 10257247 -1619292 -10645532 -8680166
11931 -8680166 -3066275 -2856820 -7146605 -10667307 -12595974 -14523623 -15434099 -14164672
11923 -14164672 -12958848 -13566063 -12946555 -8039732 -2447245 -2576881 -8035373 -11802314
11915 -11802314 -10593413 -9053662 -10920047 -11403037 -3916688 8072342 12539675 3619173
11907 3619173 -9962949 -14380099 -6112093 5534917 10156118 6860997 2521398 2266606
11899 2266606 3985421 1900389 -5833307 -14061009 -15563190 -8692321 933707 6364149
11891 6364149 5427596 697347 -4057599 -5760448 -3008558 1812484 3188354 -1256986
11883 -1256986 -6446820 -5672236 360811 4938294 5091231 4045739 3280978 -936577 -9806106
11874 -9806106 -16800283 -15371803 -7884589 -1753928 161569 131696 -525975 -1883586 -1386657
11865 -1386657 4034296 11842144 15728731 14213979 12058710 12267799 12339615 10251025 8564778
11856 8564778 9554706 11031877 10594864 9752715 9756293 7581756 1544301 -2536456 2050918
11847 2050918 11498949 14598177 8297046 2212444 4094858 8328426 5527702 -2137808
11839 -2137808 -4680144 -996342 -760341 -7602946 -11364230 -3943011 5557799 1977147
11831 1977147 -13548478 -23683377 -17522863 -2812271 7208316 9663110 9206079 7109106
11823 7109106 1504506 -5240493 -7525986 -4415835 -809455 -714071 -3648810 -7357520
11815 -7357520 -9925462 -9322461 -4796130 838398 3293750 1319138 -3104863 -7860544
11807 -7860544 -10877236 -8874422 -619305 8807069 11694397 6463223 -1079665 -5726485
11799 -5726485 -7861024 -9436316 -9528139 -6442230 -1108713 4119737 7857498 9117874
11791 9117874 6788680 1745913 -2458753 -3080948 -1033610 1202780 3064145 5723737
11783 5723737 9413785 12298573 11896911 7627558 2407784 599278 2824208 4407089
11775 4407089 1721404 -1603319 831719 8288991 13050125 11376384 8434023 9507334
11767 9507334 11552628 7983509 -1510010 -10569151 -13815401 -11240878 -6479238 -3903254
11759 -3903254 -5972488 -10405653 -11357477 -6296797 -170332 463982 -3967205 -6961149
11751 -6961149 -4688515 -110031 1818318 -87785 -2988522 -3359938 -57795 4403655
11743 4403655 5599965 1701203 -3894976 -5736204 -1778664 5468968 12474655 17708377
11735 17708377 21353725 23220705 21355595 13605683 2226742 -4309555 1293217 14657132
11727 14657132 21639985 14184862 -29905 -8210516 -8379042 -8231113 -11299434 -12902585
11719 -12902585 -9869693 -5941123 -5053606 -6078748 -7450482 -10822966 -15788733 -16307904
11711 -16307904 -8166496 3248285 8322997 4750834 -1119078 -3175196 -881580 3735266
11703 3735266 9164089 13125486 12323682 6074628 -1720731 -6088872 -5521383 -2195796
11695 -2195796 1033710 2843417 3569335 4178337 4947546 5120046 4519850 5180086 9625746
11686 9625746 16741908 20930362 17274319 7288319 -2064339 -5391258 -3647504 -1517683
11678 -1517683 -1752891 -3624802 -5613143 -6764034 -5264672 1078207 10941281 18332279
11670 18332279 18288943 12837319 8490222 8244249 9048300 7341895 3736785 934485 18525
11661 18525 952359 4333063 9772661 13980556 13635111 9868260 7060692 6803137 5724312
11652 5724312 719830 -5586559 -7018659 -1448172 5716646 7078608 1708148 -3937660
11644 -3937660 -4393081 -2330449 -4509351 -11514952 -15772425 -11288080 -1644799 4716996
11636 4716996 4405417 466132 -3976346 -8481007 -12255003 -13554458 -13073779 -13390188 -13646670
11627 -13646670 -9477434 -516811 6705562 6860756 2788178 340517 188095 -134514
11619 -134514 338766 3708680 6564385 3516207 -2949286 -4267253 1243621 5346362
11611 5346362 2706031 -1255372 -65691 3462314 2966816 -1266117 -5036974 -8279785
11603 -8279785 -12334792 -13161434 -6565961 2033561 2897214 -3404812 -6298989 -909825
11595 -909825 6263909 9280386 10179003 10664228 6569341 -2940774 -9327494 -5954644 1302927
11586 1302927 3335379 1965168 4976194 11065065 11090579 3539041 -2086909 656844
11578 656844 6660523 8299444 5849139 4583298 6640319 10145415 12994275 13719049
11570 13719049 10952119 5321512 608513 642124 5513186 11819190 15955325 16923877
11562 16923877 16676490 17306095 17454235 13624033 6594793 3082261 7213307 13471293
11554 13471293 13622791 8393256 5458179 7001804 7349801 3712639 760662 1564627
11546 1564627 1861564 -1994590 -5980348 -4904109 -685051 1815660 2959322 6011052
11538 6011052 9782494 10026293 6511615 3083963 1610916 489689 -1759409 -5280634
11530 -5280634 -9781192 -13041662 -10903323 -3100982 3412716 2116824 -4354117 -8703067
11522 -8703067 -9644412 -10950613 -11612320 -6097147 4369606 9705353 4136007 -5282342
11514 -5282342 -7957234 -2321427 5561299 11078828 12887835 9104590 -1176742 -12711951
11506 -12711951 -16293343 -8405270 3942019 9857504 5183890 -4197236 -9055702 -6068551
11498 -6068551 140700 3958392 5631079 9140411 14984083 18782296 16917057 10079447
11490 10079447 1257453 -5929109 -7134911 -979364 6181427 5498980 -1845234 -4305873
11482 -4305873 3378213 10504152 4854431 -9094174 -16413253 -12790878 -7855623 -7871209
11474 -7871209 -7487729 -2236570 2189620 186615 -3011791 154504 6117030 5087242
11466 5087242 -3384481 -9345871 -6778647 -736966 1206617 -2217599 -7802887 -12651569
11458 -12651569 -14407687 -11459907 -5880972 -2507525 -2591167 -1834589 2887245 8521922
11450 8521922 10412529 8430281 5325200 2352708 489216 2808823 10346580 17346385
11442 17346385 16449933 8664566 2908472 4521191 9015799 9499706 6186518 4796679
11434 4796679 7734881 11106393 10663573 7442268 5638624 6428658 6502484 3150156 -1649915
11425 -1649915 -4347907 -5335594 -7813480 -11584928 -12510771 -9436352 -6876656 -7823241 -8356155
11416 -8356155 -3918356 2736564 5478235 3944376 2389999 1293990 -2583085 -8234353
11408 -8234353 -10104153 -6645767 -1991292 2086762 7953070 13732182 12181489 2517958
11400 2517958 -5155798 -3775055 -120168 -3669006 -11276245 -13020081 -8747438 -7337039
11392 -7337039 -11161876 -12783942 -8156181 -2689553 -1288804 -1362327 310132 1583289
11384 1583289 552932 488900 3856384 6844551 5299131 1507160 -455310 -1842459
11376 -1842459 -5354366 -7663253 -3472569 4363007 6691608 1091269 -3937715 -820317
11368 -820317 6515153 8482972 3006748 -2520404 -1858092 2473454 4195078 2527516
11360 2527516 2624312 7354749 12526246 12205601 6521828 1455005 1722266 6419693 11442812
11351 11442812 13602428 11954770 7652729 3861038 4149299 9297287 16047866 19688365
11343 19688365 17806157 12015895 6832980 6098349 9091458 10808591 7569765 1266508
11335 1266508 -3939798 -7455566 -11335760 -14703708 -13913141 -8824406 -4210167 -3243489
11327 -3243489 -3784046 -3284621 -3279420 -5941095 -9527754 -10650497 -8570814 -4353630 1470013
11318 1470013 7210583 8987108 5444811 1124532 787408 2498180 1275649 -2134254
11310 -2134254 -2152144 2339469 6032464 5900780 5739371 8912105 11831728 9540157 4500722
11301 4500722 4120219 10342685 16913814 17947434 14832666 12169600 10122536 4897409
11293 4897409 -4096192 -11799230 -13525720 -10411320 -6818089 -4844559 -4339911 -6231771
11285 -6231771 -11362883 -16435884 -16091086 -10605518 -7291400 -11419857 -18869459 -21079953
11277 -21079953 -15136925 -5586929 2113465 6201939 7348225 6637208 5724373 6489954
11269 6489954 9086856 11159387 9703610 3818190 -3827334 -8315389 -6768867 -1860246
11261 -1860246 678254 -1194700 -3619927 -2432589 1458990 3981192 2887468 -1145279
11253 -1145279 -6204798 -9697250 -9242563 -5311087 -1248548 914750 2160060 2636516
11245 2636516 291923 -3908570 -4276365 1432415 6557715 4239921 -2152340 -4393363
11237 -4393363 -2123803 -1623773 -3400045 -705415 8516582 17342936 20210812 19421145
11229 19421145 17967915 13929790 6976031 3322002 7568711 14473324 15436873 9942136
11221 9942136 4650588 3738366 5797344 8337404 9716730 7691911 1409553 -5268456
11213 -5268456 -6998782 -3921217 -1556117 -2994751 -4487753 -354136 9554572 18713831
11205 18713831 19881315 11951685 1010188 -5659249 -6298009 -4743493 -4928709 -7380239
11197 -7380239 -10301700 -11157128 -7607718 -371012 5018079 3335866 -3318897 -8073658
11189 -8073658 -8755221 -9039397 -9713710 -6491574 665807 4110464 -282002 -5391625 -3163117
11180 -3163117 2980898 3840014 -1643879 -6608855 -7895440 -8924138 -11580175 -12732956
11172 -12732956 -9516408 -2568250 6006792 13230918 14915231 9858063 3153597 184966
11164 184966 -858529 -4710418 -9542585 -9002900 -2634679 3087507 3674835 -370586 -8245650
11155 -8245650 -18099991 -22146055 -12647011 5057541 14850596 8875932 -3432910 -8803556
11147 -8803556 -4974161 1798878 6496774 7488132 4960892 1929741 1848424 2342466 -2184533
11138 -2184533 -9064458 -7449940 5054722 15380765 12556889 3823843 2957200 9084610
11130 9084610 9429561 -61280 -9367454 -9873017 -4327322 984221 5179123 10077576
11122 10077576 14525150 15137854 9746115 -1007767 -12562187 -17522323 -12253497 -2376036
11114 -2376036 2608573 217523 -3512084 -2934579 1482772 6289501 8974590 8046532
11106 8046532 3621570 -961944 -1693886 1125113 3388483 2652631 32457 -2756607
11098 -2756607 -4605851 -3841703 220994 4907931 7065587 7602142 9416979 12176043
11090 12176043 13593543 14255382 15824272 16112528 12366994 8201718 9724084 15061897
11082 15061897 16014589 10910052 6939771 7498151 6394253 -1189810 -10342636 -14337193
11074 -14337193 -13598509 -11020475 -5238246 4633721 13322136 15623517 13698225 11597276
11066 11597276 7613138 -449962 -7423345 -7258930 -3661612 -4419478 -7652855 -4548930
11058 -4548930 4922956 10594984 8172587 5429862 8132013 10304030 5506617 -780806
11050 -780806 658521 7579616 9316108 2929711 -3279431 -2998560 37935 292979 -317929
11041 -317929 3371225 10703499 16159070 17268698 15986348 13143527 7762046 2784673
11033 2784673 4756741 13924359 20111650 14546723 2477787 -2979896 2082014 9174240
11025 9174240 11181968 10467159 10567984 8716005 2584629 -2469857 -803892 3334888
11017 3334888 1403839 -6191022 -10952952 -9497435 -7295169 -8199366 -8390875 -3907963
11009 -3907963 2304319 5110057 4397953 3440718 3400326 3548988 4687081 8237887 12588833
11000 12588833 13447639 8397493 -145264 -6838716 -8207816 -5735985 -3648006 -3479666
10992 -3479666 -2962622 -1487793 -2960683 -9224255 -13861410 -9033489 2540200 9533890
10984 9533890 6634947 163772 -2698173 -2844757 -3788381 -4247604 -1671034 2048948 4108595
10975 4108595 5841720 8700988 9388879 5329972 1314705 3421687 8961281 10290259
10967 10290259 6984152 5687851 8084751 8179698 3583853 668476 3960333 7571922
10959 7571922 3479782 -6228751 -11918715 -8912842 -1615479 3878972 5891821 5355420
10951 5355420 2547431 -2065361 -6192690 -7501484 -6505491 -5915785 -6812567 -6844403 -3423442
10942 -3423442 2198409 6212341 7540248 8842630 11175645 11394712 7764852 4382873
10934 4382873 5116051 6144388 1401855 -5945582 -6033136 2268300 7468823 1814073 -6124845
10925 -6124845 -2735262 11550184 22838697 21394981 10730310 -543538 -8104868 -11266799
10917 -11266799 -9618371 -4449280 18084 433952 -2205287 -4734704 -5652678 -5253881
10909 -5253881 -3870876 -1768150 544258 3231381 6944653 10347519 9451278 1760792
10901 1760792 -9280498 -16281822 -15444455 -10963099 -10136389 -14118636 -16023426 -10162327
10893 -10162327 -830861 2497378 -1806612 -5218651 -1817820 2966857 1429602 -3789853
10885 -3789853 -3755618 2811427 8212598 8106484 6548537 6997789 6651321 3560406 2051091
10876 2051091 5492516 9292551 7555033 2833616 2378943 6673269 8484206 3584680
10868 3584680 -2898065 -2638109 5916190 14953714 14437198 2887318 -9065330 -9132751
10860 -9132751 1809065 10011513 6099637 -3851195 -8769791 -7758670 -7490467 -9395792
10852 -9395792 -9132681 -6674034 -6610211 -8013236 -4027389 5909114 12611646 10174554 4645174
10843 4645174 4346238 7948381 8284949 3256932 -3215995 -7652792 -8738451 -5534072
10835 -5534072 319857 2788496 -2413302 -10920130 -13992962 -9030490 -1322776 3910137
10827 3910137 6372995 7630334 8112102 8464579 10001168 11923848 10816750 4938773
10819 4938773 -2449512 -5662008 -2145363 4995739 9856941 9447399 6685851 6637266 9687342
10810 9687342 10860061 7122569 2324485 1882475 4825342 5266169 1001475 -3605720
10802 -3605720 -3901477 -514647 2664108 3166327 675578 -4760012 -12395923 -18892713
10794 -18892713 -19217850 -11300915 453796 8178299 8357582 5436821 5828211 9774657
10786 9774657 12502255 12517203 13375978 15782069 13916916 4155724 -6876047 -9107184
10778 -9107184 -2004055 5230763 6010865 3189035 2642110 5296027 8014317 8751415 7743213
10769 7743213 5402180 1649619 -3021336 -7143847 -9035827 -7912832 -4535928 -381320
10761 -381320 3994095 8517307 11171073 8524397 662092 -6600667 -7322139 -1974925
10753 -1974925 4194909 7802164 9189369 9028541 6961978 3530430 278083 -2210019
10745 -2210019 -4060014 -4597906 -3694405 -3546659 -5911692 -8461050 -7428605 -3247542 154412
10736 154412 1237661 2129813 4107722 5685931 5564037 4109731 1834361 -317696 451260
10727 451260 6023420 13228772 16458167 14629398 11814524 10969341 11032016 10278645 8440852
10718 8440852 5326999 1199960 -1792882 -2531497 -4093265 -9102137 -13481392 -11132447
10710 -11132447 -3600347 2266289 5194778 8973608 11350108 4870891 -8450799 -15240932
10702 -15240932 -9525716 -2739174 -6916609 -16981975 -19449387 -11699621 -2234230 3012256
10694 3012256 4048195 257432 -8887612 -18341285 -22103387 -21900614 -22649299 -21562688
10686 -21562688 -12114846 2048001 8664903 4308666 -187931 4409147 13447995 17018234
10678 17018234 13483233 8499271 5922694 5533465 6063683 5333377 362496 -7833908
10670 -7833908 -12071692 -6697541 3856045 9078741 4837866 -2477451 -5138669 -3436615
10662 -3436615 -3216126 -6482293 -8562742 -5173788 1175559 4583760 3670000 2309999
10654 2309999 2797375 2625280 -308549 -3076974 -1393124 4197197 8683045 8105222 2843437
10645 2843437 -3362550 -6195363 -4057290 51447 1307240 -1710561 -6416750 -10458931
10637 -10458931 -13137257 -12963433 -8961980 -5034239 -6769200 -12153851 -12588549 -6104926
10629 -6104926 -1412248 -3942176 -6693302 -2434760 3503681 2977802 564956 6370383
10621 6370383 17189153 18979772 7987441 -3687807 -5751395 -1261566 2876180 6082013
10613 6082013 9445711 9794155 4934936 -1073419 -3373617 -2634730 -1860566 -1168573 467077
10604 467077 1963745 1996805 1290368 869218 737380 1258883 2556488 2400372 -927649
10595 -927649 -3611762 383508 10044020 16845850 15097657 7890981 1649490 -254182
10587 -254182 2363569 7284800 9788242 7005611 2823183 2802188 4713643 1647630 -5403603
10578 -5403603 -7395612 -1605294 3713756 2935747 1538879 5046076 8497410 5096122
10570 5096122 -1475373 -2515360 2326054 6174258 6907413 8933135 13009829 12747083
10562 12747083 4645731 -3917608 -2308411 8948867 16892757 12200295 2487372 2880370
10554 2880370 14535918 22225076 16349622 6405824 4860563 8329374 7093522 4471354
10546 4471354 10186653 19504830 17809902 5509210 -213382 8652332 20465192 23789464
10538 23789464 21227347 17789367 11713268 4335317 4024926 11726992 16118637 11446993
10530 11446993 7056746 11072263 17942893 20541562 21070153 21348495 16343627 6619977
10522 6619977 3024349 9416283 15174210 14089978 14586797 21108214 23367687 16289850
10514 16289850 11855433 17020389 19233894 9910055 2358269 8287214 16690012 15907351
10506 15907351 15643150 25060431 31159523 23878685 19746877 32588289 44778749 39122049
10498 39122049 33244197 45769159 57015050 47681633 45587038 77888696 108411406
10491 108411406 95711392 86300947 151276465 234784976 184451349 -29030058 -232161052
10484 -232161052 -258675925 -152622275 -75647261 -82021367 -93832990 -61016832 -27462045
10477 -27462045 -33338333 -50612703 -44747314 -29564198 -28056739 -30765385 -23375928 -15811494
10469 -15811494 -18114711 -19831997 -14122407 -13152877 -22086008 -25659906 -16413650 -9099290
10461 -9099290 -12107769 -11901142 -1614522 2026520 -11596515 -25268093 -21215405 -8176047
10453 -8176047 -2193043 -785135 4229411 6817146 -159009 -7803606 -6279967 -2600842
10445 -2600842 -5628643 -8277896 -3120478 -728369 -11862913 -24522116 -20868164 -6783066
10437 -6783066 -2235599 -9866305 -15149419 -12434379 -9329338 -8211226 -3764988 2121244
10429 2121244 1671668 -2800198 -1648614 3316631 180756 -11609631 -18296367 -13571255
10421 -13571255 -7194649 -7115714 -8116328 -5024200 -3784342 -10500293 -19697885 -22723017
10413 -22723017 -20349792 -18375899 -16509086 -10583002 -2514451 574426 -3017512 -6387556
10405 -6387556 -3214578 4023897 7746223 5199310 1166994 149392 -396108 -5195374
10397 -5195374 -11920083 -13123152 -7666703 -3128420 -4331666 -6675998 -5194879 -3056017
10389 -3056017 -4612849 -6398969 -3476550 -118091 -4506626 -14971865 -20888629 -16995450
10381 -16995450 -8598787 -2195903 1338473 2994682 2048703 -1431189 -5257057 -7680680
10373 -7680680 -7879540 -4806904 26932 737308 -5558750 -11242171 -6118668 7411487
10365 7411487 15845377 12389985 4163539 -967272 -4863800 -10933068 -14417330 -9507389
10357 -9507389 -611761 2759633 -269311 -2126489 -24438 -227788 -6848188 -13677234
10349 -13677234 -12102474 -3031792 4551012 5414823 3179079 2867809 3194119 -292006
10341 -292006 -7011786 -11093793 -9420835 -5703495 -4692123 -5555800 -3818125 2103987
10333 2103987 9143618 13148337 11699850 4634718 -5155729 -11795881 -10411639 -2118710
10325 -2118710 6452900 9327887 6269990 1820880 95317 843204 840871 -928076 -1321204
10316 -1321204 1889962 5156981 3481429 -1551008 -3714647 -2258924 -3064499 -7591728
10308 -7591728 -8539718 -1442912 6497011 6214860 -1501 -3010251 -405643 2858449
10300 2858449 4444303 6373099 8566630 9239552 10354329 14038270 15195101 7678769
10292 7678769 -3149222 -5691270 -662207 -1324697 -11703348 -18142975 -9824289 4336330
10284 4336330 9237335 4458857 136026 -790200 -3516673 -8790217 -11963995 -13022939
10276 -13022939 -16002288 -18680028 -14103421 -3791175 1380498 -3128579 -8399478 -5346712
10268 -5346712 2961258 8071286 8475605 8181788 7824083 5043769 1419126 1451901 4751945
10259 4751945 5802536 2858355 1274139 4990953 9394158 7517116 943725 -1403802
10251 -1403802 4087773 9905947 7647820 65648 -2591980 3196720 9807061 9277380
10243 9277380 2869158 -2990317 -5570452 -6557445 -7405147 -8557913 -10917093 -13620365
10235 -13620365 -12504519 -5589363 1814818 2931631 -972695 -3068014 -2164987 -4151390
10227 -4151390 -11232967 -17136708 -15947667 -9496721 -2684305 2455685 4131451 -1214548
10219 -1214548 -12337401 -19926380 -17086133 -9436149 -7395602 -11303417 -12548207 -8085290
10211 -8085290 -4644745 -7315053 -12228391 -13525497 -10909340 -6985094 -2976639 -688071
10203 -688071 -3267866 -9828613 -14077936 -12689592 -10425181 -11986813 -13540222 -9031000
10195 -9031000 -1379643 699874 -4382475 -9757119 -12113149 -16240949 -24215106 -27998558
10187 -27998558 -19681691 -4817342 2208300 -4292491 -14691842 -16662074 -9618826 -3135719
10179 -3135719 -3746974 -8068157 -9320942 -6494030 -4140796 -5213553 -7843740 -8970323
10171 -8970323 -7627235 -3982866 1276422 5044955 3019492 -4312323 -10042064 -8801598
10163 -8801598 -3654185 -772786 107326 3973574 10566336 13314657 9421751 4203133
10155 4203133 2330478 766739 -4909008 -11845695 -13626218 -10122298 -7486999 -8779226
10147 -8779226 -9969869 -6232829 1803930 9282955 11381490 5430604 -7520170 -20989100
10139 -20989100 -25896761 -18721612 -6041389 1866086 1742967 -879034 -606052 726485
10131 726485 -1774300 -7361013 -9407651 -4207769 3583817 6329860 2149140 -3937489
10123 -3937489 -6374298 -4385026 -1373193 -767896 -2586330 -3580338 -1369859 1777500
10115 1777500 1509399 -1860715 -2761330 1401021 5372399 3368979 -2081802 -4018605
10107 -4018605 -1481070 453357 259340 2294602 8098834 11981033 8478390 -542721
10099 -542721 -9267917 -14371277 -15187648 -11346350 -3907196 3364768 6579646 4391046
10091 4391046 -2218206 -9979938 -13469975 -9905830 -4272606 -4002368 -7568181 -5471961
10083 -5471961 4930434 13712484 12418456 6225151 5204570 9887586 13740378 14841284
10075 14841284 15739732 15227301 10340477 5076097 7136298 15513332 20240430 15992511
10067 15992511 7963242 2275521 -1740197 -6578827 -10544382 -10820448 -8006751 -4240830
10059 -4240830 -412157 2241944 1247329 -3948446 -10458208 -14904945 -15488731 -11259527
10051 -11259527 -3127523 4321309 6380085 4009292 1846495 858640 -1334658 -2891868
10043 -2891868 1989788 13062334 21524037 21290613 16540950 13902117 13397964 12529248
10035 12529248 13373780 18212123 22015101 17644646 7399668 1801247 5994538 13428776
10027 13428776 14998125 9742992 3659953 1011923 337099 -1594033 -4715185 -6095160
10019 -6095160 -4671072 -3286435 -4526814 -6126130 -3455219 3587116 9243006 8411238
10011 8411238 2329535 -3066506 -2865526 2707258 8098443 7209929 796155 -2816769
10003 -2816769 1543838 6871788 2519189 -9212372 -14079948 -5552505 5936846 8278991
9995 8278991 3607031 1628541 4076215 5039537 2412757 -597871 -3341486 -8225057
9987 -8225057 -14022845 -16555887 -15893967 -15682433 -15546354 -11652146 -5048710 -1614866 -2613570
9978 -2613570 -3108580 -1401017 -1636332 -4134393 -2137759 6412355 11999729 6216649 -4523285
9969 -4523285 -6929171 764704 7434446 5123419 -2238754 -7261525 -8319807 -7190971
9961 -7190971 -3783908 1974567 6704008 6834521 3772127 2203497 4065169 6910035
9953 6910035 7424354 4023263 -3105597 -11406021 -15645527 -11785793 -2395729 4620372
9945 4620372 4600613 1269959 1027161 4050613 4696661 313751 -4602220 -5019431 -2899287
9936 -2899287 -4271533 -9803161 -12829067 -8577088 -1770362 -897342 -6166164 -8458805
9928 -8458805 -2081411 6303012 6260165 -1616424 -6143280 -1259191 5485374 3816949 -5097365
9919 -5097365 -11196615 -9522961 -5103122 -3981262 -5532216 -5881497 -4434537 -3573002 -4215267
9910 -4215267 -4840964 -4060663 -1966136 586421 2326753 1501232 -2796920 -8624015 -11642537
9901 -11642537 -9008351 -2993742 639406 -931417 -3893378 -2524538 3196160 7533096
9893 7533096 6215177 266289 -7188957 -13243336 -13885194 -6712791 2782860 4788274
9885 4788274 -1020962 -3187421 4121749 10976558 9154037 10220900 29575209 57142531
9877 57142531 64423272 43416553 18877129 13641896 19410174 15113320 109109 -8570364
9869 -8570364 -4283685 2284237 2695627 1341416 3970736 8045146 9041719 7658235 6118019
9860 6118019 3410182 -1455244 -5271102 -3384882 4551916 12826873 13654882 4854595
9852 4854595 -5394751 -5349864 5832155 14991745 10956681 -1014230 -7127452 -3347223
9844 -3347223 2168154 2485581 -808719 -3292246 -3126948 -450200 2550751 1430710 -4905709
9835 -4905709 -10154381 -8796876 -5618317 -8479821 -14303017 -13541836 -7784530 -9563607
9827 -9563607 -22012094 -31999685 -29259022 -20452716 -16503392 -16463805 -13583251 -8808927
9819 -8808927 -7125028 -6265821 -349527 8513376 12514828 10139224 6602499 3815292
9811 3815292 -751282 -5653621 -5444287 -424701 2134850 -823791 -3157340 699459
9803 699459 7133725 8908429 4779770 -896503 -4973292 -7548427 -9042082 -9149530 -8133773
9794 -8133773 -6452589 -3506333 1131899 5677224 7461859 6457065 5694366 7496452
9786 7496452 10575414 12024499 11438146 11238762 12531435 12673210 8851709 2746081 -1279625
9777 -1279625 -2316196 -3732940 -6978568 -8364751 -4578350 1592470 4525898 2945751
9769 2945751 411242 60298 2485177 7578335 14009531 17138395 12397743 2003455
9761 2003455 -5952960 -6849355 -4105773 -2645736 -2444120 -1927199 -3320205 -9244555 -16559652
9752 -16559652 -19244938 -16215704 -11162379 -5988637 -397019 3011660 715384 -4167416
9744 -4167416 -4582304 -1693810 -4800605 -14819531 -18448389 -7134707 7599924 9565584
9736 9565584 1385540 -1860105 2293529 2412941 -3520253 -2694830 9267449 17463506
9728 17463506 10100015 -3035690 -6811575 -3056123 -2359062 -3856501 101953 5918041
9720 5918041 3280373 -5214047 -6453458 1161720 4789143 -1211763 -6477799 -2750535
9712 -2750535 3011506 1029247 -6467564 -10498089 -7595132 -574195 6299568 8285521
9704 8285521 3151130 -3244992 -2107828 4522551 4764373 -4389367 -10850296 -6606752
9696 -6606752 -1188278 -5830074 -14546457 -13968068 -4760426 873772 -1148675 -3734166
9688 -3734166 -3614917 -5659165 -10841773 -12096840 -5960395 1010274 1896198 -1353849 -2385317
9679 -2385317 949450 5717598 7893830 5098723 -1549878 -7375787 -8872991 -8194124
9671 -8194124 -9395585 -11451178 -10007417 -5231653 -1865488 -1286882 81484 3143849
9663 3143849 3284098 -2073392 -8266761 -9251712 -5033886 -239243 1859829 1230084 -756801
9654 -756801 -2694927 -3894718 -4775637 -5466201 -4689448 -2325342 -1704706 -5346705 -9202686
9645 -9202686 -6280578 3569391 12711184 15614476 14293631 12324913 9633418 6570734
9637 6570734 7399766 14495856 22732407 24694959 19209092 10853214 3870381 703062
9629 703062 3283280 10206699 14755334 11715974 5125074 3317768 6815938 7685789 1706045
9620 1706045 -5612883 -7748693 -5978048 -5608135 -7981528 -10523060 -11268921 -9232847 -3544813
9611 -3544813 3347062 4928062 -1445147 -8458403 -6958287 1649625 8112843 9290238
9603 9290238 10907330 15538224 17137070 11286408 2759668 -2233486 -4106125 -4499645
9595 -4499645 -476097 8094206 12463233 6615957 -475244 3545114 13850012 13650777
9587 13650777 48773 -10370238 -5964282 4067845 6017775 1761929 1505417 5181827
9579 5181827 4156764 -2623288 -6743533 -4214855 -812719 -1822261 -4718183 -4983178
9571 -4983178 -3189704 -2978311 -5768561 -10028679 -13342458 -13728149 -11016588 -7841100 -7364760
9562 -7364760 -9445182 -10794336 -9313775 -6552654 -5269386 -5857145 -6122431 -4405141 -2226608
9553 -2226608 -2631896 -5298269 -5304108 665720 8346643 9923675 3589509 -4884674 -9752746
9544 -9752746 -9843203 -5947325 178555 3458302 -888207 -9211095 -11896973 -6811069 -2621738
9535 -2621738 -4630708 -5837816 1035115 10163998 10390398 1450622 -6834821 -8603514
9527 -8603514 -6624380 -5020857 -5343614 -8518743 -13450980 -14939229 -9634772 -2413052
9519 -2413052 -211381 -1774739 -908569 2371703 2590653 -467029 -941832 2772933 5468770
9510 5468770 4373937 3328646 5511952 8186497 6826823 58044 -9897464 -17524119
9502 -17524119 -16412027 -6991627 408479 -2745351 -10888975 -12148993 -5936157 -2284135
9494 -2284135 -4979958 -7649529 -7487876 -9690275 -14735116 -14244282 -5513376 1501995 -760418
9485 -760418 -5708115 -4339627 510125 1302715 -770834 -281750 696918 -2957364 -7220919
9476 -7220919 -3438703 6099378 8823516 -141081 -10663446 -12047488 -6855957 -4872137
9468 -4872137 -8588555 -11414810 -8664361 -3931485 -2504697 -2812006 796457 7983019
9460 7983019 11188623 6660016 909391 1085516 3752647 928744 -5841714 -7384845
9452 -7384845 -2608869 -1338056 -8095467 -13292911 -7309377 4268376 7998298 1055204
9444 1055204 -5986579 -3898380 4322332 8692474 4612450 -2206552 -2797235 4278760
9436 4278760 11455728 12303736 9064685 6485494 3214290 -3338511 -7627153 -2058661
9428 -2058661 8649871 10809138 943388 -9639544 -12097390 -10170955 -9015047 -6262457
9420 -6262457 -697391 1774317 -996646 -1038360 6220408 12016319 7961820 363100 -528934
9411 -528934 2915567 2598353 828479 5321505 13157218 14463028 9261688 6276162 6321633
9402 6321633 1378940 -9013823 -14375265 -9551162 -2667551 -2461928 -7090306 -10087379
9394 -10087379 -9937998 -9187313 -9190666 -9092029 -7081656 -2312129 1725268 -1376793 -11355959
9385 -11355959 -17559654 -12252948 -3156701 -2915112 -9829985 -11156410 -3637683 2855216
9377 2855216 2789667 2175920 5184596 6709340 3423808 538129 1353235 649959 -4556537
9368 -4556537 -7320322 -1788732 6237255 8243317 5863667 6080077 8588153 6815795
9360 6815795 -1022497 -9190665 -11599685 -6841574 2270570 10398262 12898304 10215873
9352 10215873 6832718 4546592 920198 -4229817 -6594778 -4247546 -733556 1815023
9344 1815023 5894365 10792324 9098398 -2189820 -13129859 -11654009 527177 10483458
9336 10483458 10525180 5220480 2764268 5220199 8036695 6076193 -100991 -3499348
9328 -3499348 1210606 8944280 9151623 816024 -5096851 -1766380 3488205 1798674
9320 1798674 -2793106 -713254 7288608 12078787 10219964 5974768 1918035 -2317009
9312 -2317009 -3909864 -70199 3545663 -1525822 -12377149 -17187786 -12815887 -8216161
9304 -8216161 -7894884 -4821232 4464656 9900797 2398636 -10746493 -15651639 -11100659
9296 -11100659 -7191855 -8378561 -8825371 -3968672 3007883 7636339 9512590 9366482
9288 9366482 7175713 5303250 7817567 13930549 16794875 12002750 3775479 -384585
9280 -384585 1417746 4701687 4649541 367746 -5334497 -8324202 -6701014 -3616421 -4652558
9271 -4652558 -10411659 -13968260 -8877965 1670275 7565602 3770747 -3816138 -5690804
9263 -5690804 607189 8843462 11395190 6362109 -1775782 -6849709 -6278552 -2670824
9255 -2670824 -547270 -1421454 -2505105 -508572 4028321 7141668 5977132 1739078
9247 1739078 -2419163 -5241451 -7429320 -8408643 -6039648 -1051617 1211096 -2933122
9239 -2933122 -9263282 -10586094 -7430610 -7611414 -13450439 -16391341 -9241714 1769398
9231 1769398 4150983 -4788582 -16167367 -21803169 -20689837 -14193668 -3361199 7407435
9223 7407435 11515633 8042678 3061673 1158881 1233988 2204686 5876133 11110610 12050308
9214 12050308 6572335 763685 454898 3575639 5433014 6181067 7803514 8540922 6048673
9205 6048673 2283918 123608 -1241178 -3004418 -2975080 388285 4606582 8061105 12788456
9196 12788456 17848559 16800146 8112057 1068903 3519028 10392026 12949654 12295623
9188 12295623 13285925 12121978 3163397 -7037451 -7083218 758395 4145965 1112288
9180 1112288 1185009 5802296 4404258 -6143629 -13892008 -10077442 -1899465 341358
9172 341358 -2322637 -3638132 -3104771 -3024113 -2192418 628365 3229532 4825611 7674908
9163 7674908 10231124 6919278 -1332782 -5472285 -1860027 2078227 941421 -38920
9155 -38920 3984620 7814329 5474928 409593 -1603210 -1719579 -2616504 -1993089 874958
9146 874958 648548 -4046500 -5298683 580502 4122192 -2196379 -9760489 -7298797 330071
9137 330071 1169314 -3382915 -3008159 1776268 952265 -6342943 -10693173 -9538098 -10072145
9128 -10072145 -13934138 -13680296 -7274393 -2558286 -3104152 -1612865 7257378 17340429
9120 17340429 19875811 14583437 7307260 2515940 1248776 1439715 -1047525 -6608164
9112 -6608164 -7949270 961590 13205648 15465345 6521820 -895409 1424316 7108212
9104 7108212 7179968 2491809 -1156551 -2520612 -3378338 -2962322 338236 4914755 7495977
9095 7495977 6710702 3683111 1639402 4462768 11636552 15924568 11624795 3672372
9087 3672372 1544596 5310411 6320632 1745119 -1290990 1862158 6103311 5440462
9079 5440462 1429947 -1128794 -537818 2869402 8062071 11143807 8082241 1619376
9071 1619376 -959328 1729411 4297596 5158243 8929787 16090412 20050452 18266193
9063 18266193 16573170 17739447 15548017 6584010 -1253369 130588 6661670 8754541
9055 8754541 4563651 -614581 -3049193 -2079220 2287813 7233589 7231248 1639032 -2751804
9046 -2751804 -1448460 1444565 1472210 1219083 3509709 4747525 2226768 792688 4138612
9037 4138612 6611356 2803966 -1546966 1320364 7221157 6834140 1789451 1320869 5694844
9028 5694844 6041776 65670 -4686328 -4497790 -4810734 -8933949 -11324690 -6228872 4274606
9019 4274606 14111355 19146113 17441873 9837227 2140584 886638 5160653 7852879
9011 7852879 5761323 2607977 1490679 1046384 440195 1400870 3181246 1729916 -3751180
9002 -3751180 -9112568 -12075436 -14621992 -16328042 -12196700 -1146992 9292605 11804902
8994 11804902 8407185 5921216 6130313 5780227 3727387 2315823 2268047 1139971 -2128866
8985 -2128866 -4406753 -1946055 4443520 9285566 7839291 1156767 -5075294 -6715638
8977 -6715638 -4704486 -1975145 657561 3519605 5312987 4644047 3203078 4073820 7131981
8968 7131981 8852397 6581518 979067 -5068753 -8032250 -5672919 57053 3407657
8960 3407657 787648 -4974455 -8567040 -8134968 -4572165 1872094 9958733 15291618
8952 15291618 15130041 13270475 14436418 15756078 10681954 586383 -5192230 -2159724
8944 -2159724 3236069 2886256 -2802060 -6818885 -3949684 4877167 13828911 16555916
8936 16555916 11729624 4396445 -183926 -2298130 -4325557 -4917693 -2301637 -343118
8928 -343118 -3525302 -7650242 -4650238 3631712 6519440 797922 -4592967 -3437505
8920 -3437505 -966119 -1970423 -688473 8424228 17760041 15533194 3801445 -3185949
8912 -3185949 1932954 11092428 12842205 6298443 161753 1408172 7781758 11024057
8904 11024057 6683535 -346389 -1606987 4752824 12947473 17942875 19854180 19703979
8896 19703979 17039902 13692269 13541484 15541064 13344310 5749918 909826 4818883
8888 4818883 11723102 12573498 7932480 4970407 5331815 4004018 -1404426 -7302377 -9625761
8879 -9625761 -7577320 -2690718 1772207 2162933 -1183915 -3409536 -2144086 -998776
8871 -998776 -2359712 -2538059 290259 62451 -6897203 -11784771 -4609556 8454384 11622101
8862 11622101 1998336 -7359419 -7656318 -4699680 -5774938 -8463095 -8563528 -9159938 -14231990
8853 -14231990 -20188415 -20882996 -16231436 -10106088 -3886218 2866751 8964641 13062438
8845 13062438 15378344 15153884 10597755 3964777 1532751 5148498 8832560 7252764
8837 7252764 2349656 -1919760 -5370217 -7796555 -5955371 -141614 2381198 -2445292
8829 -2445292 -7303979 -3571880 5004892 7998838 4651836 4207553 10286280 14994569
8821 14994569 11177757 2743458 -1134433 2818517 9843692 12970999 8878723 290899
8813 290899 -6359951 -7182993 -4186913 -890148 2649383 6945072 8616786 4606047 -1417093
8804 -1417093 -3572642 -3143226 -5706634 -9607420 -6632818 3942548 11360238 7966819
8796 7966819 62056 -1751054 2916940 6016907 3376247 -1234967 -2328909 1974893
8788 1974893 9339703 14424929 12866507 6959318 4354922 8259845 13034196 12953705 10017008
8779 10017008 7990680 4684920 -2187304 -6655521 -2192323 5153300 2930828 -8558871
8771 -8558871 -15213836 -9642150 -964617 847976 -793734 1497969 4939511 2611807
8763 2611807 -2485273 -1281520 6039727 9874098 6332419 2213081 2929416 4798364
8755 4798364 3217401 769906 1753582 4075448 2547097 -2730110 -6397283 -4757025
8747 -4757025 1191177 8469144 14484521 17193987 15647304 10728930 4434253 -1140462
8739 -1140462 -4125715 -4146954 -3702801 -5803071 -9515919 -10810199 -8723209 -6824678 -6763518
8730 -6763518 -4985820 626979 5269983 3679078 -964453 -908274 4675900 8528001 6004619
8721 6004619 973465 -759871 1068359 2971182 3272083 2696021 1498565 -1174203 -5588516
8712 -5588516 -10304311 -12427297 -9399900 -2150095 4039192 4297605 7644 -2464790
8704 -2464790 702107 6494588 8430482 2506863 -9470645 -20099330 -21004509 -10653083
8696 -10653083 2952893 10619894 11831147 12155134 12587525 8184118 -2226036 -11987227
8688 -11987227 -14698821 -10707956 -3526055 4044123 7841350 3717429 -4847552 -7531655
8680 -7531655 -981153 4910682 1165419 -6428984 -6300182 1306287 6118742 4456397
8672 4456397 3035605 6037752 8408561 4513444 -4057772 -11883543 -15239364 -13026643
8664 -13026643 -7814878 -6354949 -12641080 -20137610 -18401823 -8438511 -2834827 -7884039
8656 -7884039 -14555978 -12331856 -4029753 191198 -2382444 -6223706 -7863448 -8878674
8648 -8878674 -9806812 -8153951 -3304577 1459980 3179656 2588357 2531417 4760437 8384286
8639 8384286 10473977 8825892 4794627 2199689 3016958 5807560 8379094 9440730
8631 9440730 7708008 3025092 -1047053 32429 5102280 7553087 4026828 -1297966
8623 -1297966 -2986731 -475275 4154407 9532398 13303827 12178674 7301629 4802998
8615 4802998 7094890 8426241 3459277 -4621832 -9575445 -10810857 -10765185 -8131917 -808311
8606 -808311 7454757 10444800 7801576 4059511 1478767 -422352 -636803 1709883 3454786
8597 3454786 1233379 -2681471 -4202873 -4443456 -6309896 -7016977 -2021567 5474651 7517031
8588 7517031 3216818 -522389 228131 2735523 4290298 4682739 2552467 -2420710 -4443808
8579 -4443808 1932862 10749634 10575082 1880777 -3279406 -642351 384948 -5465028
8571 -5465028 -9157808 -2818094 6241141 6860035 489186 -3984356 -4737073 -5709129 -6151628
8562 -6151628 -2276245 3616372 5203054 1816076 -1545161 -2281120 -1842425 -1367956 -1353568
8553 -1353568 -2901918 -4158833 102971 9244408 12806292 4407492 -5562077 -2311166
8545 -2311166 11063040 16064675 4065264 -12699303 -18599798 -13050214 -6445178 -5432653
8537 -5432653 -8446682 -11307827 -11657463 -9742586 -8192249 -9846474 -14278604 -17903656
8529 -17903656 -17974106 -14601804 -9095360 -2855741 2306688 5462919 8066335 11886448
8521 11886448 16025888 18111727 17335209 14331799 9958651 6241605 5584683 6460552 3806653
8512 3806653 -2890072 -6829728 -3995571 -405907 -2584979 -6402946 -4212965 1722433
8504 1722433 3541499 1845863 3240937 5967411 1910747 -6604130 -6792623 4170780
8496 4170780 12716533 8947582 461723 -1680146 651275 -121833 -3189360 -3318377 -1973512
8487 -1973512 -3757029 -6664280 -5790696 -2892645 -2941223 -4279766 -1215247 5728714 10300850
8478 10300850 9583839 5512814 -402111 -6799419 -9430229 -5965729 -1795531 -3505463
8470 -3505463 -8498290 -8889078 -4032118 -815867 -2279709 -4300509 -3809075 -2561796 -1986488
8461 -1986488 -1085792 -94249 -291040 -486684 643335 640925 -1645785 -503611 7804941
8452 7804941 14233979 7782897 -4463237 -3794271 11508235 20976486 11912400 -1983268
8444 -1983268 -2806284 5312831 6931205 1191504 -395200 4324695 6468398 4043669
8436 4043669 4879642 10675748 13077823 8686577 4785371 5873420 6355698 1991604 -1882290
8427 -1882290 199147 4976509 7136132 6783414 4444094 -2858160 -13473775 -17484131
8419 -17484131 -10159041 -2041997 -5330534 -15551679 -18076489 -9444288 -189528 2464769
8411 2464769 2519321 4219622 4606174 1461088 -398085 3248666 8132609 6906598 -1136741
8402 -1136741 -9716891 -12266659 -7011586 1249689 3494398 -4686385 -15755096 -17766789
8394 -17766789 -10400425 -5565845 -9219644 -12129363 -5008998 6221539 9879079 6428758
8386 6428758 5395875 8382441 7798182 1733316 -2342125 -803866 396151 -2813804
8378 -2813804 -5387332 -2990882 -593236 -4106722 -9792028 -9760482 -3853939 1443775 3090422
8369 3090422 3021201 1110472 -5706518 -16310738 -23653980 -22771156 -16709459 -11955907 -10402081
8360 -10402081 -8364439 -2761346 3715051 4752423 -1717877 -8797847 -6645085 5489004
8352 5489004 16119792 13547467 -456596 -12422309 -12194841 -2758453 5361552 6015963
8344 6015963 1660294 -2135139 -3127645 -2848954 -2851383 -2828786 -2405038 -2251443 -1750693 2168575
8334 2168575 10418085 17219054 15127168 5291249 -2634495 -3233357 -2346550 -6569748 -10851099
8325 -10851099 -4704269 10841005 21550730 17615554 5695028 -1135590 -42179 1117417
8317 1117417 -2905827 -8089750 -8529488 -5020406 -3236414 -5953440 -10098520 -10923705 -7148134
8308 -7148134 -1851636 698655 -993440 -4352233 -5622423 -4435950 -4582089 -8985472
8300 -8985472 -14719357 -15372218 -8806319 -103908 4662942 5269557 5406776 5810428 3355337
8291 3355337 -2999396 -9381472 -11698816 -10144676 -7060046 -3042033 2013858 6000363
8283 6000363 6353762 4272604 3860037 6325800 7581937 3096370 -6299875 -15043902 -18731840
8274 -18731840 -17866652 -15399033 -11976728 -5644502 3401555 10156122 9522551 2948588
8266 2948588 -2815609 -4155175 -4484902 -7795861 -11377527 -8783902 961713 11082353
8258 11082353 14828798 12675260 10079035 10013591 10221042 7622374 3162723 879154 3027184
8249 3027184 7837923 12171391 14514043 14432468 11221718 5606092 1566691 3017440 8252128
8240 8252128 10746834 6757070 -201256 -3777159 -1648379 3360377 6992472 6806004
8232 6806004 3440080 190566 -175963 757764 -1404481 -7184076 -10977503 -8072344 -1392213
8223 -1392213 2248144 985433 -811225 675839 4546183 7982086 9650099 9265621
8215 9265621 6575754 2346591 -1291786 -2668368 -1662270 1510856 7053048 14043416
8207 14043416 19206026 18885027 12881321 5854990 3668873 7286553 11089715 9144154
8199 9144154 2707712 -1376915 -54966 2263998 1522940 1068145 6086837 13783781 15613017
8190 15613017 9459952 3495440 5469451 12803552 16970262 14665695 10289798 8564590
8182 8564590 9112715 9166425 8265076 8114364 9531653 11759785 13983242 15406490 14393425
8173 14393425 10173746 5477578 4346582 6520309 7716125 7134487 9692962 16732953
8165 16732953 19717328 10616067 -4507897 -11582718 -7685582 -4043123 -8001659 -12645511
8157 -12645511 -9445171 -1567733 2964737 3540723 3624793 1676125 -4561493 -9509218 -6429654
8148 -6429654 232916 348235 -5477330 -6595685 103713 5154226 2004401 -3402645
8140 -3402645 -3641730 -1066505 -1343838 -2864398 -263494 5757866 9131018 6864735 1494892
8131 1494892 -3567968 -6943364 -8188884 -6812255 -2486912 4488034 12113829 16726356
8123 16726356 16480598 13902636 11741142 8028737 497775 -5732569 -2770364 7045347
8115 7045347 11459965 4850852 -3619533 -3287842 3793745 8258144 7141638 4714245
8107 4714245 3408435 1518446 -1557141 -3971977 -4955157 -5395839 -5568651 -5365714 -5423752
8098 -5423752 -5527315 -4024728 -1062094 530021 -185908 -465868 1002886 1873783 1856231
8089 1856231 4771797 10590660 11834812 4217845 -4948105 -6657585 -3443056 -3671212
8081 -3671212 -6695392 -4566313 2880144 5961679 -22057 -7385522 -6972405 595343
8073 595343 8091313 10641712 8355047 4209876 1856824 2544331 3236785 667484 -3330185
8064 -3330185 -4511891 -2997953 -2011566 -916149 3769905 10357193 12320825 8170480
8056 8170480 4116487 4670142 7108752 8023950 8936574 11618984 13319307 10883942 5479825
8047 5479825 -273670 -5838448 -10205032 -10069109 -4471764 1939660 3862731 1350106
8039 1350106 -1314933 -348421 4934475 10937973 11004703 2692142 -5969289 -4160070 6628097
8030 6628097 13294677 9614793 4624605 7311475 12621167 11181856 4836868 1731332
8022 1731332 1629860 -2024166 -8652933 -11164163 -8877449 -8212076 -10142071 -8441617 -2306279
8013 -2306279 610966 -2587280 -4634155 -1312219 226039 -5783883 -11345317 -5502853
8005 -5502853 7805473 13938526 7866915 -193221 -518364 4056284 5574770 3403721
7997 3403721 3351077 7729744 12072555 11598938 7034908 2634210 412354 -1659953 -5686268
7988 -5686268 -9625192 -8883757 -2455884 4431458 5692501 1564200 -1939617 -827366
7980 -827366 2262718 2604575 189865 -887924 974689 2442024 610517 -2015736 -731124
7971 -731124 4456252 8445223 7886409 5260086 4445761 4778721 2621026 -2086000 -4508647
7962 -4508647 -1461928 3310434 3102702 -3207204 -9470067 -10096652 -7067377 -6480693 -9481197
7953 -9481197 -10721758 -6724521 -1547069 -1001594 -4317639 -5969638 -4069397 -1934760
7945 -1934760 -1890699 -2807577 -4059120 -6124686 -6036122 1120812 12989578 18867823 13266428
7936 13266428 5048653 5907914 13583377 15069013 5215225 -6577547 -9646687 -4800317
7928 -4800317 -738369 -2849345 -8877106 -12723364 -10341254 -3746361 504979 -830139
7920 -830139 -2644964 1458960 8587955 9624623 3006928 -2370651 -490237 3240657
7912 3240657 1348849 -4378620 -6996967 -5005592 -2390505 -1411028 -1599667 -3629111 -8224344
7903 -8224344 -12677928 -13690339 -12450864 -12221460 -12439106 -10101651 -5544021 -1778660 671838
7894 671838 3228428 4829562 3463533 1137093 1694339 4355560 5120939 3882972 3797052
7885 3797052 3916308 -327783 -8370322 -13408552 -12049703 -8558282 -7292667 -7440208 -7917052
7876 -7917052 -10723878 -15661144 -17855994 -14875051 -10927128 -9853765 -9368960 -6606352
7868 -6606352 -3693625 -2777493 -1156668 2936541 5313068 3012196 843531 3182704
7860 3182704 4811932 -694296 -8095533 -7266761 -293019 588677 -7763432 -14650385 -12742188
7851 -12742188 -8317835 -9146466 -12242466 -10807709 -5861523 -3456070 -5521648 -9984406
7843 -9984406 -15387481 -19275757 -16597521 -6534720 2862479 3998039 587179 1588263
7835 1588263 6762957 7308514 697008 -4527395 -1616448 4697880 6385461 4066635
7827 4066635 4220595 7660751 8061145 2108306 -5094641 -7287487 -5169635 -3190835 -1191083
7818 -1191083 4917031 14201264 18692630 13487980 4311300 402616 3018028 6251484
7810 6251484 6724715 5829510 3667253 -1265183 -5587323 -2657535 6361577 11099972 6337037
7801 6337037 214982 1701690 6830626 6162647 754222 55630 6113573 10817269 9480180
7792 9480180 7010248 7885689 9048059 7215363 5807839 8879873 13398526 13228670 7264403
7783 7264403 -1078005 -9024474 -14383237 -13727580 -6369193 1863897 4534164 3336950
7775 3336950 5460856 12427330 17264382 14124819 5695543 -1477585 -5055419 -6989573
7767 -6989573 -8375409 -8223001 -6403987 -4424605 -3160675 -2266948 -1970956 -3165715 -5365872
7758 -5365872 -6830949 -7307922 -8181682 -8870180 -6061129 1059463 7404074 7490849 2974570
7749 2974570 508190 2368849 3636224 -271561 -7266300 -11809715 -11537229 -8736298
7741 -8736298 -7456357 -10291636 -15477522 -16687974 -9540033 930685 4499420 -641110
7733 -641110 -4786074 -881667 5189313 4654757 -417546 -2315978 -1647619 -5092047 -11600410
7724 -11600410 -12973269 -8724504 -8179248 -14528380 -18310868 -12505545 -4101858 -3100299
7716 -3100299 -8001921 -10580928 -8726376 -5749309 -1955405 3730013 7074781 2873367
7708 2873367 -5519257 -9245811 -5588747 841966 6988374 13066674 16407710 13059027
7700 13059027 6429120 5092361 9861241 12028088 7416586 2669170 2805757 2345159
7692 2345159 -3422809 -6900355 1161709 14724084 18585241 10116826 2723483 5609198
7684 5609198 11421448 9531766 2406917 168295 4165926 5739081 418677 -5387593
7676 -5387593 -4539115 184329 329468 -6070539 -11507438 -8529101 1223332 9629432 11919991
7667 11919991 10578393 9180275 6433959 -116241 -7041419 -7560044 -1492699 3397854
7659 3397854 2523601 865692 3624777 6384989 2276227 -5053700 -5593833 893558 3745772
7650 3745772 -1506453 -5777075 -1407381 5205813 3929526 -3676901 -8698464 -9251738
7642 -9251738 -10200341 -11713716 -8869202 -1883102 3190833 4538329 6371026 9696547
7634 9696547 10235788 7316747 6096190 8372273 9690550 8624698 10043625 14875789
7626 14875789 15646517 8439760 1408664 3771717 12458569 17536593 15985661 12165195
7618 12165195 8708569 5349549 4110135 7316206 11397971 9715908 1452667 -7438329
7610 -7438329 -11176760 -7914776 646244 8393851 7259702 -2920808 -10487444 -5590381
7602 -5590381 5385515 8107415 676691 -5104600 -2609141 1432621 687180 -153722
7594 -153722 5044237 12034771 11864272 3541097 -5898305 -10989430 -11577882 -8885888 -3379717
7585 -3379717 3322879 7961979 8195117 5043080 2800026 5434822 11322710 13207919
7577 13207919 6802514 -2216449 -4741811 -687856 1477702 -2183219 -5880875 -4111466
7569 -4111466 456596 3051662 4397124 7108101 9495991 8711933 6706736 7597796 11139373
7560 11139373 13280802 11630884 6810378 167850 -6481008 -10403871 -10241778 -7667642
7552 -7667642 -5037008 -3147978 -2312566 -2694342 -2469511 605524 4530338 4569342 1033383
7543 1033383 -127940 2911627 4073409 -420882 -4764093 -2577513 2594438 3090924
7535 3090924 -1241331 -5205325 -8320502 -13919531 -20281892 -21613013 -17573481 -13865493
7527 -13865493 -12817978 -10491355 -4135385 3641479 9171765 11067695 9179223 5361025
7519 5361025 4531818 8955973 12341822 6793732 -4531738 -9707238 -4054950 4184099
7511 4184099 6306192 3113676 -965160 -5648800 -11182695 -13254749 -8241528 -159969
7503 -159969 3126286 -1160995 -8945389 -14088566 -12356962 -3722539 6395679 10954354
7495 10954354 8677961 4734907 2706828 507181 -3458398 -5658309 -3055417 1439302
7487 1439302 3861268 5234131 7510785 7674177 2467783 -3859029 -3923954 1479673 3451502
7478 3451502 -2536574 -9895117 -9171491 234729 9074183 8090625 -1899588 -9997273 -6686243
7469 -6686243 4723300 11325953 6175325 -4073054 -9439638 -8603581 -5668717 -1045020
7461 -1045020 6102373 10209353 4626556 -5816931 -7946242 1703526 11277437 10215718
7453 10215718 3112346 779706 4073811 4591901 -1941697 -10634303 -14779197 -12240329
7445 -12240329 -4830569 3468214 7513827 4981078 134299 -319767 4069014 6806043
7437 6806043 3497745 -2675012 -6818107 -9621889 -14612138 -20353072 -20661374 -13305656
7429 -13305656 -4425094 -1896308 -6488967 -12202828 -14322355 -14317026 -16376469 -21260888 -24937287
7420 -24937287 -22563849 -13101874 -563059 8895849 11804380 9722541 6290676 2404973
7412 2404973 -3784649 -11738962 -16228297 -12647398 -3198500 5142768 8514983 9252708
7404 9252708 10730837 12002014 9408944 2171490 -5485853 -7862106 -3130012 4358050
7396 4358050 7350344 2794229 -3968875 -4023196 4771373 13930608 13132399 2055169 -9316594
7387 -9316594 -12418775 -8983944 -6326190 -6584119 -4934658 1641693 8560892 9532571 5381838
7378 5381838 2628596 3910945 4448976 -334258 -7287454 -8710120 -1299436 10909637
7370 10909637 21369859 25730182 22349652 12108050 -518162 -8707880 -8477143 -2480624
7362 -2480624 2856698 4032861 3175611 3960411 6287895 6481797 2586995 -2237012 -2854417
7353 -2854417 2047700 8773950 12942574 13150169 10074120 4420136 -2206795 -5799174
7345 -5799174 -2364290 7239308 16480459 18649815 13133302 5597053 1905140 2534915
7337 2534915 3649420 3019511 2773680 5213163 8112526 7262332 3032732 688386 3169610
7328 3169610 6891868 6803628 2999354 -349745 -722843 1026867 3338578 5153813 5039448
7319 5039448 2304399 -682056 -41095 4666840 8834376 7418415 533687 -6156648
7311 -6156648 -6600110 -276456 6876758 8408670 4443238 1090612 2231146 4802005
7303 4802005 4409661 2609832 4499002 10517116 15253408 14524012 9693521 4414027 784562
7294 784562 -368540 871531 2100717 286773 -3234270 -2824802 3834432 11273810 12814398
7285 12814398 9325071 7286894 9265466 10946175 8337346 3775169 2277457 4347690
7277 4347690 5503453 2430504 -2898667 -5794793 -4004904 411064 3389704 2571179
7269 2571179 -315832 -483074 4879247 11882875 12761251 5597653 -1375098 632540 8578790
7260 8578790 10594114 2021675 -7941018 -8894020 -2919910 -197693 -4700446 -10881212
7252 -10881212 -13217195 -12446660 -11436639 -10273878 -7920732 -5442737 -4972866 -6776154
7244 -6776154 -8931182 -9687816 -9693765 -11305512 -14567209 -14891272 -8200181 1687475 6142581
7235 6142581 3796858 2798872 7250878 9355605 2303753 -6673732 -7008249 -2766475 -5889527
7226 -5889527 -13984188 -11166744 6599951 23000279 24613669 18480078 17226783 19115983
7218 19115983 15199753 7117556 3584067 4149397 281770 -8969800 -14684362 -12112156
7210 -12112156 -6813643 -4926155 -5467035 -4569422 -1128689 3572196 7186808 6913048 3154021
7201 3154021 1413373 5214066 8980501 4920417 -4338543 -8356466 -4258964 -453131
7193 -453131 -2884233 -6483887 -4555294 914329 3935062 3727961 3272519 2978069 1959195
7184 1959195 2629869 7755051 14294938 15974495 12021542 8441786 9561341 12350185
7176 12350185 11250025 5874632 1038469 221758 2033117 3701015 5184876 7363773
7168 7363773 8062889 4065153 -2796406 -6135022 -3460434 238100 439608 151019 3990517
7159 3990517 8779954 7018593 -1341232 -7655207 -6095442 -345544 3119146 3144022 2541949
7150 2541949 2924728 4168679 6072746 7490836 5834965 52953 -7149217 -11807122
7142 -11807122 -12352421 -9850055 -6123825 -2610489 269076 3250874 6563503 8261436
7134 8261436 6144418 1334232 -2307813 -2661006 -1256818 -666022 -2127777 -5667226 -10008271
7125 -10008271 -12184689 -9881294 -4732444 -1043624 -773643 -1862481 -1879870 -1334963 -2824170
7116 -2824170 -7956369 -14696922 -17118931 -10086118 3749793 14394813 15329881 11289163
7108 11289163 11018387 14954911 15892662 10338557 2590854 -2606900 -5355639 -7431985
7100 -7431985 -8841868 -8777972 -6447978 -1297271 3977230 3045910 -5554030 -12159589 -6503662
7091 -6503662 6763329 12700804 6544234 -962159 -859017 2365952 981193 -4171696
7083 -4171696 -8283754 -10465823 -10341954 -4472227 6480060 13634834 10570194 2764831
7075 2764831 -444549 2125140 6303699 11401139 18212426 23165126 22816281 20311880
7067 20311880 19661917 17710265 9925298 185002 -4071628 -3273753 -3330075 -4555298 -2431910
7058 -2431910 2338759 4116982 2058063 624251 515635 -2213360 -7479101 -9867659
7050 -9867659 -7184114 -3102747 -412789 1463693 1549763 -2899888 -10233533 -14297908 -11993793
7041 -11993793 -5900552 756177 6358384 8682495 6539638 3251026 2657918 2913112
7033 2913112 541516 -1807216 101620 2312071 -2087881 -9132077 -7438427 3585323
7025 3585323 11660653 10668110 8828638 12684903 15604718 10365714 2535171 1462367
7017 1462367 5826889 7987309 6690938 5925742 5682569 2971945 -1022388 -2750039 -2874561
7008 -2874561 -4402746 -6763346 -7580030 -7259461 -6253934 -1724586 6731837 12186371 8682357
6999 8682357 1150489 -792044 3631353 7078360 6325868 5099529 5261457 3872644 316892
6990 316892 -1125272 1783013 5369134 5530260 2983602 1227784 2144010 4453021 4739504
6981 4739504 1174919 -1837562 3731401 18163525 29430904 26632455 14685043 7389838
6973 7389838 8182039 7918646 1728762 -3330900 -940975 4358047 5748855 4920667 7107433
6964 7107433 11130712 12009184 9854137 8921059 9813840 9097180 5695465 2004622 -988863
6955 -988863 -4488988 -7477454 -6279060 33630 7146755 9969635 7508569 2456946
6947 2456946 -2027226 -4074268 -3168240 139832 4671789 9011704 11669722 11860036 10717169
6938 10717169 10618046 12216563 13065761 10389236 4569772 -1021563 -2870759 546297 7826285
6929 7826285 14663400 16639222 13728880 10354362 9199337 7460568 2311361 -2521009
6921 -2521009 -879015 5819076 8688918 3133558 -4789715 -6875496 -3321877 -464106
6913 -464106 -896635 -933755 2938053 9326906 13817373 12759929 5695289 -3222994 -7239239
6904 -7239239 -3819671 1492730 1889433 -1293649 -1228881 3053592 5082368 2169688 375901
6895 375901 4039809 7578544 4492982 -963051 301561 7679459 11544425 8046648
6887 8046648 4284870 6770530 12287117 13604225 8649541 701619 -5892324 -7272670
6879 -7272670 -1865003 6261711 9883644 7274911 4122573 4205715 3740812 -753943 -4856450
6870 -4856450 -3183551 444201 -1969046 -9436015 -12473894 -7068142 -182469 830943
6862 830943 -2422815 -3860715 -1262958 3660901 9107552 12913705 12010681 6680827 2720346
6853 2720346 4559261 8079002 5679923 -1975097 -5027385 3059309 16592284 24210432
6845 24210432 21356984 13038602 6340478 4068655 5141256 7332302 8441420 7235871
6837 7235871 4699715 2942187 2056722 -260998 -4911725 -8992910 -8996612 -5351401 -1846357
6828 -1846357 -831738 -591603 2239838 8426118 14436430 14953142 7761168 -3490391
6820 -3490391 -12019397 -13542742 -8721671 -1160301 4820802 5331948 -245353 -6792993
6812 -6792993 -7693899 -2964872 791423 87587 -961801 1275115 3334283 1228220 -1719881
6803 -1719881 -316884 3508333 4660572 4157909 6072976 8465061 7114521 5799102
6795 5799102 11346675 19322381 17646607 6036781 -1777314 771295 3598807 -1574358
6787 -1574358 -6856164 -2453741 6096135 7323569 1871267 -1724060 -2542162 -5195819
6779 -5195819 -7415552 -3778402 1348347 -1246964 -9239485 -11443010 -6729785 -5799092
6771 -5799092 -12266819 -16658586 -13568552 -10691400 -13724940 -14906602 -6243433 5694041
6763 5694041 9258628 5276722 3826656 7397270 8390489 2701300 -3831722 -4433894 -91379
6754 -91379 3390237 2645169 -1512530 -7043383 -12924162 -18790110 -23310092 -23695509 -17928305
6745 -17928305 -7618403 2474337 7890238 6713437 -283882 -9427179 -15196081 -14708019
6737 -14708019 -10744619 -7579572 -5289767 -2024960 284984 -1457482 -4398173 -2610045
6729 -2610045 2788943 4608658 2001545 2624135 9049037 12788808 7850110 1207431
6721 1207431 1569169 5395185 4101221 -787653 -1274349 1916920 326108 -6629413 -9287177
6712 -9287177 -3272764 3450616 3264416 -626116 -1941314 -1811464 -4502311 -8054298 -6839302
6703 -6839302 -907601 3905180 4403044 3170962 3248423 4145273 4074663 2844090 1204919
6694 1204919 -517479 -1887175 -1848022 28317 2463882 3753161 4087967 5586234 9236087
6685 9236087 12565949 12143233 8499438 6044330 6725660 6700076 2374334 -2893660 -3269495
6676 -3269495 -597394 -3482704 -14379508 -23839376 -22024320 -11407388 -2402318 598204
6668 598204 2116728 5673346 8510825 8162025 7825247 10842556 13935420 11209229 3231293
6659 3231293 -2827900 -2415384 798667 42524 -5848501 -10561485 -7163602 3353771
6651 3353771 11153851 7230330 -5600756 -14664650 -12482874 -5969301 -6139593 -12247974
6643 -12247974 -13777299 -7278693 -1844827 -4741066 -10174572 -8561936 -535529 6004710
6635 6004710 8212831 8810790 7061458 -581675 -10507951 -12669583 -4628760 3363026
6627 3363026 2238559 -3629392 -4177704 1420233 5000797 2179759 -2505901 -3452585 -939648
6618 -939648 1681136 3414818 5336483 7137163 6913137 4166596 1175235 690204 2938751
6609 2938751 5613490 6574329 5635859 3705868 1644750 543830 1233953 2255066 542109
6600 542109 -3761853 -5613168 -1357644 5544419 9164325 9346476 10024637 11045905 8647727
6591 8647727 3908488 2791370 5955681 6496830 1320375 -3035653 -1193562 1591999
6583 1591999 -2138580 -9629432 -12007077 -7285935 -1316977 2014643 3847314 4891823
6575 4891823 4218354 2919578 2431729 105673 -6626398 -12666135 -10082188 -944126 3412912
6566 3412912 -1800877 -8071036 -6416051 529399 4508201 3601059 1892968 1300187 155289
6557 155289 -2124487 -4412611 -6997706 -11066496 -15470486 -17132483 -14341292 -7726575
6549 -7726575 791193 8144970 10934991 8321411 2840293 -2959299 -8402725 -11877479
6541 -11877479 -9901380 -2350020 4387748 3859829 -2356323 -6890672 -5766667 -1718639
6533 -1718639 626447 -772033 -4817064 -7554531 -4031648 5890999 14237790 12297770
6525 12297770 1605613 -7391738 -8635749 -7115981 -9927092 -15989525 -19086389 -17376905
6517 -17376905 -14270632 -11444672 -6780976 187884 5775596 7327182 7384264 9583182
6509 9583182 12516265 11365244 5292228 -326788 -425479 3364188 4978960 1328964 -4872314
6500 -4872314 -9162255 -9722194 -7492682 -4451303 -2794201 -3491511 -4072442 -86572 8945124
6491 8945124 17064214 18506653 15314254 14262535 16754153 16856572 10823955 3536517
6483 3536517 1856074 5230548 7737548 7324452 7233956 8356251 6334044 -1038582 -8268909
6474 -8268909 -8433253 -2415745 2828690 4005701 4267938 5993680 6639616 4769804 5137926
6465 5137926 12066927 20358672 19832358 9445052 256820 1382400 8429897 10483222
6457 10483222 4482446 -3161126 -6785950 -6688280 -4642616 -759849 3925639 7230033
6449 7230033 9862142 14518455 19103076 16759746 6080996 -4216313 -5460694 717118
6441 717118 7218929 11720467 15566141 16677924 12151400 6113890 6194877 12041309 15456384
6432 15456384 12739867 8604507 6192293 2212889 -4304114 -7146729 -2685703 2675227
6424 2675227 1811352 -2066425 -1360223 3323699 5049771 2541035 1730456 5743128 10780727
6415 10780727 12638972 11104666 7164439 1755611 -1572108 1538164 9724588 15813911
6407 15813911 15394584 11609752 9489524 9377562 8642263 6960943 6737225 9341761 13007425
6398 13007425 14463563 12411754 9595784 10229295 14199632 15827340 10869578 2792635
6390 2792635 -1435916 -283388 1792676 1783681 1444907 3053914 6071327 8595930 8798154
6381 8798154 5144019 -1071920 -3983208 1488927 12422107 20366608 20983486 16757132
6373 16757132 10653437 2846597 -5689248 -12110921 -15513462 -16795998 -14319574 -5747640
6365 -5747640 5103917 10390717 9062848 8203996 10867380 10580149 2719636 -5787714
6357 -5787714 -4611079 6753456 19489942 25577198 23044756 15226283 9167680 10915603
6349 10915603 18420805 22966015 20495207 16010774 13530914 9208323 101932 -7657123
6341 -7657123 -7382529 -2715761 -1512156 -3567925 -3298657 -877735 -1477136 -5808900 -9971670
6332 -9971670 -12733997 -15003147 -14373206 -8527362 -1928388 -597541 -2268667 -478651
6324 -478651 3872945 4821233 3091595 4417226 7104549 3605206 -4630199 -6751324 -128544
6315 -128544 4112930 -1399267 -8457518 -6199449 3275106 10192179 10780828 7434376 747190
6306 747190 -9872402 -20127412 -22525410 -14168860 278554 12255854 14994094 8943876
6298 8943876 2413174 2511743 5395783 1815633 -7533322 -11419395 -5429961 497877 -2292316
6289 -2292316 -7897017 -6854021 -2197209 -3375086 -9184643 -8988512 -33032 7268128
6281 7268128 3661881 -6880540 -12787090 -8422000 625929 4245526 -1113984 -8325852
6273 -8325852 -8204738 -1318558 3535182 2621625 1418595 2893094 929339 -7990569 -15017006
6264 -15017006 -10621587 -133947 3504671 -1125942 -3827809 -358727 2222901 -644518
6256 -644518 -3261054 -33608 5238699 5923758 2270120 -583441 -111671 2313996 4563681
6247 4563681 4800718 1701844 -3734785 -7951574 -7721316 -2539278 5087207 10175464 8400440
6238 8400440 1878618 -978524 4016193 9662985 7251992 563053 789099 8446631
6230 8446631 11342751 3113017 -6722852 -6667000 1293971 6991750 6530646 4111241 3437175
6221 3437175 3894705 3103104 -1070435 -8358513 -13149219 -8534205 3076015 9556990
6213 9556990 4711330 -2141464 395818 8854921 11152722 5352015 553790 815441
6205 815441 588500 -2566258 -2843979 2045616 4637867 -328185 -6111230 -3775820 4166427
6196 4166427 7733715 3262643 -3829120 -7457578 -5972910 -1159809 2351112 -789631
6188 -789631 -9505769 -14140298 -7913571 2172129 3650137 -3944903 -8900735 -4596344
6180 -4596344 2626994 5009240 3521650 2326478 1234609 -883894 -1911319 -1335044
6172 -1335044 -3035162 -7418512 -7542930 -404023 4737892 -945373 -10325847 -9439265 922098
6163 922098 6059423 -191243 -7542222 -6993414 -3496429 -4575524 -7403286 -5840311 -2018160
6154 -2018160 -1548872 -3183144 -2384977 -553851 -1545738 -2660369 1347190 7527314 7784101
6145 7784101 2090983 -778319 3274728 8141550 7637703 3386082 -524387 -3831370
6137 -3831370 -7026778 -7759220 -4969110 -2249262 -2405506 -2174747 2576780 8700024 8336289
6128 8336289 -348230 -9368107 -9592814 -1111324 6981564 6888259 620693 -3314109 -1152612
6119 -1152612 1622587 -941595 -5694699 -4752052 2275534 7218441 5490511 2287988
6111 2287988 3050783 4019425 -1289441 -10042936 -12540397 -6289530 9343 -1001956 -5216609
6102 -5216609 -4379630 822276 2114566 -2632116 -4627587 3308214 14887341 17324801
6094 17324801 8077887 -2262265 -4470357 -1392017 -960682 -4184522 -5654476 -2913018
6086 -2913018 656818 1325296 -1642826 -7714612 -15239549 -19516041 -15483764 -4040199
6078 -4040199 7506041 12596739 10760848 5749179 1511254 475310 2696941 5926092
6070 5926092 8620362 12020603 16157523 15972662 7363800 -3763477 -6254953 962512
6062 962512 6454713 2847878 -2282204 1703510 12649944 20047981 20621661 19808300 19780940
6053 19780940 16144646 7644773 344229 -1058495 543288 589066 -543478 -795932 -1634878
6044 -1634878 -5206658 -9209572 -9316356 -5386605 -1474980 -317566 -905402 -1243685 -916018
6035 -916018 -767447 -1837079 -4595137 -7895237 -9066830 -6554999 -2298865 -112253 -1578547
6026 -1578547 -4384731 -4666273 -600644 5646629 8954782 5305534 -3969286 -12625535
6018 -12625535 -15165361 -11422567 -5158307 -102369 1233055 -2462676 -9123049 -12838571
6010 -12838571 -9871290 -4501737 -4170384 -8818551 -10852069 -7143108 -4351404 -8325841
6002 -8325841 -14514689 -15297508 -11891989 -10716565 -11130081 -6712866 1927988 6411091 4851176
5993 4851176 6209591 15221310 22640085 18548554 8067527 4120805 9141553 13979471
5985 13979471 12579043 7871112 3667586 92437 -1969205 -313543 2906828 2423539
5977 2423539 -1427156 -2598577 56252 -6872 -6071304 -12347216 -13500705 -12399040 -12737230
5968 -12737230 -11200830 -4455096 1856247 30560 -7058340 -9063700 -2663831 5000119
5960 5000119 7431900 6244092 6291258 8991248 12235408 13094084 9732335 3763273 480711
5951 480711 3344762 8939610 11211770 9675910 8835191 10265268 10615209 7619870 2925752
5942 2925752 -1658062 -5786437 -7853583 -5857171 -2045157 -1452991 -4363058 -5560297
5934 -5560297 -2974189 -1438942 -4924154 -10135565 -11434897 -7876284 -1959993 4398257
5926 4398257 9073730 9183650 5413243 2891877 3536862 2001819 -5318888 -11656223 -7699223
5917 -7699223 4373425 12785341 11732203 7249826 6171375 6632289 3312169 -3086071
5909 -3086071 -6383979 -2766454 5243015 11540978 11297501 4348838 -4547411 -9482794
5901 -9482794 -8274792 -3232191 2392901 7148420 10887588 13474294 14289535 12132906
5893 12132906 6553014 400719 -1305669 2254312 5175568 2936622 307651 4569731
5885 4569731 12251642 11546733 -34445 -9432679 -4930331 7634371 12740554 4737436
5877 4737436 -8044772 -15776808 -15647421 -9008530 1610692 10942103 13095564 8361463
5869 8361463 3669501 3889096 6303011 5781269 1774034 -2396776 -4019645 -1879001 4593596
$$ [...]
##END NTUPLES=NMR SPECTRUM
##END=
