##TITLE=31Pdec_SR3_rmo
 CDCl3, 24 sc
 14.10.2019
##JCAMPDX= 6.0         $$ Bruker NMR JCAMP-DX V2.0
##DATA TYPE= NMR SPECTRUM
##DATA CLASS= NTUPLES
##ORIGIN= UXNMR, Bruker Analytische Messtechnik GmbH
##OWNER= root
$$ XWIN-NMR		Version 3.5
$$ Mon Oct 14 14:26:40 2019 Russian Standard Time (UT+4h)  she@DPX200
##.OBSERVE FREQUENCY= 81.013821
##.OBSERVE NUCLEUS= ^31P
##.ACQUISITION MODE= SIMULTANEOUS
##.ACQUISITION SCHEME= undefined
##.AVERAGES= 24
##.DIGITISER RES= 17
##SPECTROMETER/DATA SYSTEM= spect
##.PULSE SEQUENCE= zgpg30
##.SOLVENT NAME= D2O
##.SHIFT REFERENCE= (INTERNAL, D2O, 0, 182.463)
##AUDIT TRAIL= $$ (NUMBER, WHEN, WHO, WHERE, WHAT)
$$ ##TITLE= Audit trail, XWIN-NMR		Version 3.5
$$ ##JCAMPDX= 5.01
$$ ##ORIGIN= Bruker BioSpin GmbH
$$ ##OWNER= she
$$ F:/spectra/data/she/nmr/P31/1/pdata/1/auditp.txt
$$ ##AUDIT TRAIL=  $$ (NUMBER, WHEN, WHO, WHERE, WHAT)
(   1,<2019-10-14 14:25:46.15 +0400>,<she>,<DPX200>,
      <created by zg, POWCHK disabled, PULCHK disabled
       configuration hash MD5:
       00 E9 B6 7A A2 85 ED C7 34 08 36 98 17 FE 4E 26
       data hash MD5: 32K
       E5 27 07 7C 87 51 56 18 8D 3C CD 2B 55 24 30 22>)
(   2,<2019-10-14 14:25:48.78 +0400>,<she>,<DPX200>,
      <Start of raw data processing
       efp BC_mod = 2 LB = 1 FT_mod = 6 PKNL = 1 PHC0 = -268.0839 PHC1 = -227.5996 SI = 64K 
       data hash MD5: 64K
       08 54 3A 1E 40 1A C5 4E 2B 4D 8C 55 79 2A 68 F5>)
(   3,<2019-10-14 14:26:08.70 +0400>,<she>,<DPX200>,
      <pk PHC0 = -0.7287879 PHC1 = 0 
       data hash MD5: 64K
       0D EB EA 21 DC 99 90 09 DB 74 27 18 7C 5B 5F 10>)
$$ ##END=
$$ 
$$ hash MD5
$$ 2A 2D 03 1F A2 83 0E 61 1F 9B E1 EE 38 8D F2 66
##$RELAX= 
##$RELAX= 
##$RELAX= 
##$RELAX= 
##$RELAX= 
##$RELAX= 
##$RELAX= 
##$RELAX= 
$$ Bruker specific parameters
$$ --------------------------
##$DU= <F:/spectra>
##$EXPNO= 1
##$NAME= <P31>
##$PROCNO= 1
##$TYPE= <nmr>
##$USER= <she>
##$AMP= (0..31)
100 100 100 100 100 100 100 100 100 100 100 100 100 100 100 100 100 100 
100 100 100 100 100 100 100 100 100 100 100 100 100 100 
##$AQSEQ= 0
##$AQ_mod= 1
##$AUNM= <au_zg>
##$AUTOPOS= <>
##$BF1= 81.014009
##$BF2= 200.13
##$BF3= 200.13
##$BF4= 200.13
##$BF5= 200.13
##$BF6= 200.13
##$BF7= 200.13
##$BF8= 200.13
##$BYTORDA= 1
##$CFDGTYP= 0
##$CFRGTYP= 5
##$CHEMSTR= <none>
##$CNST= (0..31)
1 1 145 1 1 1 1 1 1 1 1 1 1 1 1 1 1 1 1 1 1 1 1 1 1 1 1 1 1 1 1 1 
##$CPDPRG= <waltz16>
##$CPDPRG1= <>
##$CPDPRG2= <waltz16>
##$CPDPRG3= <>
##$CPDPRG4= <mlev>
##$CPDPRG5= <mlev>
##$CPDPRG6= <mlev>
##$CPDPRG7= <mlev>
##$CPDPRG8= <mlev>
##$CPDPRGB= <>
##$CPDPRGT= <>
##$D= (0..31)
0 1 0 0 0 0 0 0 0 0 0 0.03 2e-05 3e-06 0 0 0 0 0 0 0 0 0 0 0 0 0 0 0 0 
0 0 
##$DATE= 1571048745
##$DBL= (0..7)
120 120 120 11 120 120 24 19 
##$DBP= (0..7)
150 150 150 150 150 150 150 150 
##$DBP07= 0
##$DBPNAM0= <>
##$DBPNAM1= <>
##$DBPNAM2= <>
##$DBPNAM3= <>
##$DBPNAM4= <>
##$DBPNAM5= <>
##$DBPNAM6= <>
##$DBPNAM7= <>
##$DBPOAL= (0..7)
0.5 0.5 0.5 0.5 0.5 0.5 0.5 0.5 
##$DBPOFFS= (0..7)
0 0 0 0 0 0 0 0 
$$ [...]
##$SUBNAM2= <"">
##$SUBNAM3= <"">
##$SUBNAM4= <"">
##$SUBNAM5= <"">
##$SUBNAM6= <"">
##$SUBNAM7= <"">
##$SUBNAM8= <"">
##$SUBNAM9= <"">
##$SW= 369.568048894756
##$SWIBOX= (0..15)
0 1 3 0 0 0 0 0 0 0 0 0 0 0 0 0 
##$SW_h= 29940.119760479
##$TD= 32768
##$TD0= 1
##$TE= 0
##$TE2= 300
##$TE3= 300
##$TEG= 300
##$TL= (0..7)
0 120 53 12 22 120 120 120 
##$TP= (0..7)
150 150 150 150 150 150 150 150 
##$TP07= 0
##$TPNAME0= <>
##$TPNAME1= <>
##$TPNAME2= <>
##$TPNAME3= <>
##$TPNAME4= <>
##$TPNAME5= <>
##$TPNAME6= <>
##$TPNAME7= <>
##$TPOAL= (0..7)
0.5 0.5 0.5 0.5 0.5 0.5 0.5 0.5 
##$TPOFFS= (0..7)
0 0 0 0 0 0 0 0 
##$TUNHIN= 0
##$TUNHOUT= 0
##$TUNXOUT= 0
##$USERA1= <user>
##$USERA2= <user>
##$USERA3= <user>
##$USERA4= <user>
##$USERA5= <user>
##$V9= 5
##$VALIST= <valist>
##$VCLIST= <CCCCCCCCCCCCCCC>
##$VD= 0
##$VDLIST= <DDDDDDDDDDDDDDD>
##$VPLIST= <PPPPPPPPPPPPPPP>
##$VTLIST= <TTTTTTTTTTTTTTT>
##$WBST= 1024
##$WBSW= 4
##$XGAIN= (0..3)
0 0 0 0 
##$XL= 0
##$YL= 0
##$YMAX_a= 41704
##$YMIN_a= -43757
##$ZGOPTNS= <>
##$ZL1= 120
##$ZL2= 120
##$ZL3= 120
##$ZL4= 120
##$ABSF1= 0
##$ABSF2= 0
##$ABSG= 0
##$ABSL= 0
##$ALPHA= 0
##$AQORDER= 0
##$ASSFAC= 0
##$ASSFACI= 0
##$ASSFACX= 0
##$ASSWID= 0
##$AUNMP= <proc_1d>
##$AZFE= 0.1
##$AZFW= 0.5
##$BCFW= 0
##$BC_mod= 2
##$BYTORDP= 0
##$COROFFS= 0
##$CY= -3
##$DATMOD= 1
##$DC= 0
##$DFILT= <>
##$DTYPP= 0
##$F1P= 0
##$F2P= 0
##$FCOR= 1
##$FTSIZE= 65536
##$FT_mod= 6
##$GAMMA= 0
##$GB= 0
##$INTBC= 1
##$INTSCL= 5.30512e-09
##$ISEN= 30
##$LB= 1
##$LEV0= 0
##$LPBIN= 0
##$MAXI= 10000
##$MC2= 0
##$MEAN= 0
##$ME_mod= 0
##$MI= 50
##$NCOEF= 0
##$NC_proc= -4
##$NLEV= 6
##$NOISF1= 182.463
##$NOISF2= 159.3651
##$NSP= 0
##$NTH_PI= 0
##$NZP= 0
##$OFFSET= 182.463
##$PC= 4
##$PHC0= -268.8127
##$PHC1= -227.5996
##$PH_mod= 1
##$PKNL= yes
##$PPARMOD= 0
##$PSCAL= 0
##$PSIGN= 0
##$REVERSE= no
##$SF= 81.0140089999434
##$SI= 65536
##$SIGF1= 159.3651
##$SIGF2= -187.1042
##$SINO= 113.3802
##$SIOLD= 16384
##$SREGLST= <1H.CDCl3>
##$SSB= 0
##$STSI= 65536
##$STSR= 0
##$SW_p= 29940.119760479
##$SYMM= 0
##$S_DEV= 0
##$TDeff= 32768
##$TDoff= 0
##$TI= <>
##$TILT= no
##$TM1= 0
##$TM2= 0
##$TOPLEV= 0
##$USERP1= <user>
##$USERP2= <user>
##$USERP3= <user>
##$USERP4= <user>
##$USERP5= <user>
##$WDW= 1
##$XDIM= 65536
##$YMAX_p= 339781889
##$YMIN_p= -6403321
$$ End of Bruker specific parameters
$$ ---------------------------------
##NTUPLES= NMR SPECTRUM
##VAR_NAME=  FREQUENCY,     SPECTRUM/REAL,   SPECTRUM/IMAG
##SYMBOL=    X,             R,               I
##VAR_TYPE=  INDEPENDENT,   DEPENDENT,       DEPENDENT
##VAR_FORM=  AFFN,          ASDF,            ASDF
##VAR_DIM=   65536,         65536,           65536
##UNITS=     HZ,            ARBITRARY UNITS, ARBITRARY UNITS
##FACTOR=    0.456856943014862, 1,           1
##FIRST=     14782.0589164792, 0,            0
##LAST=      -15158.0608439998, 0,           0
##MIN=       -15158.0608439998, -6403321,    0
##MAX=       14782.0589164792, 339781889,    0
$$ Real data points
##PAGE= N=1
##DATA TABLE= (X++(R..R)), XYDATA
$$ [...]
45934c01055m44230k04094o0361m5214P8060L17881L78158J78295J8568O7122
$$ -301055 -745285 -949379 -1009740 -1054954 -976894 -659013 -280855 -102560 -83992 -16870
45924a6870P7675j73352m94395n39098k23998K50032N73125M80494K3948k97069
$$ -16870 60805 -112547 -606942 -1146040 -1370038 -1120006 -546881 -66387 -42439 -339508
45914c39508n5161M28409M05075k07865o23577l17360K17611K55325j22764l11679
$$ -339508 -394669 33740 438815 230950 -392627 -709987 -492376 -237051 -359815 -671494
45904f71494j46623K3854L8225R6744K57101K63599j9547l55674m31034j87093
$$ -671494 -818117 -794263 -756038 -659294 -402193 -138594 -158141 -513815 -944849 -1131942
45894a131942J91993M59719M69572K85569R8697m2122k75509n86822o43327k22302
$$ -1131942 -939949 -480230 -10658 274911 373608 331486 55977 -530845 -1174172 -1396474
45884a396474L55691N37789K33130r0527k5178K95014M08608R1390l79455n13708
$$ -1396474 -1040783 -502994 -269864 -360391 -385569 -90555 318053 409443 29988 -483720
45874d83720j54143L14364L90263L0156l67444m87771l48180n3874L34584O17543
$$ -483720 -637863 -323499 66764 96920 -270524 -758295 -1106475 -1160349 -825765 -208222
45864b08222N16329Q0359k84137l39953k45913j40935P5143L58040L88258J02106
$$ -208222 308107 388466 104329 -235624 -481537 -622472 -547329 -189289 198969 301075
45854C01075j10631n4562o8370l32206m03919J4810M02224J99971k03399r0200
$$ 301075 190444 135882 67512 -264694 -668613 -653803 -251579 -51608 -255007 -345207
45844c45207L58554L79634n9060k57393l0835N1721k23362l47785p5135J37082
$$ -345207 13347 392981 333921 76528 45693 97414 -125948 -473733 -548868 -411786
45834d11786R339p0612J52289K86094M7111j84833q4200J5322j93661l32016j9698
$$ -411786 -402447 -473059 -320770 -34676 12435 -172398 -256598 -241276 -434937 -766953 -786651
45823g86651L29423J40426l18991l38185J27599M93257M80725L04396P4699k65943
$$ -786651 -457228 -316802 -635793 -973978 -846379 -353122 127603 431999 506698 240755
45813B40755m87042k52533K30659L90564J53577L052J16041J08588j92134l82115
$$ 240755 -246287 -498820 -268161 122403 275980 279032 395073 503661 311527 -70588
45803g0588j90145K2748j19333l46670j81770K63408M31699J40248j89094j47377
$$ -70588 -260733 -237985 -357318 -703988 -885758 -622350 -190651 -50403 -239497 -386874
45793c86874J38699K29979l8732l45123k73087J46132M25792K31010j72592k82426
$$ -386874 -248175 -18196 -56928 -402051 -675138 -529006 -103214 127796 -44796 -327222
45783c27222l4835J92676J86987J15318R6711j3145k37650k79812Q558K76400
$$ -327222 -362057 -169381 17606 132924 229635 216490 -21160 -300972 -292414 -16014
45773a6014J38200k41412l97853k41984r5223j28609j62439m4652J21209K09080
$$ -16014 122186 -119226 -517079 -759063 -854286 -982895 -1145334 -1189986 -1068777 -859697
45763h59697K46645K57553J69050j3158j46575j73281j99582k49007j58052J22218
$$ -859697 -613052 -355499 -186449 -199607 -346182 -519463 -719045 -968052 -1126104 -1003886
45753a003886L28581K14273o9452j69500k4668R6357K9200p2844j7967J39710
$$ -1003886 -675305 -461032 -530484 -699984 -724652 -628295 -599095 -671939 -689906 -550196
45743e50196J98466O1371j87922l58581k64522R4897M12328L11843j65345m84588
$$ -550196 -351730 -290359 -478281 -836862 -1101384 -1006487 -594159 -282316 -447661 -932249
45733i32249k21934L73530O62744M08102K542j27878n0295q0433k48027l00355
$$ -932249 -1154183 -780653 -117909 290193 292735 164857 114562 34129 -213898 -514253
45723e14253j53683k7061o8763j13255L4633K60464K97345J23399k3621P19R9987
$$ -514253 -667936 -694997 -763760 -877015 -842382 -581918 -284573 -161174 -184795 -184076 -84089
45712h4089J54840J61840R8291j08056l51012l29882L4499L68148K82733j10904
$$ -84089 70751 232591 330882 222826 -128186 -458068 -423569 -55421 227312 116408
45702A16408m05745m60756m12805k58413J13561M85576M26419k1070k56055L8320
$$ 116408 -289337 -750093 -1162898 -1421311 -1307750 -822174 -395755 -416825 -672880 -634560
45692f34560M16418L47949l6438k68746k51684j83962q0689J12854J66245j06955
$$ -634560 -218142 129807 93369 -175377 -427061 -611023 -691712 -578858 -412613 -519568
45682e19568l38525n2990M65321M47862j75542n91024k90685K43590L77864K13558
$$ -519568 -858093 -911083 -445762 2100 -173442 -764466 -1055151 -811561 -433697 -220139
45672b20139J66886J86290k2863l38476l89719j95487q9256j16833j9915K24430
$$ -220139 -53253 133037 110174 -228302 -618021 -813508 -902764 -1019597 -1039512 -815082
45662h15082L32704K13507J08161J54503J80875M3358j45074k39790k56760k36701
$$ -815082 -482378 -268871 -160710 -6207 174668 218026 72952 -166838 -423598 -660299
45652f60299j55561n8942m8276m8648J47598M86875N83568K37630k20997l59956
$$ -660299 -815860 -874802 -923078 -971726 -824128 -337253 246315 483945 262948 -97008
45642i7008k24518j78923k88862k41308R4806L96215L44365P9034n6476l1037
$$ -97008 -321526 -500449 -789311 -1030619 -935813 -539598 -195233 -116199 -172675 -203712
45632b03712p6084k20387k36715p6326R622q2237q3558J85454M37399L32051L1511
$$ -203712 -279796 -500183 -736898 -813224 -803602 -885839 -969397 -783943 -346544 -14493 17018
45621A7018o0847N2824M5447r6366m5648K16457K71714m5781l27641k13057J00543
$$ 17018 -43829 8995 54442 -41924 -87572 128885 400599 354818 27177 -185880 -85337
45610h5337K58409K56079K19403P3165j75323j88720J88223M72151J39451n29002
$$ -85337 173072 429151 648554 721719 546396 357676 545899 1018050 1157501 628499
45600F28499p76350m27244l3604Q608j00596r2355m4275p0290m3539J17546K13725
$$ 628499 -147851 -575095 -608699 -600091 -700687 -793042 -837317 -907607 -951146 -833600 -619875
45589f19875N9276k15364l44047k40043j9309J32429P1480j44415k17846L9765
$$ -619875 -560599 -775963 -1120010 -1360053 -1379362 -1246933 -1175453 -1319868 -1537714 -1497949
45579a497949L69594L81346J57878J37679L78863M25636N3032l32154k91563M8287
$$ -1497949 -1128355 -747009 -589131 -451452 -72589 353047 406079 73925 -217638 -169351
45569a69351K98794L52740K93821Q6719k49965m05803j36793K77785L27326n0405
$$ -169351 129443 482183 776004 862723 612758 206955 70162 347947 675273 624868
45559F24868m17614m25656j60345Q6173J33067p698j77766k06304j17266j17332
$$ 624868 207254 -218402 -378747 -292574 -159507 -167205 -344971 -551275 -668541 -785873
45549g85873k60760k99857o1829K21365K36775P7408O3775J92253J59656p8201
$$ -785873 -1046633 -1346490 -1408319 -1186954 -950179 -872771 -808996 -616743 -457087 -535288
45539e35288j79056N8615L79502M35412K11233o4036k24188k33919j19791J8026
$$ -535288 -714344 -655729 -276227 159185 370418 306382 82194 -151725 -271516 -253490
45529b53490M6693l0495n3840N6552J64605J11071p1890k32199k75310j81857
$$ -253490 -206797 -237292 -291132 -234580 -69975 41096 -30794 -262993 -538303 -720160
45519g20160L0579K49768K85662Q8528j25772j12364R5088K56864K59975K04928
$$ -720160 -689581 -439813 -154151 -65623 -191395 -303759 -208671 48193 308168 513096
45509E13096J63935M6649k12549m78540n48352l85332j25316Q1750J42763K0155
$$ 513096 677031 723680 511131 32591 -515761 -901093 -1026409 -944659 -801896 -781741
45499g81741j98652k86651j01440J93921L08121K11859J43926K12109K52242J74361
$$ -781741 -980393 -1267044 -1368484 -1174563 -866442 -654583 -510657 -298548 -46306 128055
45489A28055J56355L03644L86061J81779j39586k86985l01974l81662m27916k22501
$$ 128055 284410 588054 974115 1155894 1016308 729323 427349 45687 -382229 -604730
45479f04730N5251J77l31575m35058j40984J39919J18018M3523J75805L35220
$$ -604730 -549479 -549302 -880877 -1315935 -1456919 -1317000 -1198982 -1155459 -979654 -644434
45469f44434L09779K49484K76181J35889l05182o03713l11115K82355N19174K78347
$$ -644434 -334655 -85171 191010 326899 21717 -581996 -893111 -610756 -91582 186765
45459A86765k6339j68105k58260k90475j15692J48525K05579P8122M6279J21381
$$ 186765 160426 -7679 -265939 -556414 -672106 -523581 -318002 -239880 -193601 -72220
45449g2220P3388o5784p0436n1623l00816n95849l68497L11377O56729L16187
$$ -72220 1168 -64616 -135052 -186675 -487491 -1083340 -1451837 -1140460 -483731 -167544
45439a67544j22369j33921l2166k41529m71211k78744Q0793J15007l037K07605
$$ -167544 -289913 -423834 -456000 -697529 -1168740 -1447484 -1366691 -1251684 -1254721 -1047116
45429a047116N56399M21150j37200l64003L053L36754J43844k16903k05166P6167
$$ -1047116 -490717 -69567 -206767 -570770 -567717 -230963 -87119 -304022 -509188 -433021
45419d33021J79217M2805m1044L4461R8679M1974p0690j64916k05404j44068l523
$$ -433021 -253804 -210999 -252043 -217582 -118903 -76929 -147619 -312535 -517939 -662007 -665530
45408f65530P0065N797m3027O7299J96944J11901j22171k02054n0203N5079q3796
$$ -665530 -595465 -589668 -632695 -565396 -368452 -256551 -378722 -580776 -630979 -575900 -659696
45397f59696k45164q5306L44396O08991M26965J1470k07526q1162J56539K24799
$$ -659696 -904860 -990166 -645770 -36779 390186 401656 194130 112968 269507 494306
45387D94306R7338m8785q0294l2021j1916m1831l4945N5237J18172J6880j75182
$$ 494306 591644 542859 462565 430544 418628 376797 341852 397089 515261 532141 356959
45376C56959k25944r5528m4708k38308m28092k87606P1784K46830J41436N3897
$$ 356959 131015 35487 -9221 -247529 -675621 -963227 -891443 -644613 -503177 -449280
45366d49280J57284K76753K57841J73325N7128j61066l21208j08831L15533L02703
$$ -449280 -291996 -15243 242598 415923 473051 311985 -9223 -118054 197479 500182
45356E00182l04047p27343l36859L28308L37857k05808l90531M2056L98210K33966
$$ 500182 196135 -531208 -868067 -539759 -201902 -407710 -798241 -756185 -357975 -124009
45346a24009o7345j35442j71172l15278k49432J13004K52350r7944l71939q3476
$$ -124009 -191354 -326796 -497968 -813246 -1062678 -949674 -697324 -795268 -1167207 -1250683
45336a250683K86476P6647l84439k95008K58677M36689L4830k36125L5915L73662
$$ -1250683 -964207 -887560 -1271999 -1567007 -1308330 -871641 -836811 -1072936 -1037021 -663359
45326f63359L06724P4021M0765O5030r4111k50878j52110L8699O9107O2383K04314
$$ -663359 -356635 -282614 -241849 -176819 -270930 -521808 -673918 -635219 -566112 -503729 -299415
45315b99415K83897M3981k57394j71867K01252L40394J11974p3961L3041J61611
$$ -299415 -15518 28463 -228931 -400798 -199546 140848 252822 178861 211902 373513
45305C73513K1817k36351l00580j42760M7131J64651K06759J38946l6868j75882
$$ 373513 395330 158979 -141601 -284361 -237230 -72579 134180 273126 236258 60376
45295F0376j41713r995L8042j3063k905J44108K86311K41636J4953k08017k59233
$$ 60376 -81337 -91332 -53290 -66353 -69258 74850 361161 602797 617750 409733 150500
45284A50500j41575l14K6265p1851j80676j76708m6490J07291J91657K32352K94130
$$ 150500 8925 8611 34876 -36975 -217651 -394359 -440849 -333558 -141901 90451 384581
45273C84581L02932Q8357l13768n60744m02312o8281K3597j05455l2606L42356
$$ 384581 687513 775870 462102 -98642 -500954 -569235 -545638 -651093 -683699 -341343
45263c41343N45471K33242k51704l94214k41462j59583j31150J08797L85283K30472
$$ -341343 204128 437370 185666 -208548 -450010 -609593 -740743 -631946 -246663 -16191
45253a6191k46019l51192J18354M89382K56981j39715j09328J11835k3318l20652
$$ -16191 -262210 -613402 -495048 -5666 251315 111600 2272 114107 90789 -229863
45243b29863j74849K69563K34560l68734o60187j32714N39288N33072P2145n6503
$$ -229863 -404712 -135149 99411 -269323 -929510 -1062224 -522936 10136 82281 25778
45233B5778K58864M22321J44865k00930k64318j81890k01121k61495j78118J2192
$$ 25778 284642 706963 851828 650898 386580 204690 3569 -257926 -436044 -423852
45223d23852R5822m2866k97717m21307k26194J90690M66198L55654M0041j24183
$$ -423852 -328030 -370896 -668613 -1089920 -1316114 -1125424 -659226 -303572 -263531 -387714
45213c87714p3593r725J8476J54525L33754K33967k05391n42736l70452J31899
$$ -387714 -461307 -471032 -452556 -298031 35723 269690 64299 -478437 -848889 -716990
45203g16990M49419L80927J60373K3999n3817j77297l06792l12527j61276J0454
$$ -716990 -267571 113356 273729 297728 243911 66614 -240178 -552705 -713981 -703527
45193g03527J5160j60932k76114r1608K89476N11427M19325K01634K5408j67242
$$ -703527 -688367 -849299 -1125413 -1217021 -927545 -416118 3207 204841 230249 63007
45183F3007l51136k65265J31743L73105P4913m15900m61565p1893J64307M1003
$$ 63007 -288129 -553394 -421651 -48546 26367 -389533 -851098 -922991 -758684 -717681
45173g17681n254K82312N19399L29689n9837k40961k31227k65157l18172k52162
$$ -717681 -722935 -440623 78776 408465 348628 107667 -123560 -388717 -706889 -959051
45163i59051j62860j71232j04222K01115M87001M05228Q3465q1958m0779k5084
$$ -959051 -1121911 -1293143 -1397365 -1196250 -709249 -304021 -220556 -302514 -343293 -368377
45153c68377j4091K00412M83565M62095J77474O9277K22249K02538j79264m92603
$$ -368377 -382468 -182056 301509 763604 941078 1010355 1232604 1435142 1255878 763275
45143G63275l53197L62J24187o304j16438q5748J1579Q6443L9714j71779l35085
$$ 763275 410078 410440 534627 528323 411885 326137 337716 424159 463873 292094 -42991
45132d2991j66887J80616K22033r4553k47996k1602R3236k21255m67373j70252
$$ -42991 -209878 -29262 192771 98218 -149778 -171380 -78144 -299399 -766772 -937024
45122i37024K38562J50379j11965J37501O20813M41856l41803o53081p7066M91239
$$ -937024 -698462 -548083 -660048 -522547 98266 540122 198319 -454762 -531828 -40589
45112d0589K82455k45554l22100n6644p426j80362k13881j30386j79678k35285
$$ -40589 241866 -3688 -325788 -382432 -389858 -570220 -784101 -914487 -1094165 -1329450
45102a329450j7035L08416L69959K44321K58988L10816L1877m44781n56494j95381
$$ -1329450 -1346485 -1038069 -668110 -423789 -164801 146015 177892 -266889 -823383 -1018764
45092a018764J02049o720k02899j06564J33978J65130K278m7223J47427L99332
$$ -1018764 -916715 -923435 -1126334 -1232898 -1098920 -933790 -931512 -978735 -831308 -431976
45082d31976M40515J72290k24783l89950j44098K28537K63287r1701m04334l38145
$$ -431976 8539 180829 -43954 -433904 -578002 -349465 -86178 -177879 -582213 -920358
45072i20358l9021J63755J77980J05563J1378n4794K1674K54349M21458L04009
$$ -920358 -959379 -795624 -617644 -512081 -500703 -555497 -533823 -279474 141984 445993
45062D45993j2494k50109k88193k27752j60336p1736J9090J3229j07310k06811
$$ 445993 433499 183390 -104803 -332555 -492891 -564627 -545537 -532308 -639618 -846429
45052h46429j74928p9819l2091K2510K02387M00370L30425k4979k53210n4284
$$ -846429 -1021357 -1101176 -1133267 -1110757 -908370 -508000 -177575 -202554 -455764 -510048
45042e10048K38278Q1637l95416m64241J09972O12012L89372j79133l08678l6289
$$ -510048 -271770 -190133 -585549 -1049790 -939818 -327806 61566 -117567 -426245 -462534
45032d62534o4490n21007p25917l31334J12461R0618o3934J80401O17452O52001
$$ -462534 -527024 -1048031 -1773948 -2105282 -1992821 -1902203 -1966137 -1785736 -1168284 -516283
45022e16283K59040n1603o3127l3241j03706j06161p684l0640j97468k06700N2970
$$ -516283 -257243 -308846 -371973 -405214 -508920 -615081 -622765 -653405 -850873 -1057573 -1004603
45011a004603K51932J12421j58639j80930Q6589L83836N19003M70877K62900l9754
$$ -1004603 -752671 -640250 -798889 -979819 -893230 -509394 9609 480486 743386 703632
45001G03632k87512l74996l50363k87102j66272r383L4084p9930j17977J22839
$$ 703632 416120 41124 -309239 -596341 -762613 -771996 -737912 -817842 -935819 -812980
44991h12980M38757M44262J41338n1492R8494L04124J87585j79929l91545k42987
$$ -812980 -374223 70039 211377 159885 258379 562503 750088 570159 178614 -64373
44981f4373O2798K24886J76501O4797J4543l529q1385k00173k08624j8066K30786
$$ -64373 -1575 223311 399812 464609 479152 475623 394238 194065 -14559 -32625 198161
44970A98161L00663J50909k5313p9306p9604j40227k14547j72898J815J88610
$$ 198161 498824 649733 624420 545114 465510 325283 110736 -62162 -60347 128263
44960A28263K28255J2558l90351o60736m93557m3834J58281p7429k72629K6166
$$ 128263 356518 369076 -21275 -682011 -1175568 -1219402 -1061121 -1138550 -1411179 -1385013
44950a385013N20225N80761J95519o5572M3197J76620R1663o129K0698l0403j99032
$$ -1385013 -864788 -284027 -88508 -154080 -110883 65737 157400 151271 171969 141566 -57466
44939e7466j59400J38562J87520k69462o69367m25121J46278L27362Q5603m3043
$$ -57466 -216866 -78304 109216 -160246 -829613 -1254734 -1108456 -781094 -695491 -738534
44929g38534Q2276R8485j08814k49338k14866j85684j49966O3708K77035J37376
$$ -738534 -656258 -557773 -666587 -915925 -1130791 -1316475 -1466441 -1402733 -1125698 -988322
44919i88322j77848j31914K32081K89481p5148k05811J88259M65367J09258l87852
$$ -988322 -1166170 -1298084 -1066003 -776522 -851670 -1057481 -869222 -403855 -294597 -682449
44909f82449l23911J32599L44794K16023Q7644p210k56858m68211k53349K77478
$$ -682449 -1006360 -873761 -528967 -312944 -225300 -232510 -489368 -957579 -1210928 -933450
44899i33450N99586M90683J77192j24467l27285k61324J35482M85405L33492j83769
$$ -933450 -333864 156819 334011 209544 -117741 -379065 -243583 241822 575314 391545
44889C91545m80090k98606O4300K60755K11416j0066k19676j43996K15213L91593
$$ 391545 -88545 -387151 -322851 -62096 149320 139254 -80422 -224418 -9205 382388
44879C82388N9216l78906l28743Q2776K61451J23640P3244J15327j34304n16594
$$ 382388 441604 62698 -266045 -183269 78182 201822 275066 390393 256089 -260505
44869b60505l54269L49153O62772J09731n47086m72213K5684J41286j56648k97700
$$ -260505 -614774 -265621 397151 506882 -40204 -512417 -486733 -345447 -502095 -799795
44859g99795j54373r5045j83693p7974K99559O01376O07543M56740K89570P6686
$$ -799795 -954168 -1049213 -1232906 -1310880 -1011321 -409945 197598 654338 943908 1020594
44849A020594j51437k51926j98251j08553o0283q8627k58678m80397m13302Q9303
$$ 1020594 869157 617231 418980 310427 250144 161517 -97161 -577558 -990860 -901557
44839i01557N68814M22652k54066p17035n11737L6418L78792M08862L65813L68960
$$ -901557 -332743 89909 -164157 -881192 -1392929 -1356511 -977719 -568857 -203044 165916
44829A65916L29647J93645L1006r3568j89132k62299k62628j50496N399O0323
$$ 165916 495563 689208 720214 626646 437514 175215 -87413 -237909 -232510 -172187
44819a72187l0423j13601j2316K20071L42329K25714j7139k05242k43401j12469
$$ -172187 -202610 -316211 -328527 -108456 233873 459587 442448 237206 -6195 -118664
44809a18664J07527K07005N6541j58846j69534n6278j06165k43929q7435L23614
$$ -118664 -11137 195868 252409 93563 -75971 -132249 -238414 -482343 -569778 -246164
44799b46164M14311l6408m40026k52085J97668K54037p6232k86015k30420j87656
$$ -246164 168147 131739 -308287 -560372 -362704 -108667 -184899 -470914 -701334 -888990
44789h88990k24782j26104J13947K76393L39974M16835L68509K6285l11640k06644
$$ -888990 -1113772 -1239876 -1125929 -849536 -509562 -92727 275782 302067 -9573 -216217
44779b16217J60458J99774j35082k93216p3356J04259J5802j6749J60745J94611
$$ -216217 -55759 144015 8933 -284283 -357639 -253380 -237578 -254327 -93582 101029
44769A01029o1552j78967O8851J99995j77844o16754m78055R5874M71262M53553
$$ 101029 39477 -139490 -70639 129356 -48488 -665242 -1143297 -1047423 -576161 -122608
44759a22608L26690K18036K3795j86300k29240j74943j99793k00378P119K42755
$$ -122608 204082 422118 445913 259613 30373 -144570 -344363 -544741 -537622 -294867
44749b94867J81719r2156k10199j05506k0322p945R6094K44934J98956k1953j51440
$$ -294867 -113148 -205304 -415503 -521009 -541331 -549276 -453182 -208248 -9292 -31245 -182685
44738a82685j47410j97023k41921j413M46965O16701L08706r9556k56032k73844
$$ -182685 -330095 -527118 -769039 -770452 -323487 293214 601920 502364 246332 -27512
44728b7512l19921k20646J41777L99030J38884m07476n81613j60604L80212N05276
$$ -27512 -347433 -568079 -426302 -27272 111612 -295864 -877477 -1038081 -657869 -152593
44718a52593K04936j52189k99742k40579q1006J04514K55034L07779K53328J36239
$$ -152593 52343 -99846 -399588 -640167 -721173 -616659 -361625 -53846 199482 335721
44708C35721m2761l37175o74418p67226m10995J50131M09027K13925o3840r6937
$$ 335721 292960 -44215 -718633 -1485859 -1896854 -1746723 -1337696 -1123771 -1187611 -1284548
44698a284548j9299m6976j8147K90331O26033N42469J18885j18764N423J26177
$$ -1284548 -1303847 -1350823 -1368970 -1078639 -452606 89863 208748 89984 95407 221584
44688B21584K3443n4368L9809L307l35062n47468k09732L46004M34669J5212k78926
$$ 221584 245027 190659 230468 233775 -101287 -648755 -858487 -512483 -77814 -62602 -341528
44677c41528r7612J80872J20150j17707r9697J77931L00789P4414j87360j05290
$$ -341528 -439140 -258268 -138118 -255825 -355522 -177591 123198 197612 10252 -95038
44667i5038K52965M77194L39412K7558j50774j24322l4799M262j1705n6248q9969
$$ -95038 157927 635121 974533 1002091 851317 726995 692196 696458 684753 628505 538536
44656E38536n7506O537n0208k60916l75361j65252J73187K16672p9779k92798
$$ 538536 481030 487567 437359 176443 -198918 -364170 -190983 25689 -54090 -346888
44646c46888j31149J74537K33168p396k96056m06293k63326O3177L36078L14812
$$ -346888 -478037 -303500 -70332 -77728 -373784 -780077 -1043403 -980226 -644148 -329336
44636c29336R1707M0910K64829L64312J4044m90562n99450k38726J80455L49947
$$ -329336 -237629 -196719 68110 432422 446466 -44096 -643546 -882272 -701817 -351870
44626c51870K89805Q0874k20778m14860k93403L269J13873j440j495K49774M03819
$$ -351870 -62065 18809 -201969 -616829 -910232 -906963 -793090 -794530 -796025 -546251 -142432
44615a42432J39214l33479n30486k83146J42691L85223K76345q1262l66900k80690
$$ -142432 -3218 -336697 -867183 -1150329 -1007638 -622415 -346070 -427332 -794232 -1074922
44605a074922J25525M51304L97854R9610j08784j09230k1666N6248J17765J25154
$$ -1074922 -949397 -498093 -100239 -629 -109413 -218643 -240309 -184061 -66296 58858
44595E8858K7620j13871j81098j60940j13981k7114J26566K13798N1575k70035
$$ 58858 86478 -27393 -208491 -369431 -483412 -510526 -383960 -170162 -118587 -388622
44585c88622l97379j57395J83754K56931N3846j23110q5857P2365K03138K66590
$$ -388622 -786001 -943396 -759642 -502711 -448865 -571975 -657832 -585467 -382329 -115739
44575a15739K27864K3333k40612k60202P4897L97356K52390k60580n39451k42394
$$ -115739 112125 135458 -105154 -365356 -290459 106897 359287 98707 -440744 -683138
44565f83138K84402M94334L04039L4911j13711k15203l13886k99911j36491L5076
$$ -683138 -398736 95598 399637 434548 320837 105634 -208252 -508163 -644654 -609578
44555f09578J02728J11319J10448N0208q1917j73853j37093j6521J23781K80236
$$ -609578 -506850 -395531 -285083 -234875 -316792 -490645 -627738 -644259 -520478 -240242
44545b40242L87938K86720n0739l95900n23786m63779l24321m0284M21685P27742
$$ -240242 147696 434416 383677 -12223 -536009 -999788 -1324109 -1364393 -942708 -214966
44535b14966M59741k07920n31218j25800M70644N16943Q3196j47633K9271Q2092
$$ -214966 244775 36855 -494363 -620163 -149519 367424 450620 302987 332258 414350
44525D14350k77690n03953o9413N62628N00887k41459p23239m31483O9741J13587
$$ 414350 136660 -367293 -436706 125922 626809 385350 -337889 -769372 -699631 -586044
44515e86044j15270q4562J47859J45630o0668m1059K12058K07360k07891n24989
$$ -586044 -701314 -785876 -638017 -492387 -553055 -594114 -382056 -174696 -382587 -907576
44505i07576l15294J65678M02058L06292J78688K02584K69731K05661k7258k97864
$$ -907576 -1222870 -1057192 -655134 -348842 -170154 32430 302161 507822 480564 182700
44495A82700l97753k57226q1397j11507k63623k39607K832J94866K14204K42028
$$ 182700 -215053 -472279 -553676 -665183 -928806 -1168413 -1165581 -970715 -756511 -514483
44485e14483L52668L32481J02654n8085J8222N9024j71557m03093k94628o3647
$$ -514483 -161815 170666 273320 215235 233457 292481 120924 -282169 -576797 -640444
44475f40444j56399m44914l38082K73784P28120M57308k35043n55765j86495M00865
$$ -640444 -796843 -1241757 -1579839 -1306055 -577935 -120627 -355670 -911435 -1097930 -697065
44465f97065N56501J95931j63263p9675K49033K83003p4105l26542j24645K24952
$$ -697065 -140564 55367 -107896 -187571 61462 344465 270360 -56182 -180827 44125
44455D4125K56548K8397p4974J4506N1185k0578l1437M352r8171k75629k50053
$$ 44125 300673 329070 254096 268602 319787 299209 267772 272124 173953 -101676 -351729
44444c51729j9319J09780L8994Q23P1618J1915k40237l47467q9659K61233L59500
$$ -351729 -371048 -261268 -222274 -221451 -149833 -137918 -378155 -725622 -815281 -554048 -194548
44433a94548K73178K59363L08456K34578M7835p4473r8185j54356k85495l63323
$$ -194548 78630 337993 646449 881027 928862 854389 756204 601848 316353 -46970
44423d6970k66922m4412J07507K7453j96238k65047n0291J81041J36313m6964
$$ -46970 -313892 -358304 -250797 -223344 -419582 -684629 -734920 -553879 -417566 -464530
44413d64530m5394P5890j0532k47171k28582N6883J41990q1654r9354L22029O15728
$$ -464530 -509924 -434034 -444566 -691737 -920319 -863436 -721446 -803100 -902454 -580425 35303
44402C5303K93592k29979k97366r857J15086Q8217K64720M83289K41584l53107
$$ 35303 328895 98916 -198450 -208307 -93221 -5004 259716 743005 984589 631482
44392F31482o29027l84842j16039j05843n3569J82180K16894j29920l84087j41605
$$ 631482 2455 -382387 -498426 -604269 -657838 -475658 -258764 -388684 -772771 -914376
44382i14376K73893L49680J51414N6418P0035m9606k10198q0608L02494M97959
$$ -914376 -640483 -290803 -139389 -82971 -12936 -62542 -272740 -353348 -50854 447105
44372D47105K69470j18104k80442j45232O1541R6685p5074k56491k41600r1317
$$ 447105 716575 598471 318029 172797 234338 331023 255949 -542 -242142 -333459
44362c33459n3525j58416j24982J76798M23435K64957j37695l30380k02057m6721
$$ -333459 -386984 -545400 -670382 -493584 -70149 194808 57113 -273267 -475324 -522045
44352e22045l9349l4998N8607Q5358k0667k2530K34721M55566K47138k51617m57942
$$ -522045 -561394 -596392 -537785 -452427 -473094 -495624 -260903 194663 441801 190184 -267758
44341b67758j26136K88538K50415j26598l02810j31117m217j29005j51490J92945
$$ -267758 -393894 -105356 145059 18461 -284349 -415466 -419683 -548688 -700178 -507233
44331e07233M81979J85019m00676m48731J65524O10273K92998l08685m19596o0773
$$ -507233 -25254 159765 -240911 -689642 -524118 86155 379153 70468 -349128 -409901
44321d09901J89373J72946K18698L72176K59326j86535m61289k03761K65245M04471
$$ -409901 -220528 -47582 171116 543292 802618 616083 154794 -48967 216278 620749
44311F20749J30412k38723m43164m01488j07934K72063L79349O2609l21691l34974
$$ 620749 751161 512438 69274 -332214 -440148 -168085 211264 273873 -47818 -382792
44301c82792o5758O3252J0895J49950N21955O01952R3239m92998m95538m0133
$$ -382792 -448550 -385298 -374403 -224453 297502 899454 992693 499695 4157 -35976
44291c5976K00572J8337j41609r43J44530K7307j16363q234J55476O5780j33038
$$ -35976 164596 182933 41324 40381 184911 212218 95855 87621 243097 308877 175839
44280A75839j03727O9755K3264k43860l65980k26296q0069j8652J80444N17987
$$ 175839 72112 141867 165131 -78729 -444709 -671005 -751074 -769726 -589282 -71295
44270g1295N82022J73020k83864l09268n0380R934j81271k24708L7278K39256
$$ -71295 510727 683747 399883 90615 40235 50169 -131102 -355810 -318532 -79276
44260g9276L8103l55386m22946j7758M18364L83757o1420l81424k69453p674L9908
$$ -79276 -41173 -396559 -819505 -837263 -418899 -35142 -96562 -477986 -747439 -755113 -715205
44249g15205J3498K57839O11799N43222K3127l22431j52186O7204j33124m10765
$$ -715205 -701707 -443868 167931 711153 734280 411849 259663 326867 193743 -217022
44239b17022j88672L12952L46407j75117m98732j70519K97533K31459k06783k89834
$$ -217022 -405694 -92742 253665 78548 -420184 -590703 -293170 -61711 -268494 -558328
44229e58328K21749P49127O48084o788n47824n11723j23505Q1117l7278j34590
$$ -558328 -336579 412548 1060632 1053844 506020 -5703 -129208 -48091 -85369 -219959
44219b19959J2427J58604L8063j47215l8187K64983L15882K100k92784k53079
$$ -219959 -207532 -48928 -10865 -158080 -196267 68716 384598 386698 93914 -159165
44209a59165j065J85063K06028Q3226j40661l03478j87433J57251L63730J75936
$$ -159165 -160230 24833 230861 314087 173426 -130052 -317485 -160234 203496 379432
44199C79432k43088n30765m73935q2552M35066O86988L89765k01141m55664j62057
$$ 379432 136344 -394421 -868356 -950908 -515842 171146 560911 359770 -95894 -257951
44189b57951J60385K915m10176n19884k70091m8603M1847K71055O32507O92178
$$ -257951 -97566 -94651 -504827 -1024711 -1294802 -1343405 -1301558 -1030503 -397996 294182
44179B94182K79167j56723j72637N8633J09440l6269q1824J8209L6519o4104p7231
$$ 294182 573349 416626 243989 302622 412062 375793 293969 312178 348697 284593 207362
44168B07362K4531J9032j27990j43228P0630J88873m1734l47551k82941J41106
$$ 207362 231893 250925 122935 -20293 50337 239210 197476 -150075 -433016 -291910
44158b91910M91768M60152J02150l41913n85100l82479J81855N88492M22201n2754
$$ -291910 199858 660010 762160 420247 -164853 -547332 -365477 223015 645216 592462
44148E92462k42694p1639J0964j42147j44838J61762L31681M6943k94107j83809
$$ 592462 349768 278129 289093 146946 2108 163870 495551 542494 248387 64578
44138F4578K07492L67771K55085K13444K83818J83340j00174k31891p4226J37787
$$ 64578 272070 639841 894926 1108370 1392188 1575528 1475354 1243463 1169237 1307024
44128A307024K13515K18888K27106J97870J46399J36682J02920l5582j25706K4997
$$ 1307024 1520539 1739427 1966533 2164403 2310802 2447484 2550404 2514822 2389116 2414113
44118B414113K53149K09661r1274k75972j76111j1512J6800n9066j90977l56985
$$ 2414113 2667262 2876923 2785649 2509677 2333566 2322054 2338854 2279788 2088811 1731826
44108A731826l59742p687M38925M46831m9270n11149n43884l56449l00027l58686
$$ 1731826 1372084 1364397 1803322 2250153 2200883 1689734 1145850 789401 489374 130688
44098A30688l33623j91169M820K24706L57263K38883n6843k36354j93136r6837
$$ 130688 -202935 -394104 -389284 -164578 192685 431568 374725 138371 -54765 -151602
44088a51602k8944R2159J79376L2607j89954p7129L20119M41289Q3811k70590
$$ -151602 -180546 -88387 90989 123596 -66358 -143487 176632 617921 701732 431142
44078D31142k52553j07165p4416P1727M19308M95595J4605n06436m85038j34697
$$ 431142 178589 71424 -2992 68735 488043 983638 998243 491807 6769 -127928
44068a27928K7725M3258J97819L11093R9819j32553L7830L26893J97764j48602
$$ -127928 -100203 -56945 140874 451967 551786 419233 457063 783956 981720 833118
44058H33118j12501K03075J62761k54280m28059j97106n3494j86459k38983j22723
$$ 833118 720617 923692 1086453 832173 404114 207008 153514 -32945 -271928 -394651
44048c94651j73868l42126j36530L95929N49944J18178k32441j03687K4681k08839
$$ -394651 -568519 -910645 -1047175 -651246 -101302 16876 -215565 -319252 -294571 -503410
44038e03410l49102k7713K69954O2600k30496m5701L04166K31498l0982J19282
$$ -503410 -852512 -880225 -610271 -547671 -778167 -823868 -519702 -288204 -319186 -199904
44028a99904M92194L88647j57746m13129j87057r3782m24828o26009k29536L77598
$$ -199904 292290 680937 523191 110062 -76995 -170777 -595605 -1221614 -1451150 -1073552
44018a073552N47228K59756j1723k9348K1677m7250j35389k5651K65446M02864
$$ -1073552 -526324 -266568 -278291 -307639 -285962 -333212 -468601 -494252 -228806 174058
44008A74058J05621l87106m63429P2402O17080M99131j07804m35295j82795J73549
$$ 174058 279679 -107427 -570856 -498454 118626 617757 509953 74658 -108137 65412
43998F5412J75185k8440q6923j4946k7525j03299q4217n4419k39857n46759n46468
$$ 65412 240597 212157 125234 110288 82763 -20536 -104753 -159172 -399029 -945788 -1492256
43987a492256m8060N52093P01524L59535p8m2894L0877j25665m50133n73552l75702
$$ -1492256 -1540316 -988223 -286699 72836 72758 29864 60741 -64924 -515057 -1088609 -1464311
43976a464311j14250J8960J44408L67411M90054K87113r5483k66304o3062K72110
$$ -1464311 -1578561 -1559601 -1415193 -1047782 -557728 -270615 -366098 -632402 -695464 -423354
43966d23354L80955J53628j82031k99555j33409M0218j7535j46565l9132K17195
$$ -423354 -42399 111229 -70802 -370357 -503766 -463548 -481083 -627648 -666780 -449585
43956d49585K15527r6957k42575P8923M81713M19665m9966l94465l28044n2783
$$ -449585 -234058 -331015 -573590 -494667 -12954 406711 356745 -37720 -365764 -418547
43946d18547J29232J24759j214j36515j82836j50697j38262j36594k3329J50655
$$ -418547 -289315 -164556 -165770 -302285 -485121 -635818 -774080 -910674 -934003 -783348
43936g83348J34321q0419j02534K72560O18004M19422j59301n10257m32203k57512
$$ -783348 -649027 -729446 -831980 -559420 58584 478006 318705 -191552 -623755 -881267
43926h81267j99511r0868J70399L74473L40990J59513l2788k10895k99286j53516
$$ -881267 -1080778 -1171646 -1001247 -626774 -285784 -126271 -159059 -369954 -669240 -822756
43916h22756J63772L47613K30209o368r8643K407J77795K97199K62935P0425j20976
$$ -822756 -658984 -311371 -81162 -87530 -186173 -183766 -5971 291228 554163 624588 503612
43905E03612j28792K3119J60950K08112J91325P2388j70429l44365k27919N2773
$$ 503612 374820 397939 558889 767001 958326 1030714 860285 515920 288001 340774
43895C40774J43544k7827j83613j66902j25366j50988j09318L3894P5378m4399
$$ 340774 484318 456491 272878 105976 -19390 -170378 -279696 -245802 -170424 -214823
43885b14823n4944K06434M56155L45553l7153l30351l96347l67972l13806j51635
$$ -214823 -269767 -63333 392822 738375 701222 370871 -25476 -393448 -707254 -858889
43875h58889J20543L28689K95506J4281l24634m34119j69276K48800L88681J17934
$$ -858889 -738346 -409657 -114151 -99870 -424504 -858623 -1027899 -779099 -390418 -272484
43865b72484j81769q3331L16597N20658K76851j36569l14357k04129n5292k2270
$$ -272484 -454253 -537584 -220987 299671 576522 439953 125596 -78533 -133825 -156095
43855a56095j1910Q1160J72241J27453p977q2332q2716j16193j57110m7316J90963
$$ -156095 -168005 -86845 85396 212849 204872 122540 39824 -76369 -233479 -280795 -89832
43844h9832K87696R9952j69587k87642k95512l01618k12133N6376K99482K79712
$$ -89832 197864 297816 128229 -159413 -454925 -756543 -968676 -912300 -612818 -333106
43834c33106J05591L3745L6362p9853k43741k04688Q159R7620l7356j89698j89128
$$ -333106 -227515 -193770 -157408 -237261 -481002 -685690 -677531 -579911 -617267 -806965 -996093
43823i96093n5099J51840L35402L16968J05999N9926L77512O29894L16235k84853
$$ -996093 -1051192 -899352 -563950 -246982 -140983 -81057 296455 926349 1242584 957731
43813I57731m55374j31185O9900q6326j54273Q0900K08125p373j81298l9236J09101
$$ 957731 502357 371172 441072 354746 200473 281373 489498 482125 300827 261591 370692
43802C70692L1209K0366K16938J71111l41197p05071l48345K97443M38523P7946
$$ 370692 401901 422267 639205 810316 469119 -235952 -584297 -286854 151669 229615
43792B29615k02849k36424k63656k29303J06898N14437N07188J46769m0670R9163
$$ 229615 26766 -209658 -473314 -702617 -595719 -81282 425906 572675 532005 631168
43782F31168K18865J39076O1463J25251K62357M40458N84975M11343j49503n72825
$$ 631168 850033 989109 1050572 1175823 1438180 1878638 2463613 2874956 2725453 2152628
43772B152628l98489l9269k00362o82249o36393L5881M86630K52806j36172j52897
$$ 2152628 1754139 1714870 1514508 832259 195866 231747 718377 971183 835011 682114
43762F82114q410m404O1263L38860M42122Q6256l05639j92799K83895N98000N92376
$$ 682114 673704 669300 730563 1069423 1511545 1597801 1292162 1099363 1383258 1981258 2573634
43751B573634M64933K96519N4736j51875k23783k92260m72757o04492n24499l70689
$$ 2573634 3038567 3335086 3389822 3237947 3014164 2721904 2249147 1644655 1120156 749467
43741G49467l29459l21196k14049r9006p1929k992J87105K89505J49619k5812
$$ 749467 420008 98812 -115237 -214243 -286172 -289164 -102059 187446 337065 311253
43731C11253k4600p075j66083k93521j18511J53454J20490j47213k14264R568
$$ 311253 286653 279578 113495 -180026 -298537 -145083 -24593 -171806 -386070 -376502
43721c76502J55213K5322j04348M8537L37895M03688J26748k74107m91223l87683
$$ -376502 -221289 -195967 -300315 -251778 86117 489805 616553 342446 -148777 -536460
43711e36460p1564K35030L94559L97818K58092M254k19307k36138o9721R1842
$$ -536460 -608024 -372994 21565 419383 677475 681729 462422 226284 156563 248405
43701B48405J84005K74220K66333m6436n19968o49724k49540K29113L42040K56646
$$ 248405 432410 706630 972963 926527 406559 -243165 -492705 -263592 78448 335094
43691C35094L47413N15764L83368l6062l37071l15569j57362p0298o7926r8907
$$ 335094 682507 1198271 1581639 1545577 1208506 892937 735575 665277 597351 498444
43681D98444j17054n7048N2064N3492o6202o2964J67112L12824Q8313k78685l67893
$$ 498444 381390 324342 376406 429898 363696 300732 467844 780668 868981 590296 222403
43670B22403j73888O7O3464J32819J82805J44159J73633L62370L79110n1325n09674
$$ 222403 48515 48582 112046 244865 427670 571829 745462 1107832 1486942 1435617 925943
43659I25943l75118J66136L36497l3158l11294j74008p1461l08110m52356j19230
$$ 925943 550825 716961 1053458 1020300 709006 534998 463537 155427 -296929 -416159
43649d16159L20936L59479J47464J00818J29935j15833n07210n47986j25022L39901
$$ -416159 -95223 264256 411720 512538 642473 526640 19430 -528556 -653578 -313677
43639c13677M54644K25709q2778j93181r406K28045J41630k49509m50705j77658
$$ -313677 140967 366676 283898 90717 81311 309356 450986 201477 -249228 -426886
43629d26886J92539J83559p4914j26607P0962J67088L5164j00655q6660K7209
$$ -426886 -234347 -50788 -125702 -252309 -181347 -14259 20905 -79750 -166410 -139201
43619a39201K10839M18321M12253M5774l48732l11150L6862J24616j98805m48855
$$ -139201 71638 489959 902212 947986 599254 288104 324966 449582 250777 -198078
43609a98078k77748M9888J73044J61682K18934K38813M1974k02882j78468R9734
$$ -198078 -475826 -425938 -252894 -91212 127722 366535 408509 205627 27159 126893
43599A26893L31898L77509L55473L42298K41525j6388l29696n14150m28711n2657
$$ 126893 458791 836300 1191773 1534071 1775596 1759208 1429512 915362 486651 433994
43589D33994M22137O25337L34778k04373m73585k78006J0938m7236l48892l70425
$$ 433994 856131 1481468 1816246 1611873 1138288 860282 871220 823984 475092 104667
43579A04667R5594O04601O28903K56115K8425J71468L41303J96445j36292l52971
$$ 104667 200261 804862 1433765 1689880 1718305 1889773 2231076 2427521 2291229 1938258
43569A938258m22845m72377m52263k49964J0132J03293L9745l9375j73551m27483
$$ 1938258 1515413 1043036 590773 340809 350941 454234 493979 454604 281053 -146430
43559a46430n42323k07973L34527M73785J08189j67196M1945L47981K40612j00356
$$ -146430 -688753 -896726 -562199 -88414 19775 -147421 -105476 242505 483117 382761
43549C82761j24107K23428M56384K78595q9872l27486l84348l56854k65291r1130
$$ 382761 258654 482082 938466 1217061 1127189 799703 415355 58501 -206790 -297920
43539b97920J04875K07665J65987P6353J19262L05389L23859j08787p08774p91819
$$ -297920 -193045 14620 180607 256960 376222 681611 1005470 896683 187909 -603910
43529f03910j77888M33396L32465k61323n70189l28359N0759K39355L20337L39603
$$ -603910 -781798 -348402 -15937 -277260 -847449 -1175808 -1125049 -885694 -565357 -225754
43519b25754J49480j47339j62358J22315J79717k45840o21033l66507K57477N37769
$$ -225754 -76274 -223613 -385971 -263656 -83939 -329779 -950812 -1317319 -1059842 -522073
43509e22073L36956J59715K84904M15295K77930O5731N0567J22435J4066k24535
$$ -522073 -185117 -25402 259502 674797 952727 1018458 1069025 1191460 1205526 980991
43499I80991k75723j4108L12687L88774J87409j9831L8290L47923O17072N70346
$$ 980991 705268 691160 1003847 1392621 1580030 1560199 1598489 1946412 2563484 3133830
43489C133830K22293j70442l93968m32770l51323j57308J20688L06990K01753
$$ 3133830 3356123 3185681 2791713 2358943 2007620 1850312 1971000 2277990 2479743
43480B479743j39306l94419l47120j56885j04174j58190n4304K01129K41264q4912
$$ 2479743 2340437 1946018 1598898 1442013 1337839 1179649 1125345 1326474 1567738 1482826
43470A482826l70223j98230K05936K96482M7001l1770K74907N61004M70991K10045
$$ 1482826 1112603 914373 1120309 1416791 1463792 1432022 1706929 2267933 2738924 2948969
43460B948969J05332Q0942n9869j75294n3589J00896o9912m62939o29731m48886
$$ 2948969 3054301 3135243 3075374 2900080 2846491 2947387 2877475 2414536 1784805 1335919
43450A335919k32458j69390j21603m0754j25433l83498m43471q0799L63273M09998
$$ 1335919 1103461 934071 812468 771714 646281 262783 -180688 -261487 101786 511784
43440E11784J08993n4509J43227L67480K01791k80360n85693m03832J0317J51164
$$ 511784 620777 566268 709495 1076975 1278766 998406 412713 8881 19198 170362
43430A70362j15092m17805l94719j25479Q2347J48300K25248L59179M09802K99617
$$ 170362 55270 -362535 -757254 -882733 -800386 -652086 -426838 -67659 342143 641760
43420F41760J27449J6675K800N4097P1235o7016l08021l81314j40377J73610K35862
$$ 641760 769209 785884 788684 842781 914016 847000 538979 157665 17288 190898 426760
43409D26760P0285q1490j53406j84661m6545L09150M77889M9679o12882o86902
$$ 426760 497045 415555 262149 77488 30943 340093 817982 867661 254779 -432123
43399d32123p0643M14954K28351j60017j16972J85971J93682j02038k55445j05893
$$ -432123 -502766 -87812 140539 -19478 -136450 49521 243203 141165 -114280 -220173
43389b20173J30357L12776M28332L60869Q1151q2802J60601N16926M22187j56416
$$ -220173 -89816 222960 651292 1012161 1093312 1010510 1171111 1688037 2110224 1953808
43379A953808o79174p50768m61928n8442K99359M46852L01660Q9501J35415L99097
$$ 1953808 1274634 523866 61938 3496 302855 749707 1051367 1140868 1276283 1675380
43369A675380N33842M01720K07101J41809K31203M88733Q60164J065292Q96330
$$ 1675380 2209222 2610942 2818043 2959852 3191055 3679788 4539952 5605244 6501574
43360F501574O28478O94673R94032J031152P45694O34269R62840J445061J845539
$$ 6501574 7130052 7824725 8818757 9849909 10595603 11229872 12192712 13637773 15483312
43351A5483312K275737K667406K632036K204233K017030K174470J615379n49893
$$ 15483312 17759049 20426455 23058491 25262724 27279754 29454224 31069603 30519710
43343C0519710l449098n130250m767773l375671k290172j788723j479061j251997
$$ 30519710 27070612 21940362 17172589 13796918 11506746 9718023 8238962 6986965
43335F986965j236310j255002r85946n29934k97759l48815k92712O7509L93115
$$ 6986965 5750655 4495653 3509707 2979773 2682014 2333199 2040487 2107996 2501111
43326B501111L13467k7802k18776j83928j92687l21206k90437M7732L90322L78214
$$ 2501111 2814578 2786776 2568000 2384072 2191385 1870179 1579742 1627474 2017796 2396010
43316B396010Q7792j36001j77347j86486k24941k00302j27130j35146j92083j17310
$$ 2396010 2483802 2347801 2170454 1983968 1759027 1558725 1431595 1296449 1104366 987056
43306I87056P1954J18409p7934k80851k43515J2339L16590N05751M08352j2391
$$ 987056 1059010 1177419 1099485 818634 575119 587458 904048 1409799 1818151 1805760
43296A805760m16208l50765R4811L03515J5552k53448l5206L05719J58676k96672
$$ 1805760 1389552 1038787 1133598 1437113 1452665 1199217 1164011 1469730 1628406 1331734
43286A331734l38795J35860M37065J56323k61718k89475q7288j09704l62487n09782
$$ 1331734 992939 1128799 1565864 1722187 1460469 1170994 1083706 974002 611515 101733
43276A01733m56735l73594k90889r8740J15482J30138O32M2878L31621N39201
$$ 101733 -355002 -728596 -1019485 -1118225 -1002743 -872605 -871973 -829095 -497474 41727
43266D1727M05616R7960o6750l8456J2651j5777j12747k52967l39631j79636K49883
$$ 41727 447343 545303 478553 440097 452748 436971 324224 71257 -268374 -448010 -198127
43255a98127O07388N21173P5299k86679l11069j24937Q8819K76596L37830J28886
$$ -198127 409261 930434 1005733 719054 407985 283048 371867 648463 986293 1115179
43245A115179k18370l15092n0457J89263O9993k01965k26121J841J79520J95108
$$ 1115179 896809 581717 531260 720523 790516 588551 362430 364271 543791 738899
43235G38899J80280J78165R9654l7481j06554p0861K5465J66659K66589J30721
$$ 738899 919179 1097344 1196998 1159517 1052963 982102 1007567 1174226 1440815 1571536
43225A571536k36483m78365l19065N9052L48342N23838N64761J79578o29653j113089
$$ 1571536 1335053 856688 537623 596675 945017 1468855 2033616 2213194 1583541 470452
43215D70452o38653K47603M80982K8457j90892J29411L31147J54747K18189O87205
$$ 470452 -168201 79402 560384 588841 397949 527360 858507 1013254 1231443 1918648
43205A918648O89746j92771r38539n70496K70345L74936j23871j83061K81568
$$ 1918648 2608394 2415623 1477084 906588 1176933 1551869 1427998 1244937 1526505
43196A526505L68449j10602k95599J80160N54089K37399k89544m04927k96388
$$ 1526505 1894954 1784352 1488753 1668913 2223002 2460401 2170857 1765930 1469542
43187A469542l72631m29552j03073L31089L20959o0914k13847Q9154M21381L57678
$$ 1469542 1096911 667359 564286 895375 1216334 1155420 941573 1030727 1452108 1809786
43177A809786K1510j45214N3530L61807L80392K8654l44602l53225p179L57732
$$ 1809786 1831296 1686082 1739612 2101419 2481811 2510465 2165863 1812638 1805459 2163191
43167B163191N09054M95853M30901L08791R1969j62450l14577k34327O4267L26120
$$ 2163191 2672245 3168098 3598999 3907790 3999759 3837309 3522732 3288405 3352672 3678792
43157C678792K31725k07399n82375n63769k69294P961K02503L66498M02739K30551
$$ 3678792 3910517 3703118 3120743 2556974 2287680 2295641 2498144 2864642 3267381 3497932
43147C497932K4523l9457q1337k23782k41041Q3360M73019N13170K95595J87492
$$ 3497932 3522455 3482998 3401661 3177879 2936838 3020198 3493217 4006387 4301982 4489474
43137D489474J44113j35801m98718m79256j41887n8823l47804m47757p0707K95457
$$ 4489474 4633587 4497786 3999068 3519812 3377925 3319102 2971298 2523541 2452834 2748291
43127B748291J67015k14646l24180q3593K01654K98820J54712j52170l54655j99637
$$ 2748291 2915306 2700660 2376480 2292887 2494541 2793361 2948073 2795903 2441248 2241611
43117B241611J48491K70797J69571L10648Q11166J108695P47390L6063m28849
$$ 2241611 2390102 2660899 2830470 3141118 3952284 5060979 5808369 5844432 5415583
43108E415583n00807l88862j97843L7837J43282O020k03948k93127l06924l07916
$$ 5415583 4914776 4525914 4328071 4365908 4509190 4515210 4311262 4018135 3711211 3403295
43098C403295j67864J53858L79325K41322j41449m29089m26929j64150J65338
$$ 3403295 3235431 3389289 3768614 4009936 3868487 3439398 3012469 2848319 3013657
43089C013657K55343l8442m14123m35425j42174O1485J09859K99196N59036M02285
$$ 3013657 3269000 3230558 2816435 2381010 2238836 2300321 2410180 2709376 3268412 3670697
43079C670697j84455n23319k62218Q6647N6199j9139K84136O31000M66543n8942
$$ 3670697 3486242 2962923 2700705 2787352 2843551 2824412 3108548 3739548 4206091 4147149
43069D147149l63796k86209q1572J02044K10448P4626k79406m42412j94887J17974
$$ 4147149 3783353 3497144 3415572 3517616 3728064 3802690 3523284 3080872 2885985 3003959
43059C003959K02774L03180N83705O26077J68132k43121o3699L44255M07220L45654
$$ 3003959 3206733 3509913 4093618 4719695 4887827 4644706 4581007 4925262 5332482 5678136
43049E678136N65847O41714M0503n90791j71513R98554J525620J033702O53000
$$ 5678136 6243983 6885697 6926200 6335409 6163896 7162450 8688070 9721772 10374772
43040A0374772J164676J921692K072816J749508J398079Q22394l28935j654061
$$ 10374772 11539448 13461140 15533956 17283464 18681543 19503937 19175002 17520941
43032A7520941k284203j880058r41060k53300k03536m88033m69714M0951N46172
$$ 17520941 15236738 13356680 12415620 12162320 11958784 11470751 11001037 11041988 11588160
43023A1588160O26321N63820P70130J039937J013779R59333J313897J830681K050811
$$ 11588160 12214481 12778301 13548431 14588368 15602147 16561480 17875377 19706058 21756869
43014B1756869K253348K954453L814675M150201M228023M861388O017768P145574
$$ 21756869 24010217 26964670 30779345 34929546 39157569 44018957 50036725 57182299
43006E7182299Q552067J0873218J3379549J4612116J4708812J5223750J6606686
$$ 57182299 65734366 76607584 89987133 104599249 119308061 134531811 151138497
42999A51138497J8034685J9899496K3737680K8836679L1622040K9671383K3562027
$$ 151138497 169173182 189072678 212810358 241647037 273269077 302940460 326502487
42992C26502487J3279402l444343k5714644m5206509n2293399m6127919l4837801
$$ 326502487 339781889 336337546 310622902 265416393 213122994 166995075 132157274
42985A32157274k5867750j9963648j4928726j0702581q361036p193140n720151
$$ 132157274 106289524 86325876 71397150 60694569 52333533 45140393 39420242
42978C9420242m133827l480460l476994l050550k267611k020204k316802k349327
$$ 39420242 35286415 31805955 28328961 25278411 23010800 20990596 18673794 16324467
42970A6324467j888238j376219r66877n59858m52150r02386j334304r93090j87062
$$ 16324467 14436229 13060010 12093133 11533275 11081125 10178739 8844435 7851345 7664283
42961G664283Q8864l76479q36435q05222n62543m09095k32745K7516J35671l3545
$$ 7664283 7753147 7376668 6540233 5735011 5172468 4763373 4530628 4558144 4693815 4660270
42951D660270l03432n03102n79513m26093k5593K82499J36021k77225m38748k55789
$$ 4660270 4356838 3853736 3274223 2848130 2822537 3105036 3241057 2963832 2525084 2269295
42941B269295j00957j04841K2712L48991M58031J04909l10326k72949J30477L74501
$$ 2269295 2168338 2063497 2086209 2435200 2893231 2998140 2687814 2414865 2545342 2919843
42931B919843K06904j19273k64595j90350r3232j18954k18735k38660j04960Q3929
$$ 2919843 3126747 3007474 2742879 2552529 2459297 2340343 2121608 1882948 1777988 1861917
42921A861917J48958J3444k04052k82623j19058J20829J40834j13497l09880j26298
$$ 1861917 2010875 2024319 1820267 1537644 1418586 1539415 1680249 1566752 1256872 1130574
42911A130574K67344L80645P5637k35458j89000M3820J07860L0649P8860K04253
$$ 1130574 1397918 1778563 1854200 1618742 1429742 1473562 1581422 1612071 1690931 1895184
42901A895184P0339l38344n33267j43131N35550Q55120N64802J2851l53290m41857
$$ 1895184 1965523 1627179 1093912 950781 1486331 2341451 2906253 2919104 2565814 2123957
42891B123957m00308k72929q079K74544L15457R6652n8059N9740J98415K7673
$$ 2123957 1723649 1450720 1442641 1717185 2032642 2129294 2071235 2130975 2329390 2357063
42881B357063k91564k90226Q0854L11350N0685l80420m40906r5026K03899J42324
$$ 2357063 2065499 1775273 1856127 2167477 2218162 1837742 1396836 1301810 1505709 1648033
42871A648033j18901k40085j27042J8530j1751j70278k09353L555L05210M44349
$$ 1648033 1529132 1289047 1162005 1180535 1168784 998506 789153 792708 1097918 1542267
42861A542267L75683K06284m4002l84918o14398m61245k7211K31935R6838j36810
$$ 1542267 1917950 2124234 2080232 1695314 1080916 619671 592460 824395 921233 784423
42851G84423j35111J6390O6163L2878P3182J13581k7073k49845k56808O987K91181
$$ 784423 649312 665702 731865 764743 837925 951506 924433 674588 417780 424767 715948
42840G15948M14406M19424L41099J13403k08404l84849k85815p3904K4509j0299
$$ 715948 1130354 1549778 1890877 2004280 1795876 1411027 1125212 1051308 1075817 1065518
42830A065518n9971p4124p4510m7664K5054Q0277M5575k5016k0201J7803r7108
$$ 1065518 1005547 931423 856913 809249 834303 914580 960155 935139 914938 932741 835633
42819H35633l90400n60803k99871K49678N68453L80321J2665l5580K51796M36244
$$ 835633 445233 -115570 -415441 -165763 402690 783011 795676 760096 1011892 1448136
42809A448136K54299p4300k27080j83833q6832P4125L74736O56993N98073J24138
$$ 1448136 1702435 1628135 1401055 1217222 1130390 1204515 1579251 2236244 2834317 2958455
42799B958455m25659o36126m25592n5621J90614K40746J63350n145k55048m65517
$$ 2958455 2532796 1896670 1471078 1415457 1606071 1846817 2010167 2005022 1749974 1284457
42789A284457m32431j14329K51316L83496K46645K1151j22897j13564N0091K57069
$$ 1284457 852026 737697 989013 1372509 1619154 1640305 1517408 1403844 1453935 1711004
42779A711004L11747J70320M1494O6343O5105j14826j88477J83461O99186O77543
$$ 1711004 2022751 2193071 2234565 2300908 2366013 2251187 2062710 2246171 2945357 3622900
42769C622900R1605k70609O3955N47178M67204J8374p4953L25681P02415P80764
$$ 3622900 3714505 3443896 3507851 4055029 4522233 4540607 4465654 4791335 5493750 6274514
42759F274514Q20284R78419J023818Q73244Q70096J219358J559586J473502J147742
$$ 6274514 7094798 8073217 9097035 9970279 10840375 12059733 13619319 15092821 16240563
42750A6240563J122321J518762J900074J897576J663980J594709J780595J870638
$$ 16240563 17362884 18881646 20781720 22679296 24343276 25937985 27718580 29589218
42742B9589218J430963L89887q44471j707071j967799j909000j972760k257922
$$ 29589218 31020181 31410068 30565597 28858526 26890727 24981727 23008967 20751045
42734B0751045k463025k328848j978716j704172j541219j280475q74422n72110
$$ 20751045 18288020 15959172 13980456 12276284 10735065 9454590 8580168 8008058
42726H008058n48951o35371n97082m96810n30967o42774n96955l76787j93267
$$ 8008058 7459107 6823736 6226654 5729844 5198877 4556103 3959148 3582361 3389094
42717C389094j08101K3810J91477J58815j07954k70870r5864J59741R6539k64813
$$ 3389094 3280993 3304803 3496280 3655095 3547141 3276271 3180407 3340148 3436687 3171874
42707C171874n35767m77014k28359n8988p0324j52105j34522J6468J43743J02850
$$ 3171874 2636107 2159093 1930734 1871746 1801422 1649317 1514795 1531263 1675006 1777856
42697A777856j1491L858J21819R8777j41956l79042m04945k31212N9660L77783
$$ 1777856 1766365 1770223 1892042 1990819 1848863 1469821 1064876 833664 893324 1271107
42687A271107M90198J87825k91840m05917n1337K50129J46888l2597Q3989K43623
$$ 1271107 1761305 1949130 1657290 1251373 1200036 1450165 1597053 1564456 1648445 1892068
42677A892068M2527l10115l02533N0730K93771K85765K80884L48304K95905J38872
$$ 1892068 1934595 1624480 1321947 1372677 1666448 1952213 2233097 2581401 2877306 3016178
42667C016178R6190J35354N2768j8954K37914O62273P34821M52387M24518Q99412
$$ 3016178 3112368 3247722 3300490 3281536 3519450 4181723 4916544 5368931 5793449 6692861
42657F692861J333100J237040Q79351P61451R02346J077195J322616J701622J912676
$$ 6692861 8025961 9263001 10142352 10903803 11806149 12883344 14205960 15907582 17820258
42648A7820258J682892J326830J351182J590941J282873P8317j441811k434588
$$ 17820258 19503150 20829980 22181162 23772103 25054976 25133293 23691482 21256894
42640B1256894k688746k637238k645763k571679k099916j324607p35571o01032
$$ 21256894 18568148 15930910 13285147 10713468 8613552 7288945 6553374 5952342
42632E952342o45864n23508l33851l47873m48009l10086k4741M408k25620k92088
$$ 5952342 5306478 4782970 4449119 4101246 3653237 3343151 3318410 3322818 3097198 2805110
42622B805110j30171k07592o69653r33638n47740P3597K82987J44799J65767L86533
$$ 2805110 2674939 2467347 1797694 864056 316316 389913 672900 817699 983466 1369999
42612A369999L80361L1805k75329k62486p6704N5788J23049J93189K58893K77676
$$ 1369999 1750360 1782165 1506836 1244350 1167646 1223434 1346483 1539672 1798565 2076241
42602B076241J96660k9682k94988l34053n2938K78745L68612K49046P0302j79379
$$ 2076241 2272901 2243219 1948231 1614178 1561240 1839985 2208597 2457643 2527945 2348566
42592B348566m32367l32661K63089Q13253O81733O9904k32846K8153L35359L18440
$$ 2348566 1916199 1583538 1846627 2659880 3341613 3411517 3178671 3206824 3542183 3860623
42582C860623K24456K77036K32956n6085j92389J81507P43425R37438P79557P12406
$$ 3860623 4085079 4362115 4595071 4538986 4346597 4528104 5271529 6208967 6988524 7700930
42572G700930Q35152Q10430N21610L45567O27437J191919J553950J459597J091288
$$ 7700930 8536082 9346512 9868122 10213689 10841126 12033045 13586995 15046592 16137880
42563A6137880Q07418P42487O44301J27836q66724j918831k492621k410342j920811
$$ 16137880 16945298 17687785 18332086 18459922 17593198 15674367 13181746 10771404 8850593
42554H850593j397293j062376r23782q45046o93998m91151l70554l58549l09828
$$ 8850593 7453300 6390924 5467142 4622096 3928098 3436947 3066393 2707844 2398016
42545B398016j54612o3694j91269l67127k97553m4751j4295l66254o95683n17713
$$ 2398016 2243404 2179710 1988441 1621314 1323761 1279010 1264715 898461 202778 -314935
42535c14935P4365N02672M34026J53049J10376L14174L82754J08641k77967m44281
$$ -314935 -240570 262102 696128 849177 959553 1273727 1656481 1765122 1487155 1042874
42525A042874l45434j63383p810J42631K64310K48866P6801j02071j32945l0617
$$ 1042874 697440 534057 526247 668878 933188 1182054 1258855 1156784 1023839 993222
42515I93222O6115O4851r143q0559j04346p3638R662J28114K06483J32023j09881
$$ 993222 1059337 1124188 1115045 1034486 930140 856502 866164 994278 1200761 1332784 1222903
42504A222903l36727l15937n6516J51657Q1350j38976k10247p8307K4472l6958
$$ 1222903 886176 570239 513723 665380 746730 607754 397507 319200 343672 306714
42494C06714r0552M3771K12332J13411k14800l47939k9938M16070M55188N4616
$$ 306714 216162 259933 472265 585676 370876 22937 -7001 409069 864257 918873
42484I18873k33912J7941N52422P57398M20745q4956l26556k71066j71585j97791
$$ 918873 684961 702902 1255324 2012722 2433467 2348511 2021955 1750889 1579304 1381513
42474A381513k99217l24206j71631J20676L84844M64813L62640J99985P7881N6784
$$ 1381513 1082296 758090 586459 707135 1091979 1556792 1919432 2119417 2197298 2254082
42464B254082J84314L79972L82293N0839l34977l73584j17288N35j64509k99108
$$ 2254082 2438396 2818368 3200661 3251500 2916523 2542939 2425651 2426186 2261677 1962569
42454A962569k39445k44141m06756l20932K21985O48371L23924m27674p09236
$$ 1962569 1723124 1478983 1072227 751295 973280 1621651 1945575 1517901 808665
42445H08665l21868N9946M118j20330P7867L31293K22709r3702j63217M7564J55306
$$ 808665 486797 546743 550861 430531 508398 839691 1062400 968698 805481 853045 1008351
42434A008351l2833k93719l49154j79335M3197J55347J17468K1234j7285K139
$$ 1008351 975518 681799 332645 153310 196507 351854 469322 490556 473271 475410
42424D75410j4320j01246k10630l13572l64477k16282J72273M72707K94094j78301
$$ 475410 461090 359844 149214 -164358 -528835 -745117 -572844 -100137 193957 15656
42414A5656k83251J73878N29501J87617m52380n38645p409L67106J50010j83460
$$ 15656 -267595 -93717 435784 623401 171021 -367624 -375033 -7927 142083 -41377
42404d1377p3657K86372L54172J07959p478J38696J68773j36049m22344k80614
$$ -41377 -115034 171338 525510 633469 625991 764687 933460 797411 375067 94453
42394I4453J18636K62678M2851j27303L1539K71263K56418P0992j6291n0850k48836
$$ 94453 213089 475767 518618 391315 422854 694117 950535 1021527 1005236 954386 705550
42383G05550m74684l40836J26240L90509J62057j66034j21088J65073K55205J14593
$$ 705550 230866 -109970 16270 406779 568836 402802 281714 446787 701992 816585
42373H16585N0222R3652l1628l22014l88949r7389J43279o49k44065j34921K04615
$$ 816585 866807 960459 928831 606817 217868 120479 263758 263109 19044 -115877 88738
42362H8738K49543j03650l64482j86761J53401K48292J69766K21816L19189J05441
$$ 88738 338281 234631 -129851 -316612 -163211 85081 254847 476663 795852 901293
42352I01293l43517m60741k1343M16373K56996k73318m77567j99360O9767O3445
$$ 901293 557776 97035 75692 492065 749061 475743 -1824 -201184 -131417 -67972
42342f7972J12807M50177O92647M27815o4800j80475J26291L47049K50318J75163
$$ -67972 44835 495012 1187659 1615474 1550674 1370199 1496490 1843539 2093857 2269020
42332B269020L77231N48922K78454l01230o45505m54226O4002N21239P20111O99260
$$ 2269020 2646251 3195173 3473627 3172397 2526892 2072666 2136668 2657907 3378018 4077278
42322D077278N86542M57058K70099l9627l68517m43937j36445L20781N88251O16959
$$ 4077278 4663820 5120878 5390977 5351350 4982833 4538896 4402451 4723232 5311483 5928442
42312E928442N88124N44202L89395K48588M23901Q47503R89184O09437K26904
$$ 5928442 6516566 7060768 7450163 7698751 8122652 8970155 9959339 10568776 10795680
42303A0795680L69646O43929J84412j037424k035330k080645j529820j106334
$$ 10795680 11165326 11809255 11993667 10956243 8920913 6840268 5310448 4204114
42295D204114r38491p41988m86328l36950k37828p3070j6558k26900m15633k45382
$$ 4204114 3265623 2523635 2037307 1700357 1462529 1389459 1372901 1146001 730368 484986
42285D84986M9045K3707j71084l2601L49475L69808k5644j76571J66573L68784
$$ 484986 534031 557738 386654 354053 703528 1073336 1047692 871121 1037694 1406478
42275A406478l3825n33992m63490j6079J74397L7986j5624J12655J55512M4278
$$ 1406478 1372653 838661 375171 359092 533489 571475 555851 668506 824018 868296
42265H68296m1964p8435j53456j51497N6835K57565K00028Q0982J92175K79353
$$ 868296 826332 747897 594441 442944 499779 757344 957372 1038354 1230529 1509882
42255A509882r3255o55863o73945j18360K02662j00988l93910p4978M41521M02485
$$ 1509882 1416627 760764 86819 -31541 171121 70133 -323777 -398755 42766 445251
42245D45251j11683l74597j17718K11784K24124L8290j00477j79706k40896j86173
$$ 445251 333568 -41029 -158747 53037 277161 315451 214974 35268 -205628 -391801
42235c91801M4328L10459M38551M14096L14770J79718K9739r1665j72155k36196
$$ -391801 -347473 -37014 401537 815633 1130403 1310121 1339860 1248195 1076040 839844
42225H39844k51222j43312L3214Q0366p4103k12694j00208J60947K57039J17650
$$ 839844 588622 445310 478524 558890 484787 272093 171885 332832 589871 707521
42215G07521o038L1745M4654j22111k61929j23832J23688J13644j11634j26377
$$ 707521 701483 733228 777882 655771 393842 270010 393698 507342 395708 269331
42205B69331J98594M48797K62927j65128m03653l25771r6195J38051K74351J77486
$$ 269331 467925 916722 1179649 1014521 610868 285097 188902 326953 601304 778790
42195G78790j30688l49423k39958L0230J32626M4913K0434J96436M64875O23590
$$ 778790 648102 298679 58721 88951 221577 266490 286924 483360 948235 1571825
42185A571825M61295j19886q22025j026358m91414K27732M38577J79859k3366
$$ 1571825 2033120 1913234 1091209 64851 -426563 -198831 239746 419605 396239
42176C96239n7950k59115o21037o63786k23265K40320L53949L10179L57283L28764
$$ 396239 338289 79174 -541863 -1205649 -1428914 -1188594 -834645 -524466 -167183 161581
42166A61581N8030j71161l9284K49220K72439N0042m0059J17453K48366J52827
$$ 161581 219611 48450 9166 258386 530825 580867 540808 658261 906627 1059454
42156A059454n0601j77856k09316k00383j49455m0913P2334R8632J9813m1297
$$ 1059454 1008853 830997 621681 421298 271843 230930 303264 401896 421709 380412
42146C80412O6134K78759L00186j9017l94526m45456k30921j31218k43038k89124
$$ 380412 446546 725305 1025491 1006474 611948 166492 -64429 -195647 -438685 -727809
42136g27809j56329p7217j46477r7099K26260N62222O41226N33633L52728J3937
$$ -727809 -884138 -961355 -1107832 -1204931 -978671 -416449 224777 758410 1111138 1125075
42126A125075m09931n08822j05735L50001L88785J94726K07679L62742K79588
$$ 1125075 715144 206322 100587 450588 839373 1034099 1241778 1604520 1884108
42117A884108j4969j50271p8169r2592k23561j68218J44460M17980M63881L60740
$$ 1884108 1869139 1718868 1640699 1548107 1324546 1156328 1300788 1718768 2182649 2543389
42107B543389J20389l16310o95622n75553K2060N28038N41737K27957j01511l39855
$$ 2543389 2663778 2347468 1651846 1076293 1098353 1626391 2168128 2396085 2294574 1954719
42097A954719l82025q4727L31814L33193j68305n55786l66826L5021R0999o5987
$$ 1954719 1572694 1487967 1819781 2152974 1984669 1428883 1062057 1097078 1188077 1122090
42087A122090O5729M33100M95179J23834k07464k05802j50294l00279m00187j05586
$$ 1122090 1187819 1620919 2116098 2239932 2032468 1826666 1676372 1376093 975906 870320
42077H70320M10581O36596L67027j10424m04032l76946j60303L228n8862k68565
$$ 870320 1280901 1917497 2284524 2174100 1770068 1393122 1232819 1236047 1177185 908620
42067I08620l10492J2544M32519M30289j05678o25059n26326Q5556N26522M16992
$$ 908620 598128 610672 1043191 1473480 1367802 742743 216417 301973 828495 1245487
42057A245487J13407J02706K80813J91858j72593k87836J05641N40976M34681
$$ 1245487 1358894 1461600 1742413 1934271 1761678 1473842 1579483 2120459 2555140
42048B555140j16078m92621l75946l8927J71903K68869L87042M17501J67903k34701
$$ 2555140 2439062 1946441 1570495 1531568 1703471 1972340 2359382 2776883 2944786 2710085
42038B710085m03950j85010J39758K20166L8225j81260l12869m01335m62396m14609
$$ 2710085 2306135 2121125 2260883 2481049 2519274 2338014 2025145 1623810 1161414 746805
42028G46805k26527J5196K09377K93176K01546n7292k67669j56028K39267N42233
$$ 746805 520278 535474 744851 1038027 1239573 1182281 914612 758584 997851 1540084
42018A540084N04030L00156K03808J69961k916k51041l10336j54559m3110r8397
$$ 1540084 2044114 2344270 2548078 2718039 2715123 2464082 2153746 1999187 1956077 1857680
42008A857680j41488n1139r495k09488n14925o23312m58534k14027o7274j7103
$$ 1857680 1716192 1665053 1655558 1446070 931145 307833 -150701 -364728 -432002 -449105
41998d49105K1850J01587K12737K71069J54957j28820l38596k12086J80246M57528
$$ -449105 -427255 -325668 -112931 158138 313095 184275 -154321 -366407 -186161 271367
41988B71367L95930K12736K09217K73220N1958l93367n13821n9391M29071L15851
$$ 271367 667297 880033 1089250 1362470 1414428 1021061 507240 447849 876920 1192771
41978A192771j84016k95263J49323M54392J29953l95814m98172k77676k25303
$$ 1192771 1008755 713492 862815 1317207 1447160 1051346 553174 275498 50195
41969E0195l24620j43175L16382N12918J84038k73333l97672k05814L6210K03735
$$ 50195 -274425 -417600 -101218 411700 595738 322405 -75267 -281081 -244871 -41136
41959d1136K60548J34286j13285k21898m8395K30536L71485L16664Q3937l15908
$$ -41136 219412 353698 240413 18515 -29880 200656 572141 888805 972742 656834
41949F56834o75304o04013k9310N45225N98418K43330r471J67k1205k03051k42208
$$ 656834 -18470 -622483 -651793 -106568 491850 735180 725709 725876 704671 501620 259412
41938B59412P6906M41388L90496l7555l60892l18851j66197k02733k87332q1842
$$ 259412 336318 777706 1168202 1130647 769755 450904 284707 81974 -205358 -287200
41928b87200L58525N75149L21359j08727k95398j87176p68J41493K27327J90427
$$ -287200 71325 646474 967833 859106 563708 376532 375764 517257 744584 935011
41918I35011K2003p3740P3644K91802K90037R2912o2467j49369k94228l89566
$$ 935011 957014 883274 956918 1248720 1538757 1631669 1569202 1419833 1125605 736039
41908G36039k16544P6683J17943m0021L4533L52927L72329q5683m07100j03019
$$ 736039 519495 596178 714121 674100 708633 1061560 1433889 1348206 941106 838087
41898H38087L82233L35033j59791m35951k66653k9181K3009L4496R5357N8563
$$ 838087 1220320 1555353 1395562 959611 692958 663777 686786 721282 816639 875202
41888H75202j08481k26227k36945k58135k52709m0662K79326L21293k2845l58260
$$ 875202 766721 540494 303549 45414 -207295 -247957 31369 352662 329817 -28443
41878b8443l19801m3366J07794O2644N2246K23787M46447M77536K29075j22602
$$ -28443 -348244 -391610 -283816 -221172 -168926 54861 501308 978844 1207919 1085317
41868A085317k97930k25495j19806j60934k35128j77022j11487k46648m20724
$$ 1085317 787387 561892 442086 281152 46024 -130998 -242485 -489133 -909857
41859i09857k51385K34750N25225L14327q0761k03380n4620O1478N7001R3158
$$ -909857 -1161242 -926492 -401267 -86940 -167701 -371081 -425701 -364223 -307222 -214064
41849b14064J94853J54701j28013m15593l54860J10291O09331O75799K37317k87292
$$ -214064 -19211 135490 7477 -408116 -762976 -652685 -43354 632445 869762 582470
41839E82470m58938k95792j31254j03741o4122L1339j4020k57982m19646k76203
$$ 582470 123532 -172260 -303514 -407255 -471377 -440038 -454058 -712040 -1131686 -1407889
41829a407889j8255N1893o230R2643L44440M09651J21610k24436k21478J49762
$$ -1407889 -1426144 -1374251 -1380481 -1287838 -943398 -533747 -412137 -636573 -858051 -708289
41819g08289N02874M87756J64065r1955l1246J80307J87066q2933l13734k10361
$$ -708289 -205415 282341 446406 354451 323205 503512 690578 607645 293911 83550
41809H3550J34287L79143L22238K7487l23041n34987m35705k2490M01051M33670
$$ 83550 217837 596980 919218 946705 623664 88677 -347028 -369518 31533 465203
41799D65203K6273l93473l66409Q1625M76395M30540L7275k94078k99931q4741
$$ 465203 491476 98003 -268406 -186781 289614 720154 757429 463351 163420 78679
41789G8679O2426l0936l00281n24304m91248j67009K48654M84671M52038K86728
$$ 78679 141105 110169 -190112 -714416 -1205664 -1372673 -1124019 -639348 -187310 99418
41779I9418J46224P4794Q3976J93350L03933K08681j20184m02531l82463j52857
$$ 99418 245642 320436 404412 597762 901695 1110376 990192 587661 205198 52341
41769E2341L6730J33693K00615J50548r9279l25113k42197J813J1680j82368j34240
$$ 52341 89071 222764 423379 573927 474648 149535 -92662 -90849 -79169 -261537 -395777
41758c95777K44233M58952K06920j46589j95144j05017j68228j99371N4637K71118
$$ -395777 -151544 307408 514328 367739 172595 67578 -100650 -300021 -245384 25734
41748B5734K566m58784m18966R9395L66803J36180m381K80877M54645N9949m08049
$$ 25734 28300 -430484 -849450 -750055 -383252 -247072 -251453 29424 484069 544018 135969
41737A35969k67094K15926K43205k38645m96134j74253K61441L39764J55265o7848
$$ 135969 -131125 84801 328006 89361 -406773 -581026 -319585 20179 175444 107596
41727A07596l52362o10711m73727J14680N75816M25811j4389j09637J70155L36299
$$ 107596 -244766 -855477 -1329204 -1214524 -638708 -212897 -227286 -336923 -166768 169531
41717A69531J85103m1421k01044l86095n00357k62237K38605M84749K31796j57394
$$ 169531 354634 313213 112169 -273926 -774283 -1036520 -797915 -313166 -81370 -238764
41707b38764k92966k61555k85853k78296r0119J08285Q9811j8148K3775J05161
$$ -238764 -531730 -793285 -1079138 -1357434 -1447553 -1339268 -1249457 -1267605 -1243830 -1138669
41697a138669l6325k89857k86586J0637K60363K95922L09231M05665L80950J20001
$$ -1138669 -1174994 -1464851 -1751437 -1740800 -1480437 -1184515 -875284 -469619 -88669 31332
41687C1332j11454k3508K55079L37775Q8753k26604k84019p6941P7325j00026
$$ 31332 -80122 -103630 151449 489224 577977 351373 67354 -9587 67738 -32288
41677c2288m85838o32336k79342L06773O30195N04976J42204j80425l06829j63711
$$ -32288 -518126 -1150462 -1429804 -1123031 -492836 12140 154344 -26081 -332910 -496621
41667d96621J59553L23557O5106l53591l64317J35946N72783M38022n6258l29074
$$ -496621 -337068 -13511 51595 -301996 -666313 -530367 42416 480438 424180 95106
41657I5106k06568k2518n3833j92821k20174j42803j12449j37633o6140J27846
$$ 95106 -111462 -133980 -187813 -380634 -600808 -743611 -856060 -993693 -1059833 -931987
41647i31987K06727k4411l54710l55216L6985L97520L99673K16238J19901K1975
$$ -931987 -725260 -749671 -1104381 -1459597 -1422612 -1025092 -625419 -409181 -289280 -267305
41637b67305k21417l48360n5740L68791L77484L7653p4272J41959J57511j98961
$$ -267305 -488722 -837082 -892822 -524031 -146547 -108894 -183166 -41207 116304 -82657
41627h2657l64194p14L67208J92049k05149k02768J04228J42522j59548l15287
$$ -82657 -446851 -447565 -80357 111692 -93457 -296225 -191997 -49475 -209023 -524310
41617e24310r3090K07158K72973J05190j53297l26317k10126J66165L98221J90564
$$ -524310 -617400 -410242 -137269 -32079 -185376 -511693 -721819 -555654 -157433 33131
41607C3131j77714k73930j87651k81085m60958l27322M2158J42711q7328j29436
$$ 33131 -144583 -418513 -606164 -887249 -1348207 -1675529 -1633371 -1490660 -1577988 -1707424
41597a707424K40121N91480N83615M47401M23366L00278q3042l77045k37330Q0884
$$ -1707424 -1467303 -875823 -292208 155193 578559 878837 795795 418750 181420 262304
41587B62304J22214p5765j60247q6928p5978j11860K0934K70595L30996J22968
$$ 262304 384518 308753 148506 61578 -14400 -126260 -105326 165269 496265 619233
41577F19233j08205j91542j95808j74031o1611J07511J57544K9660j27467j84593
$$ 619233 511028 319486 123678 -50353 -111964 -4453 153091 182751 55284 -129309
41567a29309j59240q4386M6719J65320J58616O1846K6231O6170N5154n186J1696
$$ -129309 -288549 -372935 -326216 -160896 -2280 59566 85797 151967 207121 201935 213631
41556B13631L3226j76313n03446m24905K07929P02997L70885m06133o12399n8753
$$ 213631 246857 70544 -432902 -857807 -649878 53119 424004 17871 -594528 -653281
41546f53281L52879L2017m01023j35244N28107O53695J08761l32859k50534r2917
$$ -653281 -300402 -268385 -669408 -804652 -276545 377150 485911 153052 -97482 -190399
41536a90399k55256l93147n7712N16060P24867M00241p7620k75268p2432K71997
$$ -190399 -445655 -838802 -896514 -380454 344413 744654 667034 391766 319334 591331
41526E91331K84777k19445p26413n27447K48121O51221K03857m40651n14271j76344
$$ 591331 876108 656663 -69750 -597197 -349076 302145 506002 65351 -448920 -625264
41516f25264R507L1510J43602J36866k52720n86294k87565K95062L46685p2241
$$ -625264 -615757 -584247 -440645 -303779 -556499 -1142793 -1430358 -1135296 -788611 -860852
41506h60852j67677J77172K48568j38325k84409P6524K35005j99742n00649l1977
$$ -860852 -1028529 -851357 -602789 -741114 -1025523 -948999 -713994 -913736 -1414385 -1446362
41496a446362O08420M92976k34520p00154n64022j61253K26743M91117M12565
$$ -1446362 -837942 -344966 -579486 -1279640 -1843662 -2004915 -1778172 -1287055 -874490
41487h74490j6365k56436J03466N95114M90790o6817l04549k1244K41963J86922
$$ -874490 -890855 -1147291 -1043825 -448711 42079 -24738 -329287 -350531 -108568 78354
41477G8354J23077K46572K69895l247k96869l09909j21482N6644J79024K48154
$$ 78354 201431 448003 717898 714651 417782 107873 -13609 43035 222059 470213
41467D70213K00180N2974o6912j17993j54345j52510o9954k6610j48621k91991
$$ 470213 670393 723367 656455 538462 384117 231607 161653 135043 -13578 -305569
41457c05569k22187N309J60530K26203L00958K43627j19650n01150l91524J69604
$$ -305569 -527756 -522447 -361917 -135714 165244 408871 289221 -211929 -603453 -433849
41447d33849N68677M55722J23298p4897j86462l27814l40449q3228K47611L69500
$$ -433849 134828 590550 713848 638951 452489 124675 -215774 -299002 -51391 318109
41437C18109K60119N4353j77833l69767l91328k26238n0583m982m2656p9501j12547
$$ 318109 578228 632581 454748 84981 -306347 -532585 -583168 -588150 -630806 -710307 -822854
41426h22854j24450n7793N9652J32732J54112J76673J84995J89193L18433N46567
$$ -822854 -947304 -1005097 -945445 -812713 -658601 -481928 -296933 -107740 210693 757260
41416G57260N04606l0950o22095o51312k15797M6902l1416j4039K14672J83733
$$ 757260 1261866 1230916 608821 -42491 -258288 -211386 -242802 -256841 -42169 141564
41406A41564k53004n08311j77600L00205L72931J68458M5939o5697k85775k78812
$$ 141564 -111440 -619751 -797351 -497146 -124215 44243 90182 24485 -261290 -540102
41396e40102J66015M98702J29510n42362o41799j47135J50355n7520k16745N7319
$$ -540102 -374087 124615 254125 -288237 -930036 -1077171 -926816 -984336 -1201081 -1143762
41386a143762L80481L24873Q9378N6995J56945Q1671j53390k34555m206L40951
$$ -1143762 -763281 -438408 -349030 -292035 -135090 -53419 -206809 -441364 -445570 -104619
41376a04619M46085J17611m54108p90003n82110l3528L95472M77331K80058o7995
$$ -104619 341466 459077 4969 -785034 -1367144 -1400672 -1005200 -527869 -247811 -315806
41366c15806l84014l90170m9124K17096P3655j34092J19831N91041N27771r3313
$$ -315806 -699820 -1089990 -1139114 -922018 -848363 -982455 -862624 -271583 256188 162875
41356A62875m01344M3994N39776L23330k86039m61114j16394J26093l1530k54436
$$ 162875 -238469 -194475 345301 668631 382592 -78522 -194916 -68823 -100353 -354789
41346c54789k32808o2129P8321J68752J93781R5359n8258j33217j66992k78334
$$ -354789 -587597 -649726 -571405 -402653 -208872 -113513 -171771 -304988 -471980 -750314
41336g50314l70360k26542R8269K85383J83587l1871j53476j38709k124K21546
$$ -750314 -1120674 -1347216 -1248947 -963564 -779977 -811848 -965324 -1104033 -1106157 -884611
41326h84611L79853L21492J28579j0499j14307k79885l09758P5368O15595O44999
$$ -884611 -504758 -183266 -54687 -65186 -179493 -459378 -769136 -693768 -78173 566826
41316E66826M5913m58823l04451J11798R6042k79100l80312l2879L23446M07477
$$ 566826 612739 153916 -150535 -38737 57305 -221795 -602107 -634986 -311540 95937
41306I5937L73857K85804m4118n15998o37429k46075J55550J26681q3623k8371
$$ 95937 469794 755598 711480 195482 -441947 -688022 -532472 -405791 -489414 -517785
41296e17785K00176K03426k8034j67822j43135j62555k27679j15046J39314K05164
$$ -517785 -317609 -114183 -142217 -310039 -453174 -615729 -843408 -958454 -819140 -613976
41286f13976J498j40312m909J76916J23148o7532j12867J8271R1967n8654l27076
$$ -613976 -612478 -752790 -757699 -580783 -457635 -525167 -638034 -619763 -527796 -586450 -913526
41275i13526m18909j25609L95944O64796L76251j75473m01430j26473K61262L58844
$$ -913526 -1332435 -1458044 -1062100 -397304 -21053 -196526 -597956 -724429 -463167 -104323
41265a04323J52994j37339l03275j95334J34835L11442L5026l69707k92228K00478
$$ -104323 48671 -88668 -391943 -587277 -452442 -141000 -105974 -475681 -767909 -567431
41255e67431L50910j12137m70074j32840L94282L24618j53601k56068J02544L02822
$$ -567431 -216521 -328658 -798732 -931572 -537290 -212672 -366273 -622341 -519797 -216975
41245b16975J72927K04804N35476O05894J21700m05236m69506k98478l17515m19031
$$ -216975 -44048 160756 696232 1302126 1423826 1018590 549084 250606 -66909 -485940
41235d85940k81726k1760J8881j18353j15476O3171J73999J59242J85413K50876
$$ -485940 -767666 -789426 -770545 -888898 -1004374 -941203 -767204 -607962 -422549 -171673
41225a71673J46052j49715l50762k40713N5050K59957K48632Q6641j02648k22485
$$ -171673 -25621 -175336 -526098 -766811 -711761 -451804 -203172 -116531 -219179 -441664
41215d41664k18914r5366P1609J56223Q4811m5409k7029J77119L01362R9694k63906
$$ -441664 -660578 -755944 -684335 -528112 -443301 -488710 -515739 -338620 -37258 62436 -201470
41204b01470l88789j88610J1877k0460j29905j00870J344O884p0041j18264j19193
$$ -201470 -590259 -778869 -766992 -787452 -917357 -1018227 -1016883 -1009999 -1080040 -1198304 -1317497
41193a317497o9577R8823L41498M30747K53025j394j20926j40185j47157q1193
$$ -1317497 -1387074 -1288251 -946753 -516006 -262981 -264375 -385301 -525486 -672643 -753836
41183g53836M3267J679k36341k65233J70490O10469M44053j19520k85728J31129
$$ -753836 -710569 -708890 -945231 -1210464 -1039974 -429505 14548 -104972 -390700 -259571
41173b59571M33297J34709l28791l49029m8828Q0569M0676J95248M76684L91594
$$ -259571 173726 308435 -20356 -369385 -418213 -337644 -296968 -101720 374964 766558
41163G66558j36999n18775l08858J68617L16885P2040j52900j42163r2023j80796
$$ 766558 629559 110784 -198074 -29457 287428 359468 206568 64405 -27618 -208414
41153b08414k86159k22502K466K74357M92180N04255J84879k62435l57059L6259
$$ -208414 -494573 -717075 -714609 -440252 51928 556183 741062 478627 121568 157827
41143A57827L83498J46326m16660n81884k07357J10539j380j67228L3336L62323
$$ 157827 541325 687651 270991 -310893 -518250 -407711 -409091 -576319 -542983 -180660
41133a80660L57024P9789o6740j6481j2063o3420K7860J73098P1362j97197k00031
$$ -180660 176364 256153 189413 172932 160869 97449 125309 298407 369769 172572 -27459
41122b7459J03975J98162j53799m10033k4290O41134P28904P7633n59970n62717
$$ -27459 76516 274678 120879 -289154 -313444 327690 1056594 1134227 574257 11540
41112A1540k00941p9330k07906j08156K88231M17137n1203n92627n03751Q3327
$$ 11540 -189401 -268731 -476637 -584793 -296562 120575 69372 -523255 -1027006 -943679
41102i43679M09360K09017j1764Q1362J16674k13126m57051q1732N67298O78458
$$ -943679 -534319 -325302 -337066 -255704 -139030 -352156 -809207 -890939 -323641 354817
41092C54817J42647l78650m62186l08187j12434K20829N75264N16750l14l88751
$$ 354817 497464 118814 -343372 -651559 -763993 -543164 32100 548850 548536 159785
41082A59785k47148O7498O6873j28404j33782n694p4270l14662m02413k67907
$$ 159785 -87363 -19865 47008 -81396 -215178 -220872 -295142 -609804 -1012217 -1280124
41072a280124j35257p3731P5870L32719M80425L77796J25552q3881j17263L0668
$$ -1280124 -1415381 -1489112 -1413242 -1080523 -600098 -222302 -96750 -180631 -297894 -267226
41062b67226J67698M0603k86262l87108m3893L65385L62730M6414j18651k9545
$$ -267226 -99528 -58925 -345187 -732295 -776188 -410803 -48073 -1659 -120310 -149855
41052a49855j2344k20349m14387l72364j36488J75775M48627M58263R7047k65173
$$ -149855 -162199 -382548 -796935 -1169299 -1305787 -1130012 -681385 -223122 -126075 -391248
41042c91248j10098M30802O01851P0741n25953m43398J52809M95246K97217q6
$$ -391248 -501346 -70544 531307 602048 76095 -367303 -214494 280752 577969 577883
41032E77883l996J14667K2611k38793l77127l06471j99169j41231j1137K22747
$$ 577883 573887 688554 711165 472372 95245 -211226 -410395 -551626 -562763 -340016
41022c40016L21240J03442j83861j36227J84031K63512q9664l79969j42851L01722
$$ -340016 -18776 84666 -99195 -235422 -51391 212121 122457 -257512 -400363 -98641
41012i8641K90666j73799m28381j58076J82285J37737p1637J2364L33540M20523
$$ -98641 192025 18226 -410155 -568231 -385946 -248209 -319846 -307482 26058 446581
41002D46581Q0368l53719m38858q0967M01280N70277K94898q2791j43763N4595
$$ 446581 526949 173230 -265628 -346595 54685 624962 919860 837069 693306 747901
40992G47901Q4331j61530k72105j608K56052M0436m27157n31658j50654K21014
$$ 747901 832232 670702 398597 396989 653041 693477 266320 -265338 -415992 -194978
40982a94978K15105K1647j9586R6375J46725N0804o2982p8349n0687j30248l32392
$$ -194978 20127 41774 22188 118563 265288 316092 253110 174761 124074 -6174 -338566
40971c38566m21002j48767L50141N98048L29807j76599m87401n13909m00425j63384
$$ -338566 -759568 -908335 -558194 39854 369661 193062 -294339 -808248 -1208673 -1372057
40961a372057J98172M20666K58607l2639J8970L38144L53643p2924l34368O544
$$ -1372057 -1173885 -753219 -494612 -527251 -508281 -170137 183506 110582 -223786 -217242
40951b17242M81468L65697k56348o20019l53765J07368K35039P2155k4339K5230
$$ -217242 264226 629923 373575 -246444 -600209 -492841 -257802 -185647 -209986 -184756
40941a84756O266j49828k24012n3922J99278K67049J40099M0172N8920L8669j14834
$$ -184756 -178490 -328318 -552330 -606252 -406974 -139925 174 40346 99266 137935 23101
40930B3101k10537m7248K29303K88673P9126j24263j35938o5781n0029l1763N7136
$$ 23101 -187436 -234684 -5381 283292 362418 238155 102217 36436 -13593 -45356 11780
40919A1780J01950k5999k32884l05144j80613J2647J40680J85401K06811K37819
$$ 11780 113730 87731 -145153 -450297 -630910 -618263 -477583 -292182 -85371 152448
40909A52448K04495j4520l67694n47249l17876J06549K69141O8640j45695j40197
$$ 152448 356943 342423 -25271 -572520 -890396 -783847 -514706 -446066 -591761 -731958
40899g31958r5277j72792j75955N2716K36967R1579j11689R0601N50669O19935
$$ -731958 -827235 -1000027 -1175982 -1123266 -886299 -794720 -906409 -815808 -265139 354796
40889C54796Q8780m87359n36462j27581K86926M17271K33503j39514l94896k16129
$$ 354796 443576 -43783 -580245 -707826 -420900 -3629 229874 90360 -304536 -520665
40879e20665K67697M70897P4312m91187o03092k65777J5146K4792N0962L02724
$$ -520665 -252968 217929 292241 -198946 -802038 -1067815 -1052669 -1027877 -976915 -674191
40869f74191N40040M35672L1211l42530m48700l20539j38445j0271J33517L79802
$$ -674191 -134151 301521 332732 -9798 -458498 -779037 -917482 -927753 -794236 -414434
40859d14434N56892L26567k76744o40341k65114M74669P10678J98065m27124n78846
$$ -414434 142458 469025 192281 -448060 -713174 -238505 472173 670238 243114 -335732
40849c35732l88206k40056j63457l5232M4840J2168J12306M50865N98040J89278
$$ -335732 -723938 -963994 -1127451 -1162683 -1117843 -1105675 -993369 -542504 55536 244814
40839B44814l59068l81495j9870K360l84155m24400K01076P45904M60014l29999
$$ 244814 -114254 -495749 -515619 -513259 -897414 -1321814 -1120738 -374834 85180 -244819
40829b44819p28010m33946J04778M01336L18532k6095l31643k68816J09579L29539
$$ -244819 -972829 -1406775 -1301997 -900661 -582129 -608224 -939867 -1208683 -1099104 -769565
40819g69565J50075n8491O6313K62146J20037j71750j54953Q4384P7600k07168
$$ -769565 -619490 -677981 -611668 -349522 -229485 -401235 -556188 -471804 -394204 -601372
40809f01372l61619k64145j60729p8091J62530L57520Q2077m73777n72637j8684
$$ -601372 -962991 -1227136 -1387865 -1465956 -1303426 -945906 -863829 -1337606 -1910243 -1928927
40799a928927N29413N71846L88663L45609K92195O7819m5913J27463K26698k5212
$$ -1928927 -1399514 -827668 -439005 -93396 198799 266618 220705 348168 574866 549654
40789E49654k90531k24807r5583k27498l34906n4778K97562K07249j63244k79987
$$ 549654 259123 34316 -61267 -288765 -623671 -678449 -380887 -173638 -336882 -616869
40779f16869j08776K3981J33442L80542M56637J0065n10808l49064L15904N50996
$$ -616869 -725645 -701664 -568222 -187680 268957 279022 -231786 -580850 -264946 286050
40769B86050J12146k57516j15575O2370j32178l30924j25592K18511K84096J42619
$$ 286050 398196 140680 25105 87475 -44703 -375627 -501219 -282708 1388 144007
40759A44007J8518j43401l44444k93953N9012K63889P5061r5464J03295L22387
$$ 144007 162525 19124 -325320 -619273 -560261 -296372 -221311 -316775 -213480 108907
40749A08907J33933k16360k95417k60218m51225o01161k40248L67375N19954J95283
$$ 108907 242840 26480 -268937 -529155 -980380 -1581541 -1821789 -1454414 -934460 -739177
40739g39177N7193L40342N27632K89626M955M7649J69088j3571l55995m32785
$$ -739177 -681984 -341642 185990 475616 480571 528220 697308 683737 327742 -105043
40729a05043j74326J02345J48876R688j14462o4263J24621J88405r2920n27552
$$ -105043 -279369 -177024 -28148 -18460 -132922 -197185 -72564 115841 22921 -504631
40719e04631o26773k08300L16875M30229J23673j59086j00332J70697L08941J38740
$$ -504631 -1131404 -1339704 -1022829 -592600 -468927 -628013 -728345 -557648 -248707 -109967
40709a09967k21038m99539m85631j77661J92608L22247J30275j07056m5647K58068
$$ -109967 -331005 -830544 -1316175 -1493836 -1301228 -978981 -848706 -955762 -1001409 -743341
40699g43341L51603n550m47889m80298j68993L1783L6223J92648N45953O14044
$$ -743341 -391738 -397288 -845177 -1325475 -1494468 -1462685 -1426462 -1233814 -687861 -73817
40689g3817J52299l71476m41700k14407j35278j93626p0309K13597L30855K08541
$$ -73817 78482 -292994 -734694 -949101 -1084379 -1278005 -1348314 -1134717 -803862 -595321
40679e95321Q1298O0682O3821Q7865J67704J64361j8993j46236J0202J95629J6684
$$ -595321 -514023 -453341 -389520 -301655 -133951 30410 11417 -134819 -124617 71012 87696
40668H7696l89074n54549m20406k85141j44401K21698N52498L07081l35477n18234
$$ 87696 -301378 -855927 -1276333 -1561474 -1705875 -1484177 -931679 -624598 -960075 -1478309
40658a478309o383L94694J31277k15981M3371N26291M36426r2869k36637J69342
$$ -1478309 -1484692 -1089998 -958721 -1174702 -1131331 -605040 -168614 -261483 -498120 -328778
40648c28778M14282P2349l98057m17866o6452J84500J25025q4532k31499k53458
$$ -328778 85504 157853 -240204 -658070 -724522 -540022 -414997 -499529 -731028 -984486
40638i84486k13158j74592q1149J88096N65047P38835N28671J69944L72o847j10211
$$ -984486 -1197644 -1372236 -1453385 -1265289 -700242 38593 567264 737208 737580 730733 620522
40627F20522l00229k85115J5773K94059K63059J114k18394k47981j22163M5270
$$ 620522 320293 35178 50951 345010 608069 609183 390789 142808 20645 65915
40617F5915J20426K2243j79470l10048k69569j01799J04187K77804L39383K35236
$$ 65915 186341 208584 29114 -280934 -550503 -652302 -548115 -270311 69072 304308
40607C04308K7629j49709k44410k94101k70757n7906L25768N82524L88796j68693
$$ 304308 331937 182228 -62182 -356283 -627040 -684946 -359178 223346 612142 443449
40597D43449n51877l29845K51379M74278K3078n65680n54901M9160N38486M34017
$$ 443449 -108428 -438273 -186894 287384 310462 -255218 -810119 -760959 -222473 211544
40587B11544j7210l43151m34041m08648k37302J50314N48531O05338K50625k10665
$$ 211544 194334 -148817 -582858 -991506 -1228808 -1078494 -529963 75375 326000 115335
40577A15335m23553k91002k0638N5571j89294m74552m02701n249K48599J00698
$$ 115335 -308218 -599220 -619858 -564287 -753581 -1228133 -1630834 -1636083 -1387484 -1286786
40567a286786j35237o5712K23672L94504L92257L98169M15097K82168J8953j86674
$$ -1286786 -1422023 -1487735 -1264063 -869559 -477302 -79133 335964 618132 637085 450411
40557D50411k80784l27993k65903r748K39688J54084k25493m79051l71413j36183
$$ 450411 169627 -158366 -424269 -434017 -194329 -40245 -265738 -744789 -1116202 -1252385
40547a252385q4461j73338j24551J65589M80260N20790K44652n4730o8621J41345
$$ -1252385 -1336846 -1510184 -1634735 -1469146 -988886 -468096 -223444 -278174 -346795 -205450
40537b05450K41373J30069P6226K32082L32560J31505j61944k22064j21426j09011
$$ -205450 35923 165992 242218 474300 806860 938365 776421 554357 432931 323920
40527C23920j06590R5753L09976J58766k50504m06527j64460Q9993J06270O7623
$$ 323920 217330 313083 623059 781825 531321 124794 -39666 50327 156597 224220
40517B24220J03546L7024j70964k17203K0525J85565K338k26836p1425L37555
$$ 224220 327766 364790 193826 -23377 -2852 182713 185051 -41785 -113210 224345
40507B24345M73495J49761k60022l23133k6650K79693K92284O0959j11420p8049
$$ 224345 697840 847601 587579 264446 237796 517489 809773 870732 759312 681263
40497F81263l8424j94245l77314k95918m6966j5345k67968m28293k30487J43002
$$ 681263 642839 448594 71280 -224638 -271604 -286949 -554917 -983210 -1213697 -1070695
40487a070695L79394L85598K25463k079j35838p4380K8945l1431j41227n0586
$$ -1070695 -691301 -305703 -80240 -82319 -218157 -292537 -263592 -295023 -436250 -486836
40477d86836J25499O1937j39389m3927L11751L55959q3852m40164l02014j2787
$$ -486836 -361337 -299400 -438789 -482716 -170965 184994 101142 -339022 -641036 -653823
40467f53823J8316k3250J22538J92208q3558l54262j94626J17511M4937k92634
$$ -653823 -635507 -658757 -536219 -344011 -427569 -781831 -976457 -858946 -814009 -1106643
40457a106643l29995K8445L56011M16946L36152J88186k7438j37148l9505j2426
$$ -1106643 -1436638 -1408193 -1052182 -635236 -299084 -110898 -138336 -275484 -314989 -327415
40447c27415k43947l27634J24083O40211M72373j60604l27840J38148M03705M0740
$$ -327415 -571362 -898996 -774913 -134702 337671 177067 -150773 -12625 391080 431820
40437D31820l09339o9541L42588K80926j10347k73520j44625o3618j12041j08129
$$ 431820 122481 52940 395528 676454 566107 292587 147962 84344 -27697 -135826
40427a35826m5605n5016q6373l2829j8765j90683l54906j95912K15698M69265
$$ -135826 -181431 -236447 -322820 -355649 -374414 -565097 -920003 -1115915 -900217 -430952
40417d30952L58367J06914J0497M3810p5292m66085q01672n88526J72675P99666
$$ -430952 -72585 34329 44826 88636 13344 -452741 -1254413 -1842939 -1670264 -870598
40407h70598O76030M1972l44025k35550q0208j58020j57550J53632M14932K50315
$$ -870598 -194568 -152596 -496621 -732171 -812379 -970399 -1127949 -974317 -559385 -309070
40397c09070o8299l1955L03061M26351J56268j49790j65248o087K4372j18991
$$ -309070 -377369 -409324 -106263 320088 476356 326566 161318 155231 179603 60612
40387F0612j73365O2150L82165L50963p9462l62066p9712L38567J52222n40178
$$ 60612 -112753 -50603 331562 682525 603063 240997 161285 499852 652074 111896
40377A11896q70860n01824p6775q9995j19108K72302O06415K47340m42467n87367
$$ 111896 -758964 -1260788 -1337563 -1427558 -1546666 -1274364 -667949 -420609 -863076 -1450443
40367a450443j31557J94354Q1394n3594M4105J09112R902J9567K28374L26151
$$ -1450443 -1582000 -1387646 -1306252 -1359846 -1315741 -1206629 -1196727 -1177160 -948786 -622635
40357f22635J95455J34642K49612J97844j61383m02566j97014J22991R4510j51964
$$ -622635 -427180 -292538 -42926 154918 -6465 -409031 -606045 -483054 -388544 -540508
40347e40508j67843P1821J83426J4623j58529p9098J55365K61053R2152k33020
$$ -540508 -708351 -636530 -453104 -438481 -597010 -676108 -520743 -259690 -167538 -400558
40337d00558m32181l05788M9001L20373L20442J63341P5414J33451K29967K00307
$$ -400558 -832739 -1138527 -1089526 -769153 -448711 -285370 -209956 -76505 153462 353769
40327C53769l2410l40391m47754k41480K8180M7598j21260j53527K8874J75352
$$ 353769 321359 -19032 -466786 -708266 -680086 -632488 -753748 -907275 -878401 -703049
40317g03049J50457J13906J70244J76466M2895p7055o2890j7561k0989K5940J35420
$$ -703049 -552592 -438686 -268442 -91976 -49081 -126136 -189026 -206587 -227576 -201636 -66216
40306f6216J07208j11419k27723l3541K19041J72107j15474l11465l04827k31972
$$ -66216 40992 -70427 -298150 -331691 -112650 59457 -56017 -367482 -672309 -904281
40296i04281j37354N1558K60462K79751N0045k64086m57312l87934j1455M78275
$$ -904281 -1041635 -990077 -729615 -449864 -399819 -663905 -1121217 -1509151 -1520606 -1042331
40286a042331O54970K80519l18800n47695k16476K82828M71441K58670r6975l22549
$$ -1042331 -387361 -106842 -425642 -973337 -1189813 -906985 -435544 -176874 -273849 -596398
40276e96398l49711k74064j58390O1794L90485N73028L39122j36892l39346r5372
$$ -596398 -946109 -1220173 -1378563 -1316769 -926284 -353256 -14134 -151026 -490372 -585744
40266e85744J79806J09257j38043k40415k43608k97865k27248J33416M46150K99161
$$ -585744 -405938 -296681 -434724 -675139 -918747 -1216612 -1443860 -1310444 -864294 -565133
40256e65133n3548j8100L62970M46574L9249k87272j21256J85332J49623j27495
$$ -565133 -618681 -636781 -273811 172763 212012 -75260 -196516 -11184 138439 10944
40246A0944k46154j14138P7669J86880J51685l2557j67412l052K95709K45801
$$ 10944 -235210 -349348 -271679 -84799 66886 34329 -133083 -136135 159574 405375
40236D05375j81611l80883k9846L38848J65480k20669j53648K54759L08476j21502
$$ 405375 223764 -157119 -186965 151883 317363 96694 -56954 197805 506281 384779
40226C84779m13541k07989J02347R4192o4122k1615J63221J94121K8978j13591
$$ 384779 -28762 -236751 -134404 -40212 -104334 -125949 37272 231393 260371 146780
40216A46780q7401O4458K12909K11123k1011l47753m61743k05548K17900M42971
$$ 146780 59379 123837 336746 547869 526858 179105 -282638 -488186 -270286 172685
40206A72685L02575m2350k71368j88846R3038K58303J30813j31973k62063k08126
$$ 172685 475260 432910 161542 -27304 65734 324037 454850 322877 60814 -147312
40196a47312j15098p0962m8318l7021m9295k6661Q4820J96695J79466O7375N237
$$ -147312 -262410 -333372 -381690 -418711 -468006 -494667 -409847 -213152 -33686 33689 38926
40185C8926L2804O6721L4435j04204l55031n64293m71219q8542J80535P4596j14609
$$ 38926 71730 138451 172886 68682 -286349 -850642 -1321861 -1410403 -1229868 -1155272 -1269881
40174a269881j6873J87550J00037j44728p3820K69172L49915O6197o4617J83263
$$ -1269881 -1286754 -1099204 -999167 -1143895 -1217715 -948543 -598628 -532431 -597048 -413785
40164d13785L43638P7248k47152j98307M0566R3386J1502r43m4041k01901j73136
$$ -413785 -70147 7101 -240051 -438358 -397792 -304406 -292904 -293847 -337888 -539789 -712925
40153g12925K25280N43472K92741k31988l58294n2090J27375m7594k60164l11836
$$ -712925 -487645 55827 348568 116580 -241714 -293804 -166429 -214023 -474187 -786023
40143g86023l35696l02380M7605O20378Q68263M99163j30845n19952n46317l41416
$$ -786023 -1121719 -1424099 -1376494 -756116 112147 611310 480465 -39487 -585804 -927220
40133i27220k2507K44976K40514k5339k30557j14783K21798M71325M19254Q9911
$$ -927220 -949727 -704751 -464237 -489576 -720133 -834916 -613118 -141793 277461 367372
40123C67372k36643k20095J15070K95476M2339k15450M8611N19195L91171l46797
$$ 367372 130729 -89366 25704 321180 363519 148069 196680 715875 1107046 760249
40113G60249p67352l73225J59689O3042l66861l46246J26038L45434N5795k21589
$$ 760249 -7103 -380328 -220639 -157597 -524458 -870704 -744666 -399232 -343437 -565026
40103e65026p0760K17986J60189k12541m42983k56294J60177M27477L64336Q3596
$$ -565026 -635786 -417800 -257611 -470152 -913135 -1169429 -1009252 -581775 -217439 -133843
40093a33843k01890l67130l70981k07817K6369J34451M8400l5365O3600K11452
$$ -133843 -335733 -702863 -1073844 -1281661 -1255292 -1120841 -1072441 -1107806 -1044206 -832754
40083h32754J86089P1394R7113J91557J02179r4755p5442J38197J85742L2582
$$ -832754 -646665 -575271 -478158 -286601 -184422 -279177 -354619 -216422 -30680 1902
40073A902N3055K97107K93334j31690m42779k13267J86260K04465n4884j59598
$$ 1902 54957 352064 645398 513708 70929 -142338 43922 248387 193503 33905
40063C3905j08862j59401j99363O1521M56525N19994J88944j69305l37650l79618
$$ 33905 -74957 -234358 -433721 -372200 84325 604319 793263 623958 286308 -93310
$$ [...]
##END NTUPLES=NMR SPECTRUM
##END=
