##TITLE=31Pdec_SR3_OSue
 CDCl3, 24 sc
 22.10.2019
##JCAMPDX= 6.0         $$ Bruker NMR JCAMP-DX V2.0
##DATA TYPE= NMR SPECTRUM
##DATA CLASS= NTUPLES
##ORIGIN= UXNMR, Bruker Analytische Messtechnik GmbH
##OWNER= root
$$ XWIN-NMR		Version 3.5
$$ Tue Oct 22 14:52:57 2019 Russian Standard Time (UT+4h)  she@DPX200
##.OBSERVE FREQUENCY= 81.013821
##.OBSERVE NUCLEUS= ^31P
##.ACQUISITION MODE= SIMULTANEOUS
##.ACQUISITION SCHEME= undefined
##.AVERAGES= 24
##.DIGITISER RES= 17
##SPECTROMETER/DATA SYSTEM= spect
##.PULSE SEQUENCE= zgpg30
##.SOLVENT NAME= DMSO
##.SHIFT REFERENCE= (INTERNAL, DMSO, 0, 182.463)
##AUDIT TRAIL= $$ (NUMBER, WHEN, WHO, WHERE, WHAT)
$$ ##TITLE= Audit trail, XWIN-NMR		Version 3.5
$$ ##JCAMPDX= 5.01
$$ ##ORIGIN= Bruker BioSpin GmbH
$$ ##OWNER= she
$$ F:/spectra/data/she/nmr/P31/1/pdata/1/auditp.txt
$$ ##AUDIT TRAIL=  $$ (NUMBER, WHEN, WHO, WHERE, WHAT)
(   1,<2019-10-22 14:51:52.46 +0400>,<she>,<DPX200>,
      <created by zg, POWCHK disabled, PULCHK disabled
       configuration hash MD5:
       00 E9 B6 7A A2 85 ED C7 34 08 36 98 17 FE 4E 26
       data hash MD5: 32K
       1D D7 58 25 21 E4 3F B9 DC 1E 76 B7 3A CB 9C 9D>)
(   2,<2019-10-22 14:51:54.50 +0400>,<she>,<DPX200>,
      <Start of raw data processing
       efp BC_mod = 2 LB = 1 FT_mod = 6 PKNL = 1 PHC0 = -850.6232 PHC1 = 430.8006 SI = 64K 
       data hash MD5: 64K
       D1 09 6C 03 D9 9E E5 0F 40 19 10 30 59 45 8F E9>)
(   3,<2019-10-22 14:52:21.64 +0400>,<she>,<DPX200>,
      <pk PHC0 = 18.96401 PHC1 = -61.39997 
       data hash MD5: 64K
       09 AD C9 1F AF AC DA D6 76 04 E9 1F 52 63 2A 98>)
(   4,<2019-10-22 14:52:24.87 +0400>,<she>,<DPX200>,
      <abs ABSG = 5 
       data hash MD5: 64K
       1E A1 72 C8 EC 7B 40 9D EC 3F 9C B4 0B CD A9 B7>)
$$ ##END=
$$ 
$$ hash MD5
$$ 55 52 BE 9D 26 9F 4D 2A 7E 5D E4 F4 E2 36 C8 90
##$RELAX= 
##$RELAX= 
##$RELAX= 
##$RELAX= 
##$RELAX= 
##$RELAX= 
##$RELAX= 
##$RELAX= 
$$ Bruker specific parameters
$$ --------------------------
##$DU= <F:/spectra>
##$EXPNO= 1
##$NAME= <P31>
##$PROCNO= 1
##$TYPE= <nmr>
##$USER= <she>
##$AMP= (0..31)
100 100 100 100 100 100 100 100 100 100 100 100 100 100 100 100 100 100 
100 100 100 100 100 100 100 100 100 100 100 100 100 100 
##$AQSEQ= 0
##$AQ_mod= 1
##$AUNM= <au_zg>
##$AUTOPOS= <>
##$BF1= 81.014009
##$BF2= 200.13
##$BF3= 200.13
##$BF4= 200.13
##$BF5= 200.13
##$BF6= 200.13
##$BF7= 200.13
##$BF8= 200.13
##$BYTORDA= 1
##$CFDGTYP= 0
##$CFRGTYP= 5
##$CHEMSTR= <none>
##$CNST= (0..31)
1 1 145 1 1 1 1 1 1 1 1 1 1 1 1 1 1 1 1 1 1 1 1 1 1 1 1 1 1 1 1 1 
##$CPDPRG= <waltz16>
##$CPDPRG1= <>
##$CPDPRG2= <waltz16>
##$CPDPRG3= <>
##$CPDPRG4= <mlev>
##$CPDPRG5= <mlev>
##$CPDPRG6= <mlev>
##$CPDPRG7= <mlev>
##$CPDPRG8= <mlev>
##$CPDPRGB= <>
##$CPDPRGT= <>
##$D= (0..31)
0 1 0 0 0 0 0 0 0 0 0 0.03 2e-05 3e-06 0 0 0 0 0 0 0 0 0 0 0 0 0 0 0 0 
0 0 
##$DATE= 1571741511
##$DBL= (0..7)
120 120 120 11 120 120 24 19 
##$DBP= (0..7)
150 150 150 150 150 150 150 150 
##$DBP07= 0
##$DBPNAM0= <>
##$DBPNAM1= <>
##$DBPNAM2= <>
$$ [...]
##$SUBNAM3= <"">
##$SUBNAM4= <"">
##$SUBNAM5= <"">
##$SUBNAM6= <"">
##$SUBNAM7= <"">
##$SUBNAM8= <"">
##$SUBNAM9= <"">
##$SW= 369.568048894756
##$SWIBOX= (0..15)
0 1 3 0 0 0 0 0 0 0 0 0 0 0 0 0 
##$SW_h= 29940.119760479
##$TD= 32768
##$TD0= 1
##$TE= 0
##$TE2= 300
##$TE3= 300
##$TEG= 300
##$TL= (0..7)
0 120 53 12 22 120 120 120 
##$TP= (0..7)
150 150 150 150 150 150 150 150 
##$TP07= 0
##$TPNAME0= <>
##$TPNAME1= <>
##$TPNAME2= <>
##$TPNAME3= <>
##$TPNAME4= <>
##$TPNAME5= <>
##$TPNAME6= <>
##$TPNAME7= <>
##$TPOAL= (0..7)
0.5 0.5 0.5 0.5 0.5 0.5 0.5 0.5 
##$TPOFFS= (0..7)
0 0 0 0 0 0 0 0 
##$TUNHIN= 0
##$TUNHOUT= 0
##$TUNXOUT= 0
##$USERA1= <user>
##$USERA2= <user>
##$USERA3= <user>
##$USERA4= <user>
##$USERA5= <user>
##$V9= 5
##$VALIST= <valist>
##$VCLIST= <CCCCCCCCCCCCCCC>
##$VD= 0
##$VDLIST= <DDDDDDDDDDDDDDD>
##$VPLIST= <PPPPPPPPPPPPPPP>
##$VTLIST= <TTTTTTTTTTTTTTT>
##$WBST= 1024
##$WBSW= 4
##$XGAIN= (0..3)
0 0 0 0 
##$XL= 0
##$YL= 0
##$YMAX_a= 6784
##$YMIN_a= -5838
##$ZGOPTNS= <>
##$ZL1= 120
##$ZL2= 120
##$ZL3= 120
##$ZL4= 120
##$ABSF1= 182.463
##$ABSF2= -187.1042
##$ABSG= 5
##$ABSL= 3
##$ALPHA= 0
##$AQORDER= 0
##$ASSFAC= 0
##$ASSFACI= 0
##$ASSFACX= 0
##$ASSWID= 0
##$AUNMP= <proc_1d>
##$AZFE= 0.1
##$AZFW= 0.5
##$BCFW= 0
##$BC_mod= 2
##$BYTORDP= 0
##$COROFFS= 0
##$CY= -3
##$DATMOD= 1
##$DC= 0
##$DFILT= <>
##$DTYPP= 0
##$F1P= 0
##$F2P= 0
##$FCOR= 1
##$FTSIZE= 65536
##$FT_mod= 6
##$GAMMA= 0
##$GB= 0
##$INTBC= 1
##$INTSCL= 5.30512e-09
##$ISEN= 30
##$LB= 1
##$LEV0= 0
##$LPBIN= 0
##$MAXI= 10000
##$MC2= 0
##$MEAN= 0
##$ME_mod= 0
##$MI= 50
##$NCOEF= 0
##$NC_proc= -7
##$NLEV= 6
##$NOISF1= 182.463
##$NOISF2= 159.3651
##$NSP= 0
##$NTH_PI= 0
##$NZP= 0
##$OFFSET= 182.463
##$PC= 4
##$PHC0= -831.6592
##$PHC1= 369.4006
##$PH_mod= 1
##$PKNL= yes
##$PPARMOD= 0
##$PSCAL= 0
##$PSIGN= 0
##$REVERSE= no
##$SF= 81.0140089999434
##$SI= 65536
##$SIGF1= 159.3651
##$SIGF2= -187.1042
##$SINO= 113.3802
##$SIOLD= 16384
##$SREGLST= <1H.CDCl3>
##$SSB= 0
##$STSI= 65536
##$STSR= 0
##$SW_p= 29940.119760479
##$SYMM= 0
##$S_DEV= 0
##$TDeff= 32768
##$TDoff= 0
##$TI= <>
##$TILT= no
##$TM1= 0
##$TM2= 0
##$TOPLEV= 0
##$USERP1= <user>
##$USERP2= <user>
##$USERP3= <user>
##$USERP4= <user>
##$USERP5= <user>
##$WDW= 1
##$XDIM= 65536
##$YMAX_p= 488693505
##$YMIN_p= -19027684
$$ End of Bruker specific parameters
$$ ---------------------------------
##NTUPLES= NMR SPECTRUM
##VAR_NAME=  FREQUENCY,     SPECTRUM/REAL,   SPECTRUM/IMAG
##SYMBOL=    X,             R,               I
##VAR_TYPE=  INDEPENDENT,   DEPENDENT,       DEPENDENT
##VAR_FORM=  AFFN,          ASDF,            ASDF
##VAR_DIM=   65536,         65536,           65536
##UNITS=     HZ,            ARBITRARY UNITS, ARBITRARY UNITS
##FACTOR=    0.456856943014862, 1,           1
##FIRST=     14782.0589164792, 0,            0
##LAST=      -15158.0608439998, 0,           0
##MIN=       -15158.0608439998, -19027684,   0
##MAX=       14782.0589164792, 488693505,    0
$$ Real data points
##PAGE= N=1
##DATA TABLE= (X++(R..R)), XYDATA
$$ [...]
47858 847765 3280695 4658304 4136232 2373691 1044511 1216659 2256665 2561168 1543435
47849 1543435 429654 488594 1019295 319309 -1538260 -2532553 -1688773 -522251 -543911
47840 -543911 -937245 -176041 1385760 2409703 3112269 4708914 6645339 6627766 3817902
47831 3817902 257996 -1522772 -1110391 -17368 -27778 -2044016 -5435408 -8137944 -8396116
47822 -8396116 -6742032 -5363347 -5347267 -5526826 -4231190 -1240607 2123963 4047331 3539491
47813 3539491 1642768 848863 2102829 3138241 1516188 -1575338 -3069859 -2951281
47805 -2951281 -4118557 -7128533 -8778697 -7160707 -4618821 -3761813 -3790301 -3261706 -3388846
47796 -3388846 -5230896 -6060486 -2629107 3151117 5813991 3472989 -108481 -983478
47788 -983478 427287 1249215 426352 -334895 937724 3882658 5894179 5285355 4035115
47779 4035115 5521958 9139584 10017869 5827173 877279 418090 3324031 4389300
47771 4389300 2183800 -47415 -687416 -1890370 -4509710 -5375478 -1861411 3776407
47763 3776407 6890023 5587230 1905029 -827813 -790089 1104450 2242652 1302040 -254616
47754 -254616 -786519 -1256559 -3169923 -4993682 -3803391 61371 3271961 4159199 3762128
47745 3762128 2576223 88984 -2412363 -2685611 -1583649 -2004898 -3284021 -1520797
47737 -1520797 3253070 5500404 2113169 -2983078 -5109578 -5056093 -5452830 -5371400 -3109148
47728 -3109148 -889860 -1815653 -4445690 -5014079 -3254900 -1738251 -1027649 181238 1322264
47719 1322264 654944 -958803 -883009 971487 1990021 762498 -1641136 -3700909 -4157200
47710 -4157200 -1717844 3109942 6890812 6763276 4044436 1821295 619639 -571832
47702 -571832 -1006786 287877 1350701 -248743 -3140225 -4454572 -4850889 -6612395 -8247895
47693 -8247895 -6525816 -3075925 -2886488 -6056792 -7195608 -4067294 -800371 -609810
47685 -609810 -1043871 800019 3325218 3894935 3133683 2629134 1822307 93240 -1183099
47676 -1183099 -1246815 -1533603 -2309320 -1082398 3074015 7017052 8140029 8117171 9042532
47667 9042532 9295158 6868568 3708977 2655075 2570841 772990 -1666045 -1406743 1599267
47658 1599267 4091739 4344172 3536400 2881359 2465701 2366848 2274924 916499 -1687370
47649 -1687370 -2892293 -1195532 494610 -1117484 -4121269 -4045064 -888571 1197219
47641 1197219 734807 388887 1305726 1222707 -280808 431272 5285046 10350806 10768237
47632 10768237 7189518 4057201 3322791 3221111 2367638 1796842 2539422 3455775 2547326
47623 2547326 -456931 -3504198 -4090569 -1748868 1243410 1953532 -235965 -3084727
47615 -3084727 -4030779 -2811581 -1345627 -1431402 -2952803 -4292325 -4233892 -3121769 -2010958
47606 -2010958 -1261204 -741185 -896307 -2153593 -3321357 -2410493 442328 2728480 3033255
47597 3033255 2725669 3061347 2914158 1210279 -658493 -1344801 -2407989 -5475087 -8095745
47588 -8095745 -6283546 -661507 3742992 4061490 2422914 1616220 1394300 478416 -675223
47579 -675223 -998492 -744579 -674948 -690356 -365785 396765 1842341 3998028 5495166
47570 5495166 4663185 2221210 675975 478782 -627074 -3484985 -5692970 -5567244 -5025293
47561 -5025293 -6062307 -6964134 -5267638 -2484535 -1901822 -2661306 -450904 5480610 10226791
47552 10226791 9899488 6889086 5650057 5855814 3650045 -1313420 -4457700 -2872849
47544 -2872849 391771 941628 -842809 -1515176 -458427 84164 168507 2474088 6470239
47535 6470239 7133327 2235270 -3178598 -3481893 -437020 249807 -1985313 -2597514 -208328
47526 -208328 1182389 -854801 -3467196 -3750477 -2994712 -3012290 -2255026 1002870 4588194
47517 4588194 5119380 2839086 620378 -300859 -696905 -815555 -441433 -642419 -2740512
47508 -2740512 -5951599 -8192009 -8729859 -8187013 -6700544 -4116153 -1374569 237901
47500 237901 682402 404345 -991705 -3340194 -4391579 -2340926 818499 1371695 -818375
47491 -818375 -2008321 -3845 2907058 3529271 1926218 452120 286895 742149 1214114
47482 1214114 2154605 4009578 6142645 7272692 6860219 5782449 5312614 5527120 5391471
47473 5391471 4534526 3907754 4122086 4212577 3011146 847276 -1179430 -2747546 -3929395
47464 -3929395 -4139477 -2964706 -1422377 -828731 -831817 -103856 1321832 1957798 964009
47455 964009 -1057487 -3180984 -4658908 -4538524 -2392394 504911 2185780 2301177 2133987
47446 2133987 2372139 2422916 2086673 2196773 2914320 2735893 195713 -4063091 -7600095
47437 -7600095 -8387449 -6609283 -4407818 -3531642 -3158273 -1073332 2517287 4090672 1358090
47428 1358090 -2754067 -3176561 921180 5489213 7148113 6473551 5235133 3363220
47420 3363220 314212 -2623044 -3414526 -1783549 698215 2362040 2460689 1256994 -118624
47411 -118624 -575307 -327839 -482740 -1069294 -592444 1904055 5325341 7667783 7925739
47402 7925739 6628765 5404021 5999438 8378128 9680587 6871872 1006845 -2973270
47394 -2973270 -1761848 2504332 5097759 3974752 927109 -1249070 -1175937 666885
47386 666885 2424022 2213285 45158 -2102195 -2856474 -3143767 -4304258 -5648475 -5451777
47377 -5451777 -3650361 -1786652 -529569 1001645 3179610 4618287 3747029 880123
47369 880123 -1958561 -2997223 -2121120 -489811 831784 1595709 1866757 1424071 119821
47360 119821 -1624955 -3301123 -4782508 -5512517 -4004926 276588 4897385 6264004
47352 6264004 3756611 344767 -1231975 -1018225 -171673 899045 1584990 545791 -2060557
47343 -2060557 -3580647 -2114978 567031 1312793 -411569 -2755939 -4429748 -5080607
47335 -5080607 -3880387 -617683 2296823 1956949 -728664 -1752571 313757 2214647
47327 2214647 897606 -2115111 -3384390 -2677929 -2676267 -4355657 -5563267 -4613129 -2781767
47318 -2781767 -1798912 -758097 2064641 5131973 4541292 -65298 -3396380 -869135
47310 -869135 4753114 6535888 2606433 -1681229 -1579172 940997 1120241 -1663521 -4107929
47301 -4107929 -4265166 -3296724 -2799063 -3256234 -4740488 -6682905 -7309142 -5604195 -3433042
47292 -3433042 -3378771 -4903924 -5207497 -3618345 -2303149 -2407005 -2306492 -431423 2546638
47283 2546638 5156380 6755499 7098059 6172983 4949910 4499689 4297259 3410392 2920159
47274 2920159 4164471 4825523 848152 -6880263 -12103935 -11334093 -8196745 -7006219
47266 -7006219 -6310694 -2876773 1486679 2334911 -184626 -1788754 -871972 122862 -32437
47257 -32437 438604 2208888 3279088 2597641 1494019 477129 -1661597 -4373427 -4859290
47248 -4859290 -2670767 -974312 -1254948 -780912 1959262 3422187 566054 -3162163
47240 -3162163 -2311154 2283259 4892394 3436764 1354299 1151687 1433154 1253816 2338867
47231 2338867 4900318 5556666 2287570 -1719376 -2089659 1253781 5217545 7888000
47223 7888000 9018542 8200427 5616516 3248741 2506123 1828497 -685730 -3610856 -4154821
47214 -4154821 -2575348 -1262288 -354198 1906194 4896417 5959544 5412269 6863007
47206 6863007 11222362 14433536 13190787 9371848 6355143 4148909 1129224 -2078688
47198 -2078688 -3826671 -4614875 -5725405 -6190358 -4462020 -2003380 -1789801 -3764224 -4978729
47189 -4978729 -4040474 -2413099 -1328316 -356209 673205 1089585 1224150 2342691 4223871
47180 4223871 5198687 5158237 6094228 8850219 11593623 12436375 11541894 9818745 7603007
47171 7603007 5495823 4386130 3703918 1826148 -805517 -1439281 743284 2713726
47163 2713726 1912428 163125 774333 3534199 5402392 5070523 4106138 4144284 5351183
47154 5351183 7300408 9194367 9518834 7541041 4901009 3733839 3517733 1933101
47146 1933101 -1307877 -3813316 -3877406 -2239765 -117194 2139867 3637919 2622328
47138 2622328 -890454 -4039035 -4553137 -3949710 -5233252 -8142567 -8937968 -5179789 938778
47129 938778 4740115 3650151 -846629 -5057039 -6251445 -4513659 -2224507 -1706555
47121 -1706555 -2938872 -3624239 -1891851 1233281 2802749 1542614 -530941 -907192
47113 -907192 -72079 -575725 -2827375 -3948922 -1841904 1301662 1465765 -1905435 -5156999
47104 -5156999 -5189141 -3176925 -2510225 -4151794 -5577044 -4297072 -1146931 786374 -801
47095 -801 -1868269 -2654113 -2684353 -3857079 -6222858 -7325261 -5516379 -2367891 -563096
47086 -563096 -442074 -194036 1032817 1984185 1515738 419469 37837 -148661 -2189205
47077 -2189205 -6619245 -10707780 -10906661 -7094292 -3110876 -2218070 -3211644 -2753901 -735599
47068 -735599 -544389 -3533813 -6193198 -4741091 -387289 2558659 2546941 1936777 2720841
47059 2720841 3835523 3146882 53267 -4414592 -8410842 -9787312 -7474815 -2967563
47051 -2967563 920267 3132603 4717402 5906226 5056524 1633351 -1751865 -2226221
47043 -2226221 -465902 373554 -972858 -2561689 -2415554 -1184484 -718364 -1147709 -798695
47034 -798695 1125965 3038844 2833215 618560 -1418151 -1793345 -1277186 -1322973 -2054187
47025 -2054187 -2642388 -2832937 -2981436 -3040320 -2551786 -1377096 329983 2329978 3661353
47016 3661353 2753678 -375495 -2788981 -1397672 3099170 6742116 6722147 3689187 -52668
47007 -52668 -2626535 -2838842 -609639 2255157 3526773 3195990 2873855 2589996 825172
46998 825172 -1807335 -2138235 780189 3434164 2583120 -274900 -1706260 -1368758 -1232718
46989 -1232718 -1553256 -1033244 23157 109682 -421192 96939 1302397 1297582 578732 2016761
46979 2016761 6118019 9531984 9624290 7678081 5900418 4015678 1228473 -646817
46971 -646817 788522 4219361 5391637 2549544 -1104913 -1274885 2501267 6816421
46963 6816421 8484664 7405924 5323258 3004745 -44374 -3308711 -4541331 -2523258
46955 -2523258 653427 1893537 1132994 942248 2130873 2256740 -482934 -4040114 -4933729
46946 -4933729 -2487579 1154967 4231397 6539167 7905834 7699884 6304395 5410829
46938 5410829 5983793 6941944 6667493 5084216 3337947 1898749 151308 -1981940 -3140584
46929 -3140584 -2137430 118696 1529817 1549091 1606961 2477367 2981482 2441906 2610558
46920 2610558 5011219 7680393 7467541 5042923 4218920 5921304 6506427 3533645 -336962
46911 -336962 -1698230 -1512206 -2429269 -3423335 -1456376 2692990 4927137 4216357 3993783
46902 3993783 6074130 7369976 4859153 398586 -2357146 -3371909 -5178595 -7780305
46894 -7780305 -8123042 -4698784 74361 2875402 3180179 3062832 4214089 5894720 5760124
46885 5760124 2708856 -1223536 -2626208 -665275 1861018 2171177 945105 840646
46877 840646 2690895 4987097 6522131 7516524 8129286 7756933 6343541 4985479 4600500
46868 4600500 4939071 5296584 5320698 4811878 3585703 1892882 374392 -529600 -662638
46859 -662638 35083 1094462 1512752 1274146 2053850 4649975 6418959 3891021 -1876806
46850 -1876806 -5365341 -3097056 2310822 5992856 6440856 5368389 4086445 2706883
46842 2706883 1801532 2111261 2890890 2696633 1610434 746145 -163198 -2476846 -5764092
46833 -5764092 -7335716 -5458392 -1597552 1358528 2197233 2116644 2902730 4629554 5052577
46824 5052577 1904024 -3787440 -7961232 -8286982 -7149325 -7851813 -9304953 -7650824
46816 -7650824 -2620202 1417342 1375283 -959886 -2459900 -2554603 -1820958 278599 3659537
46807 3659537 5905420 5121502 2907942 1894231 1848629 1053562 115858 986219 2900154
46798 2900154 2937910 791472 -432094 1042950 3177078 3668315 3307037 3970713 5307974
46789 5307974 5527805 4279822 2807121 1845110 957239 -288683 -1682305 -2871596 -3752307
46780 -3752307 -4368979 -4732852 -4564935 -3351904 -1347137 -283424 -1709893 -4331790 -4597243
46771 -4597243 -846189 4389832 7237819 6425117 3257170 -903810 -5231420 -8338314
46763 -8338314 -8873015 -7448905 -6375457 -7043211 -8623297 -9465102 -8702985 -6475287 -3817734
46754 -3817734 -2496627 -3590186 -5786838 -6273492 -3821805 73326 3477321 5989256
46746 5989256 7676926 7640222 5215448 1711113 -735942 -1656242 -2123957 -2464122 -1840877
46737 -1840877 -345780 265576 -1130808 -3170776 -3653541 -2483053 -1742744 -2829711 -4549380
46728 -4549380 -4660767 -2823937 -1078233 -1140151 -2169170 -2309602 -1865389 -2937402 -5469048
46719 -5469048 -6130440 -3078321 222115 -856008 -5137761 -6829054 -3983596 -1429814
46711 -1429814 -3307498 -6679369 -6024107 -1239132 2984124 3977326 2837028 385419
46703 385419 -3598562 -6883219 -5676505 -763952 1714032 -1695378 -6628458 -7057455
46695 -7057455 -3436963 -727700 -611468 -461037 779649 634689 -2119422 -4763333 -4588967
46686 -4588967 -2630619 -1297840 -439912 1706845 4809498 6272876 4811750 2266548
46678 2266548 1238884 2153627 3503844 4199556 4471261 4591398 4110033 3117052 3091089
46669 3091089 4896845 6430048 4351635 -1333109 -6300370 -6565925 -2642396 2041045
46661 2041045 5210870 6614663 6377236 4899062 3743188 4330701 5852154 6287581 5234637
46652 5234637 3860079 2446838 324904 -1793538 -2067868 -782970 -812012 -3481825 -6032706
46643 -6032706 -5040777 -1142522 1481853 -46039 -4173877 -6537319 -4194582 1474406
46635 1474406 5941813 6028152 2951520 85274 -1569688 -3777663 -7161852 -9441522
46627 -9441522 -8421706 -4643354 15704 4369487 7275524 7125675 4037836 1059150
46619 1059150 1015807 3087267 4341343 3683195 2317958 1188158 204107 -388233 -11532
46610 -11532 929360 1512653 1952860 3088803 4421450 4518990 3355604 2379991 2151652
46601 2151652 1820939 1208203 1346993 2316423 2456787 690199 -2027752 -4549107 -7143658
46592 -7143658 -9975817 -11542976 -10436689 -7697121 -5579966 -4503443 -2969767 -280750
46584 -280750 2426896 3990365 4418350 3837883 1834333 -1223858 -3479680 -3549674 -2450797
46575 -2450797 -2146312 -2583826 -1819404 826399 3520479 4623651 5083588 6688307 9003932
46566 9003932 9922677 8866447 7510848 7152728 7150312 6487039 5190979 3440534 997232
46557 997232 -1271703 -992517 2722272 6979944 7929385 5397251 2710307 2146021 2717911
46548 2717911 2686517 2024515 1497957 1207226 1362343 2965097 5985835 7860560 5848968
46539 5848968 756267 -3460203 -4152138 -2590318 -1470898 -1192446 6375 2851787
46531 2851787 5690474 6695761 6067669 5056191 3674596 913973 -2768292 -4741539
46523 -4741539 -2990909 1104686 3907770 3334533 661576 -1520708 -2161916 -1951074 -1423374
46514 -1423374 -185778 1672851 2552525 965119 -2050621 -3495114 -1889422 863700
46506 863700 1880294 625296 -1230354 -2429949 -3037780 -3119065 -2320126 -983614 -78445
46497 -78445 487876 2077021 5155484 8090078 8816005 6803569 2996265 -1012002 -3348764
46488 -3348764 -3000442 -1483678 -1964733 -5555047 -9602749 -10751108 -8634343 -5550245
46480 -5550245 -3703962 -3925645 -5779530 -7442842 -6571727 -2871616 1011041 2459963
46472 2459963 1754602 767218 259363 148576 932755 2627971 3496146 2226307 348562
46463 348562 -73041 -147439 -2573352 -6987454 -10160711 -10734872 -10475553 -10463030 -9281528
46454 -9281528 -5875145 -1407634 2608552 5449744 5827698 2454738 -2923889 -6103260
46446 -6103260 -5552713 -4144853 -4122163 -3428927 494982 5905095 8727962 7587915 4142126
46437 4142126 -23506 -3973671 -6113535 -5327688 -3022636 -1666469 -1691381 -1818808 -1668094
46428 -1668094 -1754281 -1565258 -170668 1536922 1661899 318960 -534399 -376616 -790542
46419 -790542 -2364573 -3306915 -2232494 -474498 -233076 -1533778 -2228227 -448261 3663014
46410 3663014 8168564 10796947 10613589 8571148 6225536 4172611 2301662 1091405
46402 1091405 1440015 3100288 4325807 3541630 945711 -1644488 -2297534 -704220 1166527
46393 1166527 838604 -1536323 -2766299 -561241 3096955 4416375 3007987 2133723
46385 2133723 3530734 4733438 2981068 -371228 -1667642 -187172 911648 -908709
46377 -908709 -4098475 -5098713 -2755787 694022 2698412 3022238 2915069 2953941 2907626
46368 2907626 2959045 3339505 2856913 -191645 -4890337 -7372071 -5156991 -557900 2027695
46359 2027695 1388002 115272 411327 1491680 1577175 680352 449568 2129111 5308531
46350 5308531 8190753 8939750 7352668 5190101 4269754 4542699 4858387 5048867 5822573
46341 5822573 6850250 6760083 5417617 4576857 5487123 7154207 7875769 7385214 6382132
46332 6382132 4798607 1908372 -2027088 -5356381 -6606652 -5912415 -4535983 -3187839
46324 -3187839 -1307330 1646427 4508840 4980404 2358524 -1064082 -2163445 -165732
46316 -165732 2946606 4611493 3510866 21806 -3895472 -5696620 -4392548 -1479356
46308 -1479356 1125578 3280345 5512593 6920037 6408449 5330841 6131355 8320084
46300 8320084 8614305 5672370 1982863 166491 156090 1238544 3836601 7239432 8488384
46291 8488384 6441629 4615394 6464397 9555709 8662423 4010684 1741284 5091896
46283 5091896 9281061 7721871 597837 -5795841 -6861042 -3837481 -479402 1474157
46275 1474157 2400305 2320980 465388 -2831029 -5500979 -6019659 -5506572 -6221329 -8136008
46266 -8136008 -8601225 -5982207 -2047045 520333 1640888 2963193 4321662 3591352
46258 3591352 244889 -3339986 -5006631 -5232692 -5236646 -4676391 -3132493 -2263839 -3776557
46249 -3776557 -5847968 -4550640 563663 4903924 4391873 760805 -690704 2347985
46241 2347985 7011325 9334826 8380858 5788811 3086263 794325 -776945 -1369082
46233 -1369082 -1333260 -1337301 -1355658 -613207 1219363 3153749 3514226 1558801 -1397714
46224 -1397714 -2736398 -1144569 1424642 1495284 -1567969 -4188460 -3034604 151129
46216 151129 571055 -2821132 -5382804 -2993650 2273651 5185926 4432612 3352673 3982229
46207 3982229 4196992 2157043 296874 2013173 6280331 8904106 8398076 7163803
46199 7163803 6619724 4771125 187906 -4616778 -6281812 -5002959 -3100569 -822941
46191 -822941 3030607 7040326 7555440 3847246 -321016 -1632454 -1168170 -1808102 -3855362
46182 -3855362 -5214218 -4362960 -1215236 3752534 9248712 12841830 12784473 9954264 6865605
46173 6865605 5264261 5445026 6728657 7400753 5508709 1330411 -2132098 -2851289 -2708489
46164 -2708489 -4644077 -8053618 -9613603 -7992540 -4977136 -2179826 511111 2959119
46156 2959119 4052285 3781536 3771792 4769003 5465442 4726598 3283842 2258366 1473008
46147 1473008 260695 -1038321 -1127247 1205040 5860989 10301211 10523362 5267250 -1182819
46138 -1182819 -2981329 374252 3835279 3902644 2753355 3917151 6868344 8374479
46130 8374479 7304545 5473076 4539866 4169502 3073870 620790 -2474163 -4591984
46122 -4591984 -4887226 -4582656 -5523176 -7476894 -8390088 -7318112 -5199016 -2681971 366327
46113 366327 2821486 2661246 376824 -844067 294851 1380983 791452 766687 3293017
46104 3293017 5765883 4341670 -100718 -2863781 -1408517 2516732 5940860 7091216
46096 7091216 5427771 2064442 -53070 1254507 4715264 7254098 7644093 6647596
46088 6647596 4626527 1644804 -607937 198447 3901142 7791377 9816189 10073305
46080 10073305 9318882 7999120 6885708 6882882 7835521 8704699 8945410 8792868 8571048
46071 8571048 8600604 9072172 9098437 6965498 2460533 -2224190 -5052009 -6208250 -6516968
46062 -6516968 -5762236 -4149201 -3266304 -3605598 -3329854 -1651106 -821801 -2102266 -2780820
46053 -2780820 -880508 170664 -3537811 -9060377 -9911072 -5639948 -2189106 -2769015
46045 -2769015 -4237881 -3476834 -1895894 -1792585 -2738086 -3502139 -3853579 -3016473 -290
46036 -290 3363231 3603965 1043817 -45800 1930177 3528769 2399457 1203689 2659581
46027 2659581 4714220 3971379 807102 -2113120 -3877145 -5021877 -5393476 -4864432 -4353341
46018 -4353341 -4268859 -3878557 -3349656 -3717358 -3900321 -1407743 2633215 3541250 320474
46009 320474 -1879948 385137 3317855 2309976 -499546 -283926 2308877 2781531 281769
46000 281769 -2142870 -3261220 -4244705 -4558762 -2584052 -3456 -571425 -4217773 -6735678
45991 -6735678 -5828261 -3609004 -2599128 -2867077 -3845610 -5730403 -8090454 -9530277 -9402724
45982 -9402724 -8090924 -5805279 -3018506 -1367652 -1805931 -2633213 -1791340 -203848 -267852
45973 -267852 -2074811 -3862327 -5051701 -5957942 -5903574 -4843942 -5194818 -8168872 -9936220
45964 -9936220 -6133891 852614 4227273 2011620 -1237268 -1929099 -1221597 -686071 241433
45955 241433 1031830 -496685 -3579186 -4166896 -1323771 701297 -805626 -2837107 -2062443
45946 -2062443 -37587 346881 -284226 -148849 -64282 -1014324 -1004550 1676590 4705350
45937 4705350 5286993 5081964 7245219 10531483 11064235 8781381 7323482 7820090 7362681
45928 7362681 4209882 496485 -1435801 -2180841 -3272399 -4520561 -4888663 -4302245 -3253321
45919 -3253321 -1836512 -233575 827799 1058859 1375460 2770533 4640155 4972454 2596213
45910 2596213 -918237 -2344283 -415054 2290421 2280030 -525204 -3154550 -3995815 -4313197
45901 -4313197 -4871984 -4024796 -859373 2312392 3036400 2333340 2496612 2858808 1085552
45892 1085552 -2015353 -2580464 838878 4832357 5460461 3029701 1150791 2395057
45884 2395057 6267004 10595414 13401793 13487664 10520763 5422179 332965 -2796003
45876 -2796003 -4022663 -5122773 -6846804 -7416400 -5125906 -1634841 -453253 -2220445
45868 -2220445 -4023673 -4002294 -3878143 -5484938 -7443140 -7621487 -6847052 -7273198 -8312329
45859 -8312329 -7267673 -3603357 218221 2246821 2894562 2878828 1665118 -1014654 -3729655
45850 -3729655 -4634178 -3431289 -1443497 -339046 -1043881 -3183472 -5272106 -5922620 -5001953
45841 -5001953 -3360742 -1803070 -813979 -706236 -1152586 -974014 682485 3236204 5530643
45832 5530643 7341096 9057153 10269725 9814342 7156325 2983404 -1243174 -3647089
45824 -3647089 -2705990 969087 4189402 4213290 2120351 1529125 3821654 6387762 6205011
45815 6205011 3528963 946126 63525 657165 2317061 4959734 7464942 7646229 4880096
45806 4880096 1727982 1181289 2581576 2307651 -1040621 -4427996 -4806197 -3598494 -4173293
45797 -4173293 -6295918 -6587944 -4264577 -2686226 -4204570 -6772739 -7487174 -6808267 -6954483
45788 -6954483 -8028842 -8166886 -6423038 -3565332 -827896 739975 715085 229892 1146144
45779 1146144 3289637 4230397 2882882 1090963 244734 -877942 -2738383 -2600127 1201723
45770 1201723 5149498 4848192 1643891 443961 2130599 3139715 2319234 2850087 6124575
45761 6124575 8455905 6210945 776689 -3953267 -6398678 -7424173 -7897929 -8316701
45753 -8316701 -9192713 -9873840 -8366579 -4149303 -63117 412665 -2661317 -5470933 -4313931
45744 -4313931 796878 6149010 7918204 6019091 3780846 3343601 3017172 830021
45736 830021 -1263184 70776 3777105 5023546 1710858 -3217251 -6494143 -7941352
45728 -7941352 -8227071 -6902952 -4261743 -1921680 33370 3279930 7040864 7351541
45720 7351541 2885548 -2058296 -3295134 -2113554 -1556570 -752087 2627401 6856793
45712 6856793 8218761 7173166 7442491 9541425 10137827 7978279 5712210 5013066 4298861
45703 4298861 2665964 2005926 3279987 4263713 3298667 2192010 2802302 3451531 1748648
45694 1748648 -1082542 -1960611 -733099 -24240 -1020225 -2455413 -3487566 -4484108 -4672494
45685 -4672494 -2098106 2956484 7076738 7829865 6781323 6669116 7348650 6759883 4648287
45676 4648287 2739266 1789499 1077939 734800 1864585 3897643 4552284 3425121 2874762
45667 2874762 3776952 3293151 -538337 -4546756 -4493901 -1820424 -1836208 -5382844 -7085816
45658 -7085816 -3391592 1861280 2740437 -854176 -3976853 -3664865 -1649138 -516315
45650 -516315 -388618 -32755 1136413 3267180 6627881 10591438 12987585 11936791 8275054
45641 8275054 5090057 4500740 5641776 6360144 6094449 5884810 6001170 5457488 4264476
45632 4264476 4004247 4802799 3741428 -1371372 -7884385 -10633818 -7888899 -2566723
45624 -2566723 1919544 4233725 3890136 883113 -2748924 -3984104 -2524380 -967712
45616 -967712 -547326 443776 2985996 5219369 5519751 4696826 3415589 649410 -3010831
45607 -3010831 -3807619 185380 5111069 5927115 2963951 340435 -319692 -559052 -786242
45598 -786242 225183 1795556 1508562 -566613 -1477888 -36759 1460402 1302453 1105930
45589 1105930 2815508 5372678 6393741 5698423 5302274 6519989 8396406 8961670 7507835
45580 7507835 5479803 4789414 5175009 4311455 1240555 -1770783 -2306100 -1405427 -1982894
45571 -1982894 -4561033 -6998024 -7966907 -8139000 -7934306 -6632485 -4228017 -2078125 -1032812
45562 -1032812 -469990 442459 1892863 3830863 5752178 6322954 4942264 3364173 3766138
45553 3766138 5462976 5803304 4231417 2937689 3237812 3940342 3992369 4225241 5307187
45544 5307187 5971942 4603824 1344984 -2070075 -3495476 -1481783 3051829 6343147
45536 6343147 5140203 694381 -2693439 -2965003 -1528383 533146 3738892 6938611
45528 6938611 6846210 2939329 -582315 -375577 1361564 785871 -1402016 -1232003 2399743
45519 2399743 6299935 7256859 4970847 893059 -3374346 -6274637 -6835065 -5557778
45511 -5557778 -3820315 -2447391 -1565944 -1209729 -1102402 -636482 -185447 -1499283 -5254722
45502 -5254722 -8806235 -8132451 -2266557 5159461 9022158 7149933 2090661 -1284057
45494 -1284057 -475258 2270797 2960270 722028 -1904531 -3114302 -3612635 -3761821 -2050539
45485 -2050539 1830995 4937993 4480692 1537678 -893414 -1973391 -2747256 -3180675 -2244657
45476 -2244657 -338509 818084 536494 -363431 -993704 -800279 672750 2766930 3382263
45467 3382263 1477303 -1024043 -1683189 -863913 -555878 -1040178 -1217484 -1356409 -2720170
45458 -2720170 -4871097 -6031160 -5942207 -5847141 -5844879 -4916463 -3505218 -3284329 -4154274 -4242593
45448 -4242593 -3288688 -3190969 -4450040 -4871826 -3014220 -501886 459912 -186496 -1408543
45439 -1408543 -2855321 -4048023 -3543210 -685347 2849511 4636484 3883505 1480281
45431 1480281 -1225421 -2966080 -3109291 -2470704 -2412807 -2610429 -1293929 1563079 3223410
45422 3223410 1712571 -1238976 -2397152 -946266 1378340 3018485 3782892 4088411
45414 4088411 4614068 6162197 8460557 9642116 8250391 5213397 2546556 843512
45406 843512 -360672 -511282 1411814 4260103 4965853 2321132 -1198855 -2544094 -1721377
45397 -1721377 -943327 -1095594 -851069 769531 2626669 2987972 1812554 539223 76317
45388 76317 -21773 -501833 -1490224 -2823716 -4477220 -6184810 -7156844 -6687693 -4851932
45379 -4851932 -2421511 -352922 751668 1278452 2558365 5234815 7749588 7873630
45371 7873630 6022921 5275856 7215034 9556896 9344721 6882672 4716867 4175300 5006860
45362 5006860 7010994 9330730 9195846 4634244 -1805666 -5227786 -4477711 -2927093
45354 -2927093 -2767793 -2098978 905513 4266234 4975852 3139359 946381 -637536 -1692630
45345 -1692630 -1315933 1473716 5284464 7110795 5765443 3224990 2414446 4261111
45337 4261111 6635082 5955625 723482 -6259625 -10381572 -10155204 -8089835 -6554626
45329 -6554626 -5297082 -3837208 -3224688 -3536620 -2547626 478208 2283554 110457 -3608609
45320 -3608609 -4847665 -4324596 -5682282 -8582266 -8939637 -6097920 -4282534 -5513494
45312 -5513494 -6218408 -3424683 245346 1276070 1190803 3359211 6427420 6006301 2105110
45303 2105110 65884 3314732 8858705 11392851 9246356 4830182 1316107 459433
45295 459433 2096636 4074993 3662218 540388 -2285320 -1912693 754634 2261391 1182797
45286 1182797 -379582 -126037 1512749 2818681 3580997 4634118 5424390 4296278 1448767
45277 1448767 -394844 812017 4061792 7110547 9103844 9887619 8267433 3531218
45269 3531218 -1756634 -3248497 182523 4916737 6893795 5691379 3386348 1259414
45261 1259414 -708786 -2414053 -3703015 -5259191 -7612641 -9508678 -8899913 -5613637
45253 -5613637 -1663672 1174884 2798916 3698029 3939096 3744597 3779637 4091147 3813055
45244 3813055 2787021 2479855 4060450 6177330 6128561 3306823 250407 -217818 1929521
45235 1929521 4304258 4998864 4360612 4063441 5116742 6957557 8076585 7331051 4959877
45226 4959877 2515495 1482267 1718424 1660170 462931 -595499 292882 2766852 4425505
45217 4425505 3874157 2337819 1571575 1474703 995920 296412 234696 312277 -750252 -2370662
45207 -2370662 -2240322 237002 2678342 3087363 2767005 4267636 7672686 10650155 11341611
45198 11341611 9578275 6078122 2300139 449075 1509378 3508976 3770733 2671324
45190 2671324 2800081 4370925 4468200 1875918 -384173 399429 1825778 -682318 -6995387
45181 -6995387 -11555691 -10059384 -4396041 314034 1868182 2271371 3499404 4242621
45173 4242621 2141076 -1845942 -3592546 -1081869 2334315 1920084 -2141271 -4959449
45165 -4959449 -3490721 -213834 787054 -870351 -2273839 -1491444 467713 1347330
45157 1347330 -65785 -2950026 -4978263 -4487152 -2542958 -1750930 -2733139 -3555734 -3209863
45148 -3209863 -3280176 -4856085 -6266928 -5861831 -4784090 -4631923 -4438154 -2618093 -26599
45139 -26599 1702806 2954561 4331074 4262221 1919734 169960 1305353 2146706 -1215077
45130 -1215077 -5731748 -5139615 -551707 384391 -4248502 -7292125 -4150833 -15261
45122 -15261 -915907 -4239723 -3973222 -191645 2914928 4396093 5539967 4834115 625015
45113 625015 -3522045 -2842451 761339 1459139 -977606 -1357865 1356538 1918878 -2360629
45104 -2360629 -7244434 -8526007 -7751436 -7982350 -8646493 -8097652 -7480422 -8381480 -9402568
45095 -9402568 -8348633 -5626906 -2683316 716789 4755341 7124096 5496132 1153042
45087 1153042 -2671745 -4959056 -6658132 -7329700 -5341011 -1392652 1217688 784378
45079 784378 -640420 -608747 -90449 -1947980 -6193277 -8961417 -7089627 -2223822 1374000
45070 1374000 2366128 3200631 5127481 5418328 1662415 -3489591 -5080406 -2308446 996339
45061 996339 2041780 1986806 2800206 4199337 4789513 4077505 2413346 608522 23523
45052 23523 1268267 2746411 2532751 1493917 1963060 3561310 3673935 2259773 2248062
45043 2248062 4233644 5011315 3112153 1450050 1844432 1229211 -2910829 -7088144 -6626038
45034 -6626038 -3285862 -2720508 -5710697 -7481736 -5686648 -3736565 -4773308 -6641669
45026 -6641669 -5254443 -268326 4842331 6855593 5407162 2641972 1351501 2642981
45018 2642981 4815015 5162787 2974095 -40740 -1980443 -2267954 -1317417 -137074 -66372
45009 -66372 -1432732 -2590417 -1736666 494922 1778411 1235551 182004 -103181 481296
45000 481296 1948334 4446879 7021026 8017765 7362687 6853001 7606028 8714944 8997147
44991 8997147 8542188 7826454 6739304 5318630 4247969 3904289 4005933 4634293 6166153
44982 6166153 7655829 7109967 4494874 2724292 3954508 6246151 6081599 3562026
44974 3562026 2712600 6176900 11386015 13064131 8779288 1228062 -4567272 -5646870
44966 -5646870 -2880584 790041 3130034 3604454 2467006 -20746 -3255623 -6082715
44958 -6082715 -7658358 -8185401 -8211987 -7555741 -5739830 -3359965 -1899268 -1672046 -908914
44949 -908914 1992393 5730229 7063240 4811579 1530077 340220 1269534 2074016 1777498
44940 1777498 1457533 1703029 1384685 -373641 -2571420 -3587376 -2966303 -1255886 826017
44931 826017 2334600 2361111 1254916 599613 1110328 1531453 503416 -1451517 -2687922
44922 -2687922 -2196779 142059 3723217 6598375 6262140 2693814 -598303 -380531 2397230
44913 2397230 4271582 3846753 2576361 1732426 1144912 912072 1865337 3603685 3947247
44904 3947247 1447426 -2546497 -5127430 -4715570 -2496529 -1341575 -3172437 -7070425
44896 -7070425 -10297307 -11168262 -9948572 -7002006 -2125720 3413259 6533797 5881692
44888 5881692 3855551 3144953 3205093 2431050 1543932 1672227 1171766 -1645234 -4166806
44879 -4166806 -2518816 1820848 3462230 1229484 -350641 1347791 3188309 2101633
44871 2101633 75384 338443 2266337 3303171 3119860 2829945 2381882 1446967 821930
44862 821930 603017 -763436 -3297122 -3945410 -984479 2561705 3070172 1593356 1469085
44853 1469085 2739120 3076903 2882395 4876462 8837181 11012351 9502046 6706821
44845 6706821 5271752 4490541 2295168 -1198379 -3780644 -3856828 -2053178 -480868 -670818
44836 -670818 -2074020 -2974071 -2880571 -2693641 -2146119 606145 5318506 8035836 5885412
44827 5885412 1694952 453630 2270864 2682685 -250550 -3181982 -2766633 -194030
44819 -194030 1413623 1550518 2021833 3613898 5253674 5976006 6079965 6152348 5821070
44810 5821070 4031983 693167 -2258554 -2299528 749533 3999047 4263526 913069 -4155971
44801 -4155971 -7979581 -7655196 -2304901 4790319 8258085 6638897 4111010 4200012 4616878
44792 4616878 1607543 -3268974 -5294953 -3846293 -2365607 -1865973 -9336 3046986
44784 3046986 3609269 820870 -1135944 411401 2489460 1754637 -254606 -497192 575043
44775 575043 1153183 2068020 4440803 5806588 3268985 -843964 -1117364 3448073 8113966
44766 8113966 8825554 6372721 3505363 1225825 -638442 -1657037 -1417257 -639684 -280901
44757 -280901 -159461 636266 2308429 3869088 4101136 2928201 1631320 1222363 825863
44748 825863 -1183990 -4299260 -5701724 -3742686 -163682 2173477 2438893 1677222 1045561
44739 1045561 1588142 4192896 7951578 9848166 8053751 4505167 2338390 1957565
44731 1957565 1791361 1588590 2049896 2023767 -500490 -4487975 -6233418 -4497682 -2430638
44722 -2430638 -3095224 -5495558 -6650628 -5645945 -3792070 -2201881 -1171159 -1183077 -2732024
44713 -2732024 -5267619 -7421141 -8158367 -7082452 -4200601 -362916 2556953 3213123
44705 3213123 2598906 3180966 5746665 8028304 7414157 4555253 2889681 4261619 6479875
44696 6479875 6412309 4261889 2697072 2377391 1203052 -1542968 -3454227 -3057296 -2684119
44687 -2684119 -4498216 -5959243 -3110487 2644945 5296742 2153476 -2802094 -4811906
44679 -4811906 -4284926 -4617774 -6458251 -6993992 -4156261 696793 4344947 4741983 2471198
44670 2471198 -138818 -1330069 -1448033 -1923564 -3204886 -4705078 -6314736 -8212375
44662 -8212375 -9197200 -7436084 -3631181 -1281171 -2337987 -4306149 -3437570 398711
44654 398711 3883738 4455712 2484511 -307505 -2678543 -3886586 -3321763 -845220 2900315
44645 2900315 6671899 9015399 8961691 6878981 4380046 3002000 3137417 4145936 4822664
44636 4822664 3889282 1218425 -1255147 -1239942 871032 2162382 971246 -1217038 -2469565
44627 -2469565 -2995479 -3644475 -3770856 -2526536 -723530 590906 1911441 3528746 3779776
44618 3779776 1791743 324587 2367519 5988195 6580821 3832318 2103669 3550568
44610 3550568 5468086 5696741 5951477 7428551 7528871 4435532 1306855 1672814 3443340
44601 3443340 2320268 -704691 -708450 2803868 4502615 1390043 -2572102 -2499460 520129
44592 520129 1873810 331136 -1185258 -861321 -608713 -2756460 -6343903 -8090854 -6280890
44583 -6280890 -2524424 426449 1759938 2665019 3702723 3746985 2226272 661447 280049
44574 280049 -414798 -3165175 -6052430 -5402271 -1536859 1035568 69756 -1494568 -844478
44565 -844478 184231 -1094875 -2953664 -1768848 2034906 4703875 4843623 4270319 3550248
44556 3550248 1013330 -3140033 -5747061 -5158317 -3530972 -2996041 -2499700 -474056 1935737
44547 1935737 2748845 2388519 2632289 3580643 3810014 2696653 919996 -553325 -827110
44538 -827110 326250 1124252 -1130019 -6005121 -9019038 -6961924 -2249922 635355
44530 635355 1127662 1657237 2428211 1486807 -558748 -634496 1322148 1535884 -1346554
44521 -1346554 -3430751 -1583947 1415451 1203736 -1436010 -2240197 -375594 459059 -2332732
44512 -2332732 -6989718 -10290685 -10985718 -9630122 -7259980 -5122982 -4002963 -3085504
44504 -3085504 -987665 1646810 2411962 783319 -407113 1445285 5076782 6944642
44496 6944642 5477697 1988585 -1976167 -6042922 -9587729 -10983698 -9518227 -6976909
44488 -6976909 -5913214 -6671839 -7332606 -6610409 -5541719 -5660843 -6496216 -6110170 -3859794
44479 -3859794 -1343094 -299710 -663343 -1313623 -1722452 -1745588 -550797 2533218 6006685
44470 6006685 6745769 3557777 -811175 -2422787 -447156 2385686 3348322 2386944 1011548
44461 1011548 -44549 -964447 -1439237 -634864 1242561 2509797 1889874 292375 -129902
44452 -129902 1306986 2694997 1502274 -2488950 -6536506 -7441343 -4712422 -1047664
44444 -1047664 467141 -612045 -2151046 -2194171 -959285 -108036 -838801 -2962836 -5108945
44435 -5108945 -5479984 -3274400 32698 1698741 838347 -354871 366890 2020831 1878070
44426 1878070 -341383 -2014718 -1574286 -621311 -1049067 -1938413 -935597 2354248 5833144
44417 5833144 7130041 5289672 1094708 -3090952 -4682511 -3593488 -2953414 -5422683
44409 -5422683 -9181936 -9522533 -4607380 2111422 5758714 4828575 1435081 -1758089
44401 -1758089 -3606805 -4289721 -4388941 -4224700 -3555290 -1985500 199611 2092051 3320603
44392 3320603 4531039 6240558 7857716 8577228 8729962 9188309 9547573 8139307 4460025
44383 4460025 726286 -80030 2428164 5640763 7108225 7018161 6802909 6402076 4594853
44374 4594853 1739237 85702 627399 1432839 487538 -1207430 -1217742 557732 1876751
44365 1876751 1628131 1074900 1298804 1509153 788323 -186731 -353943 40962 114901 -299427
44355 -299427 -1094230 -2743351 -5424153 -7927451 -8737470 -7844004 -6380228 -4809379 -2654457
44346 -2654457 65048 2221964 2637896 1154574 -1385151 -3814692 -5455388 -6555772
44338 -6555772 -7585876 -8004354 -6655203 -3782793 -1307384 -147229 1218583 3920241
44330 3920241 5977368 4952956 2360737 2151893 4765363 6195381 4063614 1183573
44322 1183573 921588 2013743 1222946 -928419 -1081789 1030803 1742206 -738998 -3287634
44313 -3287634 -2423367 823553 3003541 3345015 3909680 5373014 5522369 2539314 -2267893
44304 -2267893 -6106098 -7785097 -7952995 -7121818 -5099343 -2461352 -1062824 -2037605 -4025232
44295 -4025232 -4718759 -4039112 -4217889 -6142001 -7251596 -4737577 85898 2860489 1740103
44286 1740103 -368670 -90851 1833920 2033667 -624832 -3834493 -5252755 -5007762 -4266380
44277 -4266380 -3036426 -721201 1902833 2735831 728934 -2514032 -4195895 -3364211
44269 -3364211 -1871881 -1909355 -3214798 -3759715 -2881797 -2119002 -2505214 -2791031 -1562217
44260 -1562217 346927 1273358 1455044 2295992 3638013 4094526 3820809 4449743 6041188
44251 6041188 6595017 5300837 3941995 4064067 4904339 5294689 5464362 5500647 4121565
44242 4121565 819337 -2551883 -4197144 -4681021 -4937232 -4012028 -1283274 998785 569044
44233 569044 -825347 286988 3694948 6018424 6052324 5631391 5222560 2988678 -906914
44224 -906914 -3255525 -2610774 -1320940 -899099 806399 5269710 9645285 10665373 9281416
44215 9281416 8046733 6595155 3689407 1471722 2897558 6094069 6209176 2834163
44207 2834163 893309 3239287 6578717 6524399 3343510 502152 -68476 960156 2350171
44198 2350171 3438144 4127911 4991995 6631651 8311110 8304235 6090727 2950165 -15766
44189 -15766 -2901883 -5534218 -6795397 -6403535 -5869704 -6609888 -8260231 -9635043 -10089149
44180 -10089149 -9260379 -6939539 -4010865 -2048312 -1174737 99735 2153168 3343795
44172 3343795 2946666 2778527 4086190 4825342 2483445 -1745363 -4245972 -3777801 -2545088
44163 -2545088 -2686817 -3899525 -4807381 -4967729 -4900831 -4954919 -4478820 -2157761 2078238
44154 2078238 5484670 4619296 -141908 -4167031 -4030965 -1448247 -79669 -704406 -1932137
44145 -1932137 -3324843 -4524500 -3356395 1035963 4557372 2449424 -3251203 -5576402
44137 -5576402 -2326870 1294293 1032048 -789324 -593378 375845 -795522 -3125750 -3729078
44128 -3729078 -2935445 -3082090 -3833317 -3010476 -1206594 -1326463 -3477884 -4111685 -1079168
44119 -1079168 3411186 5961402 5843134 4570061 3330079 2087563 422888 -1496958
44111 -1496958 -2583396 -1678320 774038 2560445 2080389 243720 -893212 -461746 1314191
44102 1314191 4248382 7464914 8561248 5743761 578958 -3187049 -3486557 -1346191
44094 -1346191 925975 1446006 -588566 -4076684 -6292262 -5584321 -3179027 -954537
44086 -954537 1096065 3135324 3136363 -415817 -4764076 -5754143 -3892978 -3343937 -4967520
44077 -4967520 -5053942 -1859532 1337057 1569078 286233 -253877 -703222 -1796908 -1500553
44068 -1500553 1326473 3339068 923128 -3875088 -5647683 -2786831 1184302 2718139
44060 2718139 1453222 -1283702 -4288530 -6721303 -8441386 -9728175 -9490037 -5483909
44052 -5483909 1716737 7111755 6504783 1580285 -3218937 -6735756 -10155475 -12128771
44044 -12128771 -10130412 -6018621 -4754345 -7022331 -8164834 -5563492 -2214122 -1249470
44036 -1249470 -1561226 -1268166 -1345548 -2808113 -3684979 -1918987 1371680 4154623 6260597
44027 6260597 7347152 5267053 -131056 -4311366 -3111607 1400963 3922279 3119512
44019 3119512 1925419 1981267 2115126 1895377 2582166 4273744 5489950 5787350 5708136
44010 5708136 4293338 187477 -4620057 -5965713 -3209608 -184963 531772 586859 1646853
44001 1646853 2169319 881455 98127 2261306 5564843 6508099 5175124 4469153 5139909
43992 5139909 5232395 4274517 4410994 6527391 8214278 7176784 4652194 3582969 4497030
43983 4497030 5045752 3444638 896661 -10012 1362656 2885755 2385151 440231 -412764
43974 -412764 984306 3038330 3554379 2000440 -881309 -4263557 -6899025 -6885900 -3547198
43965 -3547198 962979 3530198 3355566 2065162 998125 75849 -784726 -1068811 -907065
43956 -907065 -1259130 -2189314 -2374198 -1084499 599182 1377569 1447918 1818960 2914639
43947 2914639 4610953 6608868 7983684 7512203 5391117 3498842 2979976 2877343 2262803
43938 2262803 1983026 2497695 1840181 -1446323 -4643536 -3768642 140036 1644070 -1341476
43929 -1341476 -4372593 -3039000 848454 2677378 1891770 1555531 2602707 2699558 648554
43920 648554 -1808956 -3198736 -4160691 -5099942 -4768378 -2558985 59748 1845597 3517736
43911 3517736 5702082 7103180 6576679 5367603 5169423 5240805 3759700 1187812 -114427
43902 -114427 746538 2474976 4078667 5773604 7175943 6936178 5008217 3343585 3261315
43893 3261315 3757775 3562889 3227980 3581377 3520188 1527498 -1300232 -2180853 -777672
43884 -777672 -53261 -1939811 -4119908 -3079019 683408 2942297 1420976 -1114856
43876 -1114856 -725273 2369594 4419606 3582039 2420383 4225376 8465543 11303233
43868 11303233 10065354 6076977 3112741 3656497 6643562 8594316 7160627 3606214
43860 3606214 1241919 1389884 1977162 630941 -2103532 -3813607 -3563963 -2649367 -2383029
43851 -2383029 -2630538 -2566116 -1683670 1685 1738692 2146607 684087 -1145061 -1425160
43842 -1425160 -627292 -1152886 -3784022 -6303926 -6405538 -4449833 -2303229 -758667 562410
43833 562410 1689097 2155788 1967915 1497631 577194 -1325294 -4000447 -6238348 -6812676
43824 -6812676 -5550182 -3569607 -2418134 -2523439 -2626413 -1418044 593970 1978203
43816 1978203 2675951 3474914 3319220 10248 -5365716 -7746495 -4153396 1918817 5003618
43807 5003618 4574549 4079564 4741926 4667486 3530787 3361594 4041471 2785712 -203778
43798 -203778 -261759 4547839 8805995 6565854 70241 -3175192 -632108 2914955 3038650
43789 3038650 828670 -794456 -1672183 -2969744 -4141277 -4069254 -3485416 -3849014 -4916334
43780 -4916334 -5438206 -5374980 -5522162 -5663628 -5025825 -4077088 -3828447 -3435109 -664288
43771 -664288 4564253 8855843 8839727 5124795 1585414 1052168 2741203 4042761 3965562
43762 3965562 4004145 5583027 7478390 6865813 3111053 -678201 -1076395 1202941 1911654
43753 1911654 -1267105 -5363289 -5506961 -899237 4212177 5568182 3368052 967397
43745 967397 427247 950316 1271522 1561571 2146311 1894545 -439173 -3808550 -5511044
43736 -5511044 -4392827 -2059373 -548936 -157049 -228896 -740739 -1850207 -2753444 -2408371
43727 -2408371 -1027986 334447 1372949 2490972 3422962 3284150 2108203 1086173
43719 1086173 1003277 1504934 2084970 2585895 2447305 887752 -1496876 -2655676 -1599050
43710 -1599050 53183 85126 -1680643 -3851049 -5555441 -6562729 -6050178 -3208832 852383
43701 852383 3479886 3290647 1508911 116541 -248085 -119101 -111999 -812470 -2806250
43692 -2806250 -5660221 -7281024 -5490074 -515338 4682081 6829953 4878832 293669
43684 293669 -4475550 -7485569 -7900046 -6087757 -3439380 -1587711 -1315004 -2276301 -3842588
43675 -3842588 -5702115 -7285515 -7371595 -5336122 -2496873 -952132 -986547 -921383 133920
43666 133920 863540 -79886 -1812187 -2415110 -1493933 -188811 704012 1215684 1270610
43657 1270610 741216 279240 756429 1854308 2307476 1510829 -99599 -2051237 -4099540
43648 -4099540 -5662422 -6121749 -5561791 -4285712 -2169826 259365 1005658 -1097207 -3767485
43639 -3767485 -3416903 26491 2918646 2885551 1414843 770044 1084681 1798134 3311604
43630 3311604 5399222 6271911 5246012 4259590 4572509 4084943 659182 -3636609 -4758825
43621 -4758825 -2150423 1004013 2255691 1719835 46573 -2284066 -3728668 -2724410
43613 -2724410 -235031 1270536 1362483 1550421 1969262 1502136 1226661 3712179 7927542
43604 7927542 9030177 5181926 662670 -523398 -461860 -3011392 -6650611 -6422183 -1626475
43595 -1626475 3213054 4967567 5172793 5930665 6420605 5272047 3613313 3536679 4986226
43586 4986226 5902940 4734599 1830999 -982916 -1721458 27919 2336815 2778759 1133014
43577 1133014 -817755 -2005711 -2920591 -3631786 -3060488 -1023559 852961 1331994 1064722
43568 1064722 861831 234861 -1032686 -1714101 -1269780 -1350442 -2959831 -3760642 -1085767
43559 -1085767 3443931 5623500 4645161 3902160 5430661 7122019 6803948 5785295 6052798
43550 6052798 6506201 4850505 1637663 -504518 -842860 -967136 -1518880 -1121918 995524
43541 995524 3397229 4273998 3589463 2790753 3201776 4866407 6270621 5502596 2636018
43532 2636018 408039 1179767 3769028 4977902 3753063 1714348 -126993 -2455350
43524 -2455350 -5049973 -5954845 -4525311 -2939209 -3088159 -3953589 -3737654 -2730640 -2168968
43515 -2168968 -1908504 -1283419 -794290 -780068 139338 2787093 4830037 3387364 -399481
43506 -399481 -2389029 -932889 1435051 1963028 633605 -1287667 -3020738 -3748614 -2636129
43497 -2636129 -423728 824665 364595 -568190 -1205242 -2225119 -3666187 -4280636 -3970794
43488 -3970794 -4376573 -5721946 -5736404 -3592379 -2242528 -4131768 -6750773 -5807505 -1570769
43479 -1570769 1390206 355546 -2814656 -5105493 -5540882 -4524034 -2742744 -1665253
43471 -1665253 -2854702 -5601780 -6953126 -5206754 -2008978 -30126 182802 91871 983389
43462 983389 2794060 4318250 4006988 1414961 -1758730 -3085253 -2165269 -787793 -172443
43453 -172443 227657 711325 332857 -853824 -790928 1311551 2598787 224896 -3820243
43444 -3820243 -4731950 -1400888 2345551 3389325 2918595 3111658 3299386 1774304 -732944
43435 -732944 -2212648 -2846996 -4495238 -7120064 -8467012 -7648544 -6620540 -7095876 -7867288
43426 -7867288 -6653719 -3524433 -1015374 -1174151 -3505841 -5762984 -6052061 -4078546
43418 -4078546 -834760 2431611 4682376 4903354 2567202 -1143018 -3618662 -3481050
43410 -3481050 -2159588 -1525977 -1056923 522327 1780961 141982 -2994840 -2696789 2228811
43401 2228811 6120579 3711273 -2263374 -4592228 -1154346 3160943 3627909 819280
43393 819280 -1906768 -2576314 -1053665 2013953 5215050 6948814 6878659 5641054 3236551
43384 3236551 -353037 -3159429 -2566850 848731 3490591 3543165 2940351 3540121 4201324
43375 4201324 3290429 1509383 227630 -822802 -2097665 -2412334 -747668 1713383
43367 1713383 3401643 4662118 6179782 6670955 4484439 379664 -3380523 -5667580
43359 -5667580 -6473513 -5729100 -4098907 -3316530 -3515643 -2064590 2286136 6105164 5644802
43350 5644802 2913937 3140677 6905482 9396601 7758674 4592701 2884269 1755141
43342 1755141 -391518 -1974413 -675267 2243989 3198961 1141372 -1228702 -1066525
43334 -1066525 1376784 3363366 2721579 48597 -2006104 -1608244 525333 2522234
43326 2522234 3560695 3797057 3175126 1892521 1301090 2455341 4122399 4074295 2200564
43317 2200564 694067 1323595 3867151 6616153 7081798 3555896 -2028994 -4473942
43309 -4473942 -1321518 3220792 3817456 1559526 1293508 3000627 2184100 -1219884 -1576227
43300 -1576227 2770017 5510991 1840398 -4101476 -6038529 -4705164 -4522437 -5218491
43292 -5218491 -3260631 803116 2886510 2245981 2183389 4258400 6706070 8295961 9073353
43283 9073353 7513539 1840195 -5387024 -8546122 -5767754 -808238 2321110 2806713
43275 2806713 941434 -2843511 -5806541 -4317911 606881 3147841 330448 -3689560
43267 -3689560 -3603601 -153371 1663454 -607538 -4806094 -7453953 -6689075 -3018505 865782
43258 865782 1992446 349258 -903663 416299 2879107 4356431 5391967 7339500
43250 7339500 8868354 7302683 2819552 -1314268 -2643689 -1595479 316988 2368609
43242 2368609 4375529 6203287 8078709 10307870 12313209 12832800 11333915 8497592
43234 8497592 5261705 2310245 659579 1530465 4709268 7677925 7645206 4653488 1673926
43225 1673926 1021149 1634273 1136318 -202217 232300 2916436 4617955 2823006 -390171
43216 -390171 -1139634 1154369 4004757 5923550 7169835 7192031 4935779 1952432 1709402
43207 1709402 4710420 7164630 5819790 1754852 -1771783 -2950537 -1821316 599369
43199 599369 2440181 2497125 2579002 5733304 11210309 14421179 13314903 11105173 10527421
43190 10527421 9493320 5851362 2578129 3451945 6356430 6335424 3661270 3148977 6020927
43181 6020927 8281050 7832352 7681383 10174038 12650806 11465284 7020519 2443081
43173 2443081 -47629 529851 4424620 9692398 12590877 11785623 10254437 10995196 13005853
43164 13005853 13903073 14361891 16753901 20635008 22967423 22650791 22005538 23356093 26323414
43155 26323414 29198131 31519577 34587276 40107589 48460765 57861952 65767949 71911173
43147 71911173 79312790 91374176 108748949 130195060 155585204 186704433 226136667
43140 226136667 276825313 340231628 410082776 467575007 488693505 462062352 399779152
43133 399779152 328005187 266549769 218760063 179148491 145348323 119696702 102490460
43126 102490460 89307410 76356715 65137011 59159329 57651934 55578570 49939355
43119 49939355 43343533 40015052 39971997 39019968 33917246 25901486 18951192 15606308
43111 15606308 14835881 13487334 9651537 4786081 2221636 3245838 5384820 5525130
43103 5525130 4092950 4362093 7392313 9688550 7390929 1554118 -2857603 -3005634
43095 -3005634 -996497 6363 279163 2104825 5081340 5837726 2987542 -218230
43087 -218230 -22045 2658853 3612706 1295055 -1296404 -1249883 269046 333019 -1136314
43078 -1136314 -1487026 359135 2088120 1219195 -1493106 -3217266 -2835826 -2088125 -2820744
43069 -2820744 -4363259 -4537133 -2655949 -202968 1641479 3661213 6602152 8595776
43061 8595776 6797908 1812707 -1720724 -278055 4284597 7185559 6302427 3470183
43053 3470183 1174338 425203 1637776 4737151 7625855 7223887 3587273 764464
43045 764464 1543128 3321141 1909294 -1993738 -3551914 -648115 3590661 5773447
43037 5773447 6278008 6664695 6218035 3874739 1492483 1818196 4028499 4471723 1829440
43028 1829440 -1290119 -2328890 -1686420 -737247 573324 2544492 4023776 3942670 3501189
43019 3501189 4823182 7788430 9856279 9098143 6201483 3300860 1735341 1246083
43011 1246083 861643 289745 397844 2065583 4684558 6572379 6994210 6714268 6225948
43002 6225948 4938180 3060557 2682808 5203233 8742286 10140306 8862665 6822567
42994 6822567 4975049 2836689 1336737 2807401 6871588 9300087 7199614 3200823
42986 3200823 1889462 3669158 5202604 4977216 4814413 5613354 5251960 2348223 -788442
42977 -788442 -1430483 -689968 -1612441 -4147659 -5289013 -4128174 -3391130 -4850476 -6232550
42968 -6232550 -4852281 -2065181 -1166157 -2076898 -1435228 2041995 5402057 5655773 3704567
42959 3704567 2589821 3507090 5068400 5388257 3698141 898071 -641252 793610
42951 793610 3397708 2969385 -1597666 -5952301 -5698888 -2383352 -1009478 -2810103 -4295774
42942 -4295774 -3362149 -2280413 -3340464 -4931019 -4162201 -1152586 1528335 2290375 1537050
42933 1537050 320826 -392192 102602 1497124 2496293 2398258 1787826 1126339 32868
42924 32868 -1301517 -1662067 -812974 -159409 -160385 811540 3204296 4125531 1195676 -3163560
42914 -3163560 -4633628 -3174926 -2628081 -4403537 -5489859 -3586623 -605592 713985
42906 713985 775313 1417380 2409161 2309060 1561407 2037893 3830133 4837309 3898354
42897 3898354 2566439 3007226 5244851 7356413 7832368 6919331 5737638 4822571 3986787
42888 3986787 3324475 3682853 5880431 9751616 14052726 16954320 16834366 13697389 10185920
42879 10185920 9806811 12983753 15929858 15045310 11757878 11069613 15391738 21700598
42871 21700598 25178188 24095742 20617442 18278916 19446970 24110782 30226288 35582659
42863 35582659 39347065 41243595 40129527 35328564 29093922 25184383 24299252 23259172
42855 23259172 19755657 15506627 13086509 11954160 10011138 7346486 5569705 4409579
42847 4409579 2021075 -1405064 -3117555 -1602377 1105543 1886474 123666 -1882555
42839 -1882555 -1414927 1930711 5448420 5590667 1860368 -2161061 -2822654 -652968 1075959
42830 1075959 1279947 2060466 4673899 7179400 7257420 5379601 3687768 3078634 2870879
42821 2870879 2450534 1879902 1370106 1168843 1621591 2678535 3756381 4480658 4916450
42812 4916450 4807803 3656440 2092362 1938812 3947576 6432302 7186702 5969571 4154459
42803 4154459 2848571 2485745 3295053 4627194 4472020 1394666 -3214018 -6397090 -7192414
42794 -7192414 -7459644 -8872167 -10463245 -9867308 -6220130 -1268530 2048067 2082431 47506
42785 47506 -1061369 279519 2384026 2850530 2194268 3193771 6537600 9236449 8455600
42776 8455600 5299973 3165304 3316051 3968672 3460633 2370724 1847040 1279008 -942594
42767 -942594 -4609069 -6914936 -5252653 -456594 3542036 3598396 468390 -2262080 -1893934
42758 -1893934 1228860 4761458 6628150 6338528 4963709 4097011 4339424 4726818 4033520
42749 4033520 2337727 607127 -781053 -1902865 -2042359 -374410 1882503 1992257
42741 1992257 -685914 -3352964 -3318533 -1297596 462778 1808347 4094196 6870052
42733 6870052 7851100 6264433 3894421 2354552 1419685 744010 1130131 2841042 4348592
42724 4348592 4353285 3859932 4557912 5990079 6268265 5320364 5314077 7188022 8494217 6263365
42714 6263365 1309192 -2194608 -1864169 -190279 -1005470 -3876220 -4450441 -710245 3771430
42705 3771430 4556823 2222111 769543 1472426 1872940 814715 498241 2062880 2657995
42696 2657995 -323494 -4527808 -5491550 -2945659 -943914 -2052513 -4490012 -5408484
42688 -5408484 -4373166 -2768325 -1876956 -2508366 -4742564 -6963901 -6614387 -3094966 1044826
42679 1044826 2656451 897049 -2793125 -6249273 -7454655 -5476713 -1843973 180729
42671 180729 -911490 -3004945 -3226465 -1628617 -403081 -342855 -182156 848158 1951707
42662 1951707 2521998 3082270 3880223 4179368 3758006 3667650 4436820 4709961 3029986
42653 3029986 303035 -892575 591318 2940749 3068838 -446226 -5810777 -9173546
42645 -9173546 -7987292 -3713903 -530120 -785971 -2549733 -2424401 159380 2710853
42637 2710853 3013293 1148965 -1444272 -3303168 -3364240 -1655686 252582 940440 1336236
42628 1336236 3476762 6885586 8425655 6620561 3860957 2853841 3029398 2547170
42620 2547170 1934791 2813711 4070555 2562271 -2286391 -7310506 -9495209 -8777558 -6531739
42611 -6531739 -3606440 -756056 969050 1330458 955064 -181887 -2413803 -4061509
42603 -4061509 -2113404 3354832 7940783 8211078 6165326 5859073 7287886 6867537 3239442
42594 3239442 -842352 -2811320 -3509095 -4860814 -6458471 -6229134 -3601598 -501602
42586 -501602 873433 577174 767126 2856255 5219540 4785097 1076167 -2754978 -3655546
42577 -3655546 -1866579 765626 3738174 6935715 8289020 5613980 529292 -2473821
42569 -2473821 -1347811 1586695 3491193 4228631 4854213 5305871 5017375 4130885 2924773
42560 2924773 1494946 767454 1964444 4094179 4075150 864390 -2388150 -2085877 1411458
42551 1411458 4891698 6379232 6182739 5105911 3829447 3346612 3946958 4186925 2634303
42542 2634303 202390 -875664 137754 2272448 4632168 6448529 6245117 3571917
42534 3571917 1229498 2739230 7073280 8845109 5088863 -645465 -2860700 -810474
42526 -810474 1739059 2156671 1526265 1722855 2602518 3107058 3229891 3262667 2242613
42517 2242613 -785569 -4164057 -4534948 -1380572 1126334 -1232684 -7121450 -11042634
42509 -11042634 -10198127 -7288367 -5694000 -4798706 -2400914 400140 230856 -3145857
42501 -3145857 -5862210 -5156488 -2755044 -1579015 -1341754 352972 3821725 6701780
42493 6701780 7302407 6356154 5018918 3129445 613536 -982434 -317106 1107442 465736
42484 465736 -2013683 -2703186 25051 2322505 -588751 -7606543 -12624738 -12055983 -8336971
42475 -8336971 -5451630 -4370638 -4455785 -6086482 -9119468 -11073779 -10076253 -8178545 -8516108
42466 -8516108 -10093550 -8804868 -3466184 2417183 5384280 5768089 5981677 7369705
42458 7369705 9547633 10931783 9368863 4212208 -1680444 -4048644 -2016583 1061515
42450 1061515 2002809 937033 -465470 -1402784 -1499320 -289947 1477991 2055509 1472324
42441 1472324 1963871 4266006 5891551 4919169 3112609 3003308 4110970 4707375 5154197
42432 5154197 6184804 5676395 1190497 -5103704 -8258234 -7371879 -6557383 -8364404 -10184237
42423 -10184237 -8827383 -5249849 -2467016 -1500568 -1925912 -4159361 -8175895 -11397814
42415 -11397814 -11024485 -7964483 -5727008 -5595311 -5553926 -4208905 -3015190 -3538873 -4758102
42406 -4758102 -4751396 -3625463 -3020523 -3516987 -4104795 -3784703 -2359571 -11536 2564691
42397 2564691 3886677 3015855 1167339 565784 1533533 2129194 935646 -1309915 -3247260
42388 -3247260 -4317920 -3987910 -1526531 2147018 4213801 3282287 1447508 1172015 1698854
42379 1698854 900486 -797058 -1308245 -658094 -476081 -308826 1717418 4415872 3843318
42370 3843318 -805625 -5418696 -6691229 -6003775 -5585556 -4555550 -1705653 1044492
42362 1044492 1550016 1250393 2337362 3308802 1492797 -1670184 -2428994 -893076 -687525
42353 -687525 -2567627 -3130397 -724278 1732197 1437150 -442743 -1485888 -1511162 -1420543
42344 -1420543 -1231612 -1199117 -2379039 -4002457 -2753238 2721699 8446567 9090687 4264206
42335 4264206 -1542945 -4376773 -3807652 -1335351 1378915 2570500 1157603 -1590235
42327 -1590235 -2722503 -913063 1854652 2724002 1403398 234934 1060572 3078942
42319 3078942 4349670 4577602 4992116 5559867 4355206 859456 -2024833 -1543988 509969
42310 509969 -122941 -4033328 -7181097 -6488613 -3381994 -776024 625404 1604210 2572209
42301 2572209 4030991 6522130 8628247 7700388 4308128 2797878 4938002 6455181
42293 6455181 3514010 -669877 -698529 2027083 1506999 -2565045 -3705889 952148 5805650
42284 5805650 5363233 2100972 1473630 3377336 3700018 1643792 168911 381424 428095
42275 428095 -196078 393882 2701421 4745588 5528787 6323759 7532397 7398112 5219878
42266 5219878 3026691 2374973 1976885 400039 -1196757 -1323826 -1232682 -3056469 -6089404
42257 -6089404 -7485517 -5936951 -2485796 1423169 4378750 4552351 1785100 -422583
42249 -422583 1733545 7018981 10453448 10118528 8872975 8508218 6705022 2130670 -1608036
42240 -1608036 -750959 2960289 5393326 6210284 7448380 8111529 5707195 2195371 2358231
42231 2358231 5822045 6778247 3313756 947735 3616240 6652122 3765489 -2889456
42223 -2889456 -5553988 -1819250 3068706 4399563 3107852 1917627 1155649 418712
42215 418712 881771 3326858 5923249 6304899 4756262 3523070 3587510 3603966 1933376
42206 1933376 -1199874 -3845202 -4455470 -3640366 -3230187 -3528277 -2768507 -160191 2093847
42197 2093847 1737322 279666 1207645 4688174 6975922 5662161 2736878 1153522
42189 1153522 802812 -123438 -1527840 -1586415 147705 1902018 1994302 625530 -742556
42180 -742556 -838988 651312 2999738 4951694 5750053 5661639 5304406 4750438 3637951
42171 3637951 1918043 132596 -913794 -579076 1271301 4086506 6859167 8604801
42163 8604801 8678838 7007390 4350752 2032878 965884 1132137 2185711 3861911 5348931
42154 5348931 5296462 3496461 1713249 1590778 2521733 3001367 3128228 3797589 4238682
42145 4238682 2944099 792449 378710 1858332 2294446 -20100 -3331280 -5636199
42137 -5636199 -7296954 -8793934 -8663190 -6106970 -3470361 -3334456 -4670651 -4631812 -2977389
42128 -2977389 -1874066 -2083461 -2281113 -1955800 -2221275 -3389217 -3997913 -2893960 -726126
42119 -726126 962310 871132 -1700213 -6143330 -10258011 -12080801 -11813893 -10646474 -8379394
42110 -8379394 -4202479 676208 3669227 4243325 4421981 5483280 6379259 5964355 4532901
42101 4532901 2407017 -657749 -3574870 -3816597 -887740 2017594 1756054 -865012
42093 -865012 -2842920 -3225551 -3305014 -3537556 -2903594 -1235081 176736 737982 1361654
42084 1361654 2413016 2601761 1144527 -190949 1205617 5372799 9384257 10484819
42076 10484819 8593750 5373524 1922409 -1530557 -4159589 -4359930 -1733259 1607126
42068 1607126 2765875 1096561 -1013341 -488266 3347284 7792661 8975475 5662415
42060 5662415 906942 -963454 894600 3266259 3227710 1243023 -872111 -2792664
42052 -2792664 -4595108 -4878309 -2838323 -944924 -2290805 -5851452 -7715378 -6779960
42044 -6779960 -5518490 -4819195 -2306242 2789991 7185845 8354820 8212786 9008698 8767254
42035 8767254 4731725 -954365 -3427738 -1890555 -42257 -105403 -442678 516576 1688230
42026 1688230 1722446 973845 -106635 -1958239 -4041780 -4409577 -2707923 -1579049 -3269036
42017 -3269036 -6311679 -7333995 -5095905 -1136308 2709322 5658885 7152758 6357592
42009 6357592 3136453 -1094764 -4102857 -4733894 -4066147 -4086960 -4842039 -3875478 324927
42000 324927 5212687 6463572 3123087 -1662705 -5113749 -7375360 -8793549 -7622326
41992 -7622326 -2809225 2857337 5300685 4153363 2626494 2638909 2724331 1310920 -415333
41983 -415333 -474817 671346 893490 -56660 253065 3531343 7877563 9644782 7858866
41974 7858866 5381915 5201033 6692086 6613569 3144478 -2343876 -7243619 -10002071 -10350836
41965 -10350836 -8742606 -6265463 -4130161 -2549005 -794832 1317616 3035138 4186885
41957 4186885 5741407 7804998 8244988 4950074 -922844 -5486695 -6150592 -4163889
41949 -4163889 -2852415 -3941615 -5980039 -6180214 -3523915 256008 2886299 4009007
41941 4009007 4463444 3765634 373062 -4992712 -8355420 -6416505 -336608 5844862
41933 5844862 9512695 10648273 9842501 7442429 4504076 2563691 2063570 2276750 2762550
41924 2762550 3497498 3660523 2010376 -1130650 -3650453 -3844257 -1814923 1312491 4223440
41915 4223440 5482655 4489076 2708733 2286325 3009899 2487880 -60742 -2330698 -2384142
41906 -2384142 -1447173 -1496086 -1907797 -873078 1091918 1701748 481892 -713507 -727874
41897 -727874 -281547 156338 1293338 2984821 3473494 2104153 1166213 3220447 7447990
41888 7447990 10320132 9527692 5939875 2070972 74231 1080298 4717303 8573297
41880 8573297 9475998 6556262 2538134 933074 2142389 3340713 2282208 80339
41872 80339 -523121 1110444 2747920 2253157 120682 -1633038 -2200784 -2329650 -2206178
41863 -2206178 -670451 2591051 5262860 4488002 644913 -2520295 -2167701 400060
41855 400060 1774151 821984 -438726 -60756 1419609 2290339 1985133 1067594 -171175
41846 -171175 -1781600 -3200217 -3539903 -2949851 -2651403 -3331558 -4345938 -4868555 -5043177
41837 -5043177 -5490718 -6332033 -7278368 -8093355 -8240324 -6608559 -2670925 2127410 5171389
41828 5171389 5307541 4109028 4115247 6140377 8561786 8967506 6439502 2697881 1003262
41819 1003262 3043677 6564890 7214149 3630304 -390071 -240616 3872883 7635708
41811 7635708 8332744 7080482 5175601 1719900 -3290903 -6634028 -5770657 -3070144
41803 -3070144 -2576890 -3949006 -3686724 -1648382 -1435288 -3611532 -3637575 1084477 6453443
41794 6453443 7401829 5077142 4257490 5849454 6282214 3319895 -1412958 -5246160 -6479003
41785 -6479003 -4136073 866469 4631043 3843679 425653 -744013 1314052 2902996
41777 2902996 2020007 1116386 2064597 2552719 45405 -3846484 -5785110 -5192166 -3739255
41768 -3739255 -2324876 -1139770 -1205778 -3311560 -6301429 -8293247 -8731063 -7926809 -5906535
41759 -5906535 -3068258 -546381 1309636 3208453 4785148 4619673 3589092 4987910
41751 4987910 9106307 11090855 7524267 2125198 755142 3218147 4906151 4846584
41743 4846584 6355608 9869789 10860332 6457170 -146758 -3786186 -2677397 1627343
41735 1627343 6517329 9082151 7442437 3102463 7538 109205 1657140 2335196
41727 2335196 1727814 201013 -1917348 -3233622 -2126352 270896 510649 -2695959
41719 -2695959 -6842981 -9116345 -8732466 -5320699 1321129 8502126 11469626 9172385
41711 9172385 6021815 5771488 6906059 6520254 5308165 5429363 6244306 5717406 3989286
41702 3989286 2414191 1011527 -282504 -61268 1978122 3447062 3300922 4374160
41694 4374160 8072710 9958715 5845056 -498407 -1985727 1199232 2569021 292513
41686 292513 -306174 3537294 6906548 4798564 -741313 -4563062 -5132849 -3916987 -1740744
41677 -1740744 758485 1882411 1194622 824847 2077957 3242088 2915479 2586255 3456379
41668 3456379 3762018 2109447 482867 705776 810284 -1362524 -3598617 -2571584 498012
41659 498012 2011232 2122548 3693582 6096772 5468014 1329042 -2200290 -2859304 -3153885
41650 -3153885 -5067825 -6299573 -4477751 -1588938 -914169 -1987576 -2006657 -780945 -864991
41641 -864991 -3106421 -4988139 -4073524 -1261111 345682 -1007205 -3980986 -5689956
41633 -5689956 -4558718 -1464635 1744155 4053147 5080392 4116133 989064 -2359670
41625 -2359670 -3083657 -823238 1595528 1708739 430514 419258 2284374 3728835 2374824
41616 2374824 -1393046 -4676292 -5028711 -3038388 -1537477 -2079731 -3175030 -2922876 -2217182
41607 -2217182 -3333993 -5850317 -6568873 -4040312 -752654 405245 -109318 137845 1935940
41598 1935940 3909508 4678679 4068466 2903425 2734271 4811933 8163557 9814215 8283509
41589 8283509 5646492 4497139 4209436 2447021 -682344 -2832302 -3456903 -4580885
41581 -4580885 -6937704 -8174682 -6375966 -3262322 -2003784 -3142252 -4575188 -4929681
41573 -4929681 -5099513 -6284033 -7862251 -7983542 -5890378 -3056605 -1796558 -2937403
41565 -2937403 -5241308 -7016041 -7552663 -6843818 -5066937 -3111591 -2433193 -3117846 -3115166
41556 -3115166 -957612 1767294 2679763 2411661 3423193 5448273 5506119 3046328 1545715
41547 1545715 3198356 5037791 3025480 -2031908 -5576829 -5216678 -2840488 -1267886
41539 -1267886 -1138289 -1267682 -465278 1258883 2505935 1819146 -334801 -1931374 -2276651
41530 -2276651 -2828755 -4127097 -4141044 -1598709 1208996 1612116 726763 1280167 2746460
41521 2746460 2342235 15382 -1518535 -1501410 -1909716 -3237457 -3493068 -2173154 -1351214
41512 -1351214 -1681500 -1190250 434920 286047 -2857814 -5668268 -4948783 -2072152 -83600
41503 -83600 562298 438926 -1538125 -5526923 -8026794 -5813343 -828894 2689856 4160944
41494 4160944 5514220 5792692 2140721 -4101894 -7414879 -5148855 -463316 2733736
41486 2733736 3910875 3866906 2510038 557699 160139 1731051 2852100 2220215 1945842
41477 1945842 3732073 5416330 4158179 1120044 -153821 1067377 2159162 1500834
41469 1500834 697190 1971330 5208056 8307751 9381034 8065923 5457235 3337186
41461 3337186 3180056 5299045 8488243 10504057 9662075 6607636 3921550 3156636 3000097
41452 3000097 1566153 -373799 -409967 1620296 3044620 1990510 -383732 -1823504
41444 -1823504 -1364104 708378 3480397 5426721 5516434 4744849 4776956 4932975 3006294
41435 3006294 -415609 -1474725 1679500 5868930 7063727 5251321 3067646 1737328
41427 1737328 770928 -15055 -573270 -1376876 -2067768 -880093 2583984 5803480 6801263
41418 6801263 7075611 8264263 8098141 3602637 -3046182 -6330148 -4808216 -2436216
41410 -2436216 -1998284 -1472257 1498688 5117830 5887236 3331058 -54916 -2310846 -3574502
41401 -3574502 -4723430 -5791736 -5784872 -3856819 -790077 1404626 2131010 3188545 5433368
41392 5433368 5918612 1365728 -6113595 -10369347 -8805549 -5223074 -4002745 -4857058
41384 -4857058 -5250087 -4917589 -5194521 -5981993 -6286704 -6375129 -6691728 -5822558 -2505977
41375 -2505977 943030 413061 -4361005 -8617730 -8163222 -4213987 -1217745 -1127356 -1609677
41366 -1609677 316555 4414203 7656451 7751480 5258490 2247966 -98057 -1898282
41358 -1898282 -3340517 -4169752 -4241733 -3567351 -1835752 1029621 3746891 4409176 2960198
41349 2960198 1912787 3669200 7607954 10599797 10242953 7113776 3902926 2623924
41341 2623924 2785595 2434118 839703 -631596 -681245 -38920 -207849 -1168724 -1871911
41332 -1871911 -2362280 -3458622 -4538245 -3859459 -1466724 364252 401054 241205 1703687
41323 1703687 4162516 5905167 6705890 7327461 7442033 5949384 3117028 832306 461108
41314 461108 1380682 1913161 1205483 -58676 -696126 -581346 -685369 -1246940 -788817
41305 -788817 1797650 4749571 4921891 1995530 -743050 -655592 941768 1050331 -737815
41296 -737815 -1988478 -1021358 807121 863133 -1380176 -3364595 -2216564 1665761 4742539
41287 4742539 4541295 2547560 1817122 3076269 4988404 6914511 8738698 8944170 6284041
41278 6284041 3087864 3097657 5628996 6023754 3042139 1298859 3992138 7523994 7023463
41269 7023463 3835679 2995520 5292715 6531224 4035683 -143592 -2697196 -2646636 -1091023
41260 -1091023 426375 1090610 1688790 3638167 6043697 5635940 1672078 -1407737 611013
41251 611013 5550726 7926067 6766414 5824007 6544974 5883531 2050396 -2060971 -3181517
41242 -3181517 -2093100 -1641416 -2729466 -4159417 -4675179 -3705080 -1498620 569487 1242376
41233 1242376 1297978 2407206 3888233 3059117 -436715 -3183321 -2240449 1086187 3103752
41224 3103752 1934822 -1188226 -3596666 -3434741 -1354927 -179317 -1566387 -3357016
41216 -3357016 -2281049 1020703 2435236 13321 -3834375 -6328171 -7232772 -6695279
41208 -6695279 -3676441 1336179 4878595 4361904 1548774 84362 1161725 3392137
41200 3392137 5249811 5814371 4616890 2418127 802127 -75593 -1476936 -2995898
41192 -2995898 -2351066 151987 256443 -4393772 -9870953 -10840964 -7635836 -4769169 -4078390
41183 -4078390 -3397875 -1239221 1173220 2571055 3086224 2850618 1908562 1529196 2943675
41174 2943675 4821206 4674622 2740251 1678305 2356057 2967666 2828486 3869243 7064263
41165 7064263 10021487 9912565 7029698 3799520 1552182 -190119 -1973563 -3336257
41157 -3336257 -3503891 -2693308 -2495134 -4338650 -7184581 -7882688 -5029888 -1373233 -597698
41148 -597698 -2633101 -4375532 -4398468 -4175275 -4620470 -4344177 -2175093 992845 3863144
41139 3863144 6099099 7028159 5259286 1139766 -2301493 -2781471 -1872748 -2790723 -5872929
41130 -5872929 -8181822 -7482563 -4996476 -3649978 -4445743 -5400784 -4164387 -1076230 1261895
41121 1261895 1436053 855328 1180462 1682616 848203 -606310 -662450 626869 1164589
41112 1164589 95302 -1373193 -2525835 -3991529 -5714858 -6683166 -7181789 -8491852
41104 -8491852 -9527455 -6977456 -460827 5425836 6525231 4188620 2464601 2424576
41096 2424576 2237694 1229351 529631 403387 -59461 -805281 -913077 -708264 -1425435
41087 -1425435 -2748835 -2919402 -1517297 -154131 -83046 -864374 -1684850 -2370779 -2804220
41078 -2804220 -2839501 -3041253 -4069558 -5161388 -4689667 -2436805 85028 1663069 2225397
41069 2225397 1673704 -187853 -2118092 -1804434 1212928 4383715 4897566 2578653 -567488
41060 -567488 -2527778 -2415415 -700072 971398 1281896 1047533 2169031 4382724 4982347
41051 4982347 2759133 134565 -367248 6958 -1745587 -5576357 -8200658 -7528620 -5060771
41042 -5060771 -3592747 -4226046 -5970872 -6941285 -5676789 -2411305 826467 2264133
41034 2264133 2259689 2115833 1736108 119511 -2342632 -4112640 -4825438 -5199549 -4857482
41025 -4857482 -2929528 -952535 -1859626 -5105787 -6315464 -3713797 -1468976 -3642758
41017 -3642758 -7741358 -8209488 -4371557 -553608 599472 333606 -414842 -2570736 -5255311
41008 -5255311 -4979371 -581577 4299123 5765057 4001907 1349392 -1086085 -2827221
41000 -2827221 -2891782 -1796973 -2166853 -4651278 -5781503 -3038609 492196 571192 -1126074
40991 -1126074 639594 6081544 9506913 7660263 3962139 2689902 3333681 3359878 2903396
40982 2903396 3280708 3433397 1668604 -466939 225814 3566265 5937657 5554429 4653577
40973 4653577 5306245 5787025 3352070 -914521 -2780612 -392216 3156014 3745280 1157948
40964 1157948 -1362078 -1455099 271084 2074580 2936985 2385847 501036 -1269238 -1288344
40955 -1288344 -550372 -2037899 -5975674 -8371544 -6510487 -3331179 -3137790 -5090944
40947 -5090944 -5033797 -2393162 -502032 -449799 259632 2206247 2380219 -173695 -1926438
40938 -1926438 -901097 -722779 -4796518 -9950489 -10458654 -6190691 -2192689 -1389543 -2034569
40929 -2034569 -1936760 -1201511 -484362 210393 480796 -208744 -1084966 -1201919 -1695169 -4121809
40919 -4121809 -6695194 -5392449 513882 6814233 9158004 7149226 2999603 -1244343
40911 -1244343 -3969040 -4013865 -2198123 -1137013 -2021914 -3002897 -2059919 -10479 796569
40902 796569 -418916 -2504393 -4155159 -4764248 -4296433 -3463146 -3337523 -3908943 -3867578
40893 -3867578 -2651876 -1599194 -1957258 -2864629 -2716770 -1604382 -717233 57304 2007218
40884 2007218 5041936 7032748 6382883 4167236 2908006 3657357 4845776 4012146 567877
40875 567877 -3294601 -4831839 -3868527 -2847289 -3401121 -4109764 -2903543 -710325 -613042
40866 -613042 -3356008 -5857723 -5166967 -2198410 -39130 224246 39884 356898 291299
40857 291299 -883847 -2382968 -3378236 -4230735 -5213239 -5492778 -4745740 -4384814 -5368061
40848 -5368061 -5979676 -4115828 -1003088 118942 -1193783 -2162575 -1564413 -1560581 -3413487
40839 -3413487 -4719757 -3311823 -1124064 -1008402 -1721738 247339 4865433 8164809
40831 8164809 7453113 3848519 -204858 -2883458 -2593792 839966 4077151 2867920
40823 2867920 -2137342 -5506084 -4356569 -2107825 -2791736 -5077543 -5232995 -3390273
40815 -3390273 -2810324 -4299422 -5487524 -5341927 -5502026 -6541760 -6347713 -3534297 249096
40806 249096 2966559 4792874 6166047 5347481 709986 -5473183 -8493074 -6828938
40798 -6828938 -3970325 -3643191 -5152249 -5173616 -2899495 -1003967 -1552976 -3339811 -4368414
40789 -4368414 -5106281 -7255173 -10144590 -10717704 -7513902 -2890694 -330156 -654623 -1944426
40780 -1944426 -2427928 -2183969 -2114681 -2399714 -2581625 -2730098 -3685725 -5752057 -7595003
40771 -7595003 -7300523 -4651301 -1502328 468483 1391570 1915751 1514917 -430016 -2562497
40762 -2562497 -2425563 435338 3562469 4046707 1130379 -3333913 -6058756 -4637524
40754 -4637524 -205816 2747423 998014 -3441689 -5886577 -4793817 -2388197 -136901
40746 -136901 2617732 5098205 4493136 812110 -1553144 69538 2347102 1247829
40738 1247829 -1349610 -858464 2174653 2689948 -784821 -3796428 -2840286 -182957 330854
40729 330854 -1058685 -1361617 179861 1304513 269272 -1996114 -3415153 -3196106 -2310074
40720 -2310074 -1931711 -1846089 -940991 702650 1473590 900258 1205000 4274413 8174467
40711 8174467 9360718 7901580 7285331 8604938 8459751 4361422 -821971 -2572682
40703 -2572682 -873773 457873 -440251 -1587989 -1110648 -150687 -759666 -2895025 -4972156
40694 -4972156 -6269744 -7369895 -8702408 -9847653 -10196793 -9381331 -7017124 -2986891
40686 -2986891 1638961 4888568 5984734 6564567 8561558 11047629 10762334 6340453
40678 6340453 592377 -2480702 -1863477 459874 2526558 3601845 2979131 -110762
40670 -110762 -4755950 -8023001 -7343279 -2855671 2729628 6151631 5953203 3829774 3267523
40661 3267523 5684811 8361715 7612466 3497494 -526833 -2319993 -2929502 -3472775 -3042059
40652 -3042059 -1193141 -169294 -2355697 -6687779 -9636404 -9264902 -6822165 -4770105
40644 -4770105 -4558609 -6035211 -7840713 -8334369 -6771792 -3627543 107823 3240212
40636 3240212 4246533 2387821 -741860 -2484261 -2526741 -3158990 -5315725 -6691751 -5345923
40627 -5345923 -2865581 -1687600 -1265861 335282 2630545 3630909 3397062 3275166 2429233
40618 2429233 -937561 -4994141 -5144050 -482707 4393376 5552892 4205852 3146188
40610 3146188 2328820 875090 427387 2713923 5665906 5887416 3986000 3578261 5320603
40601 5320603 5829260 3098187 -580431 -2340738 -2234116 -1216446 1541195 6672835
40593 6672835 11710614 13091793 10515304 6924504 4354960 2047069 -1030565 -3893334
40585 -3893334 -4808894 -3568397 -1475015 149411 691843 259106 -213166 438397 1940075
40576 1940075 2177719 -205921 -3139559 -2809459 1453212 5535604 5018459 257258 -4547692
40567 -4547692 -6671779 -7112248 -7292771 -5996929 -1463843 4772005 8652710 8369070 6326905
40558 6326905 5494477 5462962 3767367 223576 -2236390 -1542729 371350 -161180 -3726817
40549 -3726817 -6896801 -6504191 -3530426 -1524580 -1887574 -2578943 -1804116 -996924 -2584302
40540 -2584302 -6015101 -8154276 -7285536 -4566487 -1405954 2153863 5552265 6663343
40532 6663343 4491721 1153892 -929291 -2348549 -4781817 -7049764 -6317889 -2903714
40524 -2903714 -526801 -1182945 -2770465 -2812088 -1686551 -746354 31094 547864 -826512
40515 -826512 -4705037 -8543793 -9592780 -8544950 -7736983 -7117808 -4921417 -1391050 1288083
40506 1288083 2393328 3089474 3663058 3251123 2271876 2048031 1805123 -642624 -4566212
40497 -4566212 -6189933 -4214267 -2058550 -2622845 -4070888 -3596023 -2547005 -4073223
40489 -4073223 -7337688 -8150072 -5126814 -1725894 -1554730 -4352573 -7479495 -9155695
40481 -9155695 -9058658 -7396084 -4851213 -2698783 -1924889 -2474819 -3723352 -5152947 -6187317
40472 -6187317 -5953552 -3940942 -880150 1544321 2266150 2057056 2600625 4044082 4331741
40463 4331741 2042993 -840119 -926444 1798231 3443047 1376942 -2174261 -3236711
40455 -3236711 -1081923 1754368 3023638 2175588 -620469 -4242852 -5890657 -3333142
40447 -3333142 1735280 4775008 3473927 54117 -1964256 -1568345 -98226 1082865
40439 1082865 1540149 1275767 399382 -885153 -2339571 -3524394 -3655298 -2155334 654017
40430 654017 3710243 5708716 5338893 2281207 -1212351 -1381465 2591951 6561536 6240555
40421 6240555 2935950 1441380 2983376 4214043 3474118 3475663 5804942 6976735 3528350
40412 3528350 -1806413 -3267308 -63170 2989605 2643159 1106865 1767714 4205860
40404 4205860 5404398 4060420 1727445 504401 1116120 2939433 4735379 5353279
40396 5353279 4590996 3624368 4054589 6144736 8233172 8300674 6069373 3143195 1147456
40387 1147456 470692 945234 2444810 3851157 2782110 -1701324 -6756471 -8405165
40379 -8405165 -6486572 -4640803 -5095073 -6164101 -5870396 -5193174 -5824374 -7038817 -7137344
40370 -7137344 -6171367 -4814182 -2289704 1692113 4434013 3195941 -72770 -634281
40362 -634281 2360230 4725969 3460990 543773 -944820 -1231562 -2021392 -2663490 -1082688
40353 -1082688 2471949 5111345 4665959 1848615 -925507 -1976529 -1689512 -1717517 -2516846
40344 -2516846 -2095883 1352403 5808998 6831319 3327083 -629566 -1223177 395724
40336 395724 983314 280311 23745 -259041 -2407578 -5222815 -5138663 -1828947 734455
40327 734455 104966 -1320890 -780387 310549 -791846 -3127027 -3374547 -1118572 659527
40318 659527 207168 -956011 -1215154 -1455312 -3155807 -5634772 -6783310 -5845935 -4357190
40309 -4357190 -4518744 -7107890 -10666876 -12507265 -10928456 -6709004 -2268441 418019
40301 418019 780003 -680628 -2559841 -2906423 -1023312 1064331 603146 -2123402 -3838084
40292 -3838084 -2779458 -1221262 -2126641 -4997332 -6997528 -7017508 -6338825 -5835030 -4919640
40283 -4919640 -3394386 -2128303 -1236895 557765 3695392 6269752 6022118 3148772
40275 3148772 109049 -1012370 -269721 736527 694874 -108983 -249791 890090 2025231
40266 2025231 1589685 152908 19174 2362086 6029043 9390021 11842854 12935344
40258 12935344 11791131 8778757 6365031 6383398 7053323 4696448 -1361499 -7099973
40250 -7099973 -7708234 -2528100 4297455 7721988 6121665 1994664 -1290524 -2862739
40242 -2862739 -3919667 -4668931 -3620135 -523675 1912989 912016 -2903696 -6650393
40234 -6650393 -8835483 -9825404 -9439389 -6859056 -3244893 -1768299 -3755235 -6692928
40226 -6692928 -7543564 -6558576 -6097376 -6709394 -6423477 -3775330 156127 3151347 4197062
40217 4197062 3929364 3474725 3455134 3782492 3820626 2737501 255211 -2503568 -3223235
40208 -3223235 -337505 4845292 8660512 8491843 5320063 2205531 691495 -275793
40200 -275793 -2098630 -4489715 -6025242 -5883227 -4656729 -3855871 -4460293 -5381314 -3924476
40191 -3924476 982455 6404127 7910063 4523987 -518453 -3999411 -5502481 -5480474
40183 -5480474 -3347760 630782 3647647 3082713 -74448 -2665597 -3442262 -3682284 -4452325
40174 -4452325 -5457883 -6284895 -6716226 -5989744 -3711811 -1368497 -936373 -2078772 -2761106
40165 -2761106 -2496692 -2575641 -3018735 -2202903 -283801 -154 -2423306 -4463011 -2902331
40156 -2902331 873144 2679166 1048588 -1424651 -1906463 -487555 713419 387271
40148 387271 -485354 83925 2114585 2720308 -157939 -3634026 -2674078 2309391 4632623
40139 4632623 472442 -5128802 -5464240 -2111612 -1966086 -6020349 -7895385 -4199459
40131 -4199459 192065 -164849 -3645806 -5288285 -4054235 -2215576 -572633 1228162
40123 1228162 1629472 -1046307 -4702922 -5472143 -3264432 -1691230 -2600618 -4251749 -5136682
40114 -5136682 -6011147 -7188599 -7053536 -4888413 -2783866 -2950419 -4675998 -5437861 -4015354
40105 -4015354 -1439553 444981 825170 889335 2738415 6391173 8705587 7153226 3890486
40096 3890486 3303410 5704696 6855279 4457760 1558175 1739377 4101099 5503808
40088 5503808 5280228 4844646 4440788 3235542 1519003 223334 -823731 -1910488 -1860708
40079 -1860708 166681 2526095 3381481 3867372 5795748 7347946 5042049 -225636
40071 -225636 -3309969 -1719178 1514200 3067579 3520416 4361203 4591095 3353301 2994632
40062 2994632 5772096 9283509 8959197 4344526 -484324 -2521316 -2712798 -3048564 -3733562
40053 -3733562 -4131624 -4250403 -4247664 -4072400 -4240529 -5346828 -6323880 -5133230 -2014658
40044 -2014658 -9763 -913158 -2553200 -1920299 471119 1571397 279428 -1423638
40036 -1423638 -1595881 -349785 1482704 3557086 5111350 4683981 2020234 -892914
40028 -892914 -1973722 -1566520 -1817213 -4063072 -7636697 -10612307 -10876284 -7249170 -894193
40019 -894193 4672381 6290052 4064842 817377 -1205674 -2082121 -2757688 -3111794 -2135738
40010 -2135738 464499 3337429 4279195 2352701 -567020 -1183447 1537927 4929612
40002 4929612 5936103 4841563 4018453 3969795 3191982 1635474 1159666 1881769 1240609
39993 1240609 -1747329 -4210765 -3706963 -2276052 -3152080 -5181307 -4157816 821593
39985 821593 5759306 6863434 4517669 1595508 217296 962427 3214982 5247121
39977 5247121 5386243 3750393 1620697 -827912 -4157343 -6932068 -6187800 -1874949
39969 -1874949 1775733 1405960 -953890 -1035127 1468599 2904866 1373523 -782277 -918248
39960 -918248 204279 337379 -444490 -72870 2081251 4301432 5261932 5726860 6550898
39951 6550898 6573566 4328560 1155568 393684 3032511 5999804 5842419 2794499 -83333
39942 -83333 -796437 21698 757540 447080 -975064 -2604320 -2748934 -423954 3182925
39933 3182925 5599836 5368516 2810134 -893986 -4275271 -5862087 -5422624 -4641652 -5057897
39924 -5057897 -5565191 -3596052 1282343 6591436 9767162 10154362 8262184 4949862
39916 4949862 1632489 -509197 -1950892 -3917079 -5983538 -6481885 -5397415 -4547909
39908 -4547909 -4375149 -3031863 335136 3701634 4887284 4193883 3066313 2083501 1615073
39899 1615073 2416936 3908929 3758881 1091225 -1502883 -1144580 1492213 3475837 3581503
39890 3581503 2971709 2783144 2928533 2870715 2250091 1134356 296031 372061 547307 -246439
39880 -246439 -734127 1302778 4366929 3767822 -1206559 -4630920 -1876992 3232444 3652061
39871 3652061 -1041647 -5004102 -4631032 -1465216 2437652 6431326 8454007 5875284
39863 5875284 544004 -1741142 1335502 5614069 6629815 5012926 3751205 3640637
39855 3640637 3938847 4644073 5583947 5483233 4114005 3361502 4307316 5273103 4408890
39846 4408890 2119229 -521686 -3289716 -5235125 -4549926 -2048014 -1647663 -4731563
39838 -4731563 -7163067 -5265204 -1722562 -1224839 -2805786 -1946987 1073324 1153657 -2856313
39829 -2856313 -5434777 -2734475 1423698 1442007 -1952234 -3808136 -2747782 -1844941 -2485046
39820 -2485046 -2190299 356960 2126181 76617 -3805649 -4823190 -1885144 1317982
39812 1317982 1410184 -844434 -2437899 -1865026 77773 1808914 2131361 880565 -644114
39803 -644114 -747288 509018 1322455 856992 285516 281478 -347438 -1900734 -2029220 614891
39793 614891 2913685 915184 -4139570 -7012931 -5255783 -1323923 1830134 3533516
39785 3533516 3561130 1491213 -1111123 -1373998 824263 2611987 2800973 3266432 4636884
39776 4636884 4696278 2836168 1907564 3121035 3122802 -602930 -4954304 -5515378 -2682129
39767 -2682129 228727 2167750 3584229 3126079 -94008 -2688323 -400080 5443705
39759 5443705 9263482 8507683 5637339 3537062 3170208 5325411 10076400 14145852
39751 14145852 13132283 7342170 1858326 33813 302361 89339 -756667 -1580677 -2616511
39742 -2616511 -3541533 -2971761 -718624 1529152 2412202 1696405 -998602 -5367597 -8475661
39733 -8475661 -7329795 -3780552 -2870501 -5466713 -6883765 -4350922 -1224875 -1102771
39725 -1102771 -1932938 304023 5070348 8337070 8267639 6404474 4546692 3396975 3229274
39716 3229274 3451967 2593351 683407 106743 2087061 4218210 3829714 1829760 511680
39707 511680 -458081 -2601145 -4805838 -4612786 -2391535 -669864 149815 1880672 4571878
39698 4571878 5950701 5139026 3762747 2889429 1846028 677220 785937 2112423 2323937
39689 2323937 1737 -3615004 -7012681 -10062094 -12117673 -11196355 -7157338 -3601554
39681 -3601554 -4013922 -7166880 -8765832 -6985227 -3985618 -2078873 -836253 1124812
39673 1124812 3254834 3519447 1120156 -2562611 -5745848 -7807004 -8569802 -7125903
39665 -7125903 -2835998 2601808 5711041 4808919 2147315 1447015 3743126 6574547
39657 6574547 6949646 4224631 241315 -2550579 -3082269 -2282024 -1699683 -1545092 -807998
39648 -807998 583485 1115166 -23902 -1475905 -1886051 -2179089 -3817912 -5897602 -6286331
39639 -6286331 -5038515 -4180684 -4328471 -4155207 -3389847 -3499604 -4579970 -4350563 -1789594
39630 -1789594 530435 -291940 -3514897 -5980924 -6073121 -4599960 -2802319 -1442120 -1185940
39621 -1185940 -2012471 -2565244 -1608539 262114 1706885 2784292 4418734 6358198 7487371
39612 7487371 7669778 7261021 5273253 608580 -4810025 -7049274 -5252114 -3103301
39604 -3103301 -3825959 -6161509 -7165230 -6611620 -6004028 -5115407 -2839557 -455180 -409873
39595 -409873 -1925367 -1389770 2107835 4944576 4113058 1309244 -92734 303870 700212
39586 700212 602515 743439 690073 -664628 -2743128 -3875062 -3928672 -4067291 -4159282 -2861825
39576 -2861825 -353255 1386834 1392510 650741 -177861 -1754087 -4070013 -5560049 -5219501
39567 -5219501 -3962026 -3031521 -2620988 -2713823 -3557032 -4582596 -4647166 -4018359 -4113063 -4545368
39557 -4545368 -2883593 1459169 5657228 7421977 7881576 8354053 6962892 1692860
39549 1692860 -5004392 -8213966 -6398738 -2325706 1032914 2591992 1947559 -537472
39541 -537472 -2492043 -1473725 1522676 3103601 2193177 1117740 1841088 3827058 5900778
39532 5900778 7414596 7162486 4143084 170033 -1226613 516177 2287820 2235912 2094962
39523 2094962 3123444 3392673 1699683 869090 3574250 7209247 6948001 2645924 -1235190
39514 -1235190 -2021785 -1255730 -590064 791689 3301225 4769465 3476104 1325841 1418657
39505 1418657 3349686 3432157 -238405 -5066299 -7402979 -7247484 -7524379 -9045941 -8819068
39496 -8819068 -4818423 -378184 -878066 -6525334 -11563639 -11413836 -7835201 -5544662
39488 -5544662 -6170326 -7684203 -7960456 -6411784 -3306183 116924 1745036 1170920 1323476
39479 1323476 4893123 9795782 11335212 8847665 6717816 7807092 9214207 6710979
39471 6710979 964458 -3384638 -3586791 -1151795 1145428 2272222 2706877 3007543 3340114
39462 3340114 3492147 2913652 1421432 42295 306071 2276762 4024262 3742877 1972589
39453 1972589 910500 1609172 2730570 2389928 408744 -1993964 -4008872 -5364678
39445 -5364678 -4917962 -1145451 4964357 9191377 8168344 3454927 -378564 -1295769
39437 -1295769 -1134138 -1350777 -412238 2878273 5748405 4042465 -2216019 -8450941 -10879592
39428 -10879592 -10014573 -8350766 -6901426 -5410713 -4096721 -3020495 -738097 4003214
39420 4003214 9365348 11497545 9050182 4734161 1671656 112678 -1093299 -1783079
39412 -1783079 -1252634 -346406 -398676 -879154 -488271 29858 -1000948 -2477243 -1305024
39403 -1305024 2394935 4441033 2710750 707466 2129726 4650809 2999226 -3321895
39395 -3321895 -9528649 -12179577 -12179818 -11041760 -8516907 -5333107 -4350181 -6570279 -9004909
39386 -9004909 -9215067 -9360252 -12379955 -16093275 -15265776 -9139016 -2943616 -1089357 -2094768
39377 -2094768 -1843175 675492 3106345 3775551 3676640 4626467 6953266 9179698 9282702
39368 9282702 6436257 2061350 -1254178 -2462102 -3061698 -4577260 -5828970 -4264810
39360 -4264810 241113 4831557 7456556 9317348 12032727 13846403 11268468 4516292
39352 4516292 -1315102 -2009979 535262 980157 -2364901 -5729260 -5513387 -3029563 -1854354
39343 -1854354 -2431538 -2181445 -356615 441271 -1530892 -4125070 -4274824 -2066908 334867
39334 334867 2316178 4608627 6342398 5643972 3432523 3311403 6417727 9284923 8741321
39325 8741321 6370206 5504457 5872235 4593388 1410515 -704870 -186296 1130226 1275751
39316 1275751 614319 108499 -349353 -635972 367182 2788237 4799981 4989854 4077060
39307 4077060 3106892 1813473 220464 -79444 1844824 4333345 5368796 5280599 5301007
39298 5301007 5082604 4013779 3448705 4786237 6495292 6092507 4157806 3093090 2649270
39289 2649270 554925 -2588199 -3397010 -1494266 -852236 -3603293 -6547460 -6364529 -4664993
39280 -4664993 -4511854 -4892562 -2725252 1485394 4177220 4041697 2952149 1984728 363852
39271 363852 -1327217 -599583 3049627 6535672 6876416 4380092 1157014 -1351499 -2264904
39262 -2264904 -987294 1393560 2354709 1261221 733052 2932108 6148887 7188847
39254 7188847 5732201 3899031 2604239 1190746 157049 1117046 3658205 5078869
39246 5078869 4228344 3172497 3768466 4845706 4544511 3526377 3582516 4336408 3864254
39237 3864254 2067540 992118 1692939 2865264 2998677 2105502 776730 -796179 -2073659
39228 -2073659 -1928533 -175223 1769715 2689334 3011020 3524333 3735864 2736970 916981
39219 916981 -493754 -1042457 -988333 -190879 1432163 2606631 1596555 -1202228 -3003085
39210 -3003085 -1863960 620857 847294 -2706861 -7520137 -9340412 -6291359 -472615
39202 -472615 4522204 7124965 8166812 8282257 6661841 3022753 -795630 -2690940
39194 -2690940 -2816166 -2724778 -2807953 -2434096 -2161764 -3579860 -6609659 -8867284 -8465195
39185 -8465195 -6099035 -3751806 -2579161 -2663993 -3661813 -5004957 -6353224 -8101305 -10313178
39176 -10313178 -11208503 -8679230 -3910415 -1257441 -3033435 -6201593 -6113823 -2187148
39168 -2187148 2154096 4087295 3606236 1747243 -805089 -3045250 -3718789 -2905262 -2225668
39159 -2225668 -2884563 -4491252 -6041170 -6888089 -6506659 -4673331 -2463105 -1800970 -3143945
39150 -3143945 -4503571 -3622160 -454148 3185899 5634212 6164290 4601786 1576222
39142 1576222 -1024657 -1304569 419446 1641724 713805 -779694 184643 3947410 7066735
39133 7066735 6109006 1815055 -1665332 -1543243 828575 2244936 1463757 -163176 -919427
39124 -919427 -223750 1709599 4205907 5898401 5481449 3392091 1828026 2239547 3433549
39115 3433549 3143502 1077217 -816262 -1163545 -927209 -1716941 -3567365 -5707347 -8627418
39106 -8627418 -13169435 -17411303 -17123333 -11180511 -4725091 -4089734 -8974334 -12500662
39098 -12500662 -9558287 -2457040 2914493 3998108 2451902 123198 -2620205 -4954167
39090 -4954167 -5140683 -3003596 -817804 -467669 -1076994 -742811 434137 697147 -342688
39081 -342688 -790514 829981 3315388 4576477 4991509 6926419 10465297 11919702 8597605
39072 8597605 3453294 1774114 3519288 2765775 -3818538 -11474869 -13202925 -8640432
39064 -8640432 -3450161 -1215480 -102978 2347977 5131612 6015235 5071678 4004025
39056 4004025 3562752 3246459 2515173 1094863 -1122334 -3623165 -5359903 -5715989 -4755646
39047 -4755646 -2706167 -334735 668984 -371528 -1126733 1147255 4834262 4987847
39039 4987847 203355 -4846607 -5622495 -3294762 -1559092 -926282 297152 1695214
39031 1695214 1532732 413627 34856 -660624 -3706374 -7135846 -6684422 -2685339 -170489
39022 -170489 -1023585 -1338106 1210347 2693058 -574074 -5269821 -5783002 -2755180 -1537710
39013 -1537710 -3689717 -5365673 -3845705 -784845 1534080 2872882 3057142 1256759
39005 1256759 -1462359 -2401153 -1509413 -2009492 -4968359 -6645556 -3796301 1193009 3461832
38996 3461832 1992607 -92601 -50550 2282580 5396429 6645796 3405972 -3365800
38988 -3365800 -8079876 -6461349 -1690528 -839432 -5421188 -9523559 -8010073 -2648316
38980 -2648316 1481908 2222940 744161 -1503624 -3512511 -4162319 -3452855 -3138264 -4138001
38971 -4138001 -4622885 -2817974 -369188 -169649 -1541068 -692218 3649941 7903074 8306697
38962 8306697 5955843 5157743 7548009 9882994 8170143 2676778 -2344128 -3510573
38954 -3510573 -1568490 492032 1174127 1182581 1379427 1718247 1942045 1785674 550150
38945 550150 -2052662 -4721575 -5766572 -5283050 -4395496 -2829108 249782 3197487 2970809
38936 2970809 -188654 -2586394 -2639772 -2837557 -4499829 -4921892 -2687351 -1539915 -4541564
38927 -4541564 -7823902 -5613856 738007 4579921 3609315 1696129 1336981 558837 -1538537
38918 -1538537 -2028392 663778 3492753 3368245 1267320 -589662 -2099361 -3318680
38910 -3318680 -2579171 457519 2538101 552138 -4367391 -8647705 -10209612 -8966310
38902 -8966310 -5964650 -3813019 -5048890 -8017583 -7578787 -2375824 2121595 1022644
38894 1022644 -3100780 -4828386 -4120990 -4781982 -7024526 -7470612 -5726872 -5195362 -6908111
38885 -6908111 -7660544 -5494521 -2704486 -1682203 -1260658 817909 4190053 6291528
38877 6291528 5073356 740464 -3788595 -4444397 -84552 5336449 6896518 4390871
38869 4390871 1412117 -103440 -916378 -990660 593225 2223208 877852 -2652093 -4194172
38860 -4194172 -2713105 -1467636 -1368842 1087487 6617340 9749192 6942328 3033471
38852 3033471 4060850 7657204 7064559 2063156 -1287507 -935258 -1581978 -6006919 -10067942
38843 -10067942 -9173532 -5016447 -2463898 -2889091 -3879447 -3556755 -2175069 -449908 1259379
38834 1259379 2379363 2282134 973030 -972174 -2693601 -3126224 -1849475 -97058 415653
38825 415653 389 666838 2644269 3192607 311125 -3905931 -5453703 -3089899 814474
38816 814474 3374444 3406869 1086030 -2504373 -5219573 -5132139 -2864195 -1397612 -2549790
38807 -2549790 -4561156 -4400830 -1904511 -102918 -1307716 -4363875 -6655989 -7653781
38799 -7653781 -8830637 -10448985 -10478472 -7540668 -3384526 -929508 -647233 -516561 736646
38790 736646 2081224 2091674 830795 -850684 -2584709 -4093608 -4532689 -3403769 -1558545
38781 -1558545 -216680 609037 1666682 2829910 3183211 2673133 2300110 2297347 1391936
38772 1391936 -1308900 -4577633 -6158828 -5092220 -2168958 1312617 4150066 5014145
38764 5014145 3139034 -383417 -3119215 -3732949 -3153576 -2757218 -2255331 -365377 2911364
38755 2911364 5856721 6989343 6624986 6208031 6657326 7683697 8272240 7364569 4368067
38746 4368067 -191697 -4159703 -4645793 -741071 4407883 5691765 1509419 -3736510
38738 -3736510 -4373422 -255414 3311666 2440283 -1210134 -3987132 -4907718 -4680987 -2750253
38729 -2750253 1335813 5020482 4842674 1224457 -1833330 -1759419 617966 3690273 6265579
38720 6265579 6239497 2210318 -2627148 -2446594 3389986 8404357 7495674 3545771 2069243
38711 2069243 2920115 2251465 245522 871839 4382430 5874254 2665169 -1632012 -2600279
38702 -2600279 -927952 -223081 -1578970 -3071139 -3030152 -1373668 1352842 4277490 6117210
38693 6117210 6229581 5245734 3741685 1251826 -2251650 -4938493 -4792091 -2322404 -274922
38684 -274922 -655632 -2868850 -4678078 -4383890 -2221250 -53906 484086 -345409 -991931
38675 -991931 -736933 -282406 -314263 -890215 -2430534 -5388494 -8111060 -7252025 -2227563
38666 -2227563 2458608 1970423 -2640723 -5786093 -4696607 -2335625 -2177687 -3165552 -2112859
38657 -2112859 856383 2331638 768511 -1107941 -14468 3501689 5807639 4553871
38649 4553871 1001926 -1759182 -1747880 831293 4231275 6214380 5303228 2050741 -1077667
38640 -1077667 -1867949 -441710 1319448 2200228 2653276 3360115 3847073 3151196 1262961
38631 1262961 -758224 -1827444 -1540733 -206391 1204593 1330304 -563888 -3492680
38623 -3492680 -5095464 -3644301 151587 3660062 4974207 4898528 5785690 8379549 10635334
38614 10635334 10268658 7816608 6087825 6635907 7799666 6681964 2550716 -2183621
38606 -2183621 -4340234 -3253927 -1548794 -2175127 -4749969 -5933920 -3857356 -600989
38598 -600989 1002335 1369782 2643620 4386019 4116724 2005602 1315226 3138513 4310087
38589 4310087 2567523 452082 1097833 2937532 2476212 417654 472238 2790097 3428615
38580 3428615 999337 -776996 927443 3419685 2835098 325366 325499 3995110 7818661
38571 7818661 8599057 7093777 6114046 6892597 8139137 7710853 4778722 875229 -1321901
38562 -1321901 -846546 358684 -76496 -1929480 -3119133 -2916085 -2679492 -3416959 -4415562
38553 -4415562 -4706693 -4175231 -2575450 672134 4477744 5707580 2882191 -903355
38545 -903355 -1253289 1727653 3574317 1754553 -943104 -655705 2311111 4650228 4775964
38536 4775964 3771506 2620209 1380283 815444 1848776 3074676 1853540 -1276790
38528 -1276790 -2509926 -641334 420101 -2246632 -5192848 -3538750 861992 1494604
38520 1494604 -3079705 -7162404 -6748569 -5011602 -6136361 -8264430 -6911796 -2463604
38512 -2463604 608445 692922 565443 2101114 3646841 3544907 2878832 3213931 3975511
38503 3975511 3536967 1324991 -2105295 -5614345 -7467848 -6466648 -3833585 -2357005
38495 -2357005 -2940570 -3689841 -3129471 -2303289 -2484866 -2769557 -1677437 297252 1541193
38486 1541193 1705486 1640227 1809665 2139025 2515368 2244317 298397 -2474733 -3010719
38477 -3010719 54151 3596451 3697317 954436 -849308 -459992 119369 401913 2551863
38468 2551863 6382068 7297998 2214723 -5074554 -7827232 -4392986 721764 3218587
38460 3218587 3363470 3572114 4321655 4100376 2253438 209710 -321457 362924 93464
38451 93464 -2561435 -6148623 -7396701 -4603878 359971 3550399 2399771 -1867275
38443 -1867275 -4895706 -3095060 2215805 5501984 3344369 -904227 -1107348 3648307
38435 3648307 8167783 8394664 5766395 3005753 -423658 -5653844 -10290675 -10973791
38427 -10973791 -8490130 -6538077 -6234945 -5427046 -3023232 -464402 1197410 2382633
$$ [...]
##END NTUPLES=NMR SPECTRUM
##END=
