##TITLE=31Pdec_SR3H
 D2O, 24 sc
 8.04.2021
##JCAMPDX= 6.0         $$ Bruker NMR JCAMP-DX V2.0
##DATA TYPE= NMR SPECTRUM
##DATA CLASS= NTUPLES
##ORIGIN= UXNMR, Bruker Analytische Messtechnik GmbH
##OWNER= root
$$ XWIN-NMR		Version 3.5
$$ Thu Apr  8 14:27:17 2021 Russian Standard Time (UT+4h)  she@DPX200
##.OBSERVE FREQUENCY= 81.013821
##.OBSERVE NUCLEUS= ^31P
##.ACQUISITION MODE= SIMULTANEOUS
##.ACQUISITION SCHEME= undefined
##.AVERAGES= 24
##.DIGITISER RES= 16
##SPECTROMETER/DATA SYSTEM= spect
##.PULSE SEQUENCE= zgpg30
##.SOLVENT NAME= D2O
##.SHIFT REFERENCE= (INTERNAL, D2O, 0, 248.564)
##AUDIT TRAIL= $$ (NUMBER, WHEN, WHO, WHERE, WHAT)
$$ ##TITLE= Audit trail, XWIN-NMR		Version 3.5
$$ ##JCAMPDX= 5.01
$$ ##ORIGIN= Bruker BioSpin GmbH
$$ ##OWNER= she
$$ F:/spectra/data/she/nmr/P31/1/pdata/1/auditp.txt
$$ ##AUDIT TRAIL=  $$ (NUMBER, WHEN, WHO, WHERE, WHAT)
(   1,<2021-04-08 14:26:14.51 +0400>,<she>,<DPX200>,
      <created by zg, POWCHK disabled, PULCHK disabled
       configuration hash MD5:
       00 E9 B6 7A A2 85 ED C7 34 08 36 98 17 FE 4E 26
       data hash MD5: 32K
       05 8F 8A 0E BA 65 61 A1 BE 14 B1 29 8B 67 E2 CF>)
(   2,<2021-04-08 14:26:17.20 +0400>,<she>,<DPX200>,
      <Start of raw data processing
       efp BC_mod = 2 LB = 1 FT_mod = 6 PKNL = 1 PHC0 = -5207.834 PHC1 = 494.6021 SI = 64K 
       data hash MD5: 64K
       54 87 A9 A3 04 E4 82 84 E1 0F 32 B7 73 50 31 4C>)
(   3,<2021-04-08 14:26:50.85 +0400>,<she>,<DPX200>,
      <pk PHC0 = -73.69824 PHC1 = -112.4 
       data hash MD5: 64K
       3D E5 45 D3 A0 52 72 79 2B 36 0B 36 EB C3 6E E7>)
(   4,<2021-04-08 14:26:53.75 +0400>,<she>,<DPX200>,
      <abs ABSG = 5 
       data hash MD5: 64K
       BC FC 6B CB E7 8B 6F 47 39 D5 C7 87 93 7A 1C BC>)
$$ ##END=
$$ 
$$ hash MD5
$$ A3 5E FC BB FD 88 05 D9 4E FC 3D F1 96 E8 C2 FD
##$RELAX= 
##$RELAX= 
##$RELAX= 
##$RELAX= 
##$RELAX= 
##$RELAX= 
##$RELAX= 
##$RELAX= 
$$ Bruker specific parameters
$$ --------------------------
##$DU= <F:/spectra>
##$EXPNO= 1
##$NAME= <P31>
##$PROCNO= 1
##$TYPE= <nmr>
##$USER= <she>
##$AMP= (0..31)
100 100 100 100 100 100 100 100 100 100 100 100 100 100 100 100 100 100 
100 100 100 100 100 100 100 100 100 100 100 100 100 100 
##$AQSEQ= 0
##$AQ_mod= 1
##$AUNM= <au_zg>
##$AUTOPOS= <>
##$BF1= 81.014009
##$BF2= 200.13
##$BF3= 200.13
##$BF4= 200.13
##$BF5= 200.13
##$BF6= 200.13
##$BF7= 200.13
##$BF8= 200.13
##$BYTORDA= 1
##$CFDGTYP= 0
##$CFRGTYP= 5
##$CHEMSTR= <none>
##$CNST= (0..31)
1 1 145 1 1 1 1 1 1 1 1 1 1 1 1 1 1 1 1 1 1 1 1 1 1 1 1 1 1 1 1 1 
##$CPDPRG= <waltz16>
##$CPDPRG1= <>
##$CPDPRG2= <waltz16>
##$CPDPRG3= <>
##$CPDPRG4= <mlev>
##$CPDPRG5= <mlev>
##$CPDPRG6= <mlev>
##$CPDPRG7= <mlev>
##$CPDPRG8= <mlev>
##$CPDPRGB= <>
##$CPDPRGT= <>
##$D= (0..31)
0 1 0 0 0 0 0 0 0 0 0 0.03 2e-05 3e-06 0 0 0 0 0 0 0 0 0 0 0 0 0 0 0 0 
0 0 
##$DATE= 1617877573
##$DBL= (0..7)
120 120 120 11 120 120 24 19 
##$DBP= (0..7)
150 150 150 150 150 150 150 150 
##$DBP07= 0
##$DBPNAM0= <>
##$DBPNAM1= <>
##$DBPNAM2= <>
$$ [...]
##$SUBNAM3= <"">
##$SUBNAM4= <"">
##$SUBNAM5= <"">
##$SUBNAM6= <"">
##$SUBNAM7= <"">
##$SUBNAM8= <"">
##$SUBNAM9= <"">
##$SW= 501.771253377433
##$SWIBOX= (0..15)
0 1 3 0 0 0 0 0 0 0 0 0 0 0 0 0 
##$SW_h= 40650.406504065
##$TD= 32768
##$TD0= 1
##$TE= 0
##$TE2= 300
##$TE3= 300
##$TEG= 300
##$TL= (0..7)
0 120 53 12 22 120 120 120 
##$TP= (0..7)
150 150 150 150 150 150 150 150 
##$TP07= 0
##$TPNAME0= <>
##$TPNAME1= <>
##$TPNAME2= <>
##$TPNAME3= <>
##$TPNAME4= <>
##$TPNAME5= <>
##$TPNAME6= <>
##$TPNAME7= <>
##$TPOAL= (0..7)
0.5 0.5 0.5 0.5 0.5 0.5 0.5 0.5 
##$TPOFFS= (0..7)
0 0 0 0 0 0 0 0 
##$TUNHIN= 0
##$TUNHOUT= 0
##$TUNXOUT= 0
##$USERA1= <user>
##$USERA2= <user>
##$USERA3= <user>
##$USERA4= <user>
##$USERA5= <user>
##$V9= 5
##$VALIST= <valist>
##$VCLIST= <CCCCCCCCCCCCCCC>
##$VD= 0
##$VDLIST= <DDDDDDDDDDDDDDD>
##$VPLIST= <PPPPPPPPPPPPPPP>
##$VTLIST= <TTTTTTTTTTTTTTT>
##$WBST= 1024
##$WBSW= 4
##$XGAIN= (0..3)
0 0 0 0 
##$XL= 0
##$YL= 0
##$YMAX_a= 8030
##$YMIN_a= -8069
##$ZGOPTNS= <>
##$ZL1= 120
##$ZL2= 120
##$ZL3= 120
##$ZL4= 120
##$ABSF1= 248.5645
##$ABSF2= -253.2056
##$ABSG= 5
##$ABSL= 3
##$ALPHA= 0
##$AQORDER= 0
##$ASSFAC= 0
##$ASSFACI= 0
##$ASSFACX= 0
##$ASSWID= 0
##$AUNMP= <proc_1d>
##$AZFE= 0.1
##$AZFW= 0.5
##$BCFW= 0
##$BC_mod= 2
##$BYTORDP= 0
##$COROFFS= 0
##$CY= -3
##$DATMOD= 1
##$DC= 0
##$DFILT= <>
##$DTYPP= 0
##$F1P= 0
##$F2P= 0
##$FCOR= 1
##$FTSIZE= 65536
##$FT_mod= 6
##$GAMMA= 0
##$GB= 0
##$INTBC= 1
##$INTSCL= 5.30512e-09
##$ISEN= 30
##$LB= 1
##$LEV0= 0
##$LPBIN= 0
##$MAXI= 10000
##$MC2= 0
##$MEAN= 0
##$ME_mod= 0
##$MI= 50
##$NCOEF= 0
##$NC_proc= -6
##$NLEV= 6
##$NOISF1= 182.463
##$NOISF2= 159.3651
##$NSP= 0
##$NTH_PI= 0
##$NZP= 0
##$OFFSET= 248.5645
##$PC= 4
##$PHC0= -5281.532
##$PHC1= 382.2021
##$PH_mod= 1
##$PKNL= yes
##$PPARMOD= 0
##$PSCAL= 0
##$PSIGN= 0
##$REVERSE= no
##$SF= 81.014009
##$SI= 65536
##$SIGF1= 159.3651
##$SIGF2= -187.1042
##$SINO= 113.3802
##$SIOLD= 16384
##$SREGLST= <1H.CDCl3>
##$SSB= 0
##$STSI= 65536
##$STSR= 0
##$SW_p= 40650.406504065
##$SYMM= 0
##$S_DEV= 0
##$TDeff= 32768
##$TDoff= 0
##$TI= <>
##$TILT= no
##$TM1= 0
##$TM2= 0
##$TOPLEV= 0
##$USERP1= <user>
##$USERP2= <user>
##$USERP3= <user>
##$USERP4= <user>
##$USERP5= <user>
##$WDW= 1
##$XDIM= 65536
##$YMAX_p= 409141816
##$YMIN_p= -27896891
$$ End of Bruker specific parameters
$$ ---------------------------------
##NTUPLES= NMR SPECTRUM
##VAR_NAME=  FREQUENCY,     SPECTRUM/REAL,   SPECTRUM/IMAG
##SYMBOL=    X,             R,               I
##VAR_TYPE=  INDEPENDENT,   DEPENDENT,       DEPENDENT
##VAR_FORM=  AFFN,          ASDF,            ASDF
##VAR_DIM=   65536,         65536,           65536
##UNITS=     HZ,            ARBITRARY UNITS, ARBITRARY UNITS
##FACTOR=    0.620285442955139, 1,           1
##FIRST=     20137.2065510759, 0,            0
##LAST=      -20513.1999529892, 0,           0
##MIN=       -20513.1999529892, -27896891,   0
##MAX=       20137.2065510759, 409141816,    0
$$ Real data points
##PAGE= N=1
##DATA TABLE= (X++(R..R)), XYDATA
$$ [...]
13115I78603J268840J056967o1745j834451k416777n91942J768863J672922n89313
$$ 978603 2247443 3304410 3242665 1408214 -1008563 -1600505 168358 1841280 1251967
13106A251967j617424j26952R73504n71205k337983r43532K347333L392501J453736
$$ 1251967 -365457 -492409 481095 -90110 -2428093 -3371625 -1024292 2368209 3821945
13097C821945k14663R4413L79960q62421j955318j261408q6963k33297r76936
$$ 3821945 3607282 3701695 4081655 3219234 1263916 2508 -84455 -317752 -1294688
13088a294688p13156K54412P43813Q71502J022581K52484j843833l129743j631603
$$ -1294688 -2007844 -1753432 -1009619 -138117 884464 1136948 -706885 -3836628 -5468231
13079e468231Q34251Q89455j132668j558209Q60098L017884K278032J17068o62176
$$ -5468231 -4633980 -3744525 -4877193 -6435402 -5575304 -2557420 -279388 -162320 -824496
13070h24496J40139R20724J079005R48858L18370r18120j571201n74239J002354
$$ -824496 -684357 236367 1315372 2264230 2582600 1664480 93279 -480960 521394
13061E21394J151551k04313j227906r27765k98449m57180r86393p40992M48474
$$ 521394 1672945 1468632 240726 -687039 -985488 -1442668 -2429061 -3170053 -2721579
13052b721579J452032J033407p42077k244302j764023M81044K321193K068597
$$ -2721579 -1269547 -236140 -978217 -3222519 -4986542 -4505498 -2184305 -115708
13044a15708M37552o18779m76821k73542q86550j519723q40730R25853J845310
$$ -115708 321844 -296935 -773756 -1047298 -1933848 -3453571 -4294301 -3368448 -1523138
13035a523138O55497j123886o34209K329778M191078J944506k445274m307574
$$ -1523138 -867641 -1991527 -2625736 -295958 3895120 5839626 3394352 -913222
13027i13222k476244l71613n34463j317349m56883J126195J473498J056864J245421
$$ -913222 -3389466 -3761079 -4295542 -5612891 -6069774 -4943579 -3470081 -2413217 -1167796
13018a167796J272701p3739j271445j48411J820686J173427j837279l148955j012319
$$ -1167796 104905 31166 -1240279 -1388690 431996 1605423 -231856 -3380811 -4393130
13009d393130J567080J705246N25143L59645R50674P32531j18873k55516L89508
$$ -4393130 -2826050 -1120804 -595661 -236016 714658 1447189 1328316 1072800 1462308
13000A462308O05313k68417j702071k611355k082245k76148J238462J200392N01313
$$ 1462308 2067621 1799204 97133 -2514222 -4596467 -4872615 -3634153 -2433761 -1932448
12991a932448O82427J087770L4256j490797p16580J948526K799613Q91404q8971
$$ -1932448 -1250021 -162251 -127995 -1618792 -2335372 -386846 2412767 3304171 3215200
12982C215200J794922K911545J00694l461515l032951J30781J238226j33410l21554
$$ 3215200 5010122 7921667 8022361 4560846 1527895 1658676 2896902 2763492 2441938
12973B441938J267394J245605j240137k683157j235013L32677l86545j643049
$$ 2441938 3709332 4954937 3714800 1031643 -203370 129307 -257238 -1900287
12965a900287r97811Q27523J860342J850191J334987K94982n55333J91069J680569
$$ -1900287 -2898098 -2070575 -210233 1639958 2974945 3269927 2714594 2905663 4586232
12956D586232R03319k347892l953462j469676J672281J333054r79369j106136
$$ 4586232 5489551 3141659 -811803 -2281479 -609198 723856 -255513 -1361649
12948a361649P52643R50412q99877j355957O12785J739073L3083j975711j504283
$$ -1361649 -609006 341406 -558471 -1914428 -1301643 437430 470513 -1505198 -3009481
12939c009481L76847J178473Q55997P96853R74066N86067J12086M04539P64371
$$ -3009481 -2632634 -1454161 -598164 198689 1172755 1758822 1870908 2275447 3039818
12930C039818Q2875r39900r09819m52669j418694l473233l930638j605057J303827
$$ 3039818 3122693 2182793 1272974 820305 -598389 -4071622 -8002260 -9607317 -8303490
12921h303490K306664J862910J896118K302993J178920j585250l156640j343515
$$ -8303490 -5996826 -4133916 -2237798 65195 1244115 -341135 -3497775 -4841290
12913d841290K032709L065769P38727j758376j221940J491784K859265J356727
$$ -4841290 -2808581 257188 995915 -762461 -1984401 -492617 2366648 3723375
12905C723375r45032j500126m03854M09496P730o62774l69616R05444K089498
$$ 3723375 2778343 1278217 874363 1283859 1291589 628815 259199 1164643 3254141
12896C254141K101990Q32127o56903j090082l75300L70483M18766K71264L34467
$$ 3254141 5356131 6188258 5531355 4441273 4065973 4436456 4855222 5126486 5460953
12887E460953j96013j842172l040987j758530J189244K526965Q67069j260303
$$ 5460953 5264940 3422768 381781 -1376749 -187505 2339460 3206529 1946226
12879A946226r44652J130312J976423N65733j153652j236393K2770J079314J025694
$$ 1946226 1001574 2131886 4108309 4674042 3520390 2283997 2306767 3386081 4411775
12870D411775j882j399845k510075k831184k148346n20791J550376K910179K491544
$$ 4411775 4409893 3010048 499973 -2331211 -4479557 -5000348 -3449972 -539793 1951751
12861A951751O96478q03071j159398j145654j196913l09888J666561K402987J40842
$$ 1951751 2648229 1845158 685760 -459894 -1656807 -1966695 -300134 2102853 2243695
12852B243695k869100k906042j24756J806181J226480J49149O31m95113j856718
$$ 2243695 -625405 -3531447 -3656203 -1850022 -623542 -474393 -473762 -968875 -2825593
12843b825593j970631J38142J865436J031127m45341J00610J501567J060989n04213
$$ -2825593 -4796224 -4658082 -2792646 -1761519 -2206860 -2106250 -604683 456306 -47907
12834d7907m13468J038586Q75147j280831k313807n57105J817817K315724J162318
$$ -47907 -461375 577211 1452358 171527 -2142280 -2699385 -881568 1434156 2596474
12825B596474j83763j049047j023732L15598K046290K196262L93989j492464k067839
$$ 2596474 2412711 1363664 339932 655530 2701820 4898082 5292071 3799607 1731768
12816A731768j907578j708423j038192J67012Q76468P26667N83105N02728n95530
$$ 1731768 -175810 -1884233 -2922425 -2755413 -1878945 -1152278 -569173 -66445 -661975
12807f61975k175089j680572J338316L337390J552030j535252j651745Q71775
$$ -661975 -2837064 -4517636 -3179320 158070 1710100 174848 -1476897 -605122
12799f05122J812863l49837k320840j207271J339900J923769J98322j270293r37243
$$ -605122 1207741 857904 -1462936 -2670207 -1330307 593462 791784 -478509 -1415752
12790a415752M758r0783r03189q98750K03771R54657L70910n15692k41529P44836
$$ -1415752 -1410994 -1501777 -2404966 -3303716 -3099945 -2145288 -1774378 -2290070 -2531599 -1786763
12780a786763P58108m16438j176932o23503K94394O20899O54250O62225J48891
$$ -1786763 -1028655 -1445093 -2622025 -3245528 -2951134 -2330235 -1675985 -1013760 -864869
12771h64869o02161j33761J669924K525586R42846j276585j774448j116876j001275
$$ -864869 -1467030 -1600791 69133 2594719 3537565 2260980 486532 -630344 -1631619
12762a631619p02187J258799K989088J012874l630724n400491j836711K680598
$$ -1631619 -2333806 -1075007 1914081 2926955 -703769 -6104260 -7940971 -5260373
12754e260373L122904N42290n90423O13275J111304m10295j658706r87171M2410
$$ -5260373 -2137469 -1595179 -2185602 -1572327 -461023 -871318 -2530024 -3517195 -3474785
12745c474785j59815l10779J189976K779566J736609j110882j840800Q56951L315109
$$ -3474785 -3634600 -3945379 -2755403 24163 1760772 649890 -1190910 -333959 2981150
12736B981150J984215j307522j959218O45198K393772P57033j640482j515139
$$ 2981150 4965365 3657843 1698625 2343823 4737595 5494628 3854146 2339007
12728B339007m1631m61956k434351k535539M8872K129104J504281j07222o48741
$$ 2339007 2297376 1835420 -598931 -3134470 -3085598 -956494 547787 440565 -208176
12719b08176j069062k636886l476506j140927K740776L977364J692853o64555
$$ -208176 -1277238 -3914124 -7390630 -8531557 -5790781 -1813417 -120564 -785119
12711g85119o18752K34658l44618j542152j254357M02851J599071J595778R96700
$$ -785119 -1403871 -1169213 -1513831 -3055983 -4310340 -3907489 -2308418 -712640 284060
12702B84060J25637q22980p90497P98207K199183J232603j141943j669391M29139
$$ 284060 409697 -413283 -1203780 -405573 1793610 3026213 1884270 214879 644018
12693F44018K105350Q57947j874105l086282k026775p0843J528789K069791J075721
$$ 644018 2749368 3607315 1733210 -1353072 -3379847 -3450690 -1921901 147890 1223611
12684A223611o68058j097682L30477J281775j7553j643006r13465J020624Q97804
$$ 1223611 555553 -542129 -211652 1070123 1052570 -590436 -1503901 -483277 414527
12675D14527j223507k082293o93722K66832o55518j242953L89201K595487K959295
$$ 414527 -808980 -2891273 -3584995 -3318163 -3973681 -5216634 -4827433 -2231946 727349
12666G27349J585308j88965j803114k382523m10010L254690M688617J906120j816812
$$ 727349 2312657 2123692 320578 -2061945 -2471955 782735 5471352 7377472 5560660
12657E560660k433682o30275K94043k41496o00750q25939j843411k225174k28772
$$ 5560660 3126978 2496703 2790746 2549250 1948500 1122561 -720850 -2946024 -3174796
12648c174796J987683J050071j407960p03055K635159K762767j814903m840143
$$ -3174796 -1187113 -137042 -1545002 -2248057 387102 3149869 1334966 -3505177
12640c505177j803796K837230K632042j157586k497443k17318J492821Q47306
$$ -3505177 -5308973 -2471743 160299 -997287 -3494730 -3712048 -2219227 -1371921
12632a371921N34232J772697J901677m87909k514509j451494J098652J992451
$$ -1371921 -837689 935008 2836685 2348776 -165733 -1617227 -518575 1473876
12624A473876J071865L56835M40580K63539m49243q45488p24102p59937r31400
$$ 1473876 2545741 2902576 3343156 3606695 3157452 2311964 1587862 827925 -103475
12615a03475l02967J294486K594645K465172J307294K36560n57017j739406l210596
$$ -103475 -406442 888044 3482689 5947861 7255155 7491715 6934698 5195292 1984696
12606A984696l561680j840491O79555J577356K21718j405439j295126J51282J098073
$$ 1984696 -1576984 -3417475 -2737920 -1160564 -938846 -2344285 -3639411 -3488129 -2390056
12597b390056Q47970K13191k13429o95875j199103r69514J91119J212844J004905
$$ -2390056 -1542086 -1328895 -1542324 -2238199 -3437302 -4406816 -4215697 -3002853 -1997948
12588a997948j55385j007110o65648P26043K203401K520476J095551j086457k059885
$$ -1997948 -2153333 -3160443 -3826091 -3100048 -896647 1623829 2719380 1632923 -426962
12579d26962r96250O88345J053393Q0635n73522j45943J94676n88290j471165
$$ -426962 -1423212 -734867 318526 399161 -174361 -320304 -125628 -713918 -2185083
12570b185083p50664J223329K260756J380457Q1438p2526L95655L78091M49283
$$ -2185083 -2935747 -1712418 548338 1928795 2010233 1937707 2333362 2711453 3160736
12561C160736J632308K686741J174973k578556n066587m053089j318441L16094
$$ 3160736 4793044 7479785 8654758 6076202 1009615 -3043474 -4361915 -4045821
12553d045821O89767J219812J826253J349644J43454j66769P14659J384044Q88216
$$ -4045821 -3356054 -2136242 -309989 1039655 1183109 1016340 1730999 3115043 4003259
12544D003259m21645j910587k850488k100655L37125J936550M10185k304867j916607
$$ 4003259 3581614 1671027 -1179461 -3280116 -2942991 -1006441 -596256 -2901123 -4817730
12535d817730J870900M277159K140175j617424k594337j130834o56608j758235
$$ -4817730 -2946830 1330329 3470504 1853080 -741257 -1872091 -2528699 -4286934
12527d286934j717015O35778L125665L633036K496811R23424o57548j857073j898167
$$ -4286934 -6003949 -5368171 -2242506 1390530 3887341 4810765 4153217 2296144 397977
12518C97977q49421J25562L73854L38302K43072k87846r70089r07885l52354n60959
$$ 397977 -451444 -325882 47972 386274 629346 341500 -628589 -1536474 -1888828 -2449787
12508b449787j295555o17410J724049K987746J349033r16921o32614J421938J852728
$$ -2449787 -3745342 -4362752 -2638703 349043 1698076 781155 148541 1570479 3423207
12499C423207N0792j137617k88673N03490l86200j182934K269J432275L71302
$$ 3423207 3473999 2336382 2047709 2551199 2164999 982065 984334 2416609 2787911
12490B787911k014774k014238O09882J772931n86193k834959r51900L049450L730648
$$ 2787911 773137 -1241101 -631219 1141712 555519 -2279440 -3231340 -181890 3548758
12481C548758K02765k664265j550043P62924K21405k233297k462679N08600L422554
$$ 3548758 3751523 1087258 -462785 300139 521544 -1711753 -4174432 -3665832 -243278
12472b43278L615311J756340m18666k142674k620270p92084K408811L769237J607771
$$ -243278 3372033 5128373 4709707 2567033 -53237 -845321 1563490 5332727 6940498
12463F940498j699341k791545j578155m90950n82591o18405L66346J697125K356639
$$ 6940498 5241157 2449612 871457 380507 -202084 -820489 -454143 1242982 3599621
12454C599621K077623J005060m75759j549697j675951j281448p73306M39032K458265
$$ 3599621 5677244 6682304 6206545 4656848 2980897 1699449 926143 1365175 3823440
12445C823440L303325J098665k455414l483157j166603J131789Q37744n47409
$$ 3823440 7126765 8225430 5770016 2286859 1120256 2252045 3089789 2542380
12437B542380o66368r7555n31392j288981o36771P16745N36527j108258j897421
$$ 2542380 1876012 1778457 1247065 -41916 -678687 38058 574585 -533673 -2431094
12428b431094j041696j67876j29084L03205J747123K638231J520063r21312l030755
$$ -2431094 -3472790 -3640666 -3769750 -3466545 -1719422 918809 2438872 1517560 -1513195
12419a513195l685875k087757J662124M892731L976427p20063m079863k673201
$$ -1513195 -5199070 -7286827 -5624703 -731972 3244455 2524392 -1555471 -4228672
12411d228672N15529P41938j347801j239297J928740L948186K057307j226699
$$ -4228672 -3713143 -2971205 -4319006 -5558303 -3629563 318623 2375930 1149231
12403A149231k230046q52265O45285J096184P77887J48860j28721N48249J206642
$$ 1149231 -1080815 -1933080 -1287795 -191611 586276 735136 606415 1154664 2361306
12394B361306j42634l113989m195299j233622L125270M590818K399815p35891
$$ 2361306 2218672 -895317 -5090616 -6324238 -3198968 1391850 3791665 3055774
12386C055774k513623k602311j383578M57249J592864J267500L65361j93312r75824
$$ 3055774 542151 -2060160 -3443738 -2986489 -1393625 -126125 239236 45924 -929900
12377i29900k215028k100941N18051L118488K365797q57482k636085j693778k88331
$$ -929900 -3144928 -5245869 -4727818 -1609330 756467 -101015 -2737100 -4430878 -4719209
12368d719209L33652J334308K613604J897384j040442k909817j608848P00013
$$ -4719209 -4385557 -3051249 -437645 1459739 419297 -2490520 -4099368 -3399355
12360c399355J237476M66792J15406J1520n98027p93681L62970J636751J396746
$$ -3399355 -2161879 -1695087 -1579681 -1568161 -2166188 -2959869 -2596899 -960148 436598
12351D36598J01004q91915j305158j052829M60517K251597J573191j714048l343588
$$ 436598 537602 -354313 -1659471 -2712300 -2251783 -186 1573005 -141043 -3484631
12342c484631l99566L735915M044324J192713l35031L29757J35009j497018j552289
$$ -3484631 -3884197 -148282 3896042 5088755 4753724 5083481 5218490 3721472 2169183
12333B169183P01281J858340o4933k496441k553159q19677Q27275J823545J711697
$$ 2169183 2870464 4728804 4663871 2167430 -385729 -1205406 -378131 1445414 3157111
12324C157111l02565k796455k507531O92975K576852O56301j945558j622192J42155
$$ 3157111 2854546 58091 -2449440 -1756465 820387 1476688 -468870 -2091062 -1948907
12315a948907Q5549r05830J72611K422112K119831q66895k630606j437670J19248
$$ -1948907 -1863358 -2769188 -2596577 -174465 1945366 1078471 -1552135 -2989805 -2870557
12306b870557P3341q7803Q16958R96589p33580j938133k63602K195109J778373
$$ -2870557 -2797216 -2885019 -2068061 -1071472 -1805052 -3743185 -4006787 -1811678 -33305
12297c3305q93581j752980L89368K156262J047061q95546p78460N27651L01623
$$ -33305 -926886 -2679866 -2290498 -134236 912825 17279 -761181 -233530 68093
12288F8093j189833j176049O80763J301254r28405l240277k349584Q53257K811414
$$ 68093 -1121740 -2297789 -1617026 -315772 -1244177 -4484454 -6834038 -5980781 -3169367
12279c169367K216111R58744P89857J411827J839548J567949K37320j945517l267366
$$ -3169367 -953256 5488 795345 2207172 4046720 5614669 5851989 3906472 639106
12270F39106j999760P60284J790182k8516k198692k244278p77040L92169J143000
$$ 639106 -1360654 -600370 1189812 1161296 -1037396 -3281674 -4058714 -3666545 -2523545
12261b523545K098174K413916R19073j393698k310036j459940m33877j06796J13588
$$ -2523545 -425371 1988545 2907618 1513920 -796116 -2256056 -2689933 -2796729 -2683141
12252b683141M06871L0450r03949j049597J06655J412123J927225J966103J512004
$$ -2683141 -2276270 -2245820 -3149769 -4199366 -4092711 -2680588 -753363 1212740 2724744
12243B724744m21910l437425m636762k047330K064398L747378K461937R40415
$$ 2724744 2302834 -1134591 -5771353 -7818683 -5754285 -2006907 455030 1395445
12235A395445M50458m21451j852717j516430R62312J921508q69791l650528j754395
$$ 1395445 1845903 1424452 -428265 -1944695 -982383 939125 69334 -3581194 -5335589
12226e335589K799673L873761N44240j799425l52134J009612j033172l322275
$$ -5335589 -2535916 1337845 1882085 82660 -269474 740138 -293034 -3615309
12218c615309j663257J932333K514066Q4288j099601K11581R52844m06175j491699
$$ -3615309 -5278566 -3346233 -832167 -747879 -1847480 -1635899 -683055 -1089230 -2580929
12209b580929l93546J443016J923600R54568n95180k007176k079192M5354K684833
$$ -2580929 -2974475 -1531459 392141 1346709 751529 -1255647 -3334839 -3289485 -604652
12200f04652K784014J05889k113664j558205M08678J328680Q52821K10822J58760
$$ -604652 2179362 2285251 171587 -1386618 -977940 350740 1203561 1414383 1573143
12191A573143N38238Q42720P43892O86375J364418J780604l38418m317507n351722
$$ 1573143 2111381 2954101 3697993 4384368 5748786 7529390 7190972 2873465 -2478257
12182b478257j038585L495431K078586k851348l575931P57536L032697R7153k518727
$$ -2478257 -3516842 -21411 2057175 -794173 -4370104 -3612568 -579871 -482718 -3001445
12173c001445p44440J298620m45055k277120K60730L707694K477473j185693j074000
$$ -3001445 -3745885 -2447265 -2892320 -5169440 -4908710 -1201016 1276457 90764 -983236
12164i83236K230298K716070n79925k550334j121693K23496l42859k84812J386959
$$ -983236 1247062 3963132 3383207 832873 -288820 -65324 -408183 -692995 693964
12155F93964J829285m9224j297717l59434L03666p00674q82172J140913K367040
$$ 693964 2523249 2474025 1176308 816874 1120540 419866 -462306 678607 3045647
12146C045647L79096k245576k007999J48403J117625P13783P66535J043189o7397
$$ 3045647 3424743 1179167 -828832 -680429 437196 1150979 1917514 2960703 2893306
12137B893306j767428j428129J011689K301022L64981k632718l011792k24844
$$ 2893306 1125878 -302251 709438 3010460 3375441 742723 -2269069 -2493913
12129b493913K602284K636999O39395m98810K28907J004481L41132q52155j312793
$$ -2493913 108371 2745370 3384765 2885955 3114862 4119343 4460475 3608320 2295527
12120B295527j440203j616176o02608J963111L340256J127077k365722k789538
$$ 2295527 855324 -760852 -1363460 599651 3939907 5066984 2701262 -88276
12112h8276j15693J523693K57088j263999o82070Q07559J353590J299443J447277
$$ -88276 -203969 1319724 1576812 312813 -369257 438302 1791892 3091335 4538612
12103D538612J184856R8132p04705m20011Q1990j36243p77984j389839j974963
$$ 4538612 5723468 5821600 5116895 4696884 4778874 4642631 3864647 2474808 499845
12094D99845k030649r08439N78731J031716R22459J620986K235235P65657j645465
$$ 499845 -1530804 -2439243 -1860512 -828796 93663 1714649 3949884 4715541 3070076
12085C070076j706406L20258N77861j564336j872409J330488L515724J267770
$$ 3070076 1363670 1683928 2261789 697453 -1174956 155532 3671256 4939026
12077D939026j818343j269463O69963n94677l430084k543466J619299L053403
$$ 4939026 3120683 1851220 2521183 1926506 -1503578 -4047044 -2427745 625658
12069F25658k36606l298455k148923R10784K013273J207030N96600N05619K78459
$$ 625658 389052 -2909403 -5058326 -4147542 -2134269 -927239 -330639 174980 453439
12060D53439M11356J300350J592145j5503k488317l596731k428375J96015K615751
$$ 453439 864795 2165145 3757290 3741787 1253470 -2343261 -4771636 -4575621 -1959870
12051a959870K967438O16576k155403j842713J590759L717094J248401l137611
$$ -1959870 1007568 1624144 -531259 -2373972 -783213 2933881 4182282 1044671
12043A044671m144258r39721K093373J604928p01375j332395R2012J154533O26935
$$ 1044671 -3099587 -4039308 -1945935 -341007 -1042382 -2374777 -2282765 -1128232 -501297
12034e01297o1186O29901J996736K084695K83705j902381k603408j579283k23996
$$ -501297 -562483 67418 2064154 4148849 4432554 2530173 -73235 -1652518 -1876514
12025a876514K42416J11736L59560Q81924N62672p04780j341752l86548O93891
$$ -1876514 -1634098 -1522362 -1162802 -280878 281794 -422986 -1764738 -2151286 -1457395
12016a457395J55848q86475J38252K799892L446743M71882k848788k718844L4141
$$ -1457395 -1301547 -2188022 -2049770 750122 4196865 4668747 1819959 -898885 -864744
12007h64744J591577M87448j312267j839348j030326M34800J805181J886651J77389
$$ -864744 726833 1214281 -97986 -1937334 -2967660 -2532860 -727679 1158972 1336361
11998A336361j673592j570773J5916Q27074L38395Q8073N38345L23825r14448
$$ 1336361 -337231 -1908004 -1892088 -1065014 -726619 -638546 -100201 223624 -690824
11989f90824j572533q09778Q5226K2270k77297N466L41251J07531l38232n87368
$$ -690824 -2263357 -3073135 -2987909 -2965639 -3242936 -3237470 -2896219 -2788688 -3126920 -3714288
11979c714288o39181p1795J432283K587909J798695J04192O5023J331988P08455
$$ -3714288 -4353469 -4425264 -2992981 -405072 1393623 1497815 1562838 2894826 3603281
11970C603281k336024l957071j764011J158407R39050j271445j614149M69457
$$ 3603281 1267257 -2689814 -4453825 -3295418 -2356368 -3627813 -5241962 -4772505
11962d772505K216079K285487J960349K031719J608268K22331j245746k073947
$$ -4772505 -2556426 -270939 1689410 3721129 5329397 5551728 4305982 2232035
11954B232035k427307k427491j802571n17320J056732K296235K253155M34454
$$ 2232035 -195272 -2622763 -4425334 -4942654 -3885922 -1589687 663468 1097922
11946A097922j825623k228331n06928J128170J376636J505044K372626K392271
$$ 1097922 -727701 -2956032 -3462960 -2334790 -958154 546890 2919516 5311787
11938E311787N20663j181822o94004L47101o89542k789215k800812n61737J032304
$$ 5311787 5832450 4650628 3956624 4303725 3614183 824968 -1975844 -2537581 -1505277
11929a505277O40513k14526l84833m06928k85467R34714K645003K488781j70304
$$ -1505277 -864764 -1079290 -1464123 -1871051 -2156518 -1221804 1423199 3911980 3741676
11920C741676k785116k829745q09371R45301J092751n703j166499j105468P24470
$$ 3741676 956560 -1873185 -2682556 -1737255 -644504 -650207 -1816706 -2922174 -2197704
11911b197704L138792L757633J422464k115556l574032j528412J707035K238520
$$ -2197704 941088 4698721 6121185 4005629 431597 -1096815 610220 2848740
11903B848740q30241l769005k524803J911231M543971K769192q30732k690834
$$ 2848740 2018499 -1750506 -4275309 -2364078 2179893 4949085 4118353 1427519
11895A427519k395631j239303M42163K271557K567437P01883j123086r82440l20660
$$ 1427519 -968112 -2207415 -1765252 506305 3073742 3775625 2652539 1670099 1349439
11886A349439j260915k630668j871858M03997J213598p9714j069070k03358J336893
$$ 1349439 88524 -2542144 -4414002 -4010005 -2796407 -2876121 -3945191 -4148549 -2811656
11877b811656J740626M76156j700522l023748j788746J264283K952407J767519
$$ -2811656 -1071030 -594874 -2295396 -5319144 -7107890 -5843607 -2891200 -1123681
11869a123681R3808J80863M42312j109820k391377n01284K567154K456109m80188
$$ -1123681 -1029873 -849010 -406698 -1516518 -3907895 -4409179 -1842025 614084 133896
11860A33896j805227j82793J319279J092704P98863P81209q72927l428331k997496
$$ 133896 -1671331 -1854124 -534845 557859 1356722 2137931 1265004 -2163327 -5160823
11851e160823J026145L866229K201526j146355k042840p11536L01012M55524N25166
$$ -5160823 -4134678 -268449 1933077 786722 -1256118 -1967654 -1666642 -1211118 -685952
11842f85952L29042j46678J99142J192570P04114j517800k333895l4167K345753
$$ -685952 -356910 -503588 -304446 888124 1592238 74438 -2259457 -2293624 52129
11833E2129J506069j007525j466239M42267J993096J708243J70100j965046l843271
$$ 52129 1558198 550673 -915566 -473299 1519797 3228040 3398140 1433094 -2410177
11824b410177l684899j031845J535074J648205P78849J718388L726519L523385
$$ -2410177 -6095076 -7126921 -5591847 -3943642 -3164793 -1446405 2280114 5803499
11816E803499M61679k598149l541857l165447k698700j771165J91960K281898
$$ 5803499 6265178 3667029 125172 -3040275 -5738975 -7510140 -7318180 -5036282
11808e036282K898736J590637l13155p80941Q35635K718553K541200O04577n66753
$$ -5036282 -2137546 -546909 -860064 -1641005 -805370 1913183 4454383 5058960 4492207
11799D492207r0285O1746j288884k220009r34305R83642J004490m12812j007797
$$ 4492207 4401922 4463668 3174784 954775 20470 1004112 2008602 1595790 587993
11790E87993m89043l05665n69140m8815J168798J628264J040257N96814O87493
$$ 587993 98950 -206715 -775855 -824670 344128 1972392 3012649 3609463 4296956
11781D296956L35640q27529j723523j396370k97900L29495j62559j007040o13232
$$ 4296956 4632596 3805067 2081544 685174 387274 716769 554210 -452830 -1066062
11772a066062J253545K251277K63681k706988k326275J730942M676228L369257
$$ -1066062 187483 2438760 2702441 -4547 -2330822 -599880 4076348 7445605
11764G445605L95212r99411j878221l824047m229197o05060L444393K648499j440584
$$ 7445605 7840817 6841406 4963185 1139138 -3090059 -3695119 -250726 2397773 957189
11755I57189k783210n08070O95058l86211M09527M121474N673011K248115j890832
$$ 957189 -1826021 -2334091 -1639033 -2025244 -1615717 2505757 8178768 10426883 8536051
11746H536051k615050k050364l228298m079249j863897J038043J347980R75120
$$ 8536051 5921001 3870637 642339 -3436910 -5300807 -4262764 -2914784 -1939664
11738a939664K967052M830722K510799j606793j924875P07973K94829l683145
$$ -1939664 1027388 5858110 8368909 6762116 4837241 5545214 5840043 2156898
11730B156898n009955j390407J554893r0223k153247o1377L195369K426897j015838
$$ 2156898 -2853057 -4243464 -2688571 -2778794 -4932041 -4993418 -1798049 628848 -386990
11721c86990k068752m21718J74676p94842l56591J565794J677618k97172n52032
$$ -386990 -2455742 -2877460 -2702784 -3497626 -3854217 -2288423 -610805 -907977 -1460009
11712a460009J987170L139710L04778k827072j915607J264067J892233l85456
$$ -1460009 527161 3666871 3971649 1144577 -771030 493037 2385270 1999814
11704A999814j544254J27785J794927J012999p63053j121971m90926q51943k123796
$$ 1999814 455560 583345 2378272 3391271 2628218 1506247 1015321 163378 -1960418
11695a960418k110448J46870K746337L222399J423379p07280j644931j560177
$$ -1960418 -4070866 -3923996 -1177659 2044740 3468119 2760839 1115908 -444269
11687d44269j184584n82490L73179J179354J251058Q05295M16058J74607M7267
$$ -444269 -1628853 -2211343 -1838164 -658810 592248 1397543 1813601 1988208 2035475
11678B035475L70509R96350P76555p36455j896479j032775P59340R85811n64303
$$ 2035475 2405984 3402334 4178889 3442434 1545955 513180 1272520 2258331 1694028
11669A694028j850515j947205j675842j038084P97765K696804K309952L48148
$$ 1694028 -156487 -2103692 -3779534 -4817618 -4019853 -1323049 986903 1335051
11661A335051J80432J937619J533834k175265m135306p84873L430997K434669
$$ 1335051 1515483 3453102 4986936 2811671 -1323635 -2108508 1322489 3757158
11653C757158j973940l122328M9697K135261L93152j745693j181139O18719J567451
$$ 3757158 1783218 -1339110 -1289413 845848 1239000 -506693 -1687832 -1069113 498338
11644D98338K135942K514363J102227j737712k456551L42732K837493J367260
$$ 498338 2634280 5148643 6250870 4513158 2056607 2399339 5236832 6604092
11636F604092k015624k771976n18408J107246J24016j518054j331991L89338J314230
$$ 6604092 4588468 1816492 1298084 2405330 2529346 1011292 -320699 68639 1382869
11627A382869J19246j803136j938726m3177J193183L45j505348n54411J522921
$$ 1382869 1502115 -301021 -2239747 -2282924 -1089741 -1089396 -2594744 -3149155 -1626234
11618a626234J281359r35504j408903O01844J689683L90685n19596M54654P60393
$$ -1626234 -344875 -1280379 -2689282 -2087438 -397755 -7070 -526666 -72012 688381
11609F88381q77499j338739J210764L187600J393569j301086j009974L12746j105769
$$ 688381 -189118 -1527857 -317093 2870507 4264076 2962990 1953016 2265762 1159993
11600A159993l197900j288961K882496K827276k108792n006245j705217L400649
$$ 1159993 -2037907 -3326868 -444372 2382904 274112 -4732133 -6437350 -3036701
11592c036701M422341J651188r00944j545112j173041m32976K75881R5356n98923
$$ -3036701 1385640 3036828 2135884 590772 -582269 -1015245 -739364 -644008 -1242931
11583a242931J82265K620861L541255P75486k907310l148622J2853K456561J693512
$$ -1242931 -1060666 1560195 5101450 5876936 2969626 -178996 -166143 2290418 3983930
11574C983930n24082j437678p74600k04113p67768j815188k011848r35180L26229
$$ 3983930 3459848 2022170 1247570 1043457 275689 -1539499 -3551347 -4486527 -4160298
11565d160298L56192p75041j527392r74704O9164N98390R70007J799879K320459
$$ -4160298 -3804106 -4579147 -6106539 -7081243 -7012079 -6413689 -5443682 -3643803 -1323344
11556a323344J507523K59642M06010J541044J140250j401073l153485j742520
$$ -1323344 184179 443821 849831 2390875 3531125 2130052 -1023433 -2765953
11548b765953R07810J406649R4298J36559J858545J856226j239829l856883k624219
$$ -2765953 -1858143 -451494 -357196 -220637 1637908 3494134 2254305 -1602578 -4226797
11539d226797N98160J844314Q42946J65658K89778m71904j945161k100727r79727
$$ -4226797 -3628637 -1784323 -941377 -775719 -485941 -957845 -2903006 -5003733 -5983460
11530e983460o72316j105929J27205K962646L948400J597193j065096j140535
$$ -5983460 -6655776 -7761705 -7634500 -4671854 -723454 873739 -191357 -1331892
11522a331892L18142J086284J109142Q71958m24985k571568l118893j066693R09843
$$ -1331892 -1013750 72534 1181676 2053634 1628649 -942919 -4061812 -5128505 -4218662
11513d218662N37918m89708J73348J476987J431082R12527J459402J731690K6358
$$ -4218662 -3680744 -4170452 -3997104 -2520117 -1089035 -176508 1282894 3014584 3040942
11504C040942j885454j521575l05526j070457k671485j798756J047099K243843
$$ 3040942 1155488 -366087 -671613 -1742070 -4413555 -6212311 -5165212 -2921369
11496b921369J024963L5106L21963M76496N46633J949815L373709J786286j853752
$$ -2921369 -1896406 -1861300 -1539337 -1062841 -516208 1433607 4807316 6593602 4739850
11487D739850k918478k64358J831536N05691j615897j339515L37675R33226L67128
$$ 4739850 1821372 1557014 3388550 3894241 2278344 938829 1276504 2209730 2576858
11478B576858l47693j204710j816050r23137Q17717Q09267q83674o67361K496698
$$ 2576858 2229165 1024455 -791595 -1714732 -897015 -87748 -971422 -1638783 857915
11469H57915M233937J308877k761813k872919o9582O93011j496373k847133j342029
$$ 857915 5091852 6400729 3638916 765997 696415 1389426 -106947 -2954080 -4296109
11460d296109Q39452J523042J200991Q44874K62240n20245p03075k54207p4515
$$ -4296109 -3456657 -1933615 -732624 112250 374490 -145755 -848830 -1103037 -1177552
11451a177552k82076j05419M16840M16986j14191l92840m95355j064743j472110
$$ -1177552 -1459628 -1565047 -1148207 -731221 -845412 -1238252 -1733607 -2798350 -4270460
11442d270460l73615J728887K592071J356247l54204j002642r23085p95150k23834
$$ -4270460 -4644075 -2915188 -323117 1033130 678926 -323716 -1246801 -2041951 -2265785
11433b265785R78880J617670O80420q59984j162908J06990J624437K189507J648404
$$ -2265785 -1286905 330765 1011185 151201 -1011707 -904717 719720 2909227 4557631
11424D557631L64689j118880j894674j216766L88713J275042N25958p88816r05891
$$ 4557631 4922320 3803440 1908766 692000 1080713 2355755 2881713 2092897 1187006
11415A187006K99793J148013M61635r13043j466049j001343k58273O68620K008824
$$ 1187006 1486799 2634812 3096447 2183404 717355 -283988 -542261 126359 2135183
11406B135183K785187J551868j016003k260339j173271L5619n35150j291768J41595
$$ 2135183 4920370 6472238 5456235 3195896 2022625 2058244 1523094 231326 372921
11397C72921K394902J836940j530751l236091p28877K522860J917143j489730
$$ 372921 2767823 4604763 3074012 -162079 -890956 1631904 3549047 2059317
11389B059317k591173J50693K540074R45259k579527l584704j362233R22247J083734
$$ 2059317 -531856 -381163 2158911 3104170 524643 -3060061 -4422294 -3500047 -2416313
11380b416313J28084k13482K41529P44075P34081p4857j312454j566650J2887
$$ -2416313 -2288229 -2501711 -2260182 -1516107 -782026 -856883 -2169337 -3735987 -3723100
11371c723100J768218J239510j014402j778796P937J616748J013168L7658Q82678
$$ -3723100 -1954882 -715372 -1729774 -3508570 -3500633 -1883885 -870717 -833059 49619
11362D9619K050525R27463j497771k026251l40865Q23809K44438m32261m0745
$$ 49619 2100144 3027607 1529836 -496415 -837280 -13471 230967 -201294 -242039
11353b42039N16595N28082N06941L84666o30898j761940j043304J111689J665469
$$ -242039 274556 802638 1309579 1694245 1063347 -698593 -1741897 -630208 1035261
11344A035261l73354j948206n60128J779063J730946l38644j457382p85246j35316
$$ 1035261 661907 -1286299 -1846427 -67364 1663582 1324938 -132444 -917690 -1053006
11335a053006l51607k05109Q55756J419214L92559j244548j842890r78641O77844
$$ -1053006 -1404613 -1609722 -753966 665248 1057807 -186741 -2029631 -3008272 -2330428
11326b330428K205996K535958R23608j749178l097126j794613N44649J231165
$$ -2330428 -124432 2411526 3335134 1585956 -1511170 -3305783 -2761134 -1529969
11318a529969k7393q25405N59746K754879L064103Q42848j927903l062749k154354
$$ -1529969 -1557362 -2382767 -1823021 931858 3995961 4838809 2910906 -151843 -2306197
11309b306197k67387J307810J790723J219743L69985p0001k09034l48354j01798
$$ -2306197 -2573584 -1265774 524949 1744692 2114677 2044676 1835642 1487288 1385490
11300A385490Q50812J516124O31986j041863j265131L87498J567233L82915j962388
$$ 1385490 2236302 3752426 4384412 3342549 2077418 2464916 4032149 4415064 2452676
11291B452676k871099j474259R28010K484908K117082L26802q86384k76557M66975
$$ 2452676 -418423 -1892682 -964672 1520236 3637318 3964120 3077736 2801179 3268154
11282C268154j077980l685188l518649k82089J628999l9569j668317P4026K490107
$$ 3268154 2190174 -1495014 -5013663 -5295752 -3666753 -3706322 -5374639 -5300613 -2810506
11273b810506J621282p88112m90892J661557J364962j332526k153504j46535J055787
$$ -2810506 -1189224 -1977336 -2468228 -806671 558291 -774235 -2927739 -3074274 -2018487
11264b018487R446m39710J016542J818625P06503j6767O28254J67074k240574
$$ -2018487 -2009041 -2448751 -1432209 386416 1092919 1076152 1704406 1871480 -369094
11255c69094l385264j381790J008937J279394J038289J875808J723270r79063
$$ -369094 -3754358 -5136148 -4127211 -2847817 -1809528 66280 1789550 810487
11247H10487l424025k740504o58442J11643O52099K617587L682927J310409j776806
$$ 810487 -2613538 -5354042 -6012484 -5900841 -5248742 -2631155 1051772 2362181 585375
11238E85375j393097J074123J210739n77468p8490K676280L039312o6342j994139
$$ 585375 -807722 266401 1477140 899672 821182 3497462 6536774 6470432 4476293
11229D476293j12036K045362R46439j537941k130522j512000j973143k688874
$$ 4476293 4364257 6409619 7356058 5818117 3687595 2175595 202452 -2486422
11221b486422j312084J450143K552628J213180k30497K2063J079346J170899j6183
$$ -2486422 -3798506 -2348363 204265 1417445 1186948 1209011 2288357 3459256 3443073
11212C443073j291387j425298m27722L97094n8449j167907j351619m26684J98366
$$ 3443073 2151686 726388 298666 695760 637311 -530596 -1882215 -2308899 -2110533
11203b110533N9846N51568K193973K859373P43054k209013k471662p7251J272328
$$ -2110533 -2050687 -1499119 694854 3554227 4297281 2088268 -383394 -460645 811683
11194H11683l22782k195195j277316J323351K265815J008405M6481N67575Q29570
$$ 811683 488901 -1706294 -2983610 -1660259 605556 1613961 1660442 2228017 3057587
11185C057587m84479j855205j320776N07741J510550R95481k740n51890n19754
$$ 3057587 2573108 717903 -602873 -95132 1415418 2410899 2408159 1856269 1336515
11176A336515o0769L52893J235r03154r36755M84752J829698J608340O15341L16935
$$ 1336515 1275746 1628639 1629874 726720 -210035 274717 2104415 3712755 4328096 4645031
11166D645031L12343l97535q69607K27907J394518k4053l107343l829525q64841
$$ 4645031 4957374 4559839 3690232 3918139 5312657 5288604 2181261 -1648264 -2513105
11157b513105K347929K467394K95279j394952j515225o55155L68526N33783q10333
$$ -2513105 -165176 2302218 2597497 1202545 -312680 -967835 -599309 -65526 -875859
11148h75859k217484j181607J922071L422996J429366j244297j256655N32037
$$ -875859 -3093343 -4274950 -2352879 1070117 2499483 1255186 -1469 530568
11140E30568J029872k84006j329522j021722k57185J12473J58915O6957j5203
$$ 530568 1560440 1276434 -53088 -1074810 -1331995 -1219522 -1060607 -993650 -1008853
11131a008853K18980N21728R5130p83768n98073P97639J241725l84992j774740
$$ -1008853 -789873 -268145 -173015 -956783 -1554856 -757217 484508 99516 -1675224
11122a675224m50808K132907K473271J16274j871391j317090N70833J414964N85091
$$ -1675224 -2126032 6875 2480146 2596420 725029 -592061 -21228 1393736 1978827
11113A978827n95302o05187N18178R60208o97344l018399k991742k86098J879621
$$ 1978827 1383525 778338 1296516 2256724 1559380 -1459019 -4450761 -4736859 -2857238
11104b857238J276027k48079l0028J351186J744872J140700P59778O4929j955258
$$ -2857238 -1581211 -1829290 -1859318 -508132 1236740 2377440 3137218 3202147 1246889
11095A246889l624697k375776O92339J728380j38245j502334j5696K216471K176236
$$ 1246889 -2377808 -4753584 -4061245 -2332865 -2471110 -3973444 -3989140 -1772669 403567
11086D03567L25119o06686L43031J552909J379382Q474j170304j189288l98955
$$ 403567 728686 122000 465031 2017940 3397322 3405796 2235492 1046204 647249
11077F47249K5590n20606j340192j325285k64024J072944J732561J148980m48394
$$ 647249 672839 152233 -1187959 -2513244 -2777268 -1704324 28237 1177217 728823
11068G28823j788516j525123M4673J164622J039354P90516J204211J117616n06240
$$ 728823 -1059693 -2584816 -2540143 -1375521 -336167 454349 1658560 2776176 2269936
11059B269936k284042k105530k67246R97882O40687k91106n54488L5534J057551
$$ 2269936 -14106 -2119636 -2386882 -1389000 -748313 -1039419 -1593907 -1558373 -500822
11050e00822J858573J705529O76178k8537K94922O39226p5993j037121q03334
$$ -500822 1357751 3063280 3739458 3710921 4005843 4645069 4569076 3531955 2728621
11041B728621K09015L68316n00050j035068p97115q51028j629127j946685p69731
$$ 2728621 2937636 3305952 2805902 1770834 973719 122691 -1506436 -3453121 -4222852
11032d222852J271534K722166K760520J434665o45047k289507k125649J04005
$$ -4222852 -2951318 -229152 2531368 3966033 3320986 1031479 -1094170 -990165
11024i90165K653072K916726J25859l281513l932191j443532J097243J233859
$$ -990165 1662907 4579633 4705492 1423979 -2508212 -3951744 -2854501 -1620642
11016a620642Q4841k23089q1937p45826q94861J318777L737464K394124j651580
$$ -1620642 -1535801 -1758890 -1840827 -2586653 -3481514 -2162737 1574727 3968851 2317271
11007B317271k864538J26834J938421q74706l893282j841956K855844L859472
$$ 2317271 -547267 -420433 1517988 643282 -3250000 -5091956 -2236112 1623360
10999A623360L74323k675415k331195k79273J381919K313969K047366R1366j910105
$$ 1623360 1997683 -677732 -3008927 -3288200 -1906281 407688 2455054 2546420 636315
10990F36315j661935J11961O91839j93982l22102P62311R47283o40462k175954
$$ 636315 -1025620 -913659 -221820 -415802 -737904 24407 971690 331228 -1844726
10981a844726k002773l56610J947586M014653M155165J435458k034904l058119
$$ -1844726 -3847499 -4204109 -2256523 1758130 5913295 7348753 5313849 2255730
10973B255730j562218k03998n4210K12190Q86607M66323j093849j635687l09668
$$ 2255730 693512 489514 435304 647494 1534101 2000424 906575 -729112 -1038780
10964a038780J007987R05793M63298Q59596J219353K42301j641521k853297k303318
$$ -1038780 -30793 875000 1338298 2197894 3417247 3659548 2018027 -835270 -3138588
10955c138588p2116K384003K904465J042852o47952K94987K468914K452317L3452
$$ -3138588 -3210704 -826701 2077764 3120616 2472664 2767651 5236565 7688882 7722334
10946G722334j500182n58475N24359m32735k011349j604082O68035K277674J532766
$$ 7722334 6222152 5663677 6188036 5755301 3743952 2139870 2807905 5085579 6618345
10937F618345p70190k420976j961928j75165P08699j77602j086280k83410J147208
$$ 6618345 5848155 3427179 1465251 1290086 1998785 1821183 734903 451493 1598701
10928A598701R15542q82630j950171j196602J36948O55642K60323n14491j031638
$$ 1598701 2514243 1631613 -318558 -1515160 -1378212 -722570 -462247 -976738 -2008376
10919b008376o30266N07706J152184Q90426J031128K168252K495865O31701j618991
$$ -2008376 -2638642 -2130936 -978752 -88326 942802 3111054 5606919 6238620 4619629
10910D619629j879360q60493m72787r3430J669969L048987J247439k316901l360530
$$ 4619629 2740269 1879776 1406989 1313559 2983528 6032515 7279954 4963053 1602523
10901A602523j147569P59702L26610o72883p62709r23191j567462j227635L35259
$$ 1602523 454954 1214656 1541266 868383 105674 -817517 -2384979 -3612614 -3277355
10892c277355J063870N3477q98250m52240L18109K90734N0945K50724N28395P86766
$$ -3277355 -2213485 -2160008 -3058258 -3510498 -3192389 -2901655 -2850710 -2599986 -2071591 -1284825
10882a284825J330200J433556J78890j293696j088322R8332L9259r06000l73484
$$ -1284825 45375 1478931 1657821 364125 -724197 -625865 -586606 -1492606 -1866090
10873a866090J420566J766843L74929j81032M94795j48066k239684k367356K92301
$$ -1866090 -445524 1321319 1696248 1515216 2010011 1861945 -377739 -2745095 -2452794
10864b452794J695375m86827k636271j037939K038397K224685o5964j079436j2713
$$ -2452794 -757419 -1244246 -3880517 -4918456 -2880059 -655374 -721338 -1800774 -1813487
10855a813487N26517n48291j292562k07181J675960K637116K281784J292593L52543
$$ -1813487 -1286970 -1835261 -3127823 -3335004 -1659044 978072 3259856 4552449 4904992
10846D904992l78089j183541k138509k553454j645035L03157K126900K870305
$$ 4904992 4526903 3343362 1204853 -1348601 -2993636 -2690479 -563579 2306726
10838B306726K052731l26170l019128l878178k334103k82565Q30723J817455K876291
$$ 2306726 4359457 4033287 1014159 -2864019 -5198122 -5480687 -4649964 -2832509 43782
10829D3782J830181j730709l647724q62218K888484K330619q57623j178133J034628
$$ 43782 1873963 143254 -3504470 -4366688 -1478204 852415 -5208 -1183341 -148713
10820a48713P64330j700410o94900L879056M616225j299419o470307m407517R47280
$$ -148713 615617 -1084793 -1779693 2099363 6715588 5416169 -1054138 -5461655 -4514375
10811d514375K375027P241j324737n92481j26825j29547N53800Q08507n38734
$$ -4514375 -2139348 -2132107 -3456844 -4049325 -4176150 -4305697 -3751897 -2943390 -3482124
10802c482124j413778m3972R85941r16784k819921n98861L528743L857932K59930
$$ -3482124 -4895902 -4939874 -3953933 -4870717 -7690638 -8289499 -4760756 -902824 -642894
10793f42894j776590L4932J832785M72458j826650j711894L27124J659808J601355
$$ -642894 -2419484 -2384552 -551767 -79309 -1905959 -3617853 -3290729 -1630921 -29566
10784b9566J382024J463056J022521k20681j180523q49534J51442L50775l22283
$$ -29566 1352458 2815514 3838035 3617354 2436831 1587297 1738739 2089514 1767231
10775A767231l48031P28224J147373q6352r90441J67173J305270k63272k583805
$$ 1767231 1419200 2147424 3294797 3208445 2218004 2385177 3690447 3427175 843370
10766H43370j625801J624048K013605j446088l783962k089486L05558J89170l14313
$$ 843370 -782431 841617 2855222 1409134 -2374828 -4464314 -4158756 -3969586 -4283899
10757d283899J543738L718969K904019J35445j295411j055395j070714j548180
$$ -4283899 -2740161 978808 3882827 4018272 2722861 1667466 596752 -951428
10749i51428j169322J31564J406120K476302L295252K930531J050024j017599
$$ -951428 -2120750 -1989186 -583066 1893236 5188488 8119019 9169043 8151444
10741H151444k134660k640757k802122k041366o08280K24514K79631L87405J36079
$$ 8151444 6016784 3376027 573905 -1467461 -2075741 -1851227 -1571596 -1184191 -1048112
10732a048112j173369j622996J063966M407373L477318j080349l127228n09285
$$ -1048112 -2221481 -3844477 -2780511 1626862 5104180 4023831 896603 387318
10724C87318J786135K06270k071823j683172o61505j351529j520883O85504K103932
$$ 387318 2173453 2379723 307900 -1375272 -2036777 -3388306 -4909189 -4223685 -2119753
10715b119753j590k431566j242422J625120K124190P63733L06500L28247o77548
$$ -2119753 -2121343 -4552909 -5795331 -4170211 -2046021 -1282288 -975788 -647541 -1325089
10706a325089j010151J124868L112361J722952j235138k037513j159999j237198
$$ -1325089 -2335240 -1210372 1901989 3624941 2389803 352290 -807709 -2044907
10698b044907j511452L03072K652445K021850j071825k720458j391642Q62124
$$ -2044907 -3556359 -3253287 -600842 1421008 349183 -2371275 -3762917 -2900793
10690b900793K019490J698294L49186o23482L31110K044336J245218k142077l965177
$$ -2900793 -881303 816991 1166177 542695 873805 2918141 4163359 2021282 -1943895
10681a943895k218951o8503J4752N7498J403648J404792p12607o36064L429784
$$ -1943895 -4162846 -4231349 -4216597 -4159099 -2755451 -1350659 -2063266 -2699330 730454
10672G30454N905239K422964k444473k623817k43618n13699j960925j52307K849879
$$ 730454 6635693 9058657 6614184 3990367 3746749 3233050 1272125 1119818 3969697
10663C969697J661561k454357l405985l63421J926162J615309J100401R86056
$$ 3969697 5631258 3176901 -229084 -592505 1333657 2948966 4049367 5035423
10655E035423k58383j550249o03832J029205M09708r81931r1165J213809p13169
$$ 5035423 4777040 3226791 2622959 3652164 4061872 3079941 2988776 4202585 3489416
10646C489416l771112l077315K86066J131598n88635l06107K231961K612215J98286
$$ 3489416 -281696 -3359011 -3072945 -1941347 -2529982 -2836089 -604128 2008087 2206373
10637B206373r39615R1998j80375k123946j818257J236368K321545m70751k735089
$$ 2206373 1266758 1358756 1178381 -945565 -2763822 -1527454 794091 323340 -2411749
10628b411749q98930K403224K921106P19959j077924p47657P22123J200873l16808
$$ -2411749 -3310679 -907455 2013651 2733610 1655686 908029 1630152 2831025 2514217
10619B514217k177242j798085K83468O72570j255845j856004M25535J917376K77592
$$ 2514217 336975 -1461110 -1177642 -505072 -1760917 -3616921 -3191386 -1274010 -996418
10610i96418r89235J047253L045444J356988j408150j559829r96793k449349l224338
$$ -996418 -1985653 -938400 2107044 3464032 2055882 496053 -500740 -2950089 -6174427
10601f174427n70883J823332J13590j983012L26356L761680K872847J37884Q75245
$$ -6174427 -6745310 -4921978 -4808388 -6791400 -6465044 -2703364 169483 307367 1182612
10592A182612K755883M63488l306454k182982J923454K116033r93933j156878
$$ 1182612 3938495 4401983 1095529 -1087453 836001 2952034 1958101 801223
10584H01223J367843Q09852k452473k449778R12764J777991n85841j016876J313407
$$ 801223 2169066 2978918 526445 -1923333 -1010569 767422 181581 -835295 478112
10575D78112J886443Q9833q5134J359826L22079k918364l801821j806899n13823
$$ 478112 2364555 2454388 2369254 3729080 4051159 1132795 -2669026 -4475925 -4989748
10566d989748l15269R37928J721908n35605k851447j024010K260920K121264N66603
$$ -4989748 -5305017 -4367089 -2645181 -3180786 -6032233 -7056243 -4795323 -2674059 -2107456
10557b107456J857332L242331L22960l076211j192322K380865J021217k444059
$$ -2107456 -250124 2992207 3315167 238956 -953366 1427499 2448716 4657
10549D657j521481J211463j94048k518822K8557L021746j3468l521784L76440
$$ 4657 -1516824 -305361 -499409 -3018231 -2989674 32072 18604 -3503180 -3126740
10540c126740N426059J684829n000948k884656L518159J774786m635369l049706
$$ -3126740 2299319 3984148 -1016800 -3901456 -383297 1391489 -3243880 -6293586
10532f293586L721776K979480k823155j294816M377423J253614o221091k770546
$$ -6293586 -2571810 407670 -2415485 -3710301 667122 1920736 -4300355 -7070901
10524g070901P305290N852037n096515o135324L400998M755226m052616n196899
$$ -7070901 234389 6086426 989911 -5145413 -1744415 3010811 -1041805 -6238704
10516f238704L445544M526635l476241k903943O730392O042023n420732o348550
$$ -6238704 -2793160 1733475 -1742766 -4646709 2083683 8125706 2704974 -3643576
10508c643576M608691N222815n896812n328186P443908O343988q445253o782398
$$ -3643576 965115 6187930 291118 -5037068 2406840 8750828 305575 -6476823
10500f476823J1211841J0035667j1568652j1980540J2546177J3603582j4965253
$$ -6476823 4735018 14770685 3202033 -8778507 3767670 17371252 2405999
10493B405999j4583365K4690640K7550027k3926733j9347638J02375697K01122874
$$ 2405999 -12177366 12513274 40063301 16136568 -3211070 99164627 300287501
10486C00287501J08854315j03674903k00602804j05494750J6686923K2960820
$$ 300287501 409141816 305466913 104864109 -630641 16056282 39017102
10480C9017102k8347701k5139972J6451760J8461359j2243130j4652439J0120392
$$ 39017102 10669401 -14470571 1981189 20442548 8199418 -6453021 3667371
10473C667371J3513105o255741j0387002L697373N156212o935314o498974N422007
$$ 3667371 17180476 10924735 537733 4235106 9391318 2456004 -4042970 1379037
10465A379037N012356n823192m875004N472493M093245o427129n499278M796682
$$ 1379037 6391393 568201 -4306803 1165690 5258935 -1168194 -6667472 -1870790
10457a870790M654427m508205m037783M793433M065666n056575m898001L966149
$$ -1870790 2783637 -1724568 -5762351 -968918 3096748 -1959827 -6857828 -2891679
10449b891679M169457m524455m981676M550738P863267J094410k677607L67274
$$ -2891679 1277778 -3246677 -8228353 -3677615 4185652 5280062 2602455 2969729
10441B969729N36071l022645j027309M503998J950322o380890o199031K696307
$$ 2969729 3505800 483155 -544154 3959844 5910166 -470724 -6669755 -3973448
10433c973448N592144q30964m162595J2607K090219j322637j996939K134993L198717
$$ -3973448 1618696 787732 -3374863 -3362256 -1272037 -2594674 -4591613 -2456620 742097
10424G42097P0616M61134M259806K903043k917838l105837K518539L046799l161780
$$ 742097 812713 1273847 5533653 8436696 5518858 2413021 4931560 7978359 4816579
10415D816579n234261J67495L419051J85244k037250L31283J034463j951301k077724
$$ 4816579 -417682 -250187 3168864 3354108 1316858 1648141 2682604 731303 -1346421
10406a346421J794271K137972k369432l422020J375702L999043J115958o31768
$$ -1346421 447850 2585822 216390 -3205630 -1829928 2169115 3285073 2653305
10398B653305J381685R21512l374753l801146J612810M085137l06833l500769
$$ 2653305 4034990 4956502 1581749 -2219397 -606587 3478550 3171717 -329052
10390c29052k79032K792884L04758k323168J71964L142579J212343k203683k052315
$$ -329052 -608084 2184800 2489558 166390 338354 3480933 4693276 2489593 437278
10381D37278r4838L88474P33299J997626J320678j772181k741542j27056J259624
$$ 437278 342440 730914 1464213 3461839 4782517 3010336 268794 141738 1401362
10372A401362p91975j855330K64959J079015j628609k824041O11692L686376J839913
$$ 1401362 609387 -1245943 -980984 98031 -1530578 -4354619 -3742927 -56551 1783362
10363A783362j510719j587535O7442J8489p05297J38051J326078J159652O92250
$$ 1783362 272643 -1314892 -1247450 -1228961 -1934258 -1796207 -470129 689523 1381773
10354A381773O30980m29086k165721j920789Q0773L91934j155507p63615J926202
$$ 1381773 2012753 1583667 -582054 -2502843 -2422070 -2030136 -3185643 -3949258 -2023056
10345b023056K535179j9275j321524M01043J207524p92020j872437J3493J391514
$$ -2023056 512123 492848 -828676 -427633 779891 -12129 -1884566 -1871073 -479559
10336d79559j2755j381333p66817l87395j028579J35517L179160L707637N26512
$$ -479559 -492314 -1873647 -2640464 -3027859 -4056438 -3920921 -741761 2965876 3492388
10327C492388j799096r77805n00079k129895k345503L36337J997583Q82637O75463
$$ 3492388 1693292 715487 215408 -1914487 -4259990 -3923653 -1926070 -1043433 -367970
10318c67970K461961J568819l095551m931468m12849M043456K312829j745724
$$ -367970 2093991 3662810 567259 -4364209 -4777058 -733602 1579227 -166497
10310a66497j782844O05052M75748j179119n66041J071457K62739j674491j288704
$$ -166497 -1949341 -1344289 -868541 -2047660 -2613701 -1542244 -1279505 -2953996 -4242700
10301d242700N01153P57956K82396J188433J855349K7068k049550j188606R08723
$$ -4242700 -3741547 -2983591 -2701195 -1512762 342587 369655 -1679895 -2868501 -1959778
10292a959778Q59329k39498N47704J827458J88031l238994m091236j425936J704684
$$ -1959778 -1100449 -1339947 -792243 1035215 1223246 -2015748 -6106984 -7532920 -5828236
10283e828236L189396L217062J975274j78309j439191p09035L29426j01075j074090
$$ -5828236 -2638840 578222 2553496 2375187 935996 226961 556387 455312 -618778
10274f18778j203052j068321j013704K67659K316455J859584j650241l553313
$$ -618778 -1821830 -2890151 -3903855 -3636196 -1319741 539843 -1110398 -4663711
10266d663711q92516K377771J682119p30019r9792K539565K568792j17794j564146
$$ -4663711 -5556227 -3178456 -1496337 -2226356 -2326148 213417 2782209 2664415 1100269
10257A100269q92489q29970j688547p31200K104571L133189O84138k326464k933887
$$ 1100269 207780 -622190 -2310737 -3041937 -937366 2195823 2879961 553497 -2380390
10248b380390j818832j039977p74405L2166J355281J886589P85335r32221j136538
$$ -2380390 -4199222 -5239199 -6013604 -5981438 -4626157 -2739568 -1954233 -2886454 -4022992
10239d022992P77114K638467K333419J089092J398056K291605M77080l492628
$$ -4022992 -3245878 -607411 1726008 2815100 4213156 6504761 6981841 3489213
10231C489213m677911j021602L075686K934309k77844k353490j836912j90218
$$ 3489213 -1188698 -2210300 865386 3799695 3521851 1168361 -668551 -858769
10223h58769J182769J525750N96115k62925N90100J730927J24330l152860l410060
$$ -858769 324000 1849750 2445865 2182940 2773040 4503967 4628297 1475437 -1934623
10214a934623j22624J472012q35845k129385R13328L562337R83201k962894j835904
$$ -1934623 -2057247 -585235 -1421080 -3550465 -2637137 925200 1908401 -1054493 -2890397
10205b890397K740420M090011J215446j038057p31744m25975r15499k37487J237360
$$ -2890397 -149977 3940034 5155480 4117423 3385679 2959704 2044205 1806718 3044078
10196C044078R00116q49681j086891m1154p23855k839242k744914N0972J883564
$$ 3044078 3944194 3094513 2007622 1966468 1242613 -1596629 -4341543 -4290571 -2407007
10187b407007J207930N54646J187490J047771n48867j164041P2185O92601l20448
$$ -2407007 -1199077 -644431 543059 1590830 1041963 -122078 -49893 642708 322260
10178C22260n51578R29373J244389j025164k603447q64491J480689R43640p94484
$$ 322260 -229318 700055 1944444 919280 -1684167 -2548658 -1067969 -124329 -918813
10169i18813n9090K074287J371303k170480l710383r60085K354830K229948p3361
$$ -918813 -977903 1096384 2467687 297207 -3413176 -4373261 -2018431 211517 138156
10160A38156q97971N8269K65301q08038j163726m15296o58013k174681j911252
$$ 138156 -759815 -701546 -436245 -1244283 -2408009 -2823305 -3481318 -5655999 -7567251
10151g567251J517588M436051L034895o05163j463493Q20689J862772k49607k380284
$$ -7567251 -6049663 -1613612 1421283 816120 -647373 173316 2036088 1786481 -593803
10142e93803j800107J73500J505182K387221K883769J406146j944619l832372
$$ -593803 -2393910 -2220410 -715228 1671993 4555762 5961908 4017289 184917
10134A84917k311361j20291l83692j670625p21040J998282L131150J620871l06682
$$ 184917 -2126444 -2246735 -2630427 -4301052 -5022092 -3023810 107340 1728211 1421529
10125A421529q15071l37054K3466j26477n62034n89026L91519J642004J559780
$$ 1421529 606458 269404 292870 166393 -395641 -984667 -593148 1048856 2608636
10116B608636J47832o56986k0056M82656k73575j097277q99737n82161q67448
$$ 2608636 2756468 2099482 2079426 2562082 2288507 1191230 291493 -290668 -1158116
10107a158116o83355M98906J172906M85004j60952j0639m99170j798222j278533
$$ -1158116 -1841471 -1342565 -169659 315345 154393 143754 -355416 -2153638 -3432171
10098c432171J733947L181181j0176m433989m670673r22613K163030K461664J743983
$$ -3432171 -1698224 1482957 1472781 -2961208 -7631881 -8554494 -6391464 -3929800 -2185817
10089b185817J400080J109292J026710J507112J352660l07528j491315j91356
$$ -2185817 -785737 323555 1350265 2857377 4210037 3902509 2411194 2219838
10081B219838J615035O83692j983786k635107r18231L7315o42411m94263J206440
$$ 2219838 3834873 4518565 2534779 -100328 -1018559 -981244 -1623655 -2117918 -911478
10072i11478J834565P6679j688942j275414J75951O00621Q0695r6495L24048N90870
$$ -911478 923087 999766 -689176 -1964590 -1788639 -1188018 -1107323 -1203818 -879770 -288900
10062b88900J35433q87730j500822n80644J413236K223293O90079j236065j165755
$$ -288900 -153467 -1041197 -2542019 -3122663 -1709427 513866 1203945 -32120 -1197875
10053a197875K51236P11034j3397l05192J11383q1032j140330j707035q44519
$$ -1197875 -946639 -235605 -249002 -554194 -442811 -523843 -1664173 -3371208 -4215727
10044d215727J054649K966319L516168J677239j368203k655736j370639k69671
$$ -4215727 -3161078 -194759 3321409 4998648 3630445 974709 -395930 -665601
10036f65601j187506j811319J93939K655636K334588M79943M13568J432694K29246
$$ -665601 -1853107 -3664426 -3470487 -814851 1519737 1999680 2413248 3845942 4075188
10027D075188k653387l161069m92457J551677O84387r10699q21265L27746J095904
$$ 4075188 1421801 -1739268 -2231725 -680048 4339 -906360 -1727625 -1399879 -303975
10018c03975J367297J112563j05166j488836j465430l24495J39951j68391M17947
$$ -303975 1063322 2175885 2070719 581883 -883547 -1208042 -1068091 -1236482 -818535
10009h18535J949376K306625N81314j490623j971317o13918J586091K821683J222706
$$ -818535 1130841 3437466 4018780 2528157 556840 -57078 1529013 4350696 5573402
10000E573402k559536m672970k658860P08215J339190j38531k49288J081515J052690
$$ 5573402 3013866 -1659104 -4317964 -3609749 -2270559 -2409090 -2658378 -1576863 -524173
9991e24173k50708o8058J288512N55070k085257k442260M98643K389170O87961
$$ -524173 -774881 -842939 445573 1000643 -1084614 -3526874 -3028231 -639061 48900
9982D8900j137794L76380K830901J919784j675538l260073p66417K628495K637041
$$ 48900 -1088894 -712514 2118387 4038171 2362633 -897440 -1663857 964638 3601679
9973C601679q50193l343479j172573L071473L069497k203398n822877k432926
$$ 3601679 2751486 -591993 -1764566 1306907 4376404 2173006 -3649871 -6082797
9965f082797L563968M456449N53974j574220l0135Q87703n86446j318706k71415
$$ -6082797 -2518829 1937620 2491594 917374 887239 1774942 1188496 -130210 -401625
9956d01625l36647j859558j538207O29511N87804j710956j153504L045249M655544
$$ -401625 -738272 -2597830 -4136037 -3506526 -2918722 -4629678 -5783182 -2737933 1917611
9947A917611Q27379k692111j329617Q72076q18479l396687k172655O62464N62440
$$ 1917611 2744990 52879 -1276738 -404662 -1223141 -4619828 -6792483 -6130019 -5567579
9938e567579j074832k20286K047142K010079L40878Q9700M51971j061874k759889
$$ -5567579 -6642411 -6862697 -4815555 -2805476 -2464598 -2374898 -1922927 -2984801 -5744690
9929e744690j457644J115993R50801r67184l82128K441536K999587K64023j678163
$$ -5744690 -7202334 -6086341 -5135540 -6102724 -6484852 -4043316 -1043729 -779706 -2457869
9920b457869p2823L115364M660690L258642n39735m384323m958119j798618J097853
$$ -2457869 -2530692 584672 5245362 8504004 7964269 3579946 -1378173 -3176791 -2078938
9911b078938M85567j435020r81129R41506J046955l68349n08139N80558N33272
$$ -2078938 -1593371 -3028391 -4009520 -3068014 -2021059 -2389408 -2897547 -2316989 -1783717
9902a783717p00115j104291l39485N09919J332319J787530J97117k877055l362626
$$ -1783717 -2483832 -3588123 -3927608 -3417689 -2085370 -297840 -100723 -2977778 -6340404
9893f340404n6224J939444q77315l922598k101274J415781J460432J68040Q00472
$$ -6340404 -6396628 -4457184 -5334499 -9257097 -11358371 -9942590 -8482158 -8314118 -7513646
9884g513646j279152q904633j0199460P353014L1498204L3801343Q295527j7279611
$$ -7513646 -8792798 -17697431 -27896891 -20543877 10954327 44755670 53051197 35771586
9876C5771586j8070475l103464L371082k813261o711566j917919K202029n88509
$$ 35771586 17701111 14597647 17968729 15155468 8443902 6525983 8728012 8139503
9868H139503m088787k243533J554245K208812Q67552O52783J032867K93107j135107
$$ 8139503 4050716 1807183 3361428 5570240 6437792 7090575 8123442 8416549 7281442
9859G281442k439783l551397l135466K58583M105555L780764k54886k243149J58221
$$ 7281442 4841659 1290262 -1845204 -1586621 2518934 6299698 6044812 3801663 3959884
9850C959884K272946K45121k672851j775902J238286J225781j915475l102042
$$ 3959884 6232830 6477951 3805100 2029198 3267484 4493265 2577790 -524252
9842e24252q950L554787L320445J43924k012952j543430l51567l28592q35409
$$ -524252 -533202 3021585 6342030 6485954 4473002 2929572 2578005 2249413 1414004
9833A414004k71526J138478J434305k59624k103579j546494J349269L524889K315635
$$ 1414004 1142478 2280956 3715261 3455637 1352058 -194436 1154833 4679722 6995357
9824F995357j267636l480806k206644N54508J408884J1860r32601n016R87808
$$ 6995357 5727721 2246915 40271 594779 2003663 2015523 1082922 1077906 2065714
9815B065714M20230k93570N89715J683675P99709p62975n4356K083257J710916
$$ 2065714 2485944 2192374 2782089 4465764 5265473 4502498 4448142 6531399 8242315
9806H242315j754856m221787l293086j576277j508992j159092J532535L921060
$$ 8242315 6487459 2265672 -1027414 -2603691 -4112683 -5271775 -3739240 181820
9798A81820K349376j597623k967351n11246K124153J928564k76413k269274k964112
$$ 181820 2531196 933573 -2033778 -2545024 -420871 1507693 1231280 -1037994 -4002106
9789d002106k049092L10666K626280K827558O51342j794444k185987j09491K629506
$$ -4002106 -6051198 -5740532 -3114252 -286694 364648 -1429796 -3615783 -3725274 -1095768
9780a095768L337440R94722j995233k114567N58308K146015N94758j364268q66974
$$ -1095768 2241672 3236394 1241161 -873406 -315098 1830917 2425675 1061407 194433
9771A94433O46244O81843K71387J217837J517094j326371m386369k717777K176549
$$ 194433 840677 1522520 1793907 3011744 4528838 3202467 -1183902 -3901679 -1725130
9762a725130L718324M26884j890106K82112K884147J576922j468386k148279j073061
$$ -1725130 1993194 2420078 529972 812084 3696231 5273153 3804767 1656488 583427
9753E83427r98732j311754p566J508096N38172j734879j823589M27637J983190
$$ 583427 -415305 -1727059 -1734625 -226529 311643 -1423236 -3246825 -2819188 -835998
9744h35998J595557P33300J68274n86579r21814O1061Q03409p84981k938730j861078
$$ -835998 759559 1492859 1661133 1074554 152740 213801 1017210 232229 -2706501 -4567579
9734d567579J804900K964457k52305l345784k192085J141341K384570J462170
$$ -4567579 -2762679 201778 -50527 -3396311 -5588396 -4447055 -2062485 -600315
9726f00315J059598J237989m8590k117384j802977J042834K336494l11734l579288
$$ -600315 459283 1697272 1648682 -468702 -2271679 -1228845 1107649 795915 -2783373
9717b783373k856133J251940L835420K473560O8148J12357J699958J367402j423517
$$ -2783373 -5639506 -4387566 -552146 1921414 1989562 2101919 3801877 5169279 3745762
9708C745762l383009k131611O05883J737239R13008J24919L45944O69504M16654
$$ 3745762 362753 -1768858 -1162975 574264 1487272 1612191 1958135 2627639 3044293
9699C044293R1017N0767j06729m72762n61585m46315p35013j075420l15252J260907
$$ 3044293 3135310 3186077 3079348 2606586 2045001 1598686 863673 -211747 -526999 733908
9689G33908J667029K29064r56843j86219Q66320l95462l088157l680347j111771
$$ 733908 2400937 2630001 1673158 1486939 2353259 1957797 -1130360 -4810707 -5922478
9680e922478J686372K078788R82818M56142L00476p03842j724555q59642J313290
$$ -5922478 -4236106 -2157318 -1174500 -718358 -417882 -1121724 -2846279 -3705921 -2392631
9671b392631K041628O16731m38220N06147J434364J0590k427385k899520j503280
$$ -2392631 -351003 265728 -172492 333655 1768019 1778609 -648776 -3548296 -5051576
9662e051576r42012j768878j498779R51301L139702K829900J146815J99283p2663
$$ -5051576 -5993588 -7762466 -9261245 -8309944 -5170242 -2340342 -1193527 -994244 -1066907
9653a066907n10098l46715J127545K194418R63969j190559j527023l39537j37530
$$ -1066907 -1577005 -1923720 -796175 1398243 2362212 1171653 -355370 -694907 -832437
9644h32437j046835q05248O51027O50085j373501k516852j339969j84574m46986
$$ -832437 -1879272 -2684520 -2033493 -1383408 -2756909 -5273761 -6613730 -6798304 -7245290
9635g245290M23319L961644O334919L414472k192857m209163j658876M05477p68290
$$ -7245290 -6821971 -2860327 3474592 6889064 4696207 487044 -1171832 -766355 -1534645
9626a534645j826039M68701L699893L593304M34467j828411j472161o26761j208556
$$ -1534645 -3360684 -2891983 807910 4401214 4835681 3007270 1535109 908348 -300208
9617c00208k123637j478070L36895J356498J096943J193254K601267L594410J990733
$$ -300208 -2423845 -3901915 -3565020 -2208522 -1111579 81675 2682942 6277352 8268085
9608H268085j272782k848040j567180r0346p73904k140872j663226j73252l33251
$$ 8268085 6995303 4147263 2580083 2489737 1715833 -425039 -2088265 -2261517 -2594768
9599b594768j734738j261713J600041L600301K828186J363627J133049N99092
$$ -2594768 -4329506 -5591219 -3991178 -390877 2437309 3800936 4933985 5533077
9591E533077j772768l733899k478536L82489J037181m39197m23363J927099K996935
$$ 5533077 3760309 26410 -2452126 -2069637 -1032456 -1471653 -1895016 32083 3029018
9582C029018N48774k561009k708730o32701N54791M32893J056908K571805K446706
$$ 3029018 3577792 1016783 -1691947 -2324648 -1769857 -1336964 -280056 2291749 4738455
9573D738455m02471l381713l406461o97213J934797K547392J499851N8690j030185
$$ 4738455 4335984 954271 -2452190 -3149403 -1214606 1332786 2832637 2891327 1861142
9564A861142j552486j456382q93084j87726M63872J031317J356809J148468L76222
$$ 1861142 308656 -1147726 -2040810 -2228536 -1764664 -733347 623462 1771930 2148152
9555B148152n20828q88824k77298J178601K556084K626117J067395q83158j555277
$$ 2148152 1627324 738500 461202 1639803 4195887 6822004 7889399 7006241 5450964
9546E450964o92943L24892K24041p27432j270155p26165L02091O21420l05310
$$ 5450964 4758021 5082913 5306954 4579522 3309367 2583202 2885293 3506713 3201403
9537C201403j688675k102874j064813M04985J204895J537919J995113J912147
$$ 3201403 1512728 -590146 -1654959 -1249974 -45079 1492840 3487953 5400100
9529E400100K36914k104402k645044p25487J371993J499706K02555q11683j019263
$$ 5400100 5637014 3532612 887568 162081 1534074 3033780 3236335 2424652 1405389
9520A405389n91507O15792J851670J068955k005316m048857k206119J321699K032970
$$ 1405389 813882 1429674 3281344 4350299 2344983 -1703874 -3909993 -2588294 -555324
9511e55324l65462j932680p43804R38164J306856J526544K099022J008411j910378
$$ -555324 -920786 -2853466 -3597270 -2659106 -1352250 174294 2273316 3281727 1371349
9502A371349k675895J046902M922070L290004k300231m890025j926291J738933
$$ 1371349 -1304546 -257644 4664426 7954430 5654199 764174 -1162117 576816
9494E76816J535690p80097j102168N74790J087550m05263j472348p01779J25618
$$ 576816 2112506 1332409 230241 805031 1892581 1487318 14970 -686809 -561191
9485e61191q45891k391394j992825J76297J243300p9974j311877J36395K646981
$$ -561191 -1407082 -3798476 -5791301 -5615004 -4371704 -4451678 -5763555 -5627160 -2980179
9476b980179K410566o56626k262230K2152L047276K833647L73732n50454M64174
$$ -2980179 -569613 -1226239 -3488469 -3466317 -419041 2414606 2788338 2237884 2702058
9467B702058M59061j312023k083461n46372P93501o2397j187988q1763J968081
$$ 2702058 3161119 1849096 -234365 -780737 12764 -49633 -1237621 -1319384 648697
9458F48697J741147j003103l173459k492229N6722J863654J427964l97005j138447
$$ 648697 2389844 1386741 -1786718 -4278947 -4222225 -2358571 -930607 -1327612 -2466059
9449b466059O62097L059252K476915j174602l378714j088320K313046J509825
$$ -2466059 -1803962 1255290 3732205 2557603 -821111 -1909431 403615 1913440
9441A913440k728274m387678j013665K949462L026125O58930l39541K43490K14506
$$ 1913440 -814834 -5202512 -6216177 -3266715 -240590 418340 78799 322289 536795
9432E36795l18298L60228J358255k7826l259785m256391j185230K679792L440641
$$ 536795 218497 578725 1936980 1909154 -1350631 -5607022 -6792252 -4112460 -671819
9423f71819J367960n38938p60014j03021K69666p9670q78341j114340n9977R76453
$$ -671819 696141 157203 -602811 -705832 -436166 -515836 -1394177 -2508517 -2568494 -1592041
9413a592041k37973k961431l223450M80723L881790K568196j232274j829589J204885
$$ -1592041 -1830014 -4791445 -8014895 -7534172 -3652382 -1084186 -2316460 -4146049 -2941164
9404b941164K721038N86048j087399O67385K390905J29355l492289l154934O99150
$$ -2941164 -220126 365922 -721477 -54092 2336813 2466168 -1026121 -4181055 -3481905
9395c481905K749421J178591k57988R60289K245812P15087k047674k671958q25225
$$ -3481905 -732484 446107 188119 1148408 3394220 4109307 2061633 -610325 -1435550
9386a435550J238883K190713K307144J813008O41935p55885j796040k315209j908189
$$ -1435550 -196667 1994046 4301190 6114198 6756133 6000248 4204208 1888999 -19190
9377a9190p281K341372K507770k66855l040913k806113n09667Q51290P61069R41027
$$ -19190 -26471 2314901 4822671 4555816 1514903 -1291210 -1800877 -949587 -188518 752509
9367G52509J568463J129158j63162k46027J041442J350717j75856j445986j151979
$$ 752509 2320972 3450130 3286968 3040941 4082383 5433100 5257244 3811258 2659279
9358B659279q17780j467533j369028O15191K230296J181741j014891j534651o00297
$$ 2659279 1841499 373966 -995062 -379871 1850425 3032166 2017275 482624 -117673
9349a17673j35676Q2246J216562J783088m34919l539742l137312Q86459L556247
$$ -117673 -253349 -171103 1045459 2828547 2393628 -1146114 -4283426 -3396967 159280
9340A59280J833605j498031k515513j130839N85378J870527K664303K039340k75241
$$ 159280 1992885 494854 -2020659 -3151498 -2566120 -695593 1968710 4008050 3732809
9331C732809k515947k979792k005044n58389J184014K554917K058609o8324j315321
$$ 3732809 1216862 -1762930 -3767974 -4326363 -3142349 -587432 1471177 1402853 87532
9322H7532n80597J41012n14292q47689L82038J225663J89268o07333O49690J608331
$$ 87532 -493065 -352053 -866345 -1714034 -1331996 -106333 82935 -524398 125292 1733623
9312A733623n3145j680723O1775K615244J216462k595686k798653J317241L914252
$$ 1733623 1680478 -245 61530 2676774 3893236 1297550 -1501103 -183862 3730390
9303C730390J802053j549265k617933k396971k300215j188766Q95732J195389
$$ 3730390 5532443 3983178 1365245 -1031726 -3331941 -4520707 -3624975 -2429586
9295b429586p10626j162540J294877K765141N95473j692050k54268K631381K719912
$$ -2429586 -3140212 -4302752 -3007875 -242734 352739 -1339311 -1593579 1037802 3757714
9286C757714O67406l19286n13945j928804l055191j057714K356966K823838K45207
$$ 3757714 4425120 4105834 3591889 1663085 -1392106 -2449820 -92854 2730984 2976191
9277B976191j312383k23238J036375P64055P3913j47461l41964k29746O73379
$$ 2976191 1663808 1440570 2476945 3241000 3314913 3167452 2825488 2595742 3269121
9268C269121P82610j446395l676371k398563Q71306J179168j822406k933607K60058
$$ 3269121 4051731 2605336 -1071035 -3469598 -2598292 -1419124 -3241530 -6175137 -5915079
9259e915079L659694L499545J714488J324980J130181r43780k902840j717104
$$ -5915079 -2255385 1244160 2958648 4283628 5413809 4470029 1567189 -149915
9251a49915J147474J783387m4899j108018k11330O31825M30723O92468J870250
$$ -149915 997559 2780946 2736047 1628029 1416699 2048524 2479247 3171715 5041965
9242E041965J777732p47222l121012k248563Q76097K216195R3419k687273k859634
$$ 5041965 6819697 6072475 2951463 702900 1578997 3795192 3888611 1201338 -1658296
9233a658296r57534K07390J04713P72797K548427K725552j8994k725649k222736
$$ -1658296 -2615830 -2408440 -2303727 -1530930 1017497 3743049 3724055 998406 -1224330
9224a224330J78293J224617J051612J960666L092043J227906k910849m234226
$$ -1224330 -1046037 178580 1230192 3190858 6282901 7510807 4599958 365732
9216C65732p78865K815184J903001j702960k998141p85095J979150L016229K555224
$$ 365732 -413133 2402051 4305052 2602092 -396049 -1181144 798006 3814235 6369459
9207F369459J268071o00484k155826k155753o95334O33581L49176j602983l618543
$$ 6369459 7637530 7037046 4881220 2725467 2030133 2663714 3012890 1409907 -2208636
9198b208636l413654l90711K909959L389171J487124M39853J220353J288161o59509
$$ -2208636 -5622290 -6013001 -3103042 286129 1773253 2213106 3433459 4721620 4062111
9189D062111k193433j367347p5436m84969j160616r9629J022863l32661k470403
$$ 4062111 1868678 501331 425895 -59074 -1219690 -1319319 -296456 -629117 -3099520
9180c099520j685717J373045K170219p58168l489338k405324J094590L056743
$$ -3099520 -4785237 -3412192 -1241973 -2000141 -5489479 -7894803 -6800213 -3743470
9172c743470J902751m87917j333666K14259K157763J768707p94332k251583q25753
$$ -3743470 -1840719 -2328636 -3662302 -3448043 -1290280 478427 -315905 -2567488 -3393241
9163c393241Q40178k56354k428696j803030J342668K899077J409310J32J039817
$$ -3393241 -2553063 -2809417 -5238113 -7041143 -5698475 -2799398 -1390088 -1389956 -350139
9154c50139K728096K517260P25345j039979k429146l472828l282510j451347P59087
$$ -350139 2377957 4895217 5620562 4580583 2151437 -1321391 -4603901 -6055248 -5296161
9145e296161J975792K141909J607972M34363p09734p96865k83964p01857j744276
$$ -5296161 -3320369 -1178460 429512 863875 154141 -642724 -926688 -1628545 -3372821
9136c372821j163310J393185K992536J464367j408302k569395j593550k1607J308304
$$ -3372821 -4536131 -3142946 -150410 1313957 -94345 -2663740 -4257290 -4278897 -2970593
9127b970593K074926J253147j363536l393769k162466J493324L793131K513571
$$ -2970593 -895667 357480 -1006056 -4399825 -6562291 -5068967 -1275836 1237735
9119A237735o21412k307054j301826P20923J441730N13676m53167m31701k71455
$$ 1237735 616323 -1690731 -2992557 -2271634 -829904 -316228 -769395 -1201096 -1472551
9110a472551n73327N6905K444063L985981J761434k191012k927404j84722R33411
$$ -1472551 -2045878 -1988973 455090 4441071 6202505 4011493 1084089 899367 1832778
9101A832778j712633l541180q87332K543887J572292j903199k035139J516872
$$ 1832778 120145 -3421035 -4308367 -1764480 -192188 -2095387 -4130526 -2613654
9093b613654L427991J375635j052859q58782K08067j89522q86332J67592K068974
$$ -2613654 814337 2189972 1137113 278331 486398 296876 -589456 -421864 1647110
9084A647110K331540N27405j395229j632752k45330J134204R76577k80163n45230
$$ 1647110 3978650 4506055 3110826 1478074 1232744 2366948 3343525 3063362 2518132
9075B518132Q75897J733825Q6818k166597j653677J312727L022043J754319k06298
$$ 2518132 3394029 5127854 5214672 3048075 1394398 2707125 5729168 7483487 7277189
9066G277189m63019M04736N83200l94551j758071k542857k077422q48491n86529
$$ 7277189 6814170 7218906 7802106 7407555 5649484 3106627 1029205 180714 -405815
9057d05815j758717j921115Q58523M034154L586437K66451j471223o04129n58848
$$ -405815 -2164532 -4085647 -3227124 807030 4393467 4659918 3188695 2584566 2025718
9048B025718k321141k129639J659784M667424L002726o25286j463009O1939K07256
$$ 2025718 -295423 -2425062 -765278 3902146 6904872 6279586 4816577 4878516 5085772
9039E085772j495552k206511r36066M75228Q43584O43499J06728p15567o91154
$$ 5085772 3590220 1383709 447643 922871 1766455 2409954 2516682 1801115 1109961
9030A109961Q50931K126529J119440j039790j568757j16089J225003J224303L71359
$$ 1109961 1960892 4087421 5206861 4167071 2598314 2482225 3707228 4931531 5302890
9021E302890p77484j739898j488191J1981P25345o49597k118529j211378J052923
$$ 5302890 4525406 2785508 1297317 1309298 2034643 1385046 -733483 -1944861 -891938
9012h91938J890884J057741L06401j34112j118249j706601l24389J925473K506460
$$ -891938 998946 2056687 2363088 2228976 1110727 -595874 -920263 1005210 3511670
9003C511670J297418O551j130381k556227k705361k55643K207244J408988q40948
$$ 3511670 4809088 4815639 3685258 1129031 -1576330 -1831973 375271 1784259 943311
8994I43311k56535K449823K620894j02598j163076O09000R72333j629934k815863
$$ 943311 686776 3136599 5757493 5654895 4491819 5100819 6073152 4443218 1627355
8985A627355q5541K479075J193769j265875j326859p78982k442389l925437j472534
$$ 1627355 1541814 4020889 5214658 3948783 2621924 1842942 -599447 -4524884 -5997418
8976e997418K953967M093282J116492j944787k303165q24664P03653J279565N39173
$$ -5997418 -3043451 1049831 2166323 221536 -2081629 -2906293 -2202640 -923075 -383902
8967c83902n39514j37055J335335J074716j281007k129861J45424J834498J79421
$$ -383902 -923416 -1060471 274864 1349580 68573 -2061288 -1915864 -81366 98055
8958I8055j364128R72008M166419L178612m86287j633623k81839n59865k386850
$$ 98055 -1266073 -294065 3872354 7050966 6564679 4931056 4649217 4089352 1702502
8949A702502j829208Q29070R88162j864443k943786n09920J512405Q93700L59959
$$ 1702502 -126706 702364 1690526 -173917 -3117703 -3627623 -2115218 -1221518 -861559
8940h61559J374317J258346p44437r61457J707088K437379j546848n228326l227711
$$ -861559 512758 1771104 1026667 65210 1772298 4209677 2662829 -2565497 -5793208
8931e793208J577291K643767l16865j967765k4619K274475J871748l91907j946759
$$ -5793208 -4215917 -1572150 -1889015 -3856780 -3881399 -1606924 264824 -127083 -2073842
8922b073842j355020R44093K740256J710205j400562k875567j067810R69446K44653
$$ -2073842 -3428862 -2484769 255487 1965692 565130 -2310437 -3378247 -2408801 -2164148
8913b164148j426842o99105J619655K113448L81147j014678j194906j407350j411606
$$ -2164148 -3590990 -4290095 -2670440 -556992 -175845 -1190523 -2385429 -3792779 -5204385
8904e204385K84587K523605K129025p22602j777752J014802L949060K658678j686129
$$ -5204385 -4919798 -2396193 -267168 -989770 -2767522 -1752720 2196340 4855018 3168889
8895C168889m020187k014468J469872K500141P67524p37824l4375J257728N22074
$$ 3168889 -851298 -2865766 -1395894 1104247 1871771 1133947 1099572 2357300 2879374
8886B879374j566674j619540J153224K932604O02875l188663l441205L209K392644
$$ 2879374 1312700 -306840 846384 3778988 4381863 1193200 -2248005 -2244796 147848
8877A47848J048893j362890j483997K23594J404622J510820J242242K81662j757902
$$ 147848 1196741 -166149 -1650146 -1426552 -21930 1488890 2731132 3012794 1254892
8868A254892l258892k146913P72687K337601J137480p90640r18757P04959K167039
$$ 1254892 -2004000 -4150913 -3378226 -1040625 96855 -693785 -1612542 -907583 1259456
8859A259456K190380Q41233j327435l473430m224069k692368Q3567J868073J751562
$$ 1259456 3449836 4291069 2963634 -509796 -4733865 -7426233 -7342666 -5474593 -3723031
8850c723031R36538O49416N74719K03262L32035J609603K546151J117487j864136
$$ -3723031 -2786493 -2137077 -1562358 -1359096 -1027061 582542 3128693 4246180 2382044
8841B382044l217720j657405N19060R12996J84325K01847P23259J54996j222864
$$ 2382044 -835676 -2493081 -1974021 -1061025 -876700 -674853 48406 203402 -1019462
8832a019462j326449K33186J025181o73364k897738k420110N65591K422172J138556
$$ -1019462 -2345911 -2112725 -1087544 -1760908 -4658646 -7078756 -6513165 -4090993 -2952437
8823b952437p76772n5863K371318K808420M38583j713693j785595j449055j846914
$$ -2952437 -3729209 -3785072 -1413754 1394666 1833249 119556 -1666039 -3115094 -4962008
8814d962008r39527K229141M018028J162385l149229l203633N83016K463196M69937
$$ -4962008 -5901535 -3672394 345634 1508019 -1641210 -4844843 -4261827 -1798631 -1328694
8805a328694j209514J29624J700523J035230J71400Q14740M63332k461495m096573
$$ -1328694 -2538208 -2408584 -708061 327169 498569 1313309 1776641 -684854 -4781427
8796d781427q38893L868131M047380J80152k031108n47207J109277N22039n78147
$$ -4781427 -5620320 -1752189 2295191 2475343 444235 -102972 1006305 1528344 950197
8787I50197o57499q74404j789429j634139L45539K022061J618788K51986k75647
$$ 950197 292698 -581706 -2371135 -4005274 -3659735 -1637674 -18886 233100 -42547
8778d2547j1052J74849K18683K59322J4493l53452k42793J6114n37905j504171
$$ -42547 -53599 121250 339933 599255 613748 260296 17503 33617 -504288 -2008459
8768b008459j355190l464R88349J141783J569168K118490Q29595k387565m224566
$$ -2008459 -3363649 -3367113 -2378764 -1236981 332187 2450677 3280272 892707 -3331859
8759c331859k247449J367972K819477J897852J466510K461705K433170l10123
$$ -3331859 -5579308 -4211336 -1391859 505993 1972503 4434208 6867378 6557255
8751F557255l479082l444609j50726K446297J193998k322622l828440j699879
$$ 6557255 3078173 -366436 -517162 1929135 3123133 800511 -3027929 -4727808
8743d727808J423149K517115J737489J022318Q38834K23665q48197j196204m03948
$$ -4727808 -3304659 -787544 949945 1972263 2811097 3034762 2186565 990361 586413
8734E86413M93185L58621r45466k492833k637699l55706K831111L636071J108273
$$ 586413 1079598 1438219 492753 -2000080 -4637779 -4993485 -2162374 1473697 2581970
8725B581970j597959j405737M21946O89828o43705j006708J50782P89647L0225
$$ 2581970 984011 -421726 220 690048 46343 -960365 -809583 -19936 10289
8716A0289q86208j299558j559480r07011J549427L756395K562752r09746j957807
$$ 10289 -875919 -2175477 -3734957 -4641968 -3092541 663854 3226606 2316860 359053
8707C59053O02426K376937K48611k882255k824624l1311K188601K554771J882141
$$ 359053 961479 3338416 3587027 704772 -2119852 -2151163 37438 2592209 4474350
8698D474350N64698j059197j630826o68532N1615p77836j632898o48830J342473
$$ 4474350 5039048 3979851 2349025 1680493 1732108 954272 -678626 -1327456 15017
8689A5017K334897J834239J56749k621212m929535l717806J019548M464698L017698
$$ 15017 2349914 4184153 4340902 1719690 -3209845 -6927651 -5908103 -1443405 1574293
8680A574293m80386j316746q9692n99605k537480j945549J513367L389715J421401
$$ 1574293 1093907 -222839 -312531 -912136 -3449616 -5395165 -3881798 -492083 929318
8671I29318j230772j351381j38125j68292j192610j396916o00849O4207K91605
$$ 929318 -301454 -1652835 -1790960 -1959252 -3151862 -4548778 -5149627 -5085420 -4793815
8662d793815O92855J546293K415980K468804J086632j025056j906557q67185R823
$$ -4793815 -4100960 -2554667 -138687 2330117 3416749 2391693 485136 -382049 -372226
8653c72226j104996k381500q65722K356055L199995Q08514j202936n05953Q84212
$$ -372226 -1477222 -3858722 -4724444 -2368389 831606 1640120 437184 -68769 815443
8644H15443Q17506M59843J239420J661847Q2163j854121j589470L11387J347397
$$ 815443 1632949 2092792 3332212 4994059 5076222 3222101 1632631 1944018 3291415
8635C291415R13330K74080j75062j018648j915380j909636j202083p33929n16538
$$ 3291415 4204745 4478825 4303763 3285115 1369735 -539901 -1741984 -2475913 -2992451
8626b992451K3406P08449J076842J325684J462573P34579o71740r75893L71178
$$ -2992451 -2969045 -2260596 -1183754 141930 1604503 2339082 1667342 691449 1062627
8617A062627J122712j68234j110655P33658K933250J352937k774022l883829m68169
$$ 1062627 2185339 2017105 906450 1640108 4573358 5926295 3152273 -731556 -1199725
8608a199725K516398J092240k333774l337889j533152N46675J625794J777473
$$ -1199725 1316673 2408913 75139 -3262750 -4795902 -4249227 -2623433 -845960
8600h45960P20333j052395j429123K88674J487422J64519j426204l69568J775451
$$ -845960 -125627 -1178022 -2607145 -2318471 -831049 -666530 -2092734 -2462302 -686851
8591f86851J489184o76620j233105J3376l038j438077r37331J783617K397214
$$ -686851 802333 125713 -1107392 -1094016 -1097054 -2535131 -3472462 -1688845 708369
8582G08369p26672k990222p79599K494489J995177p79013j104581R14966J288047
$$ 708369 -18303 -3008525 -3788124 -1293635 701542 -77471 -1182052 -267086 1020961
8573A020961m45876q68013N63127M98518j677270k066303Q06872K619405R1970
$$ 1020961 575085 -292928 270199 768717 -908553 -2974856 -2167984 451421 543391
8564E43391l194971k052523K320177M244807J846287j088861j195980M81043J270199
$$ 543391 -2651580 -4704103 -2383926 1860881 3707168 2618307 1422327 1903370 3173569
8555C173569O16880k27790m22087k27241l10176r08818j320845n10530J162381
$$ 3173569 3790449 3562659 3140572 2913331 2603155 1694337 373492 -137038 1025343
8546A025343J603436l98721k882636k725875K05006K595190J702481j494850l702092
$$ 1025343 2628779 2230058 -652578 -3378453 -3173447 -578257 1124224 -370626 -4072718
8537d072718k910763l1801K488969L133495K421111J711807J312009M93177p66225
$$ -4072718 -6983481 -7015282 -4526313 -1392818 1028293 2740100 4052109 4545286 3779061
8528C779061j414765j152054j113974j815767j935320m67833J379167K071457
$$ 3779061 2364296 1212242 98268 -1717499 -3652819 -4120652 -2741485 -670028
8520f70028K056819K231591J677225m56389k170045j019795J492371J635325o91866
$$ -670028 1386791 3618382 5295607 4839218 2669173 1649378 3141749 4777074 4085208
8511D085208j898841q56274n24163k052377k105617J108825L589039J445968k412794
$$ 4085208 2186367 1330093 805930 -1246447 -3352064 -2243239 1345800 2791768 378974
8502C78974k500890P02969J977938l6545j352703L7523J175287P8017o52184J056122
$$ 378974 -2121916 -1418947 558991 522446 -830257 -792734 382553 460570 -191614 864508
8492H64508K526201Q93439j635459j308352Q91496J040639j138388k167822q28796
$$ 864508 3390709 4284148 2648689 1340337 2231833 3272472 2134084 -33738 -862534
8483h62534L00241j69927k23980J302145J988115k93121l491192m045764j708286
$$ -862534 -562293 -732220 -956200 345945 2334060 2040939 -1450253 -5496017 -7204303
8474g204303Q06155J842487K062659K199115J770503L27552j376583j948153p34257
$$ -7204303 -6398148 -4555661 -2493002 -293887 1476616 1804168 427585 -1520568 -2254825
8465b254825J271003K006813O36670r10506k00263J889454J904958r39540l059722
$$ -2254825 -983822 1022991 1659661 749155 548892 2438346 4343304 3403764 344042
8456C44042j736650P49971Q58145q36082j417396p61643p30961o34759J615238
$$ 344042 -1392608 -642637 215508 -620574 -2037970 -2799613 -3530574 -4165333 -2550095
8447b550095M216444K734101k407566n013250j914183K158930J760187j412383
$$ -2550095 1666349 4400450 1992884 -3020366 -4934549 -2775619 -1015432 -2427815
8439b427815k147852q0378P24562r49449j794292K05789K627958K615575R31112
$$ -2427815 -4575667 -4656045 -3931483 -4880932 -6675224 -6469435 -3841477 -1225902 -294790
8430b94790K28455J122921J717738M05647j988930l097544j928427l35589n46658
$$ -294790 -66335 1056586 2774324 3179971 1191041 -1906503 -3834930 -4170519 -4717177
8421d717177j646424p27753K095349K912385k4964k777960j291102K170726K414551
$$ -4717177 -6363601 -7091354 -4996005 -2083620 -2108584 -4886544 -6177646 -4006920 -1592369
8412a592369n45473j794729M13341K216389Q60364j113022p43297M68209j67630
$$ -1592369 -2137842 -3932571 -3519230 -1302841 -442477 -1555499 -2298796 -1830587 -1998217
8403a998217j487809n48674K087226K973255J039784j142084j479324q47159o90523
$$ -1998217 -3486026 -4034700 -1947474 1025781 2065565 923481 -555843 -1403002 -2093525
8394b093525m80502R59551K912864L239565J208304j362007k252015j428856o51410
$$ -2093525 -2574027 -1614476 1298388 4537953 5746257 4384250 2132235 703379 51969
8385E1969p84997q02705J11098R40920O28002K55305J376969K786893J583519
$$ 51969 -733028 -1535733 -1424635 -483715 144287 399592 1776561 4563454 6146973
8376F146973k178601m541324k713709R68112K128720J15859j631366o68686J255863
$$ 6146973 3968372 -572952 -3286661 -2318549 -189829 -73970 -1705336 -2374022 -1118159
8367a118159R71123j564867l114165j507775J393435K244276Q35809J33866J544415
$$ -1118159 -147036 -1711903 -4826068 -6333843 -4940408 -2696132 -1860323 -1726457 -182042
8358a82042K604083Q79007j937397k292013J18544K254937K155503P28065o37417
$$ -182042 2422041 3301048 1363651 -928362 -809818 1445119 3600622 4328687 3691270
8349C691270j511268j405935J3785J430386J107478k33936m63036R3447q06172
$$ 3691270 2180002 774067 787852 2218238 3325716 3091780 2628744 2722191 1916019
8340A916019k657391k157676J057892K888734R96151j534452j450945l27829q65584
$$ 1916019 -741372 -2899048 -1841156 1047578 2043729 509277 -941668 -1269497 -2135081
8331b135081j757827m45977J804885K080325R15719P01596Q61412n63314k025582
$$ -2135081 -3892908 -4338885 -2534000 -453675 462044 1163640 2025052 1461738 -563844
8322e63844m55455K683702K816477l46051k325477j263825j44291m82577K88831
$$ -563844 -1019299 1664403 4480880 4134829 1809352 545527 401236 -81341 207490
8313B07490K840459L096146j036506m984300l989164l36438Q00324m37101j16960
$$ 207490 3047949 6144095 5107589 123289 -3865875 -4202313 -3401989 -3839090 -3956050
8304c956050J819359J545660j407720k803900o90958J375479K55563j837793j297077
$$ -3956050 -2136691 -591031 -1998751 -4802651 -5493609 -4118130 -3862567 -5700360 -6997437
8295f997437J117838J996559Q47962K48076J091516J241521n49137k310534j825393
$$ -6997437 -5879599 -3883040 -3035078 -2787002 -1695486 -453965 -1003102 -3313636 -5139029
8286e139029J90138J605266K006219K219326J808892k61153k677919k503505K45227
$$ -5139029 -4948891 -3343625 -1337406 881920 2690812 2429659 -248260 -2751765 -2506538
8277b506538J641345n65736k953561j111111L359104M556939P97521k820811j708794
$$ -2506538 -865193 -1430929 -4384490 -5495601 -2136497 2420442 3217963 397152 -1311642
8268a311642K030531L256641R65957j427733j547348m16706L42623O50809P21405
$$ -1311642 718889 3975530 4941487 3513754 1966406 1549700 1892323 2543132 3264537
8259C264537Q0540j079743j298863J33358J719248J583078m590j174960j049674
$$ 3264537 3345077 2265334 966471 1099829 2819077 4402155 4397565 3222605 2172931
8250B172931m48726j24286K61659R01297Q76767m53747j897834j684360k1323
$$ 2172931 1724205 1599919 1861578 2762875 3639642 3185895 1288061 -396299 -417622
8241d17622J082151O41641k18602m03048l27068m17852J0539R61437O75640j534568
$$ -417622 664529 1306170 1087568 684520 357452 -60400 -49861 911576 1587216 52648
8231E2648k961636q83909K687597L064506l41364k858779j164617K190869K722264
$$ 52648 -2908988 -3792897 -1105300 1959206 1617842 -1240937 -2405554 -214685 2507579
8222B507579P365k500790k142653M67273K740041K503494j10877k352166j538277
$$ 2507579 2514944 14154 -2128499 -1661226 1078815 3582309 3471432 1119266 -419011
8213d19011J434316K936193J471619o16941j216977j319251k064687j971291R1421
$$ -419011 1015305 3951498 5423117 4806176 3589199 2269948 205261 -1766030 -1674609
8204a674609J759950N12774j799330j645855L37627N02311j391536j510186J642853
$$ -1674609 85341 598115 -1201215 -2847070 -2509443 -2007132 -3398668 -4908854 -3266001
8195c266001M349797K956015j055160l322400k009236P87123J936844N11307j384436
$$ -3266001 1083796 4039811 2984651 -337749 -2346985 -1559862 376982 888289 -496147
8186d96147j046776J047650J279909j766196m173598k075308J833457J918204
$$ -496147 -1542923 -495273 784636 -981560 -5155158 -7230466 -5397009 -3478805
8178c478805j315129j750944K206308M617487J581905k441533k039936P64746
$$ -3478805 -4793934 -6544878 -4338570 278917 1860822 -580711 -2620647 -1855901
8170a855901R30911r04340l94418K420843L434402J729802M32460N71313j32874
$$ -1855901 -924990 -1829330 -2223748 197095 3631497 5361299 5793759 6365072 6232198
8161F232198j891120j805429N38997J525518n59531k569201j781467r6572k33160
$$ 6232198 4341078 2535649 3074646 4600164 4040633 1471432 -310035 -406607 -639767
8152f39767j220467p35498Q46415J754144J852999J541523p4275k812146l442614
$$ -639767 -1860234 -2595732 -1749317 4827 1857826 3399349 3325074 512928 -2929686
8143b929686J47570M350435L602795j694038n125819k690805K360495M474019
$$ -2929686 -2782116 1568319 5171114 3477076 -1648743 -4339548 -1979053 2494966
8135B494966K639563K37616j17051P29046N38731j109999k248487j033408J503062
$$ 2494966 5134529 5372145 5255094 5984140 6522871 5412872 3164385 2130977 3634039
8126C634039K205085j11814k641844k251284k5769L43168j726716k735047n44698
$$ 3634039 5839124 5727310 3085466 834182 808413 1151581 -575135 -3310182 -3854880
8117c854880K279923K384903M22556n47298K03541P61577K15239k47350O2269
$$ -3854880 -1574957 809946 1232502 685204 888745 1650322 1865561 1618211 1680480
8108A680480J78859m23118o92776J2138M84508m73400j940803k078259p45521
$$ 1680480 1859339 1436221 743445 755583 1240091 766691 -1174112 -3252371 -3997892
8099c997892N05533P74585P70847J250398J697147J239987J61011m24806k05600
$$ -3997892 -3492359 -2717774 -1946927 -696529 1000618 2240605 2401616 1976810 1771210
8090A771210p3353o27208j122024o64934J43229k6932r96887j141092o6195N01122
$$ 1771210 1697857 1070649 -51375 -716309 -573080 -600012 -1596899 -2737991 -2804186 -2303064
8080b303064m23309j071701L19791K151095J565065p55489j151799J315589L118848
$$ -2303064 -2726373 -3798074 -3478283 -1327188 237877 -517612 -1669411 -353822 2765026
8071B765026J592215j094768j565641k84168p795r79202j052110K20096R79321
$$ 2765026 4357241 3262473 1696832 1412664 1404869 425667 -626443 -406347 572974
8062E72974M81398Q4843M28341L44630o82105j354031p52854L18791R86375J372053
$$ 572974 1054372 1139215 1567556 1912186 1230081 -123950 -876804 -558013 428362 1800415
8052A800415J325364K06010j180600p16629J617561K642548J33251l638586m577272
$$ 1800415 3125779 3331789 2151189 1434560 3052121 5694669 5827920 2189334 -2387938
8043b387938j849590J593074K793996J453768o04504j300616q8627J330667R10098
$$ -2387938 -4237528 -2644454 149542 1603310 998806 -301810 -390437 940230 1850328
8034A850328p22818q17389J187998K283738M68143j782721j258688Q35074Q56366
$$ 1850328 1127510 310121 1498119 3781857 4250000 2467279 1208591 2043665 2900031
8025B900031j432711k738026j540600J31496N42295M88180Q78851J029074M82661
$$ 2900031 1467320 -1270706 -2811306 -2679810 -2137515 -1649335 -770484 258590 741251
8016G41251O4696K2590o13819j757751j613581M52591K472419K637434J587041
$$ 741251 805947 828537 214718 -1543033 -3156614 -2704023 -231604 2405830 3992871
8007C992871O46301k23547j210096j371524m05095O5243j018126j964211q97404
$$ 3992871 4639172 4415625 3205529 1834005 1428910 1494153 476027 -1488184 -2385588
7998b385588R13984R31158m53801n72367J001601J721075L57718r41174k49088
$$ -2385588 -1471604 -540446 -994247 -1566614 -565013 1156062 1513780 572606 323518
7989C23518R53892K94754j474570j617252M3305N42392j622914l758475k589361
$$ 323518 1277410 1572164 97594 -1519658 -1476353 -933961 -2556875 -6315350 -8904711
7980h904711R65561L033287K218565J085812J734430K608651J375810j125659
$$ -8904711 -7939150 -4905863 -2687298 -1601486 132944 2741595 4117405 2991746
7972B991746k231094j479786o45805l60146M66599J767446J695460k51930j859867
$$ 2991746 760652 -719134 -1364939 -1725085 -1258486 508960 2204420 1952490 92623
7963I2623j246829N41041J354417Q40691M5845o70605j669346k579767k264578
$$ 92623 -1154206 -613165 741252 1581943 1627788 957183 -712163 -3291930 -5556508
7954e556508k61128K410838L884142K912789K27982j753342j430245O4337N73843
$$ -5556508 -5817636 -3406798 477344 3390133 3618115 1864773 434528 498865 1072708
7945A072708k7327k68861k7807m57634j040025R5548K215127J922374j288729
$$ 1072708 1045381 776520 748713 291079 -748946 -653398 1561729 3484103 2195374
7936B195374l070136n60686K607182J467751k582118l868256r43614J905207J631950
$$ 2195374 -874762 -1435448 1171734 2639485 57367 -3810889 -4754503 -2849296 -1217346
7927a217346J47215o8274J99952m22063p85484M65978J852679J229111n81741
$$ -1217346 -1070131 -1138405 -938453 -1360516 -2146000 -1680022 172657 1401768 820027
7918H20027j210763p61099j284603k518489j563824K123978M521642K279471j856314
$$ 820027 -390736 -1151835 -2436438 -4954927 -6518751 -4394773 126869 2406340 550026
7909E50026k291447J360952L428422M84931l364299k465397K023601M122380J987089
$$ 550026 -1741421 -380469 3047953 3532884 168585 -2296812 -273211 3849169 5836258
7900E836258k38733J44480L94491k040142m464224l214162J46630J189371n78792
$$ 5836258 5597525 5742005 6136496 4096354 -367870 -3582032 -3435402 -2246031 -2824823
7891b824823j530408J06726K020806J879690M20029l76040R7223J087927J536722
$$ -2824823 -4355231 -4248505 -2227699 -348009 72020 -304020 -206797 881130 2417852
7882B417852O50445j331936k877156k753569j565379o06812L1388Q10488J232636
$$ 2417852 3068297 1736361 -1140795 -3894364 -5459743 -6066555 -6035167 -5224679 -3992043
7873c992043Q44195P92273K185788L650562K883597J39366k155374k765335k260740
$$ -3992043 -3147848 -2355575 -169787 3480775 6364372 6503738 4348364 1583029 -677711
7864f77711r21929J191335K497079J281311j162526j783031l05517N71557j93713
$$ -677711 -1599640 -408305 2088774 3370085 2207559 424528 119011 690568 496855
7855D96855n44016O52359J480233L36214j430657j867655j067408m1388Q55695
$$ 496855 -47161 605198 2085431 2421645 990988 -876667 -1944075 -1985463 -1129768
7846a129768J106225j12379j946930j977770L40943K480639K318775O57656p96104
$$ -1129768 -23543 -135922 -2082852 -4060622 -3719679 -1239040 1079735 1737391 941287
7837I41287j494585j020173J056962K873778J187411l323124n182237j451455
$$ 941287 -553298 -1573471 -516509 2357269 3544680 221556 -4960681 -6412136
7829f412136L412652L748919P37736l96397R97875P83019k189912l790217j263993
$$ -6412136 -2999484 749435 1487171 1090774 2088649 2871668 681756 -3108461 -4372454
7820d372454K485917L385623J530075k67807p25565n17656j70528K38221K31201
$$ -4372454 -1886537 1499086 3029161 2761354 2035789 1518133 1347605 1585826 1817027
7811A817027m71698j111231r16281l49829k00760j03918P26851J709385J321856
$$ 1817027 1345329 234098 -682183 -1032012 -1232772 -1336690 -609839 1099546 2421402
$$ [...]
##END NTUPLES=NMR SPECTRUM
##END=
