##TITLE=31Pdec_SR39H_Ac20
 , 24 sc
 27.09.2021
##JCAMPDX= 6.0         $$ Bruker NMR JCAMP-DX V2.0
##DATA TYPE= NMR SPECTRUM
##DATA CLASS= NTUPLES
##ORIGIN= UXNMR, Bruker Analytische Messtechnik GmbH
##OWNER= root
$$ XWIN-NMR		Version 3.5
$$ Mon Sep 27 12:18:44 2021 Russian Standard Time (UT+4h)  she@DPX200
##.OBSERVE FREQUENCY= 81.013821
##.OBSERVE NUCLEUS= ^31P
##.ACQUISITION MODE= SIMULTANEOUS
##.ACQUISITION SCHEME= undefined
##.AVERAGES= 24
##.DIGITISER RES= 16
##SPECTROMETER/DATA SYSTEM= spect
##.PULSE SEQUENCE= zgpg30
##.SOLVENT NAME= CDCl3
##.SHIFT REFERENCE= (INTERNAL, CDCl3, 0, 248.564)
##AUDIT TRAIL= $$ (NUMBER, WHEN, WHO, WHERE, WHAT)
$$ ##TITLE= Audit trail, XWIN-NMR		Version 3.5
$$ ##JCAMPDX= 5.01
$$ ##ORIGIN= Bruker BioSpin GmbH
$$ ##OWNER= she
$$ F:/spectra/data/she/nmr/P31/1/pdata/1/auditp.txt
$$ ##AUDIT TRAIL=  $$ (NUMBER, WHEN, WHO, WHERE, WHAT)
(   1,<2021-09-27 12:17:29.14 +0400>,<she>,<DPX200>,
      <created by zg, POWCHK disabled, PULCHK disabled
       configuration hash MD5:
       00 E9 B6 7A A2 85 ED C7 34 08 36 98 17 FE 4E 26
       data hash MD5: 32K
       50 B8 3E 7C 8C 56 98 35 CC B8 EC 6F 4C 1F 25 03>)
(   2,<2021-09-27 12:17:31.53 +0400>,<she>,<DPX200>,
      <Start of raw data processing
       efp BC_mod = 2 LB = 1 FT_mod = 6 PKNL = 1 PHC0 = -8469.387 PHC1 = 83.2688 SI = 64K 
       data hash MD5: 64K
       A2 30 FC 18 6C A9 BA AE 5E F6 20 F8 D7 CE ED 43>)
(   3,<2021-09-27 12:17:53.10 +0400>,<she>,<DPX200>,
      <pk PHC0 = -45.4907 PHC1 = 112 
       data hash MD5: 64K
       50 27 FE 6E 4E 56 DE 76 8A 72 F1 68 35 B7 01 2A>)
$$ ##END=
$$ 
$$ hash MD5
$$ 42 9A 56 0F F6 B9 D5 2F 95 51 90 51 E2 DD E8 38
##$RELAX= 
##$RELAX= 
##$RELAX= 
##$RELAX= 
##$RELAX= 
##$RELAX= 
##$RELAX= 
##$RELAX= 
$$ Bruker specific parameters
$$ --------------------------
##$DU= <F:/spectra>
##$EXPNO= 1
##$NAME= <P31>
##$PROCNO= 1
##$TYPE= <nmr>
##$USER= <she>
##$AMP= (0..31)
100 100 100 100 100 100 100 100 100 100 100 100 100 100 100 100 100 100 
100 100 100 100 100 100 100 100 100 100 100 100 100 100 
##$AQSEQ= 0
##$AQ_mod= 1
##$AUNM= <au_zg>
##$AUTOPOS= <>
##$BF1= 81.014009
##$BF2= 200.13
##$BF3= 200.13
##$BF4= 200.13
##$BF5= 200.13
##$BF6= 200.13
##$BF7= 200.13
##$BF8= 200.13
##$BYTORDA= 1
##$CFDGTYP= 0
##$CFRGTYP= 5
##$CHEMSTR= <none>
##$CNST= (0..31)
1 1 145 1 1 1 1 1 1 1 1 1 1 1 1 1 1 1 1 1 1 1 1 1 1 1 1 1 1 1 1 1 
##$CPDPRG= <waltz16>
##$CPDPRG1= <>
##$CPDPRG2= <waltz16>
##$CPDPRG3= <>
##$CPDPRG4= <mlev>
##$CPDPRG5= <mlev>
##$CPDPRG6= <mlev>
##$CPDPRG7= <mlev>
##$CPDPRG8= <mlev>
##$CPDPRGB= <>
##$CPDPRGT= <>
##$D= (0..31)
0 1 0 0 0 0 0 0 0 0 0 0.03 2e-05 3e-06 0 0 0 0 0 0 0 0 0 0 0 0 0 0 0 0 
0 0 
##$DATE= 1632730648
##$DBL= (0..7)
120 120 120 11 120 120 24 19 
##$DBP= (0..7)
150 150 150 150 150 150 150 150 
##$DBP07= 0
##$DBPNAM0= <>
##$DBPNAM1= <>
##$DBPNAM2= <>
##$DBPNAM3= <>
##$DBPNAM4= <>
##$DBPNAM5= <>
##$DBPNAM6= <>
##$DBPNAM7= <>
##$DBPOAL= (0..7)
0.5 0.5 0.5 0.5 0.5 0.5 0.5 0.5 
##$DBPOFFS= (0..7)
0 0 0 0 0 0 0 0 
$$ [...]
##$SUBNAM2= <"">
##$SUBNAM3= <"">
##$SUBNAM4= <"">
##$SUBNAM5= <"">
##$SUBNAM6= <"">
##$SUBNAM7= <"">
##$SUBNAM8= <"">
##$SUBNAM9= <"">
##$SW= 501.771253377433
##$SWIBOX= (0..15)
0 1 3 0 0 0 0 0 0 0 0 0 0 0 0 0 
##$SW_h= 40650.406504065
##$TD= 32768
##$TD0= 1
##$TE= 0
##$TE2= 300
##$TE3= 300
##$TEG= 300
##$TL= (0..7)
0 120 53 12 22 120 120 120 
##$TP= (0..7)
150 150 150 150 150 150 150 150 
##$TP07= 0
##$TPNAME0= <>
##$TPNAME1= <>
##$TPNAME2= <>
##$TPNAME3= <>
##$TPNAME4= <>
##$TPNAME5= <>
##$TPNAME6= <>
##$TPNAME7= <>
##$TPOAL= (0..7)
0.5 0.5 0.5 0.5 0.5 0.5 0.5 0.5 
##$TPOFFS= (0..7)
0 0 0 0 0 0 0 0 
##$TUNHIN= 0
##$TUNHOUT= 0
##$TUNXOUT= 0
##$USERA1= <user>
##$USERA2= <user>
##$USERA3= <user>
##$USERA4= <user>
##$USERA5= <user>
##$V9= 5
##$VALIST= <valist>
##$VCLIST= <CCCCCCCCCCCCCCC>
##$VD= 0
##$VDLIST= <DDDDDDDDDDDDDDD>
##$VPLIST= <PPPPPPPPPPPPPPP>
##$VTLIST= <TTTTTTTTTTTTTTT>
##$WBST= 1024
##$WBSW= 4
##$XGAIN= (0..3)
0 0 0 0 
##$XL= 0
##$YL= 0
##$YMAX_a= 1467
##$YMIN_a= -2504
##$ZGOPTNS= <>
##$ZL1= 120
##$ZL2= 120
##$ZL3= 120
##$ZL4= 120
##$ABSF1= 0
##$ABSF2= 0
##$ABSG= 0
##$ABSL= 0
##$ALPHA= 0
##$AQORDER= 0
##$ASSFAC= 0
##$ASSFACI= 0
##$ASSFACX= 0
##$ASSWID= 0
##$AUNMP= <proc_1d>
##$AZFE= 0.1
##$AZFW= 0.5
##$BCFW= 0
##$BC_mod= 2
##$BYTORDP= 0
##$COROFFS= 0
##$CY= -3
##$DATMOD= 1
##$DC= 0
##$DFILT= <>
##$DTYPP= 0
##$F1P= 0
##$F2P= 0
##$FCOR= 1
##$FTSIZE= 65536
##$FT_mod= 6
##$GAMMA= 0
##$GB= 0
##$INTBC= 1
##$INTSCL= 5.30512e-09
##$ISEN= 30
##$LB= 1
##$LEV0= 0
##$LPBIN= 0
##$MAXI= 10000
##$MC2= 0
##$MEAN= 0
##$ME_mod= 0
##$MI= 50
##$NCOEF= 0
##$NC_proc= -7
##$NLEV= 6
##$NOISF1= 182.463
##$NOISF2= 159.3651
##$NSP= 0
##$NTH_PI= 0
##$NZP= 0
##$OFFSET= 248.5645
##$PC= 4
##$PHC0= -8514.877
##$PHC1= 195.2688
##$PH_mod= 1
##$PKNL= yes
##$PPARMOD= 0
##$PSCAL= 0
##$PSIGN= 0
##$REVERSE= no
##$SF= 81.014009
##$SI= 65536
##$SIGF1= 159.3651
##$SIGF2= -187.1042
##$SINO= 113.3802
##$SIOLD= 16384
##$SREGLST= <1H.CDCl3>
##$SSB= 0
##$STSI= 65536
##$STSR= 0
##$SW_p= 40650.406504065
##$SYMM= 0
##$S_DEV= 0
##$TDeff= 32768
##$TDoff= 0
##$TI= <>
##$TILT= no
##$TM1= 0
##$TM2= 0
##$TOPLEV= 0
##$USERP1= <user>
##$USERP2= <user>
##$USERP3= <user>
##$USERP4= <user>
##$USERP5= <user>
##$WDW= 1
##$XDIM= 65536
##$YMAX_p= 276378245
##$YMIN_p= -58941856
$$ End of Bruker specific parameters
$$ ---------------------------------
##NTUPLES= NMR SPECTRUM
##VAR_NAME=  FREQUENCY,     SPECTRUM/REAL,   SPECTRUM/IMAG
##SYMBOL=    X,             R,               I
##VAR_TYPE=  INDEPENDENT,   DEPENDENT,       DEPENDENT
##VAR_FORM=  AFFN,          ASDF,            ASDF
##VAR_DIM=   65536,         65536,           65536
##UNITS=     HZ,            ARBITRARY UNITS, ARBITRARY UNITS
##FACTOR=    0.620285442955139, 1,           1
##FIRST=     20137.2065510759, 0,            0
##LAST=      -20513.1999529892, 0,           0
##MIN=       -20513.1999529892, -58941856,   0
##MAX=       20137.2065510759, 276378245,    0
$$ Real data points
##PAGE= N=1
##DATA TABLE= (X++(R..R)), XYDATA
$$ [...]
15295 190992 901511 644565 97734 -31252 -2329 36598 500827 1190094 1282219 1024623
15285 1024623 1637781 2874156 2684982 387956 -1791609 -1780695 -512173 -40893 -367619
15276 -367619 -165861 428900 -64649 -2013648 -4116977 -5137952 -4894416 -3843922 -2779531
15267 -2779531 -2450793 -2501320 -1511497 882631 2907860 2926243 1635555 475877 -837463
15258 -837463 -3057270 -4777945 -3819230 -929426 637009 -447819 -2025508 -1921441 -669128
15249 -669128 231072 765824 1688081 2681583 2721913 1671094 485367 56397 294372
15240 294372 193171 -1091537 -2855346 -3105364 -1087490 1145189 1102647 -721685 -1556085
15231 -1556085 -230639 1618983 2316354 2055368 1572058 837559 -140093 -791579 -1022493
15222 -1022493 -1449976 -2113181 -2331555 -2164034 -2413701 -2894044 -2515796 -1422085 -936764
15213 -936764 -942770 227527 2481773 3253162 1447904 -541308 -543939 213301 -178892 -832614
15203 -832614 18554 1622828 2199036 2236721 3186477 4104633 2973345 652258 77508
15194 77508 1631275 2548764 1291881 -433738 -755656 -211806 -317704 -1517025 -3349171
15185 -3349171 -5057677 -5544591 -4221967 -2143823 -832817 -185921 604427 499424 -2319644
15176 -2319644 -6690172 -8789210 -7146367 -4566794 -3754791 -3755967 -2674178 -1477344 -2387966
15167 -2387966 -4913361 -6231624 -5042026 -2787114 -1134022 -108966 1008223 2332679
15159 2332679 3383029 3669295 3023165 1808986 826114 615870 890097 894680 304853
15150 304853 -284842 271503 2472456 5057100 5759372 3914245 1569326 877508 1221656
15141 1221656 600156 -899022 -1382386 -662181 -710219 -2144761 -3029122 -2118403 -619833
15132 -619833 521144 2291395 4863181 6042229 4827677 3858638 5334679 6858370
15124 6858370 4981042 1068443 -617717 309952 155578 -2263800 -3565968 -1676789
15116 -1676789 455900 -592129 -3592704 -4847879 -3401858 -1387748 -509517 -631783
15108 -631783 -1158924 -1780971 -2135748 -2124247 -2199720 -2365532 -1624676 486945 2622719 3105163
15098 3105163 2047963 895340 507606 767399 1330010 1610248 802108 -854364 -1661777
15089 -1661777 -711270 353002 -476909 -2411708 -2993616 -1944620 -1481759 -2633912 -3667012
15080 -3667012 -3003651 -1647451 -1425639 -2298497 -2771325 -2037358 -585309 655223 947994
15071 947994 152463 -919083 -1203396 -761228 -533660 -560999 138108 1492294 1961192
15062 1961192 1113990 806380 2412277 4559285 5260580 4674939 3835702 2353250 -105507
15053 -105507 -1551965 -10703 2835613 3712612 2849027 3195718 4732140 4090504 825570
15044 825570 -706596 1917174 4883922 3998229 1213580 957358 2627463 1963040 -1315931
15035 -1315931 -2628859 348535 4387532 5778751 4775901 3314054 1734345 -69513
15027 -69513 -1022764 -756166 -959305 -2551532 -3427754 -1534318 1389203 1925957 -170979
15018 -170979 -2053846 -2146760 -1572113 -1248193 -469706 916267 1517251 840052 573241
15009 573241 1791882 2648520 912725 -2394258 -4240788 -3848740 -3161409 -2961747 -1294348
15000 -1294348 2971940 7250377 8067926 5613196 3230238 2930255 3704500 4281566 5054419
14991 5054419 6326403 6760179 5274447 3234358 2969066 4711247 6570186 7194436 6939498
14982 6939498 6456724 5636605 4356675 3099730 2177887 1120604 -469094 -1920992 -2101039
14973 -2101039 -917756 439654 1063331 1614228 3263730 5417864 5705687 3047797 -282989
14964 -282989 -1128953 593632 2183796 2152220 1712486 1935660 1871490 676701 -548462
14955 -548462 -699827 -662324 -1505245 -2188590 -1088887 1377429 3602835 5088876 5887245
14946 5887245 5021367 1912503 -1537693 -2806104 -2017979 -981167 129607 2239283
14938 2239283 4210953 3637725 923524 -659970 394297 1980441 1843513 227056
14930 227056 -1630791 -3021716 -3065420 -1150319 1101875 1020450 -1037212 -1590301 913578
14921 913578 3935243 5125407 5603804 6924269 7736896 6195051 3444834 1892487 1654992
14912 1654992 1386488 1223475 2192632 3622028 3705068 2254628 923569 959488 2125443
14903 2125443 3333194 3296431 1400511 -1167124 -2251815 -1394524 -135184 851590 2513034
14894 2513034 4331974 3638969 108505 -2164823 -143935 3236757 3328482 819447 195879
14885 195879 2371843 3496258 1108470 -2689285 -4930585 -5158974 -4108188 -1996224
14877 -1996224 603536 2435248 3143617 3448098 3304562 1873376 -293090 -1211586 -302329
14868 -302329 691798 346877 -673974 -1216357 -1277627 -1188479 -613439 695822 2160347
14859 2160347 3025171 2962030 1806986 -356634 -2669520 -3904686 -3524055 -1849801 320250
14850 320250 1697814 1236490 -32137 668749 4007756 6569006 5103456 1391603 -161778
14841 -161778 1133814 1862534 233678 -1551603 -1319000 142416 1346325 2287769 2930110
14832 2930110 2230513 333105 -599131 529020 1830377 1273437 -420983 -1434147 -1679517
14823 -1679517 -2094127 -2518256 -2285998 -1961489 -2531417 -3350683 -2618322 88808 2956508
14814 2956508 3860071 2600303 1044659 1102371 2598354 3591679 3021366 2068513 2115384
14805 2115384 2627182 2546121 2503925 3471988 4267286 3177218 1426252 1768341 3689382
14796 3689382 3617922 679360 -1334209 629153 4506696 6209526 4777389 2386556
14788 2386556 1004546 971284 1623586 1844513 1020780 171219 644339 1390449 -126363
14779 -126363 -3648129 -5607797 -4155867 -1761088 -1033016 -941081 387529 1867896 1569656
14770 1569656 582123 1388110 3564486 4253360 2372106 -261586 -1706823 -1718596 -1089423
14761 -1089423 -767882 -1152777 -1189825 660425 3451153 3664182 -66447 -4124119 -4302452
14752 -4302452 -1403420 396433 -486225 -1865347 -1921027 -1281630 -803809 12549 1682560
14743 1682560 3589131 4744744 4703181 3773813 3036829 3441522 4197010 3400055 1176120
14734 1176120 216259 1676246 2866039 1304972 -1225627 -1656508 -569783 -522169 -1050723
14725 -1050723 396739 3286634 4125857 1932437 -340676 -449402 532157 981565 994449
14716 994449 1098927 1411342 2517136 4506766 5138754 2259814 -1808958 -2208303 1363170
14707 1363170 3613540 1250579 -2438072 -2933935 -790157 462381 -104323 -701896 -444675
14698 -444675 99172 867018 2114144 3005979 2623187 1774300 1959172 3099236 3864770
14689 3864770 3676929 3048399 2520218 2326110 2467124 2406962 1607711 758873 970733 1335567
14679 1335567 -490627 -4284014 -6344725 -4318632 -619209 1081859 595060 -77612
14671 -77612 -693222 -2218494 -3753730 -3522811 -2325420 -2662891 -4528311 -5179855 -3358928
14662 -3358928 -862903 564454 1192880 1441907 684532 -908354 -1510980 -66166 1961497
14653 1961497 2445193 1001987 -1257852 -3031661 -3087412 -704409 3066026 5720583 5859624
14644 5859624 4490441 3188484 2264946 1492084 1081510 781260 -535790 -2944919 -4442986
14635 -4442986 -3502876 -1500808 -732360 -1043548 -639273 570041 1115006 1189607 2687588
14626 2687588 5431506 6380026 4076181 1290257 1115009 2493152 2202600 -221173 -2504250
14617 -2504250 -3693276 -4927303 -6200199 -5678298 -3135459 -1122185 -1214034 -1614149 -399382
14608 -399382 1066981 446936 -1462074 -1797089 -41791 1417266 985195 -453963 -1756022
14599 -1756022 -2986147 -4039504 -3995572 -2854853 -2116369 -2525077 -2827208 -1946771 -891138
14590 -891138 -1034283 -1782088 -1675235 -903129 -794575 -1248161 -681235 1310700 3064970
14581 3064970 3237573 2565787 2299787 2138662 1164266 103369 818438 3346351 5156781
14572 5156781 4383093 2568415 2626288 4689694 5934733 4668091 2541492 1762244 1948706
14563 1948706 1446614 466101 735946 2565671 4394195 5235769 5574970 5584161 4480755
14554 4480755 2370350 934617 1249304 2330714 2861883 2986352 3172441 2582990 223748
14545 223748 -2952960 -4626468 -3618375 -852931 1842102 3073030 2604821 1723035 2284431
14536 2284431 4372239 5605167 4105677 1481185 1077455 3522424 5991664 6159616
14528 6159616 4846632 3885218 3247208 1878547 155848 -420579 421977 1422497 1887121
14519 1887121 2533968 3797745 4678448 4167745 2855531 2059075 1991256 1954410 1957477 2746091
14509 2746091 4117199 4556137 3155113 911477 -580032 -922577 -679715 -165146 540032
14500 540032 972723 821074 714703 1368119 2168247 1759613 -53160 -2088232 -3382997
14491 -3382997 -3826656 -3301362 -1702523 -65413 -34688 -1472158 -2041389 -246244 2274119
14482 2274119 2758308 851112 -1147420 -1112850 882553 3024908 3371928 1484521 -699007
14473 -699007 -260108 3356418 7053037 7464678 5017968 2904939 2463689 1924201 70350
14464 70350 -1467686 -1026849 112045 -231294 -1490724 -1345522 299372 1183420 663557
14455 663557 799818 2411333 3012438 873497 -1310972 -69474 2960150 2767212 -1423990
14446 -1423990 -4371989 -2109268 2509697 4133389 2167884 378531 710407 1159991
14438 1159991 -269337 -2633082 -3880252 -3436419 -2083531 -832800 -520629 -1142461 -1229650
14429 -1229650 625129 3330587 4096033 2141354 -223075 -945372 -721915 -1006696 -1424253
14420 -1424253 -872144 196424 516260 169466 170338 458586 86683 -875336 -1342901 -1147674
14410 -1147674 -1400996 -2630312 -3869901 -4084395 -3454641 -2703106 -1978157 -1062096 -157735
14401 -157735 177691 -295943 -1253503 -2040822 -1894250 -248479 2562585 4856202 4589111
14392 4589111 1527850 -1827431 -2473520 -287005 1816970 1619489 287634 207041 1270998
14383 1270998 1245469 -633426 -2593278 -3039425 -2299760 -1172202 211225 1219977 497243
14374 497243 -1758560 -3111873 -2142987 -766320 -1343323 -2899559 -2644728 -374318 1328160
14365 1328160 1067016 177250 -74766 -366822 -1438426 -2406733 -2387328 -2302737 -3446779
14356 -3446779 -5182838 -5748293 -4891832 -3982438 -3401168 -1595801 2275567 6022596 6484226
14347 6484226 3680738 1076957 1061822 1858713 423067 -2850499 -4553554 -2983093 756
14338 756 2128033 3252102 3796070 3126241 1227019 37211 924930 2248375 1749793
14329 1749793 226558 181498 1553048 1778905 121854 -1065160 -184929 1119918 689447
14320 689447 -998764 -2030123 -1924737 -1605183 -1454758 -1018579 -137443 927812 2153626
14311 2153626 3421890 3854415 2635679 452182 -906880 -589807 382809 441718 -788643
14302 -788643 -2282129 -2766897 -1887282 -465985 230281 -330472 -1377907 -1630563 -782090
14293 -782090 80982 -88202 -672587 27768 2339201 4236963 3715393 1541089 345666
14284 345666 1153266 2340091 2299410 1427095 624540 -472280 -2232796 -3254971 -1831369
14275 -1831369 1327656 3691599 4091778 3643378 3511888 3489569 3146229 2835595 2869662
14266 2869662 2782102 2007454 535384 -1291190 -2728117 -2470504 72876 3210165 4318678
14257 4318678 3224056 2432029 3193957 3413256 1083384 -2018590 -2502288 -211105 1808236
14248 1808236 1939217 1803240 2858697 3866088 3255904 1961666 1784954 2227342 1340999
14239 1340999 -771521 -1747442 -544009 903110 431557 -1632741 -3548290 -4488756 -4551930
14230 -4551930 -3704133 -2252125 -1462514 -2089679 -2897523 -2205726 -368213 881713 993159
14221 993159 722984 267708 -596558 -897249 522068 2437028 2436176 936397 947410 3113336
14211 3113336 4372215 2977465 1347880 1681692 2155068 635005 -838395 696625
14203 696625 3569529 3660197 870415 -1158594 -1195975 -1541459 -2787393 -2277118 880507
14194 880507 3516809 3199700 1870447 2307825 3737296 3557393 1473265 -527767 -1061953
14185 -1061953 -331321 779357 1293029 886453 766537 2214937 3763367 2306085 -1870963
14176 -1870963 -4139441 -1715443 1967578 2030939 -926627 -2339838 -782808 524760
14168 524760 -722281 -2654749 -2646060 -1103752 -190684 -629012 -1457131 -1893793 -1935297 -1512367
14158 -1512367 -248577 1741838 3376766 3378361 1657326 -360438 -1288928 -1477835 -2285777
14149 -2285777 -3680481 -3894271 -2018267 384679 1203212 192031 -1555700 -3341682
14141 -3341682 -4702633 -4621813 -2695145 -493685 -415 -952817 -1345508 -410130 548217
14132 548217 405616 -201096 14191 1354622 2999484 3794869 3112621 1564574 706471
14123 706471 1348147 2494757 2737052 2135468 1650624 1287187 271474 -1182367 -1854940
14114 -1854940 -1382893 -777026 -854397 -1305189 -1469753 -936404 685257 3341669 5715789
14105 5715789 6073392 4243015 1732231 -206994 -1451414 -1988009 -1630018 -1107372 -1799666
14096 -1799666 -3670603 -4931092 -4585179 -3850987 -3957155 -3922824 -2087148 1039118 3109070
14087 3109070 2792452 923170 -1041107 -2417236 -3019683 -2573566 -931015 1513819 3855740
14078 3855740 5081758 4772597 3708175 3328970 4070776 4636975 3580642 1274540 -499978
14069 -499978 -795394 -494190 -938971 -2247701 -3290469 -2967364 -1315389 440467 947898
14060 947898 99856 -755426 -291479 1315011 2830743 3598568 3947625 4089356 3654479
14051 3654479 2648976 1863170 1666321 1238426 -107640 -1543087 -1805444 -1167087 -916068
14042 -916068 -1061419 -244280 1700422 2827492 1731269 -285134 -1044396 -420037 179452
14033 179452 437458 1253263 2475057 2615830 1320980 372337 1346268 3500271 4848846
14024 4848846 4403554 2660169 815967 206305 1546221 3886606 5131030 4368985 2888903
14015 2888903 2157000 1837387 875974 -433443 -904482 -434112 -111285 -563477 -1389453
14006 -1389453 -2121561 -2686134 -2929323 -2556912 -1541250 -46226 1683678 2836829 2283984
13997 2283984 288251 -981988 -96224 1317821 785055 -1083040 -1283428 913523 2670359
13988 2670359 1834284 -36209 -548488 -285917 -1368602 -3462654 -3947767 -1859877 796739
13979 796739 2131378 2602258 3194769 3278206 1980852 445821 520103 1558964 855596
13970 855596 -2221632 -4691123 -3910667 -1319481 -190181 -808630 -553789 1458124 2730611
13961 2730611 1285054 -1285655 -2284173 -1598202 -1025474 -1218486 -1344142 -1027302 -713283
13952 -713283 -497871 -251284 -553592 -1942373 -3544427 -3952177 -3115238 -1902048 -358531
13943 -358531 1771035 3297972 2655552 723133 248055 1978729 3568717 3121504 1769437
13934 1769437 1552225 2420732 2752651 1694186 -274794 -2302237 -3670116 -3914544 -3127141
13925 -3127141 -1722668 162503 2230050 3230145 2104833 -58816 -1014738 -556142
13917 -556142 -672160 -1980643 -2421960 -695849 1364361 1620694 797164 735546 1261871
13908 1261871 1210928 1139970 2249879 3468234 2514845 -318921 -2159003 -1605351 -419226
13899 -419226 -545589 -1523457 -1804582 -1060972 -106178 431393 409594 -215993 -1366955 -2695012
13889 -2695012 -3724801 -3983039 -3221032 -1930828 -1244361 -1698690 -2501601 -2626859 -2036272
13880 -2036272 -1133223 60709 1104801 576386 -2054650 -4748870 -4990322 -3129688 -1719850
13871 -1719850 -1843786 -2219145 -1832079 -1104166 -159159 1664175 3870408 4637507 3556069
13862 3556069 2483157 2634274 2914731 2353034 1955672 2462439 2412270 634836 -1184087
13853 -1184087 -996939 90786 -199648 -965499 634020 3988504 4787151 1228438 -2949624
13844 -2949624 -3612799 -1639697 -603753 -1176907 -1173875 -155106 -233831 -1817962 -1973865
13835 -1973865 1137696 4660067 4498711 1101720 -1059285 469553 3403270 4671261
13827 4671261 4431307 4475584 4677969 3504413 1101801 -675654 -1177344 -1571641 -2280637
13818 -2280637 -2081525 -576091 550868 90899 -584488 308615 1956846 2075675 355418
13809 355418 -1187450 -1117045 -49597 914238 1593300 2081492 2035062 1332784 578942 303672
13799 303672 239982 -154041 -921529 -1615662 -1618267 -425004 1628954 2826801 1336438
13790 1336438 -2362773 -5201391 -4593406 -1289315 1752292 2953570 3388257 4385885 5211042
13781 5211042 4171407 1460243 -505492 -25222 1591247 1638391 -543919 -2959916 -3787953
13772 -3787953 -3414569 -3027427 -2550766 -1330778 -25919 -81021 -1447569 -2403503 -1877959
13763 -1877959 -578601 544105 1531144 2447612 2506624 1199838 -605684 -1708260 -1987316
13754 -1987316 -1870563 -1199576 230086 1659761 2212270 2314192 2896914 3450745 2463535
13745 2463535 -28034 -1855806 -1320402 765722 2361511 2607839 2125840 1597468 1037882
13736 1037882 290592 -486279 -923601 -793952 -374947 -502749 -1818694 -3761710 -4860523
13727 -4860523 -4428630 -3457658 -3270414 -3720342 -3503745 -2124199 -707372 -531807 -1237460
13718 -1237460 -1052518 1101924 4010872 5071552 3015469 -549315 -2754732 -2482334
13710 -2482334 -1166205 -652625 -1142632 -1606421 -1358931 -486998 655565 1485479 1174535
13701 1174535 -358016 -1653749 -1088753 835163 1738527 394034 -1511109 -1485707 586555
13692 586555 2456438 2478241 1486044 1398550 2706529 3969203 3610548 1758893 193860
13683 193860 557153 2623167 4406008 4176560 2351738 999242 1302598 2066976 1366384
13674 1366384 -710142 -2077611 -1669647 -1238714 -3107079 -6784778 -9231572 -8530943 -6031437
13665 -6031437 -4335727 -4187431 -4192643 -3005905 -843034 995191 1368361 109534 -1801196
13656 -1801196 -2821028 -2091445 -281634 1037202 929625 -92099 -704010 -80132 1339477
13647 1339477 2320322 2213954 1783861 2236572 3441435 3804858 2232413 -435766 -2449375
13638 -2449375 -3043362 -2719982 -2175334 -1716301 -1423233 -1156656 -608145 73557 67043 -1035885
13628 -1035885 -2360157 -2807950 -2559712 -2455344 -2253890 -972950 941787 1388894 -602274
13619 -602274 -2930902 -2471639 1177161 4873399 5127652 1831143 -1571071 -1851982 386969
13610 386969 1704928 388752 -1471080 -1318840 129513 420381 -534850 -570719 847515
13601 847515 1828063 1663407 2245270 4507219 6162516 5081380 2761848 1903305 2140473
13592 2140473 1096603 -1243423 -2305197 -994357 818635 1377677 1167115 1119542 858017
13583 858017 -9849 -518486 213551 1226960 876606 -812107 -2168123 -1983334 -618776
13574 -618776 821159 1498073 984865 -719380 -2838040 -3931985 -3055971 -929910 542615
13565 542615 341382 -442912 -91587 1338919 2163204 1615103 831937 774366 709660 -127659
13555 -127659 -793280 -154739 983102 1181356 901977 1549994 2646229 2506770 1446853
13546 1446853 1422588 2302258 1721682 -452795 -934404 1845564 4566456 3765176 1214944
13537 1214944 1105844 3601852 5155986 4484441 4050481 5176321 5593697 3434258 639208
13528 639208 270399 2399733 4647091 5361308 4451499 2237608 -639213 -2830060 -3400190
13519 -3400190 -2930423 -2363201 -1489905 93274 1343847 867678 -684051 -1130055 209806
13510 209806 1613946 1487199 391551 -84682 595411 1696907 2303581 1940589 638984
13501 638984 -963415 -1787528 -1014459 1262179 3932527 5384630 4759226 3187887 2943569
13492 2943569 4365220 4600470 1200856 -3659558 -5085585 -1827496 1953657 2335027
13484 2335027 375010 -679294 -521164 -1245892 -3100616 -3980481 -2880674 -1114577 63689
13475 63689 723301 888752 81486 -1327858 -2178575 -2257193 -2212882 -1747486 -117977 1439129
13465 1439129 538833 -2357586 -3602636 -1349518 1739198 2458956 1260980 404715 205845
13456 205845 -282366 -581692 442961 2208034 3203937 3216274 2719540 1388127 -540592
13447 -540592 -991822 1133488 3389513 3133661 1888504 2585311 3859979 1944527 -2199337
13438 -2199337 -3172512 405927 3126453 813200 -3397372 -4245233 -1776183 203629
13430 203629 237270 -174309 -147937 112853 1139004 3207948 4595049 3776858 2299856
13421 2299856 2537881 3715498 3271765 1201162 -271922 -606041 -1053731 -1320338 186817
13412 186817 2693169 3303314 1499296 31036 543681 1542269 1609596 1375680 1130646
13403 1130646 -153081 -1842091 -1096110 2483341 4781987 2542815 -1769144 -3524999
13395 -3524999 -2176856 -584718 128934 1181991 2459796 2187393 411896 -636678
13387 -636678 -316084 -679501 -2796530 -4649707 -4196328 -2470965 -1939470 -3138484 -4542964
13378 -4542964 -4916894 -4423423 -3817412 -3508565 -3276317 -2544697 -1276030 -538209 -1331159
13369 -1331159 -2853119 -3181032 -1959303 -957784 -1284703 -1559163 -62330 2470300 3685141
13360 3685141 2535402 8850 -2512594 -4235713 -4678748 -3833269 -2514839 -1393820
13352 -1393820 95672 2630082 5111693 5587390 4115104 2923934 3270430 3938445 3670108
13343 3670108 3228228 3647308 4063415 3284358 2475636 3915426 7281361 9425237 8332581
13334 8332581 5522743 3728322 3580627 3565563 2328657 86452 -1774411 -2003992 -865943
13325 -865943 -290414 -1770928 -4079507 -4462580 -2456019 -741870 -1281008 -2520640 -2168868
13316 -2168868 -1021672 -1424656 -2870570 -2254534 1264514 4563858 4816958 3139086 2399003
13307 2399003 3080293 3179113 1325150 -1620639 -3694905 -3485950 -1137799 1461278 2173258
13298 2173258 1093783 601251 1963842 3174555 1775252 -1272530 -2731503 -1542322
13290 -1542322 253752 921884 781670 176024 -1487733 -3449232 -3001326 731868 4417147
13281 4417147 4389258 1505064 -524655 -571757 -702590 -1735812 -1789435 -134287 787223
13272 787223 -899222 -3199144 -3046763 -726244 967900 854698 91085 -585803 -1653902
13263 -1653902 -2809809 -2700666 -1283249 -361598 -879937 -1430596 -502280 1271387 2288744
13254 2288744 2220703 1865056 1666849 1523274 1373867 1049983 255295 -489026 153834 2325375
13244 2325375 3946153 3089295 639649 -923309 -834621 -479131 -828813 -1252084 -1050139
13235 -1050139 -561624 -248165 29036 255685 -150622 -1387195 -2674371 -3105270 -2479982
13226 -2479982 -1051281 800618 2319163 2564126 1377602 -237530 -1003132 -418324 949695
13217 949695 1815905 1138958 -602091 -1469085 -303630 1461451 1379736 -852978 -3119531
13208 -3119531 -3658505 -2714960 -1395732 -409626 -185969 -746578 -1139951 -471744 305482
13199 305482 -595597 -2700959 -3375958 -1767196 -255732 -645837 -1303511 -130352 1689390
13190 1689390 1598461 -37668 -479673 1079548 2499823 2060105 540218 -444807 -383772
13181 -383772 273150 826655 705367 239976 806382 2918385 4732220 4192863 2183619
13172 2183619 1369295 2100932 2027504 176512 -1261968 -413092 1284953 1250134 -663559
13163 -663559 -2475189 -2857153 -2008302 -579090 739968 1103410 401840 -40869 1087469
13154 1087469 3107941 3977691 2958256 1655564 2063715 4220200 6237367 6378037 4684335
13145 4684335 2504130 817750 -371254 -1027863 -526146 1123036 2349885 1704969 100253
13136 100253 -213978 984819 1215332 -1328254 -5076280 -6817913 -5321854 -2235474 133688
13127 133688 996893 1134440 1428062 1678530 1003006 -691870 -2257804 -2674523 -2058975
13118 -2058975 -667373 1889973 5045995 6129005 3132393 -1917470 -4908027 -4803536
13110 -4803536 -4094025 -3978739 -2502749 1370305 5149389 6327238 5815949 5590685 5323316
13101 5323316 4007822 2842299 3446412 4703201 4398611 2816668 1682666 647555
13093 647555 -1741991 -4208719 -3641936 -119251 2367135 1108743 -2122274 -4020209
13085 -4020209 -3528178 -1737977 -131540 96189 -1296604 -2886165 -3095739 -2609336 -3276104
13076 -3276104 -4574517 -3947762 -1320648 -162868 -2420229 -5116488 -4273413 -174122
13068 -174122 3717485 5558321 6266826 6756964 6570237 5222273 3125166 1058917 -159679
13059 -159679 239739 2128358 4010259 4424838 3579506 2811606 2813602 3119616 2935095 1846946
13049 1846946 138785 -1195675 -1352970 -822952 -645711 -481412 1070644 3844586 5691886
13040 5691886 5561599 4988908 5211795 4925586 2842474 554745 301620 1283267 1046822
13031 1046822 -290491 -184904 2150611 4487312 4818895 3489953 1621440 -434480
13023 -434480 -2322362 -3073763 -2097458 217606 3028837 5139252 5035585 2495009 -196071
13014 -196071 -606503 467176 226037 -1622834 -2292130 -360331 2002315 2414003 1367515
13005 1367515 374098 -737990 -2669016 -4457837 -4583782 -3285024 -2038103 -1490248 -1303008
12996 -1303008 -1217873 -1014441 -328926 325972 -432550 -2455810 -3099609 -634413 2538526
12987 2538526 2548238 -592533 -2911789 -1946235 198709 192385 -2096065 -4040126 -4021663
12978 -4021663 -3077504 -2869209 -3258495 -2604781 -161409 2598712 3507991 2159670 110855
12969 110855 -1167853 -1533299 -1309578 -478640 700437 1365586 1096605 426512 -228377
12960 -228377 -1077994 -1876958 -1782668 -1115362 -1554311 -3315438 -4003463 -2175779 -267506
12951 -267506 -1336576 -4192492 -4921438 -2685065 -627601 -808339 -1540535 -737994 1003692
12942 1003692 2151284 2710353 3279291 3465778 2942887 2688637 3635015 5174043 6207498
12933 6207498 6527824 6130508 4590358 2355076 1151720 1616714 1976353 775211 -571198
12924 -571198 -63807 1360764 1268051 -36279 323161 3236654 5972171 5887103 3515540
12915 3515540 906619 -1107473 -2564934 -2924371 -1771075 -99770 752451 987465 1730646
12906 1730646 2903696 3286400 2710337 2534169 3337876 3629494 2069541 -20257 -74575
12897 -74575 2020588 3446224 2186248 -355739 -1595104 -1296644 -1121398 -1417620 -730700
12888 -730700 1289994 2703083 2051578 624336 423159 1064428 570214 -1304899 -2537677
12879 -2537677 -1840927 -469398 -209713 -821554 -691888 609770 1821217 2063207 2103670
12870 2103670 2839739 3526731 2837930 1253895 672957 1337974 1040282 -1437520 -3772684
12861 -3772684 -2991707 154232 2106074 1342589 -258244 -906415 -911521 -563414 1003325
12852 1003325 3285546 3449590 208339 -3347092 -3436737 -761035 735321 -563194 -2347196
12843 -2347196 -2104347 86386 2650227 4230532 3938300 1776189 -644585 -1269938 114797
12834 114797 1957192 3272597 4377824 5213834 4780910 2938227 1283615 1276140 2423759
12825 2423759 3170641 2945449 2590084 3034287 4078572 4667193 4396878 4365547 5715465
12816 5715465 7497255 7439636 5185802 2944526 2120405 1511625 307651 290846 2492115
12807 2492115 3980557 1534571 -3021020 -5044160 -3649446 -1885725 -964583 911761
12799 911761 3660837 4241732 1856672 -279673 -250811 -286368 -2018919 -3012253 -1015486
12790 -1015486 1842200 2406377 1127729 146618 -475046 -1291292 -941367 1231600 2379752
12781 2379752 -112969 -4010280 -5241038 -3774440 -2434923 -1549311 621122 3199386
12773 3199386 3334324 1315739 507840 1951067 3217189 2976400 2568695 2503622 1578107
12764 1578107 333366 1198901 3904266 4829614 2687377 1019776 2822861 6086184
12756 6086184 7211972 6010608 4690914 4266569 4478640 5238471 5784955 4269049 414365
12747 414365 -3140378 -4200520 -3881709 -4107137 -4384300 -3592166 -2944055 -4029443 -5266960
12738 -5266960 -3623016 697409 4212933 4646184 2967612 1109779 -29089 -261245
12730 -261245 137385 183107 -678777 -1329055 -434087 1259639 1871510 1166050 346835 -543080
12720 -543080 -2586314 -5251366 -6184017 -4479308 -2129875 -1300733 -1812543 -2197476 -1759336
12711 -1759336 -665263 739966 1829829 1952556 1440114 1289650 1388973 477637 -1427662
12702 -1427662 -2166821 -226318 2838591 4150830 2793771 116158 -2282115 -3410569
12694 -3410569 -2603808 -212117 1800184 1754008 647935 845148 2356564 2648632 843784
12685 843784 -276286 1735423 4776754 4621118 919707 -2038285 -1037083 2115000
12677 2115000 3677823 2991606 2293132 2704893 2953484 2034953 830083 283838 -224684
12668 -224684 -1467384 -2581277 -2140443 -289140 1600046 2962738 4283030 5442396
12660 5442396 5395933 3861665 1973952 614829 -692098 -2342889 -3269463 -2352729 -474391
12651 -474391 437157 122233 135199 1279502 2612873 3334399 3825751 4061204 2904204
12642 2904204 346656 -1282487 -216524 2012497 2879432 2709958 3602394 5347828 5568773
12633 5568773 3806646 2186065 1530052 180695 -2235070 -3272801 -1703027 68316
12625 68316 -71154 -501599 799587 2141653 845036 -1932828 -2975859 -2272498 -2465834
12616 -2465834 -3790891 -3757025 -1947914 -1164114 -3013387 -5707032 -7127312 -7126967 -6008898
12607 -6008898 -3700172 -1384953 -1080977 -2456283 -2670898 -399652 2559380 4481405
12599 4481405 5547799 5542194 3214139 -344119 -1183345 2087022 5290232 4003601 -463158
12590 -463158 -3404334 -3043075 -1375640 -238039 222491 41621 -677349 -898152 -40950
12581 -40950 484003 -621339 -1885303 -1070128 1008487 1498711 -94267 -1406505 -1080921
12572 -1080921 -383016 -607815 -1378831 -2134194 -3042792 -3613447 -2439343 486482 2759415
12563 2759415 2254562 -45454 -1164347 238590 2356694 2598344 874318 -302340
12555 -302340 771950 2559052 2519874 981675 592183 2003325 2794981 1463678 -349818
12546 -349818 -1103781 -1948870 -3783802 -4409702 -1832790 1562720 1826020 -716890 -2164265
12537 -2164265 -1047741 145502 -359035 -1038264 -97171 1875970 3515176 4598874 5104606
12528 5104606 4217191 1581052 -1666680 -3987396 -4707380 -3957964 -2424465 -1232484 -975855
12519 -975855 -934652 -306648 261748 -284643 -1465244 -1990185 -1821927 -1753725 -1665473 -1224527
12509 -1224527 -1485822 -3301086 -4803603 -3386004 88012 2121109 1690902 1306597 2488096
12500 2488096 3498365 2702971 1230444 750881 957000 742801 -6448 -944936 -1810135
12491 -1810135 -1688619 218216 2430046 2168669 -586601 -2474843 -1292947 1289942
12483 1289942 2784514 3085342 3087864 2635815 1776653 1840371 3172248 3700805 1868840
12474 1868840 -718066 -1681857 -1354891 -1685136 -2950023 -3789839 -3676668 -3412234 -3689691
12465 -3689691 -4501080 -5290350 -4823607 -2150053 1398386 2838519 1366456 -296118 136372
12456 136372 1238344 558028 -1303946 -1836491 -605847 416561 -142843 -1780528 -3292523
12447 -3292523 -3629830 -2362368 -655014 -570141 -1957052 -1736888 1715581 5253118 4662448
12438 4662448 337459 -3638000 -5063915 -5184945 -5296396 -5099181 -4554619 -4400329 -4295544
12429 -4295544 -2956817 -682657 534253 -43630 -990340 -1286380 -1583780 -2138163 -1677911
12420 -1677911 387455 2309603 1983454 -447936 -3075688 -4472379 -4498418 -3545942 -1970352
12411 -1970352 -114450 1631902 2823431 3042807 2231724 828323 -625524 -1713389
12403 -1713389 -1914886 -962253 242824 222250 -853006 -888070 994166 2462320 955571
12394 955571 -2411830 -4107496 -2747377 -166063 1753879 2884677 3301765 2387659 419865
12385 419865 -783865 4196 1742070 2451988 1482220 -91490 -676776 468178 2441033
12376 2441033 3269080 1968643 -187760 -1255121 -986358 -529392 -350250 8988 440755
12367 440755 239192 -507257 -1083590 -1605596 -2606402 -3288215 -2206220 115195 1343712
12358 1343712 569566 -687670 -1258407 -1838668 -2795506 -2848308 -1510039 -725723 -1980893
12349 -1980893 -3382761 -2037789 1621119 4322846 4376553 3280895 2826985 2767985 2077006
12340 2077006 865487 12033 -153575 56888 259295 30607 -969824 -2215035 -2223944
12331 -2223944 -163857 2693965 4002068 2891184 814729 -269311 131519 1111649
12323 1111649 1630554 1195910 -50251 -1200114 -1026823 603254 2129394 2014613 762976
12314 762976 175020 789559 1292937 530340 -1097285 -2415245 -2499527 -807610 2356369
12305 2356369 5193760 5587192 3376441 326812 -2178953 -3795534 -3704340 -1020515 2628047
12296 2628047 3739778 1555099 -670399 -754487 -931086 -3474762 -6007339 -5050755 -2040241
12287 -2040241 -1124928 -2200436 -1340552 1834269 2677829 -1032470 -5059020 -4935761 -2359014
12278 -2359014 -1728024 -3045590 -2520870 887818 3669283 2949603 351740 -638054 852202
12269 852202 2861517 3794992 4014602 4127762 3226252 101797 -4233732 -6801945 -5995839
12260 -5995839 -3512507 -2076174 -2239748 -2636661 -2525661 -2429678 -2559646 -2247281 -1183438
12251 -1183438 -100523 51529 -962237 -2380153 -2749773 -1343248 202099 -894931
12243 -894931 -4596503 -7098417 -5688005 -2681748 -1848118 -2596671 -1391543 1935482 3546089
12234 3546089 1566613 -1334127 -2375302 -2021623 -1471022 -200974 2037792 3651164
12226 3651164 3651253 3213199 3003466 1599215 -1404934 -3433256 -2581234 -815003 -779698 -1631156
12216 -1631156 -1105599 238986 368712 -85814 1125430 3350561 3397861 579754 -2044474
12207 -2044474 -2161181 -968768 -433706 -348556 464923 1916929 3087860 3676393 3838756
12198 3838756 3494576 2733845 2228022 2502049 3274625 3917488 4032272 3336611 1672586
12189 1672586 -480768 -2032665 -2238116 -1411604 -536544 -332788 -699407 -966411 -812286
12180 -812286 -787612 -1338513 -1449242 471962 3873463 5713434 4068149 920833 -284782
12171 -284782 949710 2139000 1751486 978373 1260107 2044100 1926911 670664 -844005
12162 -844005 -1688064 -1171229 928095 3553593 4699459 3604488 1988772 2036926 3637375
12153 3637375 4803546 4523708 3756592 3422776 2898357 1352572 -514548 -1328584 -1093603
12144 -1093603 -1065892 -1716349 -2149728 -1754232 -1107801 -696794 18426 1369276 2391953
12135 2391953 2182458 1579739 2136795 3807395 4953848 4501948 2975414 1533618 1012524
12126 1012524 1695335 2926106 3150042 1483251 -924292 -2169941 -1878997 -982824 155884
12117 155884 1597757 2227231 622939 -2226014 -3372049 -1811108 116308 154698 -969869
12108 -969869 -1252901 -268297 1055463 2091772 2569867 2133500 1061631 366648 208957
12099 208957 -512590 -2088079 -3183097 -3290293 -4003386 -5990108 -6665362 -3607455 1041229
12090 1041229 2852010 1380018 764169 3458091 6532751 5941127 2155824 -810423
12082 -810423 -806873 543835 1177000 1394812 2262546 2895761 1394964 -1817795 -3624752
12073 -3624752 -1997855 1204798 2427925 555482 -2346465 -3713095 -2597095 243995
12065 243995 2855913 3196286 1362292 190584 1785103 4082631 3368751 -83124 -1989251
12056 -1989251 -192972 2380631 2257652 -6320 -1722374 -2090778 -1990204 -1602077 -688380
12047 -688380 15001 -129252 -184125 854851 2074880 2045014 1264411 1290455 2127540 2299525
12037 2299525 1074916 -823938 -2261625 -2410891 -1274128 -344174 -1379474 -3502775
12029 -3502775 -3424756 -162432 2588963 1223585 -2415889 -3476360 -793953 2090379
12021 2090379 2273902 751083 -27292 706328 2058357 2790760 1993346 -235153 -2443927
12012 -2443927 -3144002 -2379040 -1163425 15921 1071643 1601791 1702713 2563650 4630492
12003 4630492 6052232 4732559 1243881 -1898511 -3030325 -1921221 1093226 4556473
11995 4556473 5774381 3644289 608895 -481983 -226690 -831182 -1847789 -1055688 1325150
11986 1325150 2872192 3021586 3389487 4167519 3724724 1991230 820442 606135 -173657
11977 -173657 -1660329 -2201705 -1658819 -1675941 -2178054 -1339316 258544 -426942 -3497925
11968 -3497925 -4892475 -2542150 284623 333992 -728458 67830 1737072 1373242 -908194
11959 -908194 -2659234 -3000590 -2585781 -1249884 1082873 2519556 1496737 -126638 472578
11950 472578 2399542 2224185 -553153 -2645663 -1851519 260465 1233799 794365 187923
11941 187923 414455 1843695 3939564 4895629 3224466 162657 -1248860 -53672 1439967
11932 1439967 1166099 122109 318990 1477352 1744063 948305 977208 2683189 4230402
11923 4230402 3498433 1027085 -692974 -404089 709460 999540 325636 -387477 -538201
11914 -538201 -48919 1093891 2655568 3940539 4429915 4222756 3398761 1708831 -446980
11905 -446980 -1664998 -1131007 228954 1121642 1436209 1406625 578852 -850084 -1056815
11896 -1056815 976740 3235159 3249489 1854134 1632146 2530322 2288502 732422 -44208
11887 -44208 148764 -839105 -3054963 -3536282 -1233993 959773 1000902 852951 2405282
11878 2405282 3688831 2385549 322778 729614 2832892 2957174 141380 -2680273
11870 -2680273 -2894822 -978337 979816 1599252 1078033 944395 2433809 4359620 3950611
11861 3950611 751499 -2273005 -2900740 -2524362 -2874898 -2567383 79957 3085705 3381659
11852 3381659 1742977 1210288 1751639 772682 -1585682 -2187358 -295231 1065269 163561
11843 163561 -915870 -302566 626937 185125 -598263 -25151 1529410 2947700 4428938
11834 4428938 6301722 7614132 7787211 7918702 8479286 7465372 3260119 -1932462 -4146648
11825 -4146648 -2622595 -390500 -47442 -1043119 -1383092 -266466 1505793 2545628 1854014
11816 1854014 -349866 -2507454 -3118478 -2323118 -1429453 -1027744 -513135 534685 1578259
11807 1578259 2010411 1854844 1162808 -363710 -2478166 -3869631 -3436021 -1708793 -225440
11798 -225440 219994 -96298 -895770 -2122957 -3088861 -2745019 -1390977 -932157 -2478003
11789 -2478003 -4583920 -5056717 -3821211 -2573784 -1991197 -991295 1038215 2885662 3133699
11780 3133699 2039247 982030 740908 1017204 1205425 1080508 909184 1008403 1006830 -17117
11770 -17117 -1972195 -2976977 -1484964 1266205 2732048 2783096 3619108 5651428 6297292
11761 6297292 4191385 1835335 1768847 2396406 737706 -2145084 -2205820 1269405 4010462
11752 4010462 2469514 -1643421 -4148467 -3625636 -1886468 -604527 228279 831853 754192
11743 754192 91507 145249 1674983 3147608 2144188 -1290103 -3944318 -2932939 937337
11734 937337 4400716 5676705 5609201 5128857 3693523 1052168 -1199415 -1325852 170586
11725 170586 1222400 796314 -223779 -440202 613958 2245184 3281110 3201186 2757386
11716 2757386 2949191 3421694 2899488 1301972 17262 -331819 -753189 -1735979 -1992951
11707 -1992951 -652168 841584 682034 -564748 -856149 516595 2489869 3794654
11699 3794654 3600281 1557697 -1274221 -2460695 -757336 2161020 3978769 4605725
11691 4605725 5049476 4825870 2950795 548850 -324903 -28571 -666014 -2179729 -2105817
11682 -2105817 270107 2367897 1987968 119967 -1234419 -1977174 -3064858 -4296627
11674 -4296627 -4628549 -3802571 -2388872 -914227 87194 -55910 -1218943 -2038775 -1364196
11665 -1364196 265791 1376936 1428187 1186904 1466255 2179696 2675297 2550497 1994239
11656 1994239 1558088 1767578 2814645 4230838 4766155 3291931 488230 -1079319 181062
11647 181062 2458318 2720873 1075230 586158 2435612 4095948 3487975 2040690 1685199
11638 1685199 1651914 919163 1146752 3624317 5470057 3173025 -1335583 -2714627 119531
11629 119531 2902013 2754749 1406555 812627 85880 -1493804 -2405317 -1938429 -1840216
11620 -1840216 -2734763 -2295616 447412 2193189 -94849 -4313660 -6180995 -4993764
11612 -4993764 -3113236 -1566011 112415 889626 -886053 -3841817 -4457422 -2063494
11604 -2063494 60258 -679084 -3055196 -4459185 -4187342 -3075233 -1687021 -339062
11596 -339062 262746 -171969 -671645 -37830 1591598 3005192 3515680 3540395 3529687 3000855
11586 3000855 1237752 -1190296 -2449181 -1563161 102479 550206 37353 754583 3353041
11577 3353041 5467577 4729110 1941765 -166463 -510442 -367457 -902763 -1594943 -1355988
11568 -1355988 -15811 1748120 3139861 3474499 2328316 45026 -2149478 -3013933
11560 -3013933 -2342991 -969530 288779 1370229 2376800 2627827 1232835 -1208072
11552 -1208072 -2612602 -1933090 -663588 -630923 -1234024 -666552 756783 904019 -419187
11543 -419187 -658236 1432397 3216561 1598126 -2426323 -4827008 -3625404 -996254
11535 -996254 -165555 -1628515 -3016825 -2070435 822656 3140118 3128202 1590204 255774
11526 255774 -785988 -2550589 -4526445 -4809997 -3318798 -2558546 -3941270 -5373272 -4306308
11517 -4306308 -1541575 226609 500507 1062745 2448178 2989164 1795009 434371 567270
11508 567270 1386451 711609 -2053312 -5124401 -6349487 -5340500 -3477188 -2151831 -1460095
11499 -1460095 -854037 -589433 -1522441 -3338494 -4180536 -2850648 -532283 706012 525758
11490 525758 279217 717242 1080565 647063 44674 412864 1832814 3178341 3386729
11481 3386729 2556984 1771825 1928456 2762154 3013969 1578540 -1376631 -4225297 -4992694
11472 -4992694 -3260175 -1013463 -710643 -2223208 -2953156 -1674769 -501012 -1396271 -2583263
11463 -2583263 -1322956 908999 -64074 -4353864 -7001035 -5142643 -2170350 -2223094 -4062465
11454 -4062465 -3954142 -1964792 -1118390 -1758927 -1224227 1095074 2439640 1062539 -1403701
11445 -1403701 -2873364 -3249592 -2924441 -1493431 674484 1804921 1167184 414375 1100517
11436 1100517 2427133 2829824 2334468 1798889 1043442 -534660 -2239301 -2631777 -1558093
11427 -1558093 -359709 -127083 -624508 -893729 -354078 549930 537403 -1164143 -3387460
11418 -3387460 -3762426 -1460432 1583023 2882821 2069531 572513 -466571 -834418 -517995
11409 -517995 239735 461589 -576068 -1917221 -1864345 -506627 119257 -1083260 -2598516
11400 -2598516 -2516263 -1382800 -1434018 -3378327 -5378843 -5511722 -4160953 -3273369 -3740487
11391 -3740487 -4302093 -3178173 -387551 1999195 2099171 425196 -693059 84329 1650292
11382 1650292 2230451 1777069 1607517 2205993 2707247 2455812 1717539 709084 -634790
11373 -634790 -1578108 -891149 1025930 1985143 1064749 109831 662042 1208292 -195098
11364 -195098 -2070953 -1438181 1131652 1981090 166760 -918610 968331 3286014 2842085
11355 2842085 692332 -102435 480685 144494 -1150565 -1105809 566455 1375546 377643
11346 377643 -117422 1277838 2166173 177154 -2599360 -2278190 738640 1932527 -697880
11337 -697880 -3480063 -2219423 1927687 4200130 2485211 -919395 -3327627 -4518681
11329 -4518681 -4982572 -4080822 -1726608 -82207 -1340126 -4534812 -6443464 -5363481
11321 -5363481 -2485902 147243 1454952 1247568 32387 -852596 -286782 1113717 1630284
11312 1630284 731976 -480074 -1258007 -2201610 -3736933 -4870202 -4347600 -2386723 -572291
11303 -572291 -292252 -1446327 -2450560 -1774670 140448 1166572 375000 -443653 524839
11294 524839 2078509 1744110 -266530 -1453174 -1071372 -907505 -1785449 -2252883 -1490825
11285 -1490825 -695711 -525739 40150 1022901 505347 -1932798 -3669012 -3035442 -2123777
11276 -2123777 -3008792 -3768777 -1571603 2248045 3899145 2734608 1461087 1414779 1386342
11267 1386342 1153646 2416483 5242265 6731400 4821010 1217348 -1031812 -1258087
11259 -1258087 -935831 -889333 -390868 1179140 2884944 2922581 783299 -1505530 -1103725
11250 -1103725 2197028 5104100 4343194 438606 -3010433 -3257270 -592884 2725900
11242 2725900 4452337 3704253 1631148 516540 1284238 2390946 2088951 889282 484195
11233 484195 1165641 1991028 2726453 3654742 3976963 2592912 351994 -624461 2547
11224 2547 534683 341254 901039 2826315 3991502 2274372 -1187921 -3271537 -2776802
11215 -2776802 -1432381 -1045725 -1115646 39770 2615290 4851167 5202072 4005080 2557463
11206 2557463 1483951 917472 1349988 2736598 3356616 1590572 -1339537 -2656187 -2089114
11197 -2089114 -1943664 -2707111 -1971448 883300 2522512 686016 -1802125 -1305563 1076407
11188 1076407 2062791 1931361 3086209 4483422 2793729 -1197145 -2713568 -392229
11180 -392229 1391733 -596696 -3624632 -3645547 -1238532 260185 62293 18499 779894
11171 779894 991003 50730 -659072 298989 2529832 4247844 4154250 2740895 1648487
11162 1648487 1606856 1639896 944797 549071 1667214 3240347 3085765 1119605 -609994
11153 -609994 -923315 -451774 299632 1542142 2720999 2750277 2047498 2096677 2665879 1846562
11143 1846562 -627631 -2532066 -2358137 -1096345 -86426 626699 1036294 653051 127712
11134 127712 1010325 2924749 3433042 1811341 426396 1027330 2191648 2016150 909387
11125 909387 -15785 -950793 -1892707 -1472409 517985 1521128 -436948 -3500525 -4485587
11116 -4485587 -3173786 -1759502 -1288937 -1046595 -564856 -8870 843053 2175110 3224075
11107 3224075 3182973 2330530 1302510 407939 482297 2583717 5678685 6837394 5325919
11098 5325919 4065146 4939505 5343271 2379298 -1860021 -2957369 -596638 1559788
11090 1559788 1524949 620948 -183837 -1651550 -3574384 -4140159 -2863659 -1423013 -850312
11081 -850312 -336243 591588 1117852 1001483 1104795 1431800 852497 -566003 -1147115
11072 -1147115 -261121 728361 973034 1474916 2908505 4083518 3807452 2681307 1889143
11063 1889143 1565210 1355962 1303577 1224128 389317 -1297581 -2798252 -3193358 -2448415
11054 -2448415 -740629 1553265 3001775 2119283 -176204 -996444 767493 2966254
11046 2966254 3444124 2834766 2802822 3368740 3659395 3739506 3866145 3248462 1436059 -216416
11036 -216416 -410080 -161169 -1115133 -2539857 -2345458 -502288 1018885 1450873 1847921
11027 1847921 2430604 1928943 189194 -957285 -401754 738682 1368249 2111226 3455255
11018 3455255 4211077 3574628 2977097 3780584 4558438 3112187 233588 -1189693 -376316
11009 -376316 690535 714772 454572 311860 -588334 -1991929 -1960324 -193829 679108
11000 679108 -852202 -2198916 -387920 3090963 4339526 2832578 1664916 2339669
10992 2339669 2910263 1947298 1000938 1599955 2510487 2014124 946031 1234033 2705530
10983 2705530 3593149 3510341 3715547 4467828 4123612 1616260 -1396925 -1998458 553686
10974 553686 3666932 4218608 2237659 782079 1744526 3136642 2072446 -543848 -855095
10965 -855095 2287620 5222800 4315187 715475 -1577186 -863187 1154372 2449845 2671433
10956 2671433 2364944 2074641 2284289 2877194 2720060 1059441 -850299 -971365 638741
10947 638741 1669600 614552 -1363634 -2188086 -1346864 116625 1168887 1422339 800733
10938 800733 -382164 -1122138 -440316 1282337 2321980 1519736 -179348 -804076 185734
10929 185734 1514375 2325229 3391967 5134753 5854419 3933091 1076805 826570 3602418
10920 3602418 5749098 4485555 1498758 58091 550989 991747 509155 -125565 -672747
10911 -672747 -1651152 -2540167 -2011299 -307264 457408 -1006363 -3509140 -4960876 -4504158
10902 -4504158 -2653815 -376999 1378511 1956722 1299841 -297315 -2599234 -5000157
10894 -5000157 -6050067 -4549645 -1220945 1688249 2663290 2013164 757262 -497215
10886 -497215 -1348491 -1332289 -401320 903994 1986944 2386505 1619460 -229587 -1846930
10877 -1846930 -1832447 -679828 -338145 -1441749 -2364599 -1680546 -149211 763850 1046460
10868 1046460 1434014 1578205 648479 -771522 -1182828 -476790 -19554 -181456 509400
10859 509400 2958831 5615245 6158202 4325583 1948073 531270 -210220 -1401836 -3232673
10850 -3232673 -4341326 -3011265 699142 4168927 4516422 2028564 191915 1556270
10842 1556270 4689888 6392658 5803979 4558180 3654317 2502611 1074890 593303 1297328
10833 1297328 1549953 356850 -831457 -211772 1696704 2895852 2580944 1679097 1336665
10824 1336665 1950611 3172556 4022016 3583543 2233233 1384495 1545949 1846392 2011162
10815 2011162 2999254 4602921 4545065 1891031 -538542 271426 2979257 3863956 2467938
10806 2467938 1974328 4056760 6586447 7111462 5819952 4002190 1952301 -215813
10798 -215813 -1451912 -957813 521429 1573782 1512953 407475 -1315645 -2781066 -2968612
10789 -2968612 -1534053 1028237 3774235 5364269 4630416 2227897 782551 1881125
10781 1881125 3833021 4145965 3098844 2609860 2687329 1950107 997399 1886096 4268007
10772 4268007 5396626 4369307 3089062 2405781 738043 -2351228 -4533037 -4271303
10764 -4271303 -3106296 -2662376 -2045260 -116380 2006482 2708864 2183585 1233128 -341596
10755 -341596 -2487432 -3850057 -3620923 -2809537 -2302460 -1393173 456817 2233117 3029783
10746 3029783 3216821 2791446 745644 -2518125 -4341552 -3019646 15040 2478878
10738 2478878 3568859 2919002 25070 -3612015 -4621013 -2181572 323550 301549 -220186
10729 -220186 1514290 4002359 3837948 1076158 -1303767 -1992562 -2124612 -2393772 -2399801
10720 -2399801 -2229396 -2108380 -1108899 1538311 4585104 6233075 6487669 6160009 4879602
10711 4879602 2293623 -117029 -823964 -668191 -1171222 -1724570 -969117 254266 77887
10702 77887 -1132572 -1294312 252810 2366421 4053542 4693571 3432196 697065 -838350
10693 -838350 637355 3082500 3404193 2130704 2142382 3485033 3047501 -302984 -3490930
10684 -3490930 -3279382 -353711 1930733 1679363 291994 446591 2661794 4399816 3414422
10675 3414422 1344910 1813960 4888580 6407708 3924145 183029 -1315647 -1269606 -2335866
10666 -2335866 -4356675 -5049851 -3935653 -2603759 -2065702 -2198762 -2749738 -2936330 -1461624
10657 -1461624 1231790 2477287 1041547 -787382 -775378 12141 -82948 1203 1658774
10648 1658774 3296287 2744827 1059775 621431 1151504 805273 -366452 -1101574 -1505211
10639 -1505211 -2079016 -1847803 -190430 1306475 1428543 1580782 2864659 3597919 2672791
10630 2672791 2332751 4130327 5264999 2977833 -393495 -1137749 -112031 -269638 -935746
10621 -935746 330430 2379118 2216686 398093 -258412 288571 280658 420477 2394904
10612 2394904 4875338 5651878 5886848 7627683 9232721 8043403 5284812 3472101
10604 3472101 1673598 -1493862 -3339253 -1383328 1155931 577403 -127697 3354977
10596 3354977 7587001 6234388 1338074 371266 3651655 4457887 1208327 -349837
10588 -349837 2152200 4178143 3072547 1872314 2448227 2580651 1658309 2041934 3315582
10579 3315582 2344860 193671 1549400 6054287 7825826 5061416 2526995 2874223
10571 2874223 3070334 1330096 223774 926052 1374414 1721390 4499289 8056751 7370792
10562 7370792 2868167 773876 3109099 5097978 4115590 3229359 4004506 3760754 1990388
10553 1990388 1786167 3156480 2659863 976124 2629095 6998636 8253147 5405100
10545 5405100 3511418 3981041 3287222 2066433 4868576 9690009 9156848 3851183 2492969
10536 2492969 6657137 7999706 3687399 1325219 4431161 6308320 3368286 1517640
10528 1517640 3818561 4672457 2010795 2333596 7548885 9721535 5192305 1093572
10520 1093572 1832369 2405149 900138 3257216 9449689 10194267 4029471 1628192 6287909
10511 6287909 7565542 1901334 612890 8371948 13624367 10569606 9771269 15856154
10503 15856154 17189291 10095564 8917093 18024602 20668168 11615546 10690329 24803582
10495 24803582 31021788 21320024 24145721 49331398 58502962 38765194 56435645 162298983
10487 162298983 276378245 261913648 111935535 -30796716 -58941856 -18248013 -4347955
10480 -4347955 -25514054 -30436084 -11697091 -5373687 -17570226 -20079868 -7763216 -4188675
10472 -4188675 -14105460 -17087142 -8253734 -5361314 -13389829 -16647920 -9447956 -4613654
10464 -4613654 -7577063 -8363154 -3366664 -1728348 -6057057 -7493920 -3433518 -1629556
10456 -1629556 -4121246 -4297508 -1704721 -3269416 -8457478 -9134567 -5186988 -4763480 -8325472
10447 -8325472 -8050294 -3868272 -4300161 -9878787 -11313722 -6370505 -3510434 -5928207
10439 -5928207 -6594544 -2761687 -1426228 -5866871 -9491823 -7945354 -5826543 -6577114
10431 -6577114 -6367887 -2932612 -769998 -2692124 -4744919 -3809187 -2413048 -2399634 -1423702
10422 -1423702 1021909 1497218 -477782 -534141 2774081 5165334 4076259 2222181 1472736
10413 1472736 -160659 -3114944 -4240757 -2522756 -1086677 -1634079 -2289525 -2222269 -2953472
10404 -2953472 -4256661 -4220993 -3634423 -4613882 -5299144 -2375705 1717872 1420382 -2446629
10395 -2446629 -3755507 -1755504 -2081984 -6124889 -8295165 -6042971 -4067749 -5501455
10387 -5501455 -6741440 -4706539 -2283984 -2638347 -4002990 -3774703 -2678872 -1786379 -70338
10378 -70338 2543849 4017538 3771920 3090974 1316715 -3139291 -7652497 -7479808 -3724664
10369 -3724664 -2463756 -4807441 -5139279 -1136489 2060609 666066 -1886081 -1564230
10361 -1564230 116317 454762 415068 1251100 1282573 -400327 -1504119 -722114 72187
10352 72187 43440 882784 2170567 926864 -2092762 -2017835 1482345 1987534 -3462640
10343 -3462640 -8669974 -7608773 -3396266 -2413911 -4610805 -5579807 -4290139 -2964226
10335 -2964226 -2152883 -961883 133585 697594 2056450 4293993 4558034 1576573 -1524838
10326 -1524838 -2150594 -2239721 -3894177 -5061629 -3634392 -1982754 -2907473 -4507860 -3664415
10317 -3664415 -1478392 -609994 -189440 1788953 3679668 2793617 608507 465745 1847979
10308 1847979 1687083 -124752 -1126037 -965244 -1287950 -1894556 -1154211 450208 939388
10299 939388 301949 -61306 -416402 -1776570 -2886508 -1744735 533577 884207 -1063724
10290 -1063724 -2696504 -2438818 -1152848 129568 1147539 1441760 911584 842568 2133489
10281 2133489 3347246 2844586 1672705 1596052 1464559 -1150039 -5397152 -7706760 -6814755
10272 -6814755 -4952961 -3763600 -2260206 242316 2029797 1446869 -364986 -862868
10264 -862868 566338 1892868 958987 -1847378 -3723626 -2490906 775508 2992612
10256 2992612 2820798 1816289 1663218 2037398 1963741 1497902 905627 -177726 -1385007
10247 -1385007 -945664 1949131 5221925 5958697 3615493 -40472 -3250849 -5255404
10239 -5255404 -5848704 -5335829 -4514195 -3825481 -2951712 -1649914 -237273 970286 1734685
10230 1734685 1433536 -145526 -1659797 -1552784 -423959 -56651 -276261 671312 2587438
10221 2587438 3194061 1987014 970244 752427 -574520 -3375113 -4939897 -3904539
10213 -3904539 -2726539 -3467045 -4400183 -3446744 -1860400 -1522603 -1425666 -110018 919945
10204 919945 -320118 -2493323 -3049522 -2306702 -2097273 -2113582 -1063772 129130 -126117
10195 -126117 -710530 373071 1939885 1205211 -1351092 -2536995 -1509479 -595418 -1095035
10186 -1095035 -1794785 -1926794 -2278311 -2785448 -2037165 47094 1639871 1833147 1712337
10177 1712337 1993121 1892281 1098302 716605 1350574 2073771 2171618 2262681 2835912 3154301
10167 3154301 2533316 1511000 868012 443218 -223591 -746991 -216117 1572394 3716131
10158 3716131 5080438 5381974 5178205 4720027 3435714 1265194 -218503 446361 2049495
10149 2049495 1879054 -368468 -2030804 -1354978 453980 1905971 3245801 4352356
10141 4352356 3441258 128772 -2615775 -2242360 -331329 290631 206723 1780862 4311339
10132 4311339 4727023 2674718 1112744 1476978 1694083 34154 -1936369 -1838325 23520
10123 23520 1293519 670017 -901653 -1745490 -1400407 -1013827 -1885803 -3768452 -5137931
10114 -5137931 -5135272 -4290139 -3228425 -2057420 -1362747 -2026740 -3361634 -3442572 -2273939
10105 -2273939 -2245573 -3945012 -4205601 -745910 3635551 4614757 2326256 419354 401063
10096 401063 536385 -212151 -736063 -358177 220169 808232 1872418 2665194 1905163
10087 1905163 521104 957685 3321367 4944034 4451664 3574731 3866799 4150616 2804723
10078 2804723 658902 -231007 393077 816117 -179996 -1784745 -2262615 -1282036 -772518
10069 -772518 -2714004 -5950395 -6648690 -2970495 2121011 4327931 3066407 1087631
10061 1087631 196697 -101252 -273277 120315 793377 586403 -638366 -1860818 -2816423
10052 -2816423 -4106854 -5337587 -5291941 -4225764 -3830668 -4488604 -4699110 -3783162 -2964046
10043 -2964046 -2932320 -2443821 -507150 1775540 2765953 2256677 841003 -1214047 -3278243
10034 -3278243 -3901151 -2479452 -460127 433169 466007 1150095 2776243 3967162 3560938
10025 3560938 1907042 134511 -1188824 -2365717 -3788993 -5087510 -5222062 -3614119
10017 -3614119 -1073871 752536 947872 93843 -589230 -609119 -474087 -676118 -810731
10008 -810731 -137241 1204799 2374202 3281314 4552627 5465929 3753647 -854442 -4599576
9999 -4599576 -3911465 -563291 690451 -950091 -1724536 180187 2095948 2189569 2561233
9990 2561233 4407590 4562276 746576 -3359099 -2987813 352243 1410105 -613925 -1709892
9981 -1709892 -254361 750445 -734547 -2597263 -2483197 -1289486 -946780 -1316821 -1027850
9972 -1027850 273332 1697975 2056415 652825 -1794367 -3280021 -2835144 -1999922 -2338298
9963 -2338298 -2588057 -649357 2518284 3888574 2867885 1856647 2307496 3064435 2966931
9954 2966931 2513214 2353370 2239271 1913736 1327461 7350 -2044076 -3210704 -1999975
9945 -1999975 542256 2121745 2172150 1496273 139619 -1781166 -2420712 -502365 1838046
9936 1838046 1837944 530683 624739 1275378 -442022 -3707376 -4783996 -3447928 -3099215
9927 -3099215 -4097611 -2861279 1155526 3544425 2178182 722975 2057161 3513331
9919 3513331 2283113 716412 1860105 3645784 2284264 -1374211 -3453428 -3014875
9911 -3014875 -2219550 -1977398 -1276344 -55248 391252 -510878 -2169964 -3689109 -3840087
9902 -3840087 -1644697 1838007 4176128 4888542 5566175 6019321 4053606 441991 -418162
9893 -418162 2698800 4994638 2916867 -259164 -196635 1599010 1563267 618535 1212350
9884 1212350 1464813 -1313958 -4351299 -3631545 -1723389 -3645134 -7144574 -6266535 -3665258
9875 -3665258 -8574857 -20527569 -25960346 -16361543 -900287 6105764 3416234 397589
9867 397589 1376103 1979685 -668496 -3233223 -2964012 -2265817 -3839098 -6066141 -6107740
9858 -6107740 -4355411 -3136149 -3094273 -3108983 -2450399 -1241921 302447 1757475 2332543
9849 2332543 1891470 1481654 1943206 2595714 2228083 936788 437 70769 363272 -203872
9839 -203872 -1694544 -3267384 -4202369 -4442478 -4272743 -3847779 -3159881 -2293156 -1530913
9830 -1530913 -1207163 -1482457 -2193179 -2861833 -2953981 -2264586 -1048712 291933 1583193
9821 1583193 2802720 3665461 3553833 2145977 121250 -1090240 -592904 1002731 2186258
9812 2186258 2085691 1080160 21611 -519933 -207555 961892 2098944 1900703 456609
9803 456609 -263851 1204893 3614933 4488265 3397146 2273433 2491789 3117700 2373580
9794 2373580 -302509 -3910745 -6544856 -6331821 -3055356 849626 2239502 652770
9786 652770 -1432475 -2029607 -1771441 -1938841 -2086980 -1075180 629996 1327057 430963
9777 430963 -780347 -785689 533257 1873599 1798694 170629 -1659447 -2443310 -2599343
9768 -2599343 -3381336 -4670202 -4881699 -3356148 -1525157 -1024194 -1685748 -2175074 -1811467
9759 -1811467 -1007834 -467848 -536387 -991973 -1264530 -1225801 -1545884 -2579164 -3357631 -2802013
9749 -2802013 -1431603 -392435 673250 2777486 4928922 4843279 2565308 775081 795870
9740 795870 888807 -458804 -2120420 -2565546 -2101458 -1369247 34774 1742063 1796341
9731 1796341 -349370 -2248973 -2012595 -1221003 -1931227 -3050016 -2559809 -1332556 -1431339
9722 -1431339 -2191613 -1502901 147309 527751 -168818 331352 2182073 3169041 2706935
9713 2706935 2518687 2929563 2064150 -321184 -1563758 -121380 1940831 2109964 667115
9704 667115 -858683 -2245617 -3726047 -4444624 -3782561 -2873140 -2979929 -3539063 -3554421
9695 -3554421 -3736530 -5146184 -6539395 -5536455 -2448796 -615718 -2133572 -5060382
9687 -5060382 -6117183 -4812038 -3171381 -2173863 -701070 1724891 3443039 3211656 2496554
9678 2496554 3193424 4207509 2767874 -1242736 -4775373 -5544452 -4108930 -1827580 634500
9669 634500 2228987 1837891 694799 1611805 4501594 5798833 4038963 2447613 3372065
9660 3372065 3852657 646209 -3474749 -3435204 108013 1867816 209292 -1201869 -268999
9651 -268999 423291 -1196002 -3059406 -2778205 -1464440 -1313779 -2068156 -2097403 -985577
9642 -985577 647006 2103362 2249274 263822 -2203899 -1948385 1481988 4675678 4833846
9633 4833846 2988199 1391931 343822 -482244 -74318 2008941 3627594 2615283 135878
9624 135878 -896680 162668 1432877 1544049 852116 40770 -647447 -933014 -677198
9615 -677198 -432114 -795537 -1477792 -1770808 -1462809 -637075 755263 2448152 3669946
9606 3669946 3905572 3110492 1069292 -2119614 -4751866 -4653564 -2341176 -1038108 -2458470
9597 -2458470 -4602933 -5087347 -4467080 -4360100 -4330522 -3119887 -1458987 -995248 -1433157
9588 -1433157 -1313058 -883676 -1614698 -3264753 -3918626 -2868968 -1315239 -243403 467426
9579 467426 992047 1472158 2642985 4577258 5295624 2981582 -737620 -2348034 -1215606
9570 -1215606 54540 180583 758531 2298188 2266968 -700605 -3484286 -2358917 1489045
9561 1489045 3322467 961767 -3058952 -5102254 -3905686 -538138 2951976 4486166
9553 4486166 3323469 1090249 252521 1222933 2091971 1395793 -158295 -1071717 -805309
9544 -805309 448348 2423163 4230272 4198599 1595411 -1909375 -3654656 -2799519 -871766
9535 -871766 405904 853160 1082023 881695 -670092 -3414464 -5240229 -3927307 16336
9526 16336 3233871 2967446 67788 -2395715 -2981625 -2790478 -2699746 -1864505 122281
9517 122281 1579891 994287 -441108 -553625 455132 604618 -379539 -555481 1082450
9508 1082450 3051982 3522755 2338556 450704 -1150679 -1638561 -1024282 -748954 -1846777
9499 -1846777 -2627968 -646500 2808144 3329259 -352390 -3965070 -3636121 -1333490 -1490096
9490 -1490096 -4434653 -6581198 -5826437 -3375678 -861983 1134612 1806014 272382 -2554862
9481 -2554862 -4412062 -4281016 -2981388 -1557885 -867240 -2020517 -4865420 -6571815 -4437887
9472 -4437887 34336 2555635 1559624 -451787 -1187748 -1113633 -1060039 -361418 1309367
9463 1309367 2781717 3460119 4366763 5813064 6199900 4604875 2552393 1606921 1036615
9454 1036615 -381413 -1825562 -1638014 -11069 1267736 1122187 19719 -857848 -430752
9445 -430752 1436257 3216645 2913107 632344 -1249090 -1155629 -138855 144308 -291915
9436 -291915 -588591 -715704 -1083617 -1595168 -2092272 -2669765 -2829610 -1704970 168915
9427 168915 1006864 563910 779971 2393628 3080310 848007 -2594029 -4168076 -3724680
9418 -3724680 -3516759 -4271799 -4350213 -2650993 -208096 1421601 1934568 2122530 2717538
9409 2717538 3453115 3081142 920439 -1575910 -2090054 -534206 864449 1061816 1490559
9400 1490559 2788744 2883082 368245 -2496727 -2769762 -1058699 -40069 -192762 26567
9391 26567 750771 501734 -986120 -2405777 -3093616 -3339468 -2980108 -1962208 -1644560
9382 -1644560 -3069017 -4621708 -4088686 -2323191 -1832190 -2326393 -1261540 1261241 2037777
9373 2037777 -74753 -2270586 -2393145 -1985951 -2956285 -4247611 -4045477 -2812932 -1820642
9364 -1820642 -712678 1130138 2523490 2139989 882024 346863 106763 -1178860 -2890221
9355 -2890221 -3128958 -1817346 -861072 -1347063 -2567600 -3772676 -4868251 -5152458 -3432301
9346 -3432301 -211205 1937987 1409123 -160710 -21516 1908265 2875623 940947 -2533453
9337 -2533453 -4685406 -4515530 -3357994 -2400603 -1216238 723082 2353172 2193908 784697
9328 784697 461494 2323828 4488519 4163658 1018602 -2258908 -2763620 -247789 2937228
9319 2937228 4330528 3290967 667497 -2385153 -4580691 -4427291 -1516512 2205130
9311 2205130 3958298 3220195 1921494 1331190 614901 -723179 -1071832 925296 3809362
9302 3809362 5092425 4488867 3377674 2054932 -163835 -2670460 -3774677 -3142228 -2054611
9293 -2054611 -1326076 -806096 -694771 -1292732 -1624701 -549112 818074 234548 -1949013
9284 -1949013 -2875787 -1570526 -478040 -1507236 -3164661 -3250590 -2133981 -1374186 -946389
9275 -946389 -74052 513387 -488016 -2429948 -3195840 -2004716 -117138 1115356 1489446
9266 1489446 1268344 555315 -362700 -894491 -725915 -174833 155625 -21548 -347410 -190876
9256 -190876 380520 355834 -852915 -2227177 -2371345 -1607854 -1486946 -2347317 -2982146 -2840113
9246 -2840113 -2748008 -3019472 -2736535 -1671778 -1070686 -1465802 -1453200 32342 1736832
9237 1736832 1843380 483350 -881078 -1435699 -1054163 425243 2457429 3374610 2275903
9228 2275903 528396 41183 910646 1990532 2644755 2527216 965706 -1595279 -2736777
9219 -2736777 -812185 2289360 3279178 1649320 -461538 -1771162 -2590563 -2561360 -729540
9210 -729540 1862869 2638359 1358069 792222 2294065 3332219 1366952 -1870098 -2433691
9201 -2433691 547645 3962090 4772860 3029669 690771 -896762 -1618371 -1659254 -933502
9192 -933502 509855 1919277 2131775 794102 -838391 -934699 820108 2615719 2374518
9183 2374518 -29629 -2704803 -3697565 -2745457 -1207502 -554283 -1053234 -1869400 -2184915
9174 -2184915 -1865703 -1079798 164666 1775989 3286184 4204092 4411689 3987133 3047143
9165 3047143 2000669 1371959 1001948 97075 -1436833 -2468670 -2103076 -878939 257129
9156 257129 1247944 2158692 2137419 690569 -736985 -322136 1287270 1580702 -318896
9147 -318896 -2608865 -3513904 -3214359 -2568434 -1689743 -623238 54543 183848 303055
9138 303055 322338 -624144 -2300490 -3110584 -2764126 -3220592 -5314731 -6402322 -3876494
9129 -3876494 356413 2007507 485386 -476360 1320057 3349887 2532195 -173648 -1671972
9120 -1671972 -1368678 -1161431 -1724432 -1661261 -408216 571184 246395 -339211 82278 1186574
9110 1186574 2295341 3857691 6050826 7192633 5704079 2976394 1928410 2827209
9102 2827209 3033790 1384793 205177 1555931 3709128 3541418 1067788 -752644 -50125
9093 -50125 2329973 4905884 6994589 7838361 6404210 2955281 -476495 -1959038 -1243688
9084 -1243688 652467 2382200 2734963 1526110 298794 818096 2596406 3355496 2220754
9075 2220754 718144 92905 -345234 -1256342 -1786757 -1555930 -2102728 -4306421 -6125204
9066 -6125204 -5434169 -3709763 -3854273 -5235229 -4458744 -1122120 965428 -541110 -3069523
9057 -3069523 -3453537 -2821720 -4118820 -6553293 -6133944 -1523395 3739282 5622030 4006726
9048 4006726 1727196 899325 1468820 2327425 2538300 1842814 874268 694815 1553088
9039 1553088 2364557 1933970 420781 -918520 -1202999 -617048 180632 764376 1082533
9030 1082533 1348355 1807044 2299647 2215477 1330725 516979 927212 2426074 3576941
9021 3576941 3479631 2887777 2920774 3255008 2512088 343267 -1746252 -1996919 -339951
9012 -339951 1644570 2474456 2064739 1277175 582410 -347647 -1619543 -2269168 -1212654
9003 -1212654 975501 2173625 1179563 -586103 -701351 1235945 3134491 2972041 993707
8994 993707 -879585 -1158109 32988 1336380 1316578 -435278 -2952806 -4689600 -4726319
8985 -4726319 -3171541 -776244 1308441 1769873 185018 -2034520 -2769953 -1676081 -606010
8976 -606010 -1023935 -2010028 -1767119 -250643 1051845 1579548 2400760 4167303 5670994
8967 5670994 5327831 3459231 2092085 2497632 3717746 3943429 2830409 1642589 1190765
8958 1190765 762459 -262531 -811231 472042 2783518 3917135 3433759 3071274 3515832
8949 3515832 3025048 570287 -1763364 -1613734 -11846 330026 -597090 -308212 1871701
8940 1871701 3683736 3568373 2682765 2307737 1717458 149067 -1076129 -251903 2104552
8931 2104552 3920789 3976860 2476236 240981 -1480001 -1487907 -225435 130436 -1511085
8922 -1511085 -3352263 -3237707 -1791515 -1056712 -986161 216714 2560472 3684644 2333230
8913 2333230 246562 -358348 400966 790530 -178728 -2054079 -3776665 -4416002 -3624273
8904 -3624273 -1919924 -209383 1026957 1614702 1172404 -205572 -1098114 -178262 1465213
8895 1465213 1258787 -1101916 -2751739 -1540191 965735 1853802 737036 -624996 -1430270
8886 -1430270 -2265487 -2902269 -2082078 123514 1733652 1443379 278042 -228514 -189158
8877 -189158 -544427 -1101883 -804183 540826 2137633 3578381 4965957 5629849 4300284
8868 4300284 1277635 -890229 -146697 2393216 3789712 2848309 987078 -145950 -272222
8859 -272222 348052 1475616 2056604 741880 -1647956 -1983676 1185373 4987875 5593239
8850 5593239 3034895 353478 -1067297 -2313577 -3390634 -2360761 924506 3237748
8842 3237748 2078863 -656718 -1222247 1043723 3313728 3091350 746855 -1412558 -1336220
8833 -1336220 1221469 4369954 5586242 4244626 2237348 1613289 2317718 2799300 1992493
8824 1992493 74154 -1882419 -2440429 -946446 1351043 2395842 1845099 1063059 437188
8815 437188 -1059315 -2998675 -3088867 -1194582 -715212 -3410101 -5724308 -3774787 352330
8806 352330 1578762 -473375 -1625529 -343393 430060 -800887 -1427900 311178 2219090
8797 2219090 2314491 2195459 3409564 3884774 1366043 -2182918 -3178791 -1623361 -314672
8788 -314672 -201267 89229 868538 791980 -500779 -1839562 -2626796 -3232397 -3398921 -2424664
8778 -2424664 -878653 -73324 124579 948411 2258751 2523782 1434820 540771 954882
8769 954882 2187104 3418494 4114741 3325012 553145 -2310406 -2244530 905693 3792680
8760 3792680 3861241 2185650 904200 99182 -1000435 -1668076 -828648 698976 1365357
8751 1365357 1423825 2114099 3022908 2647120 1305335 1040939 2400691 3574550 3292112
8742 3292112 2487389 2290338 2324297 2026708 1790068 1508536 -152562 -3313311 -5397369
8733 -5397369 -4338652 -1994661 -1713194 -3281059 -3350479 -840491 1353231 895138 -814043
8724 -814043 -1593677 -1871595 -2810777 -3262000 -1547598 975830 1186114 -1382412 -4007250
8715 -4007250 -4489381 -2968273 -221850 3108416 5313028 4440447 1236356 -1116021 -1152556
8706 -1152556 -705262 -1304943 -1665608 -482358 753713 153150 -1257343 -1307221 -394964
8697 -394964 -604377 -2014001 -2788132 -2508703 -2509063 -2891466 -2122745 -151325 762470 -656663
8687 -656663 -2835171 -3922798 -4156003 -4338625 -3976458 -2693985 -1840901 -2529278 -3208595
8678 -3208595 -1594321 1483885 2629062 518877 -2247897 -2876748 -2123004 -2733986 -5183676
8669 -5183676 -6873639 -5630276 -2471052 -186027 -87795 -1098426 -1626860 -1331250 -947706
8660 -947706 -1202312 -2250712 -3651705 -4532847 -4212867 -3003796 -2008229 -1843798 -2073530
8651 -2073530 -2218000 -2582653 -3366580 -3611995 -2147110 637273 3006118 3882678 3657280
8642 3657280 2908043 1444288 -830220 -2968252 -3738423 -3017490 -1810894 -1046390 -840450
8633 -840450 -894580 -1118189 -1588916 -2037788 -1720998 -130752 2144077 3620453 3239764
8624 3239764 1296374 -1089107 -3031910 -4105362 -4010735 -2748913 -988986 385220 1121894
8615 1121894 1518264 1613039 1139080 344851 118707 864676 1663453 1059680 -1291833 -3954868
8605 -3954868 -4830950 -3126859 -254635 1462765 1079163 -272262 -1002897 -807167 -463724
8596 -463724 -536641 -871492 -970422 -370277 865108 1601796 451214 -2047460 -3054801
8587 -3054801 -670796 3102062 4386612 2210513 -581878 -1304744 -313854 699251 1262718
8578 1262718 1621700 1227751 -434836 -2227206 -2264533 -329122 1847375 2640050 1844187
8569 1844187 95345 -1794707 -2730670 -1765945 648106 2545261 2357742 623513 -887469
8560 -887469 -1479327 -2030836 -3095006 -3671657 -2766371 -1333615 -1196032 -2280758 -2682458
8551 -2682458 -1793327 -1396196 -2586142 -3578022 -2503119 -817144 -1277918 -3403497 -4029303
8542 -4029303 -2337157 -1072385 -1931409 -2908588 -1951129 -503250 -923140 -2358117 -2087959
8533 -2087959 125598 1899553 2017034 1685482 1904030 1976819 1217711 169157 -637977
8524 -637977 -1539843 -2554172 -2723725 -1544639 61287 1065661 1619700 2125047 2049168
8515 2049168 954786 49081 1111209 3784454 5306368 3610410 -137169 -2932032
8507 -2932032 -3366826 -2630565 -2195954 -1911394 -1186521 -886201 -2303163 -4468889 -4459482 -1179135
8497 -1179135 2703523 3935603 2747263 2075855 3242498 4320415 3132864 253439
8489 253439 -1914339 -2055640 -872413 366477 1012392 755899 -647570 -2554823 -3002988
8480 -3002988 -497229 3463139 4986352 2074559 -2526212 -4318425 -2432227 -20972
8472 -20972 726069 1338858 3597514 5775169 4897427 1500906 -683980 349039 2703952
8463 2703952 3693449 3023714 2028966 1377651 806260 342521 670278 2227861 4219395
8454 4219395 4724471 2447016 -1266452 -3157440 -1785140 501489 727475 -712047 -1314087
8445 -1314087 -755699 -976574 -2168957 -2054371 8825 1396808 246872 -1741877 -2517559
8436 -2517559 -2995732 -4535928 -5361952 -2857330 1779209 4482121 3519952 951532 -837093
8427 -837093 -1352698 -868367 174678 380841 -1435993 -3909548 -4400746 -3017089 -2629158
8418 -2629158 -4125957 -4662210 -2212980 870962 1165859 -1036817 -2856523 -3294409 -3780881
8409 -3780881 -4974479 -5730608 -5266174 -4143450 -2885777 -1486248 -510000 -829729 -1826423
8400 -1826423 -1625709 159777 1514690 784651 -1042612 -2005622 -1958704 -2188922 -2946151
8391 -2946151 -3060412 -2007700 -865109 -720965 -1219329 -1390733 -1155790 -1101298 -1171519 -610416
8381 -610416 727840 1902818 2115049 1766210 1779797 2355181 2996077 3368295 3393629 2789660
8371 2789660 1418002 20843 -318448 430855 1234143 1460449 1379650 1023299 -206026
8362 -206026 -2223131 -3749282 -3945880 -3481349 -2996037 -1674820 1175132 3976485 4160379
8353 4160379 1442818 -1701886 -2837277 -1503870 1481396 4951149 7224664 6600395
8345 6600395 3011036 -1459100 -4198852 -3849098 -796850 2997041 4847313 3526549
8337 3526549 829052 -436460 -134146 -691784 -2946320 -4412512 -2966173 -121631 1367081
8328 1367081 1520790 2191784 3080065 1746104 -2095376 -4988251 -3829287 26600 2340197
8319 2340197 1035826 -1679915 -2279987 -2776 2631054 3033224 1397246 -99656 -209611
8310 -209611 385947 777160 1083131 1555913 1722770 1283200 929012 1406002 2483435 3494258
8300 3494258 4020276 3506377 1474845 -1060408 -1893153 -540590 658327 -174377 -1739050
8291 -1739050 -2030196 -1720722 -2374102 -2798521 -758624 2306170 2245613 -1628324 -5036234
8282 -5036234 -4686027 -2523226 -2232953 -4136412 -5692811 -5168859 -2821129 125837 2023409
8273 2023409 1646101 -116609 -779643 403719 1379240 787417 275021 1383380 2342233
8264 2342233 730361 -2163928 -2674782 238270 4036902 6280028 6743234 6053231 4667743
8255 4667743 3438621 3150963 3234660 2599287 1695535 1934278 3108747 3382229 2060401
8246 2060401 496887 -128583 -198484 -381370 -558635 -545545 -549367 -501023 -65354 569979
8236 569979 1060460 1800924 2983016 3223203 1204670 -1538186 -2011230 -199038 645936
8227 645936 -1024453 -2639075 -1621615 646020 1193096 -120331 -1074277 -801577 -526597
8218 -526597 -1064064 -1733402 -1798565 -1431503 -1098116 -966392 -841102 -109975 1623875 3236599
8208 3236599 2574685 -523685 -2815952 -1070117 3624820 6751377 5490122 1445155
8200 1445155 -1802525 -2468364 -1570993 -1190572 -2155956 -3129695 -2183890 479007 2302848
8191 2302848 1655515 141279 153058 1140899 483491 -2280182 -4460324 -3854487 -1346817
8182 -1346817 836030 1680870 1271613 -258789 -2332427 -3535950 -2909988 -1075814 705231
8173 705231 1845379 2094959 978361 -1202200 -2594675 -1573843 939475 2359879 1748958
8164 1748958 939587 1890587 4045686 5232834 4544572 3183416 2479636 2197294 1443811
8155 1443811 482418 468705 1494248 2173813 1654983 848204 722722 477803 -1051923
8146 -1051923 -2864030 -2703126 -567925 793275 -354780 -2343252 -2699602 -1525036 -588021
8137 -588021 -297408 283461 1055249 886547 40168 233435 1554440 1523691 -1299279 -4502283
8127 -4502283 -4691501 -2210817 -612972 -1545099 -2627970 -1287452 1457323 2824811 2525474
8118 2525474 2829046 4681675 6156149 5489764 3695461 2769511 2718590 2167592 1090799
8109 1090799 856856 1687676 2153168 1677726 1591840 2607442 2952055 785274 -2538867
8100 -2538867 -3727094 -1928748 85263 -313938 -2219557 -2641293 -452091 2363581 3204374
8091 3204374 1586542 -866324 -2548574 -3450246 -4591878 -6198550 -6929709 -5331241 -1876161
8082 -1876161 1129623 1963961 1228059 629718 556313 -130885 -1923888 -3492178 -3360056
8073 -3360056 -1966693 -1109221 -1759770 -3393294 -5098555 -6081106 -5248811 -2085691 1525888
8064 1525888 2238161 -656673 -3560710 -2813602 610481 2909248 3024016 3401984 5257753
8055 5257753 6469811 5341789 3392406 2443839 1527135 -767091 -2953957 -2746020 -1063115
8046 -1063115 -608148 -1223077 -232080 2631579 4266743 2967201 878262 367346 833772
8037 833772 840108 832168 1606272 2170279 1463359 552818 749375 953159 -535754 -2613577
8027 -2613577 -2593209 -381110 1294365 881757 -293279 -756218 -954923 -1663217 -2206721
8018 -2206721 -1593557 -299611 224033 -714882 -2480300 -3865159 -4057119 -3190560 -2065058
8009 -2065058 -1136170 -155219 863464 1170355 579874 244040 901746 1409874 666687
8000 666687 -117803 666535 1801160 879190 -1260012 -1249366 1297389 2764913 1227788
7991 1227788 -638980 -373530 323273 -462012 -387688 3290284 7680940 7222897 2005481
7982 2005481 -1897780 -955765 1583242 1477742 -663222 -1872070 -1890317 -2421147 -3248110
7973 -3248110 -2519796 -261513 1265096 797887 -507250 -1193170 -1220046 -1026209 -400727
7964 -400727 781151 1655656 1273109 135446 22056 2053149 5188003 6915864 5620989
7955 5620989 2294906 -325938 -517572 754201 1244409 282303 -524386 316143 1938897
7946 1938897 2303648 1282267 1031423 2710802 4348472 3460103 755195 -858542 -523169
7937 -523169 -129717 -504239 111125 2321024 3188096 284463 -3829386 -4500101 -1425132
7928 -1425132 1174547 598609 -1513734 -2854275 -3559783 -4357687 -4497987 -3413822 -2284321
7919 -2284321 -2041341 -1584383 142590 1880715 1884279 749915 357106 927450 1114767
7910 1114767 310508 -940415 -2136653 -2751825 -1837042 435915 1755022 389762 -1881879
7901 -1881879 -2121775 -868484 -1306835 -3830994 -4973272 -2779154 98940 604322 -245891
7892 -245891 309963 2053884 2468371 1033501 -224078 -205242 8895 -343735 -424952 221953
7882 221953 472389 -469802 -1494107 -1144016 298638 1382823 1326415 376396 -807511
7873 -807511 -1166791 426067 3580389 5862457 5336010 3153657 2018125 2383246 2140520
7864 2140520 256400 -1455051 -1158586 251200 696600 -151656 -1152864 -1863298 -2556513
7855 -2556513 -2763111 -1826769 -682492 -1056248 -2762342 -3735806 -3129787 -2441962 -2865881
7846 -2865881 -3428725 -2882912 -1787076 -1274066 -1088236 -489168 -134755 -1270088 -3461880
7837 -3461880 -4709046 -3759031 -1245396 1276468 2519922 2090427 885101 456402 1080001
7828 1080001 1094001 -769426 -3232375 -4186077 -3889190 -4494839 -6546720 -7997703 -7116482
7819 -7116482 -4601247 -2156208 -488837 471038 644536 81935 -633155 -1003810 -1099947
7810 -1099947 -1089947 -962520 -834711 -696426 80810 1784260 3004383 1959001 -507732
7801 -507732 -1237784 1009520 3521184 3220212 691880 -1074963 -673701 922286 2575796
7792 2575796 3813628 3833498 1834906 -1391621 -3761157 -4095173 -2948292 -1346893 10811
7783 10811 408322 -505635 -1749051 -1779764 -561879 375058 221939 -107908 287646 938074
7773 938074 1108097 1071229 1378416 1835115 2165598 2876579 4415341 6047136 6579844 5837265
7763 5837265 4572519 3300715 2068646 1054016 497595 202533 -143889 -362110 -258172
7754 -258172 -429973 -1612424 -3271132 -3860533 -2669728 -549892 1380154 2785822 3471375
7745 3471375 2712742 186725 -2886926 -4482615 -3724879 -1628867 129686 814371 923738
7736 923738 1132879 1207066 282380 -1636350 -3018962 -2446594 -648709 223857 -559452
7727 -559452 -1556679 -1663661 -1678823 -2233077 -1909629 488964 2987714 2472113 -627863
7718 -627863 -2487104 -1081251 1517849 2902890 3556545 4691560 5442581 4581517 3144204
7709 3144204 2769701 2845123 1948924 896618 1366311 2376767 1499326 -698467 -972293
7700 -972293 1403432 3239000 2327907 515199 200283 640392 -34647 -1354059 -1553485
7691 -1553485 -632042 -29063 -123276 34122 1063532 2659505 3960216 3718489 1381420
7682 1381420 -1256644 -1407852 596284 987995 -1862525 -4308926 -2665934 933380 1699122
7673 1699122 -592353 -1969414 -1008836 -438429 -1713719 -2598374 -1453010 67520 422329
7664 422329 808129 2213992 2919035 1499647 -137661 488551 2495745 3228419 2402585
7655 2402585 1837139 1898167 1084320 -865371 -1918223 -520571 2105912 3289669 1897064
7646 1897064 -516584 -1457504 -276199 1167608 1060187 155080 436180 1791195 2131413
7637 2131413 977568 485322 1991274 3840513 4014563 2829273 1427809 -350934 -2632163
7628 -2632163 -3920190 -3179756 -1978398 -2109549 -2414958 -666175 2410423 3909415 3043513
7619 3043513 1830972 1619132 1610301 1019562 199443 -771389 -2337324 -3800714 -3513634
7610 -3513634 -1368869 721307 1385836 1133723 709582 -70716 -1227561 -2017606 -2068399
7601 -2068399 -1669736 -571857 1801399 4482106 5232811 3558186 1684733 1450508 1780158
7592 1780158 559520 -2180993 -4325828 -4223254 -2181220 40757 600096 -938386 -2999121
7583 -2999121 -3489514 -2070377 -151519 1238981 2262866 2958650 2868752 2436018 3009582
7574 3009582 4651116 5525849 4405360 2283393 539363 -922100 -2472428 -3229474 -2327208
7565 -2327208 -629740 380122 588856 687740 405763 -1132256 -3713415 -6046630 -7184949
7556 -7184949 -6915185 -5243303 -2683100 -674328 -443791 -1487445 -2144922 -1652709 -815056
7547 -815056 -644622 -1089167 -1348035 -1074910 -907095 -1532781 -2268851 -1379946 1507329 4231714
7537 4231714 4704408 3901125 4239672 5429234 4610393 960921 -2664561 -3728014 -2982339
7528 -2982339 -2030553 -572145 1866012 3760433 3642987 2617247 2446954 2685961 2104301
7519 2104301 1393231 1737086 2037608 518799 -1879811 -2692352 -1755895 -859775 -229974
7510 -229974 1368256 3274155 3065524 409593 -2159029 -2717618 -1543468 857947 4208576
7501 4208576 6587521 5507786 1831590 -560276 -157253 331806 -1066059 -2229524 -775233
7492 -775233 1834710 2877983 2640596 3003383 3658205 3046580 1779413 1722675 2356080
7483 2356080 1415584 -914679 -1741584 -16730 1606886 753251 -1238207 -1617808 -245860
7474 -245860 816141 847204 1314272 3003912 4250847 3162339 547692 -848374 205181
7465 205181 2170760 3188985 3289991 3264459 2696818 802091 -1459690 -2048973 -674441
7456 -674441 747253 822953 349944 661131 1664817 2397705 2557351 2588195 2784854 2944628
7446 2944628 2660437 1816369 1044330 1258736 2104044 1704989 -724335 -2904498 -2157578
7437 -2157578 512911 1596253 248862 -736616 261174 1213744 310675 -780993 98398
7428 98398 1805307 1860297 429480 -506141 -651611 -1203780 -2043631 -1948829 -1162646 -1150235
7418 -1150235 -1978045 -2261008 -1579862 -768640 27029 1342724 2532886 2201849 618792
7409 618792 -471562 -604580 -960126 -1779711 -1849384 -1134578 -1498498 -3731013 -5918771
7400 -5918771 -5997547 -4229490 -2034533 -61523 1320062 1251294 -298249 -1629801 -1267668
7391 -1267668 61490 711048 480395 311104 384079 51377 -687221 -977096 -324705 844097
7381 844097 1645985 1185133 -845460 -3237809 -3740306 -1569429 1221717 2163287 1522687
7372 1522687 1437274 2339749 2367270 682713 -721715 242365 2694198 4026512 3395267
7363 3395267 2329962 2126843 2230030 1541357 104377 -1187494 -1782210 -1665776 -841680
7354 -841680 710984 2711963 4587347 5646405 5196208 3118161 667891 -171981 995423
7345 995423 2007363 713852 -1867736 -2521363 -112508 2652287 2472418 -690796 -3888430
7336 -3888430 -4463321 -2162458 1312712 3820114 4176233 2939226 1766954 1606373 1846707
7327 1846707 1555931 860228 485815 592665 891441 1466708 2621866 4088132 4998504
7318 4998504 4553454 2592606 88769 -881089 1116294 4610900 6138832 4422956 2202591
7309 2202591 2461816 4304442 4653762 2921444 1377867 1356153 1839858 1948599 2144514
7300 2144514 2365665 1487224 -367041 -1272279 -487298 160112 -650171 -1348371 -89682
7291 -89682 2037708 2754347 2236066 2418234 3368987 3078418 899650 -1234317 -1566988
7282 -1566988 -532452 609785 1367580 1461425 402509 -1197442 -1307594 1019030 3700780
7273 3700780 3738597 879345 -2204807 -3231555 -2476612 -1523047 -1132565 -920189 -282465
7264 -282465 986210 2468938 3039367 1556318 -1734643 -4855219 -5774994 -4290743 -1846386
7255 -1846386 146225 1210801 1408583 1019963 769005 1518079 3195462 4416314 3732059
7246 3732059 1306279 -925724 -1034869 836433 2419279 1749766 -544674 -2191526 -2420388
7237 -2420388 -2747472 -4066439 -4735623 -3164155 -876661 -639558 -2275515 -3032925 -1983697
7228 -1983697 -1146610 -1732362 -2273166 -1717540 -1528140 -2768746 -3548117 -1818784 1100818
7219 1100818 2386436 1726657 925357 661390 402884 694322 2491736 4442822 3794059
7210 3794059 386271 -2799730 -3650712 -3152077 -2874360 -2492974 -1146159 326270 69270
7201 69270 -2412998 -5471832 -6774701 -5468924 -3182240 -2483454 -3859865 -5036136 -4109875
7192 -4109875 -2153976 -1276667 -1377057 -917630 50329 127009 -695262 -1075184 -842153 -940096
7182 -940096 -1031974 172014 2188993 3081703 2623446 2415283 2777741 2509792 1860625 2377520
7172 2377520 3444832 2690215 496527 -22106 1297530 573135 -3502483 -6575398 -5178108
7163 -5178108 -2091905 -1411627 -2085552 -862050 1442356 1606265 -253623 -1512864 -1927798
7154 -1927798 -2811852 -2770499 471638 4759637 5428503 2480022 558933 1339282 1357464
7145 1357464 -1302762 -3485814 -2442263 -272486 22902 -722026 -146060 1453815 2224934
7136 2224934 1811287 711681 -1304882 -3681759 -4085521 -1559148 1244390 1687808 1197399
7127 1197399 2675740 5388601 5867078 3171481 -55583 -1595294 -1649530 -740581 1307249
7118 1307249 3551766 3823110 1702701 -434653 -646644 42384 -270274 -1268883 -1179447
7109 -1179447 306312 1719575 2126721 2108824 2322156 2523576 2477334 2559876 2631019 1347673
7099 1347673 -2063689 -5808288 -6841385 -4434817 -1115874 508649 574532 622764 710043
7090 710043 -331792 -2236829 -3010493 -1799467 -384498 -782199 -2470703 -3210256 -1998760
7081 -1998760 23193 1416600 1989729 2174334 1804444 422750 -1387773 -1959611 -434143
7072 -434143 1817292 2618521 1739802 1046808 1560318 1772046 -17091 -2835389 -4196493
7063 -4196493 -3532142 -2598118 -2548893 -2576784 -1928288 -1406753 -1814901 -2323075 -1770642 -773032
7053 -773032 -1153173 -3503941 -6304224 -7464350 -6212874 -3590480 -1505848 -1155432 -2054149
7044 -2054149 -2700173 -2188185 -848633 546599 1505694 1716756 1089085 181681 -168079
7035 -168079 41166 -33144 -694885 -1180933 -905666 -318914 337 168241 245666 -370628
7025 -370628 -1856625 -3018482 -2529387 -659717 1164388 2094069 2213345 1632247 394975
7016 394975 -865297 -1308795 -1036616 -972364 -1496275 -2014265 -2001435 -1642244 -1223274 -744930
7006 -744930 -552545 -1550814 -4019076 -6590255 -7220888 -5268464 -2149446 152838 848909
6997 848909 515767 37834 -131766 70015 380215 134549 -1180035 -2941878 -3591959
6988 -3591959 -2392466 -503973 342048 -231087 -1422247 -2777430 -4314324 -5413525 -5114589
6979 -5114589 -3749231 -2832770 -2818536 -2396562 -872586 173077 -966272 -3219735 -3681679
6970 -3681679 -1288980 1856229 3046676 1815488 -96290 -857830 -249122 339693 -611154
6961 -611154 -3033350 -5077911 -4970086 -2928498 -790928 133267 202359 375429 746154
6952 746154 666497 -31535 -641735 -567282 -187613 -243348 -554136 -63961 1601918 3308594
6942 3308594 3733568 3041573 2483392 2644203 2986820 3010825 2896529 2870642 2745603 2241661
6932 2241661 1128392 -794007 -2957232 -3596074 -1539697 1509516 2255939 -37980 -2409961
6923 -2409961 -2186178 -433006 29574 -1347781 -2673298 -2580404 -1406270 172950 1783220
6914 1783220 2624522 1798869 -242030 -1784856 -1778356 -850189 -280033 -707448 -1824655
6905 -1824655 -2618580 -2101239 -572056 212468 -897857 -2640813 -2857419 -1519071 -736536
6896 -736536 -1713885 -3235118 -3571340 -2524300 -961337 546492 1824949 2540112 2258162
6887 2258162 895009 -960730 -1983139 -957793 1561360 3246820 2953154 2810195 5330300
6878 5330300 9038252 9866074 7171993 5075500 6348748 8092699 6094053 1154880
6870 1154880 -2246698 -2349260 -1650064 -2304336 -3327735 -3081095 -1793392 -401440 1044274
6861 1044274 2505276 3136660 2667401 2227029 2462950 2120522 100174 -2122633 -2133069
6852 -2133069 -201122 832959 -418952 -1906190 -1152330 1183137 2273319 996622
6844 996622 -811503 -1088755 -39391 856065 1175019 1571226 2019483 1719975 955003
6835 955003 1321273 3132746 4084449 2261293 -428518 -211286 3073053 5009876 2413821
6826 2413821 -1991453 -2957339 331851 3425800 2823483 351601 38890 2589226 5100295
6817 5100295 5450487 4651208 4537124 5029357 4811694 3586030 2246377 1236634 128712
6808 128712 -1022353 -1145091 371946 2516496 3815890 4072398 3905796 3019279 485921
6799 485921 -2965978 -4648497 -3124881 -620583 -559296 -3173888 -5398600 -5147960 -3660266
6790 -3660266 -2813030 -2106144 -74880 2542244 3325359 1686140 -167969 -269351 691207
6781 691207 790613 -462753 -1896067 -2361156 -1654016 -142781 1568081 2607879 2191595
6772 2191595 353483 -1802847 -2823369 -2180613 -963823 -839529 -1928442 -2407643 -1124277
6763 -1124277 195268 -920935 -3667172 -4441755 -1952469 654252 300971 -1627007 -1763403
6754 -1763403 23372 897380 -209616 -1262475 -627532 920900 2241791 3294855 3785109
6745 3785109 2828048 1039323 584770 1837874 2317916 527018 -1543764 -1743901 -1207476
6736 -1207476 -1842630 -2557659 -1344046 514910 275155 -1095465 65835 3843352 5960563
6727 5960563 4340760 2134575 2235838 2851256 1503522 -81897 923679 2924825 2026301
6718 2026301 -1485976 -3343121 -1873828 -51530 -141730 -347394 1326702 3140562 2235292
6709 2235292 -848200 -2998101 -2888403 -2168992 -2642012 -4088759 -4990814 -4235451 -2042877
6700 -2042877 106409 681794 -244383 -1038248 -684804 -121151 -619754 -1701832 -1799565
6691 -1799565 -460422 1228420 2064568 1623420 180276 -1220549 -1098007 827991 2670045
6682 2670045 2415159 777734 490308 2557658 4767741 4604681 2383860 489727 311567
6673 311567 1094315 1590461 1789810 2582629 4139882 5263796 4652159 2508319 296074
6664 296074 -1034031 -1692331 -1743836 -452864 2141423 4146874 3836488 2100415 1243761
6655 1243761 1714149 1846119 831396 -23007 481035 1644480 2085282 1400742 -113211
6646 -113211 -2173386 -4174678 -5168161 -4766811 -3176602 -294099 3655363 6506208 5592288
6637 5592288 1735028 -699872 671586 3098674 3229992 2304917 3571022 6353379 6824914
6628 6824914 4155240 1747654 1840613 2672720 2234603 1409147 1516691 1613067 540002
6619 540002 -518654 67399 1547167 2132381 1822360 1654511 1336708 38093 -1285927
6610 -1285927 -780759 1521395 3923565 5577826 6600771 6271015 3811637 906521 566506
6601 566506 2887661 4551572 3461967 1387090 732717 1081914 728319 -303829 -829675
6592 -829675 -657734 -185660 945175 2778903 3706930 2411304 407806 383875 2374926
6583 2374926 3740505 2768857 281569 -2212493 -3890451 -4172087 -3046686 -2014113 -2632347
6574 -2632347 -3967729 -3677029 -1749819 -565089 -805081 -338591 1787748 3431514 3169044
6565 3169044 2899577 4154888 4687889 2036426 -1757700 -2830177 -1446378 -1218109 -3084198
6556 -3084198 -4230779 -3098513 -1448233 -660049 308707 1937535 2450496 953876 -417399
6547 -417399 525137 2973555 4782298 5268378 4724891 3049057 673645 -745436 -330826
6538 -330826 676382 950325 822856 648798 -533426 -2940848 -4728320 -4816844 -4870918
6529 -4870918 -5938791 -5475444 -1250725 3567519 3622363 -909288 -4196512 -2764891 485173
6520 485173 1431436 119652 -1006438 -1264582 -1587480 -2091605 -2128674 -1711789 -1177342 -287272
6510 -287272 1032542 1951093 1841070 1236458 758079 119115 -851290 -1301784 -574681 608332
6500 608332 1197026 1174886 990355 640892 270685 594123 1625638 2028589 927907 -599537
6490 -599537 -1082887 -718171 -492159 -214500 914111 2454122 3203404 3157772 3343791 3890801
6480 3890801 3853554 2924618 1865536 1194995 807779 905717 1843527 2876009 2570820 947644
6470 947644 -130588 612788 2110542 2375510 885415 -1175037 -2448277 -2462062 -1504041
6461 -1504041 -100003 1309506 2354559 2546981 1506875 -329385 -1717091 -1903252 -1457221
6452 -1457221 -1087156 -250124 1887853 4527397 5764792 5038754 3594064 2365032 997234
6443 997234 -554105 -1092809 178926 2281162 3666835 3837239 2982310 1180451 -1029065
6434 -1029065 -2362976 -2252593 -1655824 -1310237 -324542 2011769 4137942 3948998 1987860
6425 1987860 816694 1508917 2906383 4176714 5540640 6099042 3853061 -698538 -3528026
6416 -3528026 -1852449 1873742 3264328 1986344 1446414 3047979 4188693 2759434
6408 2759434 569838 403270 1829760 2387015 1665024 1502348 2417255 2528340 721935
6399 721935 -1285562 -1364389 74379 1081157 1062417 928302 932634 268198 -1147470 -2212939
6389 -2212939 -2389811 -2405369 -2622349 -2199247 -806936 180202 -498017 -2021303 -2756174
6380 -2756174 -2597227 -2410878 -1903024 -127867 2098424 2561070 851723 -880261 -1198179
6371 -1198179 -1381611 -2827022 -4254338 -3504893 -1021128 687314 633103 219633 376728
6362 376728 -13558 -1893106 -3910671 -4054029 -2512578 -1252452 -971318 -214406 1926802
6353 1926802 3812566 3391330 1425206 575742 1359283 1371632 -541760 -1808350 -42348
6344 -42348 2430663 1281536 -3254817 -6254400 -5072884 -2675815 -2342547 -2612158 -536967
6335 -536967 2612928 2838554 -399349 -3240549 -2839356 -651398 403079 -373806 -1651383
6326 -1651383 -2264966 -2199199 -2281171 -3265425 -4522627 -4032104 -906448 2625427 3475575
6317 3475575 1591728 -307582 -619751 -262183 -212651 -159712 -99880 -798141 -1742998 -971539
6307 -971539 1790077 3854771 2974839 416086 -852439 258945 2507379 4241417 4517217
6298 4517217 3347974 1955565 1832281 2745365 2812042 1229080 -539725 -1108374 -1034287
6289 -1034287 -1280588 -1505532 -1185873 -891490 -1085884 -1116381 -653720 -546144 -1014371 -910671
6279 -910671 -229549 -1099028 -4232485 -6659824 -5660154 -2988737 -2085943 -2741716 -2173450
6270 -2173450 -339476 -89187 -2045079 -3217466 -1587296 1101302 2290279 1760168 603232
6261 603232 -777472 -2302545 -3460422 -4051315 -4491397 -4674278 -3728012 -1461313 1053393
6252 1053393 2704737 3145382 2380592 808366 -402429 -385652 10725 -713693 -2422201
6243 -2422201 -3620274 -3664305 -2911731 -1142248 1855025 4276370 3553301 67628 -2844004
6234 -2844004 -3269772 -2743024 -3088351 -3718775 -3371352 -2403515 -1789473 -1415734 -776672 -65188
6224 -65188 556674 1496748 2569272 2613249 1219141 -423672 -1213444 -1349543 -1158730 -233453
6214 -233453 1371946 2510488 2420369 1625151 806219 198813 457839 2255852 4494663
6205 4494663 4998559 3639090 2484085 2158494 902763 -1551460 -2416874 -287654 1881024
6196 1881024 1061684 -1144173 -1378683 39816 335076 -562496 -198270 1641082 2409693
6187 2409693 1291584 506174 1312015 2001677 1177801 211689 734720 1859004 1781067
6178 1781067 642630 -29299 233223 605845 640606 705167 882014 620346 -256662 -971080
6168 -971080 -701809 207312 447645 -717462 -2471733 -3358653 -2918093 -1886800 -985935
6159 -985935 -272724 362822 938392 1691682 2776583 3633339 3656124 3363664 3548538 3388311
6149 3388311 1334823 -1813543 -3007418 -1047103 1640538 2662352 2860846 4032653
6141 4032653 5607072 6078080 6042690 6869052 7371614 4960670 -69308 -4190523 -4917201
6132 -4917201 -3225204 -1386740 -451976 -423588 -1158163 -2291016 -3344281 -4299467 -5203397
6123 -5203397 -5292470 -3646300 -714441 1832628 2702914 1624854 -1042978 -4114011 -5506107
6114 -5506107 -3915929 -493693 2318614 3401346 3405595 3182311 3081326 3311646 3633902
6105 3633902 3139470 1565536 144266 -158565 -254453 -1140062 -1659649 -266118 1912503
6096 1912503 2368449 1069847 310510 878732 1160892 297287 -460557 -151968 476690
6087 476690 626241 461979 -30400 -1191012 -2287876 -2048393 -943134 -765623 -1607178
6078 -1607178 -1633000 -323160 618296 261336 -245758 -200239 -496955 -1246099 -1032530 142109
6068 142109 35565 -2026264 -3296521 -1639295 1143752 2344696 2303135 2674218 2924706
6059 2924706 1678797 7677 159539 1901559 3007854 2732579 2173132 1826744 1391918
6050 1391918 1412007 2437282 3008193 1265335 -1659817 -2715589 -1389636 -171431 -329159
6041 -329159 -396123 354679 216505 -1552140 -2559857 -850790 1588403 1617609 -264970
6032 -264970 -880058 580089 1456278 -179003 -2812583 -3896529 -3042686 -1670476 -875334
6023 -875334 -837493 -1282496 -1357265 36030 2552899 3925408 2643909 400554 80944
6014 80944 1793158 3002523 2478289 1568371 1053924 -401784 -3169988 -4694325 -3073063
6005 -3073063 -640353 -1002094 -3714554 -5094707 -3742967 -1921951 -1326658 -842209 524818
5996 524818 1434847 552911 -1069971 -1660495 -1215580 -828357 -796613 -807200 -1019182 -1715737
5986 -1715737 -2550177 -2971582 -2763709 -1788321 -158032 1117228 946165 -177032 -865031
5977 -865031 -1293672 -2823283 -4727536 -3999900 205005 4401634 4996280 2725509 843867
5968 843867 677500 1275797 1950613 2562211 2271545 529392 -1286084 -1427980 -379424
5959 -379424 227514 571845 2084428 4351962 5192686 3940005 2285136 1477113 843509
5950 843509 -325110 -1367519 -1530378 -1117168 -642283 -159022 -14207 -931727 -2631180
5941 -2631180 -3548308 -2747704 -1200437 -397283 -436456 -257620 706725 1797979 1881315 474288
5931 474288 -1760980 -3512785 -3896393 -3047836 -1713747 -605699 -197452 -553253 -1102926
5922 -1102926 -1194956 -1059601 -1380975 -1724622 -683849 1793507 3624669 3146636 1179679
5913 1179679 -558658 -1651566 -2150899 -1145346 1663385 4065274 3538377 870478 -764198
5904 -764198 -91889 1238419 1818720 2100323 2385794 1637282 -614578 -2902694 -3473778
5895 -3473778 -2191055 -177133 1301532 1205942 -650574 -2732649 -2694014 198051 4287089
5886 4287089 7262041 7751082 5547159 1876400 -591054 87720 2525491 3330381 1486455
5877 1486455 -496861 -474192 430126 84253 -1347280 -2130486 -1755220 -1184151 -996994
5868 -996994 -913355 -870518 -1202842 -1688858 -1381616 296721 2588179 3692869 2348218
5859 2348218 -481066 -1974303 -441192 2450312 3671481 2694377 1680790 1971996 2539270
5850 2539270 2348081 2024693 2200972 2208648 1628333 1312638 1589682 1309850 163772 -3575
5840 -3575 1855781 3473205 2068005 -1567774 -4185706 -4337520 -3148463 -1696933 -236012
5831 -236012 469651 -259111 -1145970 -224998 1934172 2809999 2004500 2033023 4288167 6796695
5821 6796695 7219550 5867434 4321926 3023675 1813992 1155652 1078216 328527 -1682287
5812 -1682287 -3360675 -3180894 -2261700 -2618396 -3778060 -3480842 -1290792 870931 1739312
5803 1739312 1913601 1779860 646662 -1132271 -1339538 1228353 4470188 5253612 3273624
5794 3273624 1222500 1428885 3449341 4974495 4448197 2726653 2203816 3935620 5926836
5785 5926836 5397297 2652352 896153 1683368 2768533 1861906 264129 355298 1232995
5776 1232995 77190 -2984212 -4862170 -4316886 -3286912 -2853324 -1506231 1149081 2441288
5767 2441288 714363 -1527165 -1408190 -303086 -1380795 -4196067 -5348634 -3716051
5759 -3716051 -1471774 -107123 1069546 2111505 1531378 -674005 -2027704 -1168598 -74359
5750 -74359 -913461 -2594485 -2452241 -50790 2642914 4014546 3931471 2695828 687549
5741 687549 -967663 -900575 826985 2374710 1973902 -122159 -1806029 -1305677 809600
5732 809600 2131880 1221738 -588727 -965974 274576 999067 -298530 -2708167 -4384158
5723 -4384158 -4570820 -3599707 -1970229 -181033 1280579 2363492 3258529 3540687 2384400
5714 2384400 -99964 -2718878 -4598520 -5622006 -5429514 -3671492 -1659845 -1709764 -3793245
5705 -3793245 -4844406 -2893166 22520 1032211 734336 1716732 4051872 5369815 4964321
5696 4964321 4628720 5094166 4716473 2771012 1357333 2318244 4266266 4612169 3161156
5687 3161156 1742694 1233441 980342 751160 1297543 2805343 4281815 4841055 4483063
5678 4483063 3355675 1425481 -650886 -1475913 -600161 485204 -5123 -1968512 -3843264
5669 -3843264 -4915706 -5995809 -7584901 -8515570 -7232348 -3905320 -490757 1162153
5661 1162153 753162 -706633 -1957652 -2303594 -1865943 -1242765 -809708 -420731 163353
5652 163353 892622 1630113 2235754 2207534 1026205 -577643 -697934 1262497 3040297
5643 3040297 2111643 -653693 -2013821 -1030008 -282474 -1604092 -3087358 -2208133 -64952
5634 -64952 90944 -2229466 -3919460 -2527157 756301 2966756 2630146 415285 -2161113
5625 -2161113 -3715595 -3564634 -2316197 -1480070 -1775664 -2195861 -1408614 275959 1192097
5616 1192097 536150 -571017 -638170 210776 542773 -320658 -1456945 -1831406 -1775849 -2225290
5606 -2225290 -3034786 -3114834 -2131541 -1028355 -684193 -984533 -1497515 -2133705 -2691873 -2612305
5596 -2612305 -1741437 -630302 381979 1559953 2768901 3106906 2294042 1410049 1269799
$$ [...]
##END NTUPLES=NMR SPECTRUM
##END=
