##TITLE=31Pdec_SR39H_AC1-4
 , 124 sc
 5.04.2021
##JCAMPDX= 6.0         $$ Bruker NMR JCAMP-DX V2.0
##DATA TYPE= NMR SPECTRUM
##DATA CLASS= NTUPLES
##ORIGIN= UXNMR, Bruker Analytische Messtechnik GmbH
##OWNER= root
$$ XWIN-NMR		Version 3.5
$$ Mon Apr  5 11:11:43 2021 Russian Standard Time (UT+4h)  she@DPX200
##.OBSERVE FREQUENCY= 81.013821
##.OBSERVE NUCLEUS= ^31P
##.ACQUISITION MODE= SIMULTANEOUS
##.ACQUISITION SCHEME= undefined
##.AVERAGES= 124
##.DIGITISER RES= 16
##SPECTROMETER/DATA SYSTEM= spect
##.PULSE SEQUENCE= zgpg30
##.SOLVENT NAME= CDCl3
##.SHIFT REFERENCE= (INTERNAL, CDCl3, 0, 248.564)
##AUDIT TRAIL= $$ (NUMBER, WHEN, WHO, WHERE, WHAT)
$$ ##TITLE= Audit trail, XWIN-NMR		Version 3.5
$$ ##JCAMPDX= 5.01
$$ ##ORIGIN= Bruker BioSpin GmbH
$$ ##OWNER= she
$$ F:/spectra/data/she/nmr/P31/1/pdata/1/auditp.txt
$$ ##AUDIT TRAIL=  $$ (NUMBER, WHEN, WHO, WHERE, WHAT)
(   1,<2021-04-05 11:09:48.56 +0400>,<she>,<DPX200>,
      <continue with go, POWCHK disabled, PULCHK disabled
       configuration hash MD5:
       00 E9 B6 7A A2 85 ED C7 34 08 36 98 17 FE 4E 26
       data hash MD5: 32K
       58 75 93 46 A0 C7 06 39 AC 4C B4 77 35 DD 99 7E>)
(   2,<2021-04-05 11:09:54.46 +0400>,<she>,<DPX200>,
      <Start of raw data processing
       efp BC_mod = 2 LB = 1 FT_mod = 6 PKNL = 1 PHC0 = -4478.775 PHC1 = 317.8011 SI = 64K 
       data hash MD5: 64K
       AC F3 01 AF DF 88 06 12 0D F5 21 D7 2E E8 07 7E>)
(   3,<2021-04-05 11:10:51.26 +0400>,<she>,<DPX200>,
      <abs ABSG = 5 
       data hash MD5: 64K
       7F F9 EF 0F AB D6 7C A4 34 AD 77 61 4A 8F EC 6F>)
(   4,<2021-04-05 11:11:00.42 +0400>,<she>,<DPX200>,
      <pk PHC0 = 16.66694 PHC1 = -34.79999 
       data hash MD5: 64K
       6F 7F 25 28 D9 A3 5A 1F C8 E6 BC 33 3B 35 E8 6A>)
(   5,<2021-04-05 11:11:04.18 +0400>,<she>,<DPX200>,
      <abs ABSG = 5 
       data hash MD5: 64K
       B2 30 DD 79 0A 6F 0B A9 A9 43 22 0B AC 02 54 E6>)
$$ ##END=
$$ 
$$ hash MD5
$$ 30 DF 97 EF 3D 47 F4 C5 50 AE F9 3A 87 C4 92 55
##$RELAX= 
##$RELAX= 
##$RELAX= 
##$RELAX= 
##$RELAX= 
##$RELAX= 
##$RELAX= 
##$RELAX= 
$$ Bruker specific parameters
$$ --------------------------
##$DU= <F:/spectra>
##$EXPNO= 1
##$NAME= <P31>
##$PROCNO= 1
##$TYPE= <nmr>
##$USER= <she>
##$AMP= (0..31)
100 100 100 100 100 100 100 100 100 100 100 100 100 100 100 100 100 100 
100 100 100 100 100 100 100 100 100 100 100 100 100 100 
##$AQSEQ= 0
##$AQ_mod= 1
##$AUNM= <au_zg>
##$AUTOPOS= <>
##$BF1= 81.014009
##$BF2= 200.13
##$BF3= 200.13
##$BF4= 200.13
##$BF5= 200.13
##$BF6= 200.13
##$BF7= 200.13
##$BF8= 200.13
##$BYTORDA= 1
##$CFDGTYP= 0
##$CFRGTYP= 5
##$CHEMSTR= <none>
##$CNST= (0..31)
1 1 145 1 1 1 1 1 1 1 1 1 1 1 1 1 1 1 1 1 1 1 1 1 1 1 1 1 1 1 1 1 
##$CPDPRG= <waltz16>
##$CPDPRG1= <>
##$CPDPRG2= <waltz16>
##$CPDPRG3= <>
##$CPDPRG4= <mlev>
##$CPDPRG5= <mlev>
##$CPDPRG6= <mlev>
##$CPDPRG7= <mlev>
##$CPDPRG8= <mlev>
##$CPDPRGB= <>
##$CPDPRGT= <>
##$D= (0..31)
0 1 0 0 0 0 0 0 0 0 0 0.03 2e-05 3e-06 0 0 0 0 0 0 0 0 0 0 0 0 0 0 0 0 
0 0 
$$ [...]
##$SUBNAM3= <"">
##$SUBNAM4= <"">
##$SUBNAM5= <"">
##$SUBNAM6= <"">
##$SUBNAM7= <"">
##$SUBNAM8= <"">
##$SUBNAM9= <"">
##$SW= 501.771253377433
##$SWIBOX= (0..15)
0 1 3 0 0 0 0 0 0 0 0 0 0 0 0 0 
##$SW_h= 40650.406504065
##$TD= 32768
##$TD0= 1
##$TE= 0
##$TE2= 300
##$TE3= 300
##$TEG= 300
##$TL= (0..7)
0 120 53 12 22 120 120 120 
##$TP= (0..7)
150 150 150 150 150 150 150 150 
##$TP07= 0
##$TPNAME0= <>
##$TPNAME1= <>
##$TPNAME2= <>
##$TPNAME3= <>
##$TPNAME4= <>
##$TPNAME5= <>
##$TPNAME6= <>
##$TPNAME7= <>
##$TPOAL= (0..7)
0.5 0.5 0.5 0.5 0.5 0.5 0.5 0.5 
##$TPOFFS= (0..7)
0 0 0 0 0 0 0 0 
##$TUNHIN= 0
##$TUNHOUT= 0
##$TUNXOUT= 0
##$USERA1= <user>
##$USERA2= <user>
##$USERA3= <user>
##$USERA4= <user>
##$USERA5= <user>
##$V9= 5
##$VALIST= <valist>
##$VCLIST= <CCCCCCCCCCCCCCC>
##$VD= 0
##$VDLIST= <DDDDDDDDDDDDDDD>
##$VPLIST= <PPPPPPPPPPPPPPP>
##$VTLIST= <TTTTTTTTTTTTTTT>
##$WBST= 1024
##$WBSW= 4
##$XGAIN= (0..3)
0 0 0 0 
##$XL= 0
##$YL= 0
##$YMAX_a= 6860
##$YMIN_a= -19224
##$ZGOPTNS= <>
##$ZL1= 120
##$ZL2= 120
##$ZL3= 120
##$ZL4= 120
##$ABSF1= 248.5645
##$ABSF2= -253.2056
##$ABSG= 5
##$ABSL= 3
##$ALPHA= 0
##$AQORDER= 0
##$ASSFAC= 0
##$ASSFACI= 0
##$ASSFACX= 0
##$ASSWID= 0
##$AUNMP= <proc_1d>
##$AZFE= 0.1
##$AZFW= 0.5
##$BCFW= 0
##$BC_mod= 2
##$BYTORDP= 0
##$COROFFS= 0
##$CY= -3
##$DATMOD= 1
##$DC= 0
##$DFILT= <>
##$DTYPP= 0
##$F1P= 0
##$F2P= 0
##$FCOR= 1
##$FTSIZE= 65536
##$FT_mod= 6
##$GAMMA= 0
##$GB= 0
##$INTBC= 1
##$INTSCL= 5.30512e-09
##$ISEN= 30
##$LB= 1
##$LEV0= 0
##$LPBIN= 0
##$MAXI= 10000
##$MC2= 0
##$MEAN= 0
##$ME_mod= 0
##$MI= 50
##$NCOEF= 0
##$NC_proc= -5
##$NLEV= 6
##$NOISF1= 182.463
##$NOISF2= 159.3651
##$NSP= 0
##$NTH_PI= 0
##$NZP= 0
##$OFFSET= 248.5645
##$PC= 4
##$PHC0= -4462.108
##$PHC1= 283.0011
##$PH_mod= 1
##$PKNL= yes
##$PPARMOD= 0
##$PSCAL= 0
##$PSIGN= 0
##$REVERSE= no
##$SF= 81.014009
##$SI= 65536
##$SIGF1= 159.3651
##$SIGF2= -187.1042
##$SINO= 113.3802
##$SIOLD= 16384
##$SREGLST= <1H.CDCl3>
##$SSB= 0
##$STSI= 65536
##$STSR= 0
##$SW_p= 40650.406504065
##$SYMM= 0
##$S_DEV= 0
##$TDeff= 32768
##$TDoff= 0
##$TI= <>
##$TILT= no
##$TM1= 0
##$TM2= 0
##$TOPLEV= 0
##$USERP1= <user>
##$USERP2= <user>
##$USERP3= <user>
##$USERP4= <user>
##$USERP5= <user>
##$WDW= 1
##$XDIM= 65536
##$YMAX_p= 459438299
##$YMIN_p= -27776458
$$ End of Bruker specific parameters
$$ ---------------------------------
##NTUPLES= NMR SPECTRUM
##VAR_NAME=  FREQUENCY,     SPECTRUM/REAL,   SPECTRUM/IMAG
##SYMBOL=    X,             R,               I
##VAR_TYPE=  INDEPENDENT,   DEPENDENT,       DEPENDENT
##VAR_FORM=  AFFN,          ASDF,            ASDF
##VAR_DIM=   65536,         65536,           65536
##UNITS=     HZ,            ARBITRARY UNITS, ARBITRARY UNITS
##FACTOR=    0.620285442955139, 1,           1
##FIRST=     20137.2065510759, 0,            0
##LAST=      -20513.1999529892, 0,           0
##MIN=       -20513.1999529892, -27776458,   0
##MAX=       20137.2065510759, 459438299,    0
$$ Real data points
##PAGE= N=1
##DATA TABLE= (X++(R..R)), XYDATA
$$ [...]
$$ plain form
13092 668432 1966716 2116973 1979607 2399789 3785942 5339591 5537476 4200311 3137384
13083 3137384 3833087 5364619 5636622 4052771 1956655 814876 911980 1727608 2764039
13074 2764039 3690319 4023433 3144505 966635 -1504520 -2886196 -2998896 -3095163 -3979112
13065 -3979112 -4643093 -3721782 -1729849 -593449 -1109627 -2067352 -1995606 -756223 828162
13056 828162 2060390 2685536 2581840 1454329 -1023196 -4333377 -6533537 -5806626 -3091391
13047 -3091391 -1642205 -2895687 -4435484 -3783645 -2519339 -3932248 -7571589 -9342065
13039 -9342065 -7061095 -2989832 -311026 267115 -348662 -1329043 -1643401 -344834 1557038
13030 1557038 1434990 -1398505 -4159439 -3981040 -1425048 626998 379101 -1565727 -3136167
$$ packed form
13092F68432J298284J50257j37366M20182J386153J553649J97885j337165j062927
13083C137384O95703J531532K72003j583851k096116j141779R7104Q15628J036431
13074B764039R26280L33114q78928k177870k471155j381676j12700r6267q83949
13065c979112o63981R21311J991933J136400n16178r57725P1746J239383J584385
13056H28162J232228O25146j03696j127511k477525l310181k200160P26911K715235
13047c091391J449186j253482j539797O51839J264306j412909l639341j770476
13039i342065K280970M071263K678806N78141o15777r80381l14358J298567J901872
13030A557038j22048k833495k760934J78399K555992K052046k47897j944828j570440
$$ plain form
13021 -3136167 -2384685 533729 2694025 1555793 -1068242 -881813 2500717 4523216
13013 4523216 2617695 279464 1197277 2803311 144897 -5934194 -9499267 -7806633
13005 -7806633 -4212274 -2474237 -2417755 -2388284 -2288186 -2388719 -1969530 -998499 -923055 -2079125
12995 -2079125 -2360389 -311723 2228231 2621491 1192345 276100 358697 -464150 -3149471
12986 -3149471 -5798370 -5792295 -2737198 1382049 4311338 5172684 4438468 3109369 2133432
12977 2133432 2000993 2169264 1057034 -2397982 -6812791 -8939307 -6989018 -2772198
12969 -2772198 283849 625661 -820910 -2677239 -4137689 -4309965 -2510921 147434
12961 147434 966983 -1369126 -4690558 -5278902 -1968448 2221817 2898783 -1126311 -6245005
$$ packed form
13021c136167P51482K918414K160296j138232k624035J86429L382530K022499
13013D523216j905521k338231R17813J606034k658414o079091l565073J692634
13005g806633L594359J738037N6482K9471J00098j00533M19189R71031P5444j156070
12995b079125k81264K048666K539954L93260j429146r16245Q2597q22847k685321
12986c149471k648899O075L055097M119247K929289Q61346p34216j329099r75937
12977B133432j32439J68271j112230l455016m414809k126516J950289M216820
12969b772198L056047L41812j446571j856329j460450j72276J799044K658355
12961A47434Q19549k336109l321432n88344L310454M190265O76966m025094n118694
$$ plain form
12952 -6245005 -7606141 -4407109 -816167 -1077003 -4631128 -7236543 -6342215 -3833675
12944 -3833675 -3219904 -5199195 -6734244 -4416238 1513594 6965480 8406806 6922558
12936 6922558 6362172 7639123 7410471 3411843 -1631593 -3602188 -2290211 -379194
12928 -379194 998117 2433971 3452796 3304857 3573945 5861518 7507667 4516938 -1030164
12919 -1030164 -2072410 3208381 7785829 5614974 93308 -1848178 -67572 275388
12911 275388 -1796313 -1741640 2262850 5748975 4581585 717711 -1353024 -820947 -213822
12902 -213822 -783684 -1375733 -1288961 -1522658 -2682525 -3566301 -2949317 -1748833 -2015805
12893 -2015805 -3906809 -5005129 -3327626 -59510 1835721 1202959 -489062 -1741296
$$ packed form
12952f245005j361136L199032L590942k60836l554125k605415Q94328K508540
12944c833675O13771j979291j535049K318006N929832N451886J441326j484248
12936F922558n60386J276951k28652l998628n043436j970595J311977J911017
12928c79194J377311J435854J018825j47939K69088K287573J646149k990729n547102
12919a030164j042246N280791M577448k170855n521666j941486J780606L42960
12911B75388k071701N4673M004490L486125j167390l863874k070735N32077O07125
12902b13822n69862n92049Q6772k33697j159867q83776O16984J200484k66972
12893b015805j891004j098320J677503L268116J895231o32762j692021j252234
$$ plain form
12885 -1741296 -2775604 -4207647 -5378893 -4946295 -2447999 1207362 4221468 4894979
12877 4894979 3159902 1063197 445994 379811 -1237735 -3684948 -3667818 -237025 3355778
12868 3355778 4152047 3248978 3141647 3641553 2856131 442303 -2559436 -5616668 -8016067
12859 -8016067 -7786606 -4042537 649654 2829175 2159964 568563 -1261461 -3576911
12851 -3576911 -4934658 -3534308 -839320 -275706 -2018693 -2434588 508076 4338785
12843 4338785 5834857 5138063 4570813 5082007 5340352 3516072 -700952 -5233061 -6956545
12834 -6956545 -4931896 -1743611 -324675 -448614 -277439 -142794 -1867361 -4960613 -6840812
12825 -6840812 -6936934 -7242079 -8191940 -7299390 -3205430 1621688 3832437 2966595 1136377
$$ packed form
12885a741296j034308j432043j171246M32598K498296L655361L014106O73511
12877D894979j735077k096705o17203o6183j617546k447213J7130L430793L592803
12868C355778P96269r03069j07331M99906p85422k413828l001739l057232k399399
12859h016067K29461L744069M692191K179521o69211j591401j830024k315450
12851c576911j357747J400350K694988N63614j742987m15895K942664L830709
12843D338785J496072o96794n67250N11194K58345j824280m217024m532109j723484
12834f956545K024649L188285J418936j23939J71175J34645j724567l093252j880199
12825f840812r6122l05145r49861Q92550M093960M827118K210749q65842j830218
$$ plain form
12816 1136377 540805 2004683 4440033 5414943 3773135 1408006 549254 229120 -1633179
12807 -1633179 -3617393 -2429481 1020049 1972325 -830491 -3022411 -1648363 379512
12799 379512 -514884 -3131322 -4391395 -4018178 -2979904 -544720 3485564 6296785 5399015
12790 5399015 2315796 -45650 -1339315 -2266693 -1996731 -435693 -191314 -2506180 -4010321
12781 -4010321 -1707968 1447241 708945 -2935137 -4567841 -3134659 -2124946 -3338429
12773 -3338429 -5121334 -6386509 -7440805 -7013453 -3395043 1297674 2722756 544327
12765 544327 -1383178 -1248096 -1012025 -1601303 -1424371 -545185 -1284237 -3368194 -3448433
12756 -3448433 -1042995 78175 -1549293 -2303046 10395 1868701 -122470 -3493207
$$ packed form
12816A136377n95572J463878K435350R74910j641808k365129q58752l20134j862299
12807a633179j984214J187912L449530R52276k802816k191920J374048K027875
12799C79512q94396k616438j260073L73217J038274K435184M030284K811221q97770
12790E399015l083219k361446j293665r27378K69962J561038K44379k314866j504141
12781d010321K302353L155209p38296l644082j632704J433182J009713j213483
12773c338429j782905j265175j054296M27352L618410M692717J425082k178429
12765E44327j927505J35082K36071n89278J76932Q79186p39052k083957q0239
12756c448433K405438J121170j627468p53753K313441J858306j991171l370737
$$ plain form
12748 -3493207 -4224268 -3163046 -3566062 -5079561 -4947087 -3246127 -2196283 -1500240 921208
12739 921208 3944891 3565240 -1020833 -5371654 -5404787 -2451984 -857421 -2094481 -3416023
12730 -3416023 -2267024 -243310 -1155896 -5568423 -9489713 -9632423 -7681044 -6813598 -6060652
12721 -6060652 -2258494 3340445 5560035 3036443 298708 416043 738021 -1239053
12713 -1239053 -2835914 -1188434 987525 -230176 -2976430 -2604293 363993 1177208
12705 1177208 -1104406 -2327593 -401021 1570422 791066 -955132 -780306 659178
12697 659178 454440 -2293624 -5432564 -6315838 -4415213 -1605173 45069 712981 2046255
12688 2046255 3759181 3195037 -438661 -3902426 -4216727 -2736208 -2137889 -1818530 -8349
$$ packed form
12748c493207p31061J061222m03016j513499J32474J700960J049844O96043K421448
12739I21208L023683l79651m586073m350821l3133K952803J594563j237060j321542
12730c416023J148999K023714r12586m412527l921290j42710J951379Q67446P52946
12721f060652L802158N598939K219590k523592k737735J17335L21978j977074
12713a239053j596861J647480K175959j217701k746254L72137K968286Q13215
12705A177208k281614j223187J926572J971443p79356j746198J74826J439484
12697F59178k04738k748064l138940q83274J900625K810040J650242O67912J333274
12688B046255J712926n64144l633698l463765l14301J480519N98319L19359J810181
$$ plain form
12679 -8349 1702364 597020 -1767033 -1514194 676538 1770 -4677824 -8672952 -8398173
12670 -8398173 -5687125 -3344656 -867786 2850057 6258687 7440171 6897290 5671010
12662 5671010 3239847 -442093 -3204902 -3243160 -1526948 89624 1105526 1293702 -93713
12653 -93713 -2332016 -2956809 -1304553 165722 -204017 -857051 -467729 -595893 -2278226
12644 -2278226 -3074740 -787689 2484328 3508295 2875194 3139247 3977880 3131991 737361
12635 737361 -1096854 -1879739 -2316908 -1637628 749291 2239904 196812 -2652662 -937562
12626 -937562 5156265 9380515 8009615 4192808 2189839 1794990 915658 -191771 -376167
12617 -376167 -463500 -1535391 -2294841 -1022436 1254688 2131962 1299778 329736 -118597
$$ packed form
12679h349J710713j105344k364053K52839K190732o74768m679594l995128K74779
12670h398173K711048K342469K476870L717843L408630J181484n42881j226280
12662E671010k431163l681940k762809l8258J716212J616572J015902J88176j387415
12653i3713k238303o24793J652256J470275l69739o53034L89322j28164j682333
12644b278226p96514K287051L272017J023967o33101K64053Q38633q45889k394630
12635G37361j834215p82885m37169O79280K386919J490613k043092k849474J715100
12626i37562O093827M224250j370900l816807k002969l94849q79332j107429j84396
12617c76167q7333j071891p59450J272405K277124Q77274q32184r70042m48333
$$ plain form
12608 -118597 -583903 -840235 75639 1776962 2303586 602081 -1777273 -2091305 694966
12599 694966 4557747 6069163 3707453 -601947 -3655460 -4216238 -3254643 -1695012 267088
12590 267088 1687748 896946 -2164896 -5284039 -6606510 -6546218 -6166411 -5167925 -2817067
12581 -2817067 234520 2501594 3457017 3675509 3605297 3011420 1376146 -1436809 -4394903
12572 -4394903 -5312916 -2895857 1119368 3420188 3069589 2211062 2298209 1968310 93612
12563 93612 -1323198 264734 3764480 5415834 3557819 343750 -1232920 -354053 1601186
12554 1601186 2665101 1811159 -113888 -1005545 250983 2480183 3772501 3682632 3162438
12545 3162438 3165454 4147646 5881255 6747040 4563181 -346960 -4161434 -3598896 -104555
$$ packed form
12608a18597m65306k56332R15874J701323N26624j701505k379354l14032K786271
12599F94966L862781J511416k361710m309400l053513n60778R61595J559631J962100
12590B67088J420660p90802l061842l119143j322471O0292L79807R98486K350858
12581b817067L051587K267074R55423K18492p0212n93877j635274k812955k958094
12572d394903r18013K417059M015225K300820l50599q58527Q7147l29899j874698
12563I3612j416810J587932L499746J651354j858015l214069j576670Q78867J955239
12554A601186J063915q53942j925047q91657J256528K229200J292318q9869n20194
12545C162438L016R82192J733609Q65785k183859m910141l814474N62538L494341
$$ plain form
12536 -104555 1992375 770438 -1997178 -4235098 -5660503 -6421805 -6124716 -4941855 -3882195
12527 -3882195 -3230445 -2087068 30422 2290276 3529595 3121985 982174 -2082498
12519 -2082498 -4329496 -4868077 -5150022 -6964710 -9294542 -9224147 -5894076 -1424198 2082127
12510 2082127 4133722 4380671 2284825 -1030051 -3086643 -3113605 -2593638 -2226506 -1134021
12501 -1134021 78435 -1123563 -4750948 -6666614 -4121640 -175662 665379 -979708
12493 -979708 -971770 1538182 3055528 1335569 -1754265 -3674738 -4383793 -4840140 -4801915
12484 -4801915 -3758607 -2545503 -2441657 -3261647 -3392049 -1631346 1385283 3639964 3800372
12475 3800372 2793109 2563854 3187058 2644459 135773 -2223670 -2485699 -1895091 -2654393
$$ packed form
12536a04555K096930j221937k767616k237920j425405p61302K97089J182861J059660
12527c882195O51750J143377K117490K259854J239319m07610k139811l064672
12519b082498k246998n38581k81945j814688k329832P0395L330071M469878L506325
12510B082127K051595K46949k095846l314876k056592k6962N19967L67132J092485
12501a134021J212456j201998l627385j915666K544974L945978Q41041j645087
12493i79708P938K509952J517346j719959l089834j920473p09055m56347L8225
12484d801915J043308J213104J03846q19990j30402J760703L016629K254681J60408
12475C800372j007263k29255O23204n42599k508686k359443k62029N90608p59302
$$ plain form
12466 -2654393 -4047404 -3508694 -830943 1479690 1772325 521215 -1731030 -4714319
12458 -4714319 -6557449 -4864082 -641707 1823912 441094 -2018071 -2393364 -1622262
12450 -1622262 -2351266 -4188735 -4402362 -2371045 -376755 31674 17896 1162839 2931347
12441 2931347 3483258 2215099 530824 70912 723237 991430 385049 397269 2086849
12432 2086849 3583707 1901592 -2930976 -7640532 -9868288 -10287350 -9946652 -8218613
12424 -8218613 -4986881 -2373216 -1874974 -1692967 280198 2277543 820962 -3564463
12416 -3564463 -6400911 -5451156 -3549160 -3980410 -5868328 -6193046 -4396713 -2490333 -1530170
12407 -1530170 -452996 1531807 3389729 3835076 3130113 2285658 1302555 -426869 -2203458
$$ packed form
12466b654393j393011N38710K677751K310633K92635j251110k252245k983289
12458d714319j843130J693367M222375K465619j382818k459165l75293P71102
12450a622262p29004j837469k13627K031317J994290M08429j3778J144943J768508
12441B931347N51911j268159j684275m59912O52325K68193o06381J2220J689580
12432B086849J496858j682115m832568m709556k227756m19062L40698J728039
12424h218613L231732K613665M98242J82007J973165J997345j456581m385425
12416c564463k836448R49755J901996m31250j887918l24718J796333J906380R60163
12407a530170J077174J984803J857922M45347p04963q44455r83103j729424j776589
$$ plain form
12398 -2203458 -2224119 -455363 285205 -2114528 -5424438 -5526406 -2362225 -362291 -1943091
12389 -1943091 -3816054 -2152967 1328740 2026984 -466497 -2118220 -797350 1365758
12381 1365758 2379637 2908890 3096980 1081828 -2899112 -4642883 -1618635 2376616
12373 2376616 2157021 -1291476 -2646790 -564868 768268 -1216464 -3456424 -2204551
12365 -2204551 1633376 4525545 5038621 3993799 1933027 -741301 -2254430 -868649
12357 -868649 2383116 4394566 3454776 669664 -1774969 -2458804 -1264644 533897 1053962
12348 1053962 -109959 -1157531 -708995 -121409 -1233879 -2839538 -2247471 34033 597372
12339 597372 -1316688 -2152285 442696 3714494 3977422 2011678 1068774 1433365 715636
$$ packed form
12398b203458k0661J768756P40568k399733l309910j01968L164181J999934j580800
12389a943091j872963J663087L481707O98244k493481j651723J320870K163108
12381A365758J013879N29253J88090k015152l980940j743771L024248L995251
12373B376616k19595l448497j355314K081922J333136j984732k239960J251873
12365b204551L837927K892169N13076j044822k060772k674328j513129J385781
12357h68649L251765K011450r39790k785112k444633o83835J194160J798541N20065
12348A053962j163921j047572M48536N87586j112470j605659N92067K281504N63339
12339E97372j914060q35597K594981L271798K62928j965744r42904L64591p17729
$$ plain form
12330 715636 -1399773 -2532193 -1678908 -384464 606588 2471256 5093677 5951444 3869539
12321 3869539 1221638 492818 946471 769164 383921 1111869 2193969 1927996 734753
12312 734753 396853 948850 1008739 738906 1609697 3205301 3184450 1027306 -865934
12303 -865934 -810162 -78396 -137168 33844 1866240 4180675 4595329 3051780 1723096
12294 1723096 1754596 2069768 1472837 238246 -772356 -1250893 -1187993 -492444 526164
12285 526164 965645 240960 -1079306 -1733642 -1034616 400220 1207327 750047 -18378
12276 -18378 272814 1218829 559825 -2884678 -6892728 -7663676 -3843346 2220087 7090985
12267 7090985 9085676 8593240 6885270 5146751 3892316 2829634 1664049 977264
$$ packed form
12330G15636k115409j132420Q53285J294444R91052J864668K622421Q57767k081905
12321C869539k647901p28820M53653j77307l85243P27948J082100k65973j193243
12312G34753l37900N51997N9889k69833Q70791J595604k0851k157144j893240
12303h65934N5772P31766n8772J71012J832396K314435M14654j543549j328684
12294A723096L1500L15172n96931j234591j010602m78537O2900O95549J018608
12285E26164M39481p24685j320266o54336O99026J434836Q07107m57280p68425
12276a8378K91192R46015o59004l444503m008050p70948L820330O063433M870898
12267G090985J994691m92436j707970j738519j254435j062682j165585o86785
$$ plain form
12259 977264 1571940 3017480 3845194 3284455 1789978 -133683 -2217136 -3385871 -2366454
12250 -2366454 -199847 -172957 -3585586 -7135396 -6670870 -2582437 873685 1116392 -407669
12241 -407669 -1463271 -1979902 -2785217 -3461039 -2999447 -1502974 -33188 531004 -237624
12232 -237624 -2281967 -4549278 -5448923 -4654052 -3564576 -3132856 -2254903 422966 3826454
12223 3826454 5109167 2947765 -907282 -3482789 -3254081 -1011575 1154093 1535770
12215 1535770 21973 -1974318 -2743480 -1507834 1152067 3541585 3797263 1540989
12207 1540989 -1330535 -2459330 -1744076 -1143424 -1660530 -2097112 -1392690 -456198 -457856
12198 -457856 -801118 -401905 159727 -388928 -1577480 -1581470 135332 2048508 2436479
$$ packed form
12259I77264N94676J445540Q27714n60739j494477j923661k083453j168735J019417
12250b366454K166607K6890l412629l549810M64526M088433L456122K42707j524061
12241d07669j055602n16631q05315o75822M61592J496473J469786N64192p68628
12232b37624k044343k267311q99645P94871J089476M31720Q77953K677869L403488
12223C826454J282713k161402l855047k575507K28708K242506K165668L81677
12215A535770j513797j996291p69162J235646K659901K389518K55678k256274
12207A540989k871524j128795P15254O00652n17106m36582P04422R36492j658
12198d57856l43262L99213N61632n48655j188552l990J716802J913176L87971
$$ plain form
12189 2436479 1007683 -1110670 -2238217 -1537930 -231367 -489796 -2407212 -3568822
12181 -3568822 -2701378 -1732991 -2414676 -3175832 -2132254 -1069970 -2573738 -4749522 -3624989
12172 -3624989 -298369 -248895 -4599139 -7530589 -4806870 -56081 899059 -1911502 -4262571
12163 -4262571 -4392309 -3500708 -1701150 1656761 4465045 3314205 -1225833 -4609477
12155 -4609477 -4284571 -2375603 -1567061 -1503481 -828886 -185037 -965436 -2496901 -2568126
12146 -2568126 -478040 1755838 1439249 -1942818 -5982558 -7559008 -5849664 -2658695
12138 -2658695 316817 3218498 6108768 6918105 3552034 -2424000 -6489354 -5945893
12130 -5945893 -2419567 636022 1397458 350443 -948335 -1228709 -704508 -1094566 -3322276
$$ packed form
12189B436479j428796k118353j127547P00287J306563k58429j917416j161610
12181c568822Q67444R68387o81685p61156J043578J062284j503768k175784J124533
12172c624989L326620M9474m350244k931450K723719M750789R55140k810561k351069
12163d262571j29738Q91601J799558L357911K808284j150840m540038l383644
12155d609477L24906J908968Q08542O3580O74595O43849p80399j531465p1225
12146b568126K090086K233878l16589l382067m039740j576450J709344L190969
12138b658695K975512K901681K890270Q09337l366071n976034m065354N43461
12130e945893L526326L055589P61436j047015j298778k80374N24201l90058k227710
$$ plain form
12121 -3322276 -5431781 -4589935 -1200667 1263652 1199775 1129803 3440373 6104989 5237717
12112 5237717 759626 -3236301 -3593059 -1157666 1471750 2854999 2486438 -16234
12104 -16234 -3573361 -4945169 -1842689 3567883 6533316 5373122 3098601 2622841 2775408
12095 2775408 966418 -2172890 -3702245 -2947751 -1934225 -1407124 32661 2012297
12087 2012297 1305503 -3211427 -7611302 -7873179 -5424724 -4261114 -4324824 -2064981 2887737
12078 2887737 6096932 4429736 209784 -2397476 -2386204 -1546132 -1469709 -2840654 -5680440
12069 -5680440 -8249088 -7531103 -3208052 354489 -1083104 -5684579 -7449983 -4015681
12061 -4015681 514741 1335226 -1265149 -3526056 -3402382 -1687138 769402 4035056
$$ packed form
12121c322276k109505Q41846L389268K464319o3877o9972K310570K664616q67272
12112E237717m478091l995927l56758K435393K629416J383249l68561k502672
12104a6234l557127j371808L102480N410572K965433j160194k274521m75760J52567
12095B775408j808990l139308j529355P54494J013526N27101J439785J979636
12087B012297p06794m516930m399875k61877K448455J163610o3710K259843M952718
12078B887737L209195j667196m219952k607260J1272Q40072P6423j370945k839786
12069e680440k568648P17985M323051L562541j437593m601475j765404L434302
12061d015681M530422Q20485k600375k260907J23674J715244K456540L265654
$$ plain form
12053 4035056 7206112 8141061 6231012 3721467 2859623 2933810 1790654 -523259 -1690041
12044 -1690041 -702574 454857 -444726 -2757050 -3731103 -1819393 1582389 3440252 1779688
12035 1779688 -2464023 -6007155 -6145807 -3377981 -657210 -107140 -1260686 -2400524
12027 -2400524 -2386806 -1019795 961582 1836394 390226 -1945608 -2075111 796166 3859177
12018 3859177 4408865 3029129 1698098 685304 -644939 -1625785 -1390097 -1060399 -2284589
12009 -2284589 -4327783 -5102792 -4484127 -4004778 -3706019 -2154731 394041 1796134 1549511
12000 1549511 1780545 3649285 5167867 4085520 1143975 -1176248 -1991772 -2546084 -3900246
11991 -3900246 -5268591 -4804364 -1797241 1986813 3616820 2003172 -1065939 -3299813
$$ packed form
12053D035056L171056R34949j910049k509545q61844P4187j143156k313913j166782
12044a690041R87467J157431q99583k312324r74053J911710L401782J857863j660564
12035A779688m243711l543132j38652K767826K720771N50070j153546j139838
12027b400524J3718J367011J981377Q74812j446168k335834j29503K871277L063011
12018C859177N49688j379736j331031j012794j330243r80846K35688L29698j224190
12009b284589k043194p75009O18665M79349K98759J551288K548772J402093k46623
12000A549511K31034J868740J518582j082347k941545k320223q15524n54312j354162
11991c900246j368345M64227L007123L784054J630007j613648l069111k233874
$$ plain form
11983 -3299813 -4102455 -3644832 -1624810 1296006 2658777 1368562 173033 1888976
11975 1888976 4439953 3498318 -604224 -3064446 -1983049 -888214 -2554842 -4780262
11967 -4780262 -4673013 -3294558 -2987585 -3125333 -1915874 -267644 -431872 -2104349 -2913453
11958 -2913453 -1989251 -516647 590597 1308853 1363423 509447 -471382 -779276 -1073598
11949 -1073598 -2258342 -3299766 -2071964 1652504 5504175 7055682 6198088 4768428
11941 4768428 4210293 3892670 2220747 -449072 -1429250 388982 1886400 -248776 -3937936
11932 -3937936 -3988225 209363 3662721 3313486 1906744 2398820 3175102 1979951 528268
11923 528268 1235130 2555825 1812959 144646 390175 2124647 2982564 2996714 3288404
$$ packed form
11983c299813q02642M57623K020022K920816J362771j290215j195529J715943
11975A888976K550977r41635m102542k460222J081397J094835j666628k225420
11967d780262J07249J378455L06973j37748J209459J648230j64228j672477q09104
11958b913453R24202J472604J107244P18256N4570q53976r80829l07894k94322
11949a073598j184744j041424J227802L724468L851671J551507q57594j429660
11941D768428n58135l17623j671923k669819r80178J818232J497418k135176l689160
11932c937936n0289M197588L453358l49235j406742M92076P76282j195151j451683
11923E28268P06862J320695p42866j668313K45529J734472Q57917J4150K91690
$$ plain form
11914 3288404 2314985 -1675208 -5767078 -5231998 -803723 1983359 770370 -1266902
11906 -1266902 -1439610 -875434 -721056 112514 1519868 822564 -2714563 -5435050 -3960950
11897 -3960950 277572 3440756 4012844 3124920 2069410 1420888 1310093 1285554 1004579
11888 1004579 1360279 3137383 4660344 3571992 1196864 1610167 5325781 7725132
11880 7725132 5768299 2632778 2765316 5359060 6334502 4648885 2701663 1562693
11872 1562693 -290501 -3349427 -5351743 -4146009 -458001 2947868 3864604 2238660
11864 2238660 44655 -441401 1150248 3062698 3721971 3419280 3123022 2813917 2140830
11855 2140830 1756318 2532662 3917535 4418281 3612684 2620589 2487672 2834270 2348373
$$ packed form
11914C288404r73419l990193m091870N35080M428275K787082j212989k037272
11906a266902j72708N64176J54378Q33570J407354o97304l537127k720487J474100
11897c960950M238522L163184N72088q87924j055510o48522j10795k4539k80975
11888A004579L55700J777104J522961j088352k375128M13303L715614K399351
11880G725132j956833l135521J32538K593744R75442j685617j947222j138970
11872A562693j853194l058926k002316J205734L688008L405869R16736j625944
11864B238660k194005m86056J591649J912450O59273l02691k96258l09105o73087
11855B140830l84512P76344J384873N00746q05597r92095j32917L46598m85897
$$ plain form
11846 2348373 332349 -2471700 -4765074 -6217749 -7273264 -7260444 -4425602 716327
11838 716327 3810088 1222555 -4591985 -7451949 -5118240 -1296990 407762 742820
11830 742820 1554591 1993614 640146 -1222801 -1414356 -282771 187460 -623522 -1978261
11821 -1978261 -3407782 -4315760 -3423057 -694394 1594214 1754640 1116712 1455197 1835956
11812 1835956 715376 -495090 781581 3955467 5954499 5621150 4349296 2846606
11804 2846606 508616 -2049795 -2963462 -1943559 -505335 718678 2221600 3221787
11796 3221787 2093612 -398848 -1309755 359512 2529134 3618812 4229907 4528010 3384131
11787 3384131 1449776 1503159 3654397 3707659 -723476 -5508175 -5224738 -932756 1636423
$$ packed form
11846B348373k016024k804049k293374j452675j055515J2820K834842N141929
11838G16327L093761k587533n814540k859964K333709L821250J704752L35058
11830G42820Q11771M39023j353468j862947j91555J131585M70231q10982j354739
11821a978261j429521r07978Q92703K728663K288608J60426o37928L38485L80759
11812A835956j120580j210466J276671L173886J999032l33349j271854j502690
11804B846606k337990k558411r13667J019903J438224J224013J502922J000187
11796C221787j128175k492460r10907J669267K169622J089678O11095K98103j143879
11787C384131j934355N3383K151238N3262m431135m784699K83437M291982K569179
$$ plain form
11778 1636423 518576 -593285 878754 2385856 844101 -2362330 -3711787 -2583424
11770 -2583424 -1062036 -129351 863583 1456651 54110 -2743494 -3691794 -1408439 942695
11761 942695 -177287 -3348476 -3966220 -801605 2398002 2348980 203454 -1268253 -1676883
11752 -1676883 -2017361 -1892453 -515331 918647 735807 -234804 -84764 402826 -1335161
11743 -1335161 -4952020 -6813367 -5153273 -2539315 -1802896 -2201839 -1503707 239998 1172325
11734 1172325 590913 -403219 -415096 1233131 3961349 5547328 3809128 -240844 -2670304
11725 -2670304 -1471626 711519 531157 -1244672 -1347646 907344 3018136 3183363 2086941
11716 2086941 874389 -292918 -1450430 -2438088 -3335600 -3800310 -2573315 428528 2408241
$$ packed form
11778A636423j117847j111861J472039J507102j541755l206431j349457J128363
11770b583424J521388R32685R92934N93068j402541k797604r48300K283355K351134
11761I42695j119982l171189o17744L164615L199607m9022k145526j471707m08630
11752a676883l40478J24908J377122J433978j82840r70611J50040M87590j737987
11743a335161l616859j861347J660094K613958P36419l98943O98132J743705R32327
11734A172325n81412r94132j1877J648227K728218J585979j738200m049972k429460
11725b670304J198678K183145j80362j775829j02974K254990K110792J65227j096422
11716B086941j212552j167307j157512r87658q97512m64710J226995L001843J979713
$$ plain form
11707 2408241 816210 -2305358 -2404620 977647 3297202 1702490 -997728 -998586 1152111
11698 1152111 2619318 3063766 3983872 4948684 4069950 1624905 27527 196202 614865
11689 614865 174243 -464602 -652516 -658344 -356788 841572 2133772 1523098 -1122293
11680 -1122293 -3067161 -2103190 434691 1480520 163407 -1480290 -1374234 101676
11672 101676 657215 -1137567 -3740057 -3860619 -432050 3450412 4009363 1661755 384671
11663 384671 2296665 5309439 6717390 6519760 5927038 5022831 3742598 3106477 3397471
11654 3397471 2911902 686814 -1370688 -1560860 -1632414 -3716714 -5725955 -3961810 479675
11645 479675 2516171 531155 -1651872 -1404596 -1183628 -3395399 -5612085 -4499946 -1440376
$$ packed form
11707B408241j592031l121568r9262L382267K319555j594712k700218q58K150697
11698A152111J467207M44448R20106R64812q78734k445045j597378J68675M18663
11689F14865m40622o38845j87914n828L01556J198360J292200o10674k645391
11680a122293j944868R63971K537881J045829j317113j643697J06056J475910
11672A01676N55539j794782k602490j20562L428569L882462N58951k347608j277084
11663C84671J911994L012774J407951j97630n92722r04207j280233o36121K90994
11654C397471m85569k225088k057502j90172p1554k084300k009241J764145M441485
11645D79675K036496j985016k183027K47276K20968k211771k216686J112139L059570
$$ plain form
11636 -1440376 -156425 -702241 2580 2641896 4608230 4625248 4595278 5999868 7333018
11627 7333018 6422165 3464331 632017 -294087 593497 1451193 480232 -1593985 -1820838
11618 -1820838 758470 2680637 456765 -3806242 -4863128 -2080959 -323844 -2127492
11610 -2127492 -3668758 -1207733 2449462 1993645 -2385204 -5540904 -4858800 -2915133
11602 -2915133 -2638144 -3643304 -4264577 -4161011 -3634611 -2670515 -1844068 -2221886 -3243896
11593 -3243896 -2548248 815105 4541686 5731049 4129585 1634879 -94017 -353833
11585 -353833 916643 2776070 3742506 3872380 4996494 7391011 7974895 4299904 -955368
11576 -955368 -2699624 -298779 1679594 132742 -2618743 -3115170 -1878695 -1599355 -2396310
$$ packed form
11636a440376J283951n45816P04821K639316J966334J7018k9970J404590J333150
11627G333018r10853k957834k832314r26104Q87584Q57696r70961k074217k26853
11618a820838K579308J922167k223872m263007j056886K782169J757115j803648
11610b127492j541266K461025L657195m55817m378849l155700O82104J943667
11602b915133K76989j005160o21273J03566N26400R64096Q26447l77818j022010
11593c243896O95648L363353L726581J189363j601464k494706j728896k59816
11585c53833J270476J859427R66436J29874J124114K394517N83884l674991n255272
11576i55368j744256K400845J978373j546852k751485m96427J236475K79340p96955
$$ plain form
11567 -2396310 -2149046 -541861 452315 21164 -456455 -242971 -400996 -1203704 -938590
11558 -938590 1100959 2517380 859346 -2594123 -4441098 -3783579 -2795480 -2846745 -2654917
11549 -2654917 -1033597 760194 918140 -156936 -700991 -330310 -109104 -205118 573032
11540 573032 2426543 3431249 1963494 -688387 -1610755 85182 2332305 3087508 2815181
11531 2815181 3066922 3748857 3441557 1994245 874996 647015 49691 -1445128 -2055388
11522 -2055388 -428354 1508027 844781 -1918018 -3493292 -2704596 -1827963 -2411298 -2771377
11513 -2771377 -1233581 755551 1023350 216359 410090 1576406 2039379 1452553 767007
11504 767007 81278 -855751 -845420 1056799 2662668 908084 -3179174 -5490814 -5091868
$$ packed form
11567b396310K47264J607185R94176m31151m77619K13484j58025q02708K65114
11558i38590K039549J416421j658034l453469j846975O57519R88099n1265J91828
11549b654917J621320J793791J57946j075076n44055L70681K21206r6014P78150
11540E73032J853511J004706j467755k651881r22368J695937K247123P55203k72327
11531B815181K51741O81935l07300j447312j119249k27981n97324j494819o10260
11522b055388J627034J936381o63246k762799j575274P88696Q76633n83335l60079
11513b771377J537796J989132K67799q06991J93731J166316M62973n86826o85546
11504G67007o85729r37029J0331J902219J605869j754584m087258k311640L98946
$$ plain form
11495 -5091868 -5327788 -7685938 -9066879 -7403034 -5730279 -7238409 -9651854 -8625675
11487 -8625675 -4410991 -996790 -209556 -697536 -1623325 -3296578 -4755939 -4595911 -3880274
11478 -3880274 -4593654 -5598784 -4044137 -582882 1095573 210958 -142301 1189200 1366163
11469 1366163 -942491 -2531574 -742053 2275372 3316976 2781904 2460418 1832188 146425
11460 146425 -569807 1339085 3114378 1116991 -2883206 -3515662 398283 4148709 3770562
11451 3770562 657783 -1536364 -1501027 -255000 1120605 2006639 1893271 913317 20960
11442 20960 -137013 39713 -114872 -563306 -640815 169862 1467970 1927966 739687 -879513
11432 -879513 -863157 704028 1546557 877362 768404 2296314 2920951 461534 -2369893
$$ packed form
11495e091868k35920k358150j380941J663845J672755j508130k413445J026179
11487h625675M214684L414201P87234m87980r25789j673253j459361J60028P15637
11478c880274p13380j005130J554647L461255J678455q84615l53259J331501J76963
11469A366163k308654j589083J789521L017425J041604n35072l21486o28230j685763
11460A46425p16232J908892J775293j997387m000197o32456L913945L750426l78147
11451C770562l112779k194147L5337J246027J375605Q86034j13368r79954q92357
11442B0960j57973J76726j54585m48434p7509Q10677J298108M59996j188279j619200
11432h79513J6356J567185Q42529o69195j08958J527910O24637k459417k831427
$$ plain form
11423 -2369893 -1041358 4116334 7926755 6999321 3161538 29222 -898893 -154952 1069579
11414 1069579 1365605 150936 -1139417 -476152 2127183 5004290 7311336 8980561
11406 8980561 8924891 6100958 2042131 -620116 -1964458 -3967000 -6129932 -5737342 -2829304
11397 -2829304 -828517 -1179153 -1448646 -325869 -350846 -3273280 -6413740 -6615894 -4794057
11388 -4794057 -3512744 -2737570 -1240195 52389 -427789 -1636035 -1390230 73655 798986
11379 798986 228702 -869478 -2309495 -3837957 -3982898 -2180144 -696407 -1711055 -3786313
11370 -3786313 -4032355 -2413303 -849655 597626 3123021 5739092 6203852 4916282
11362 4916282 4232472 4207887 2824534 362058 -627781 -179328 -1350197 -4508975 -5541836
$$ packed form
11423b369893J328535N157692L810421r27434l837783l132316r28115P43941J224531
11414A069579K96026j214669j290353O63265K603335K877107K307046J669225
11406H980561n5670k823933m058827k662247j344342k002542k162932L92590K908038
11397b829304K000787l50636k69493J122777k4977k922434l140460k02154J821837
11388d794057J281313P75174J497375J292584m80178j208246K45805J463885P25331
11379G98986n70284j098180j440017j528462j44941J802754J483737j014648k075258
11370c786313k46042J619052J563648J447281K525395K616071M64760j287570
11362D916282o83810k4585j383353k462476r89839M48453j170869l158778j032861
$$ plain form
11353 -5541836 -2116117 2010910 2127786 -709614 -1630287 1003645 4009245 4309782 2414919
11344 2414919 649067 131137 339009 451419 304050 266505 391120 -86940 -1798406
11335 -1798406 -3837517 -4375508 -3011785 -1373539 -850195 -1010581 -1075100 -1552756 -3065301
11326 -3065301 -4660806 -4985707 -4428427 -4259271 -4022357 -1943411 1727873 3942979 2671507
11317 2671507 -57559 -687473 1140433 2411338 1189277 -842824 -1037464 792563
11309 792563 2922927 4292281 4729867 3584148 429840 -3035203 -4110598 -2544698
11301 -2544698 -836952 -536790 -422649 689038 1679125 1366463 1009055 2352482 4568655
11292 4568655 5405780 4402470 2838259 1471618 590639 1317910 4140795 6715394 6043386
$$ packed form
11353e541836L425719M127027J16876k837400r20673K633932L005600L00537j894863
11344B414919j765852n17930K07872J12410j47369l7545J24615m78060j711466
11335a798406k039111n37991J363723J638246N23344j60386o4519m77656j512545
11326c065301j595505l24901N57280J69156K36914K078946L671284K215106j271472
11317B671507k729066o29914J827906J270905j222061k032101j94640J830027
11309G92563K130364J369354M37586j145719l154308l465043j075395J565900
11301b544698J707746L00162J14141J111687R90087l12662l57408J343427K216173
11292D568655Q37125j003310j564211j366641q80979P27271K822885K574599o72008
$$ plain form
11283 6043386 2708919 86810 -651609 -1515605 -3252982 -3598808 -1498453 265876 -877056
11274 -877056 -3169735 -3313147 -1532017 -729877 -1636001 -2007326 -518412 1484056 2697553
11265 2697553 3904012 6121094 8369335 8695687 6688517 3943099 2303218 2185781
11257 2185781 2452908 1740987 145216 -588964 838966 3253733 4223389 3430084 3279760
11248 3279760 5297216 7493109 7100997 4852941 3990315 5254920 5930786 4759640 4457261
11239 4457261 6867209 8518536 5137812 -855397 -2341925 2632900 7851782 7565473
11231 7565473 3695704 1467633 1743031 1822119 1052851 807679 444947 -1764837 -4302287
11222 -4302287 -3834827 -1007541 89607 -1139464 -587223 3149660 5404420 2667780
$$ packed form
11283F043386l334467k622109p38419q63996j737377l45826K100355J764329j142932
11274h77056k292679j43412J781130Q02140r06124l71325J488914K002468J213497
11265B697553J206459K217082K248241L26352k007170k745418j639881j17437
11257B185781K67127p11921j595771p34180J427930K414767R69656p93305j50324
11248C279760K017456K195893l92112k248056q62626J264605O75866j171146l02379
11239D457261K409948J651327l380724n993209j486528M974825N218882k86309
11231G565473l869769k228071K75398P9088p69268k45172l62732k209784k537450
11222d302287M67460K827286J097148j229071N52241L736883K254760k736640
$$ plain form
11214 2667780 -1244665 -538760 4155220 7365364 6750769 4720314 3084584 940773
11206 940773 -1774735 -2856048 -1275957 993150 1978494 2166643 2754928 3521983 3728239
11197 3728239 3493636 3144424 2569591 2074717 2388859 3003530 2192077 -209849 -1729656
11188 -1729656 -463150 2047357 2873369 1576368 175202 -21064 389386 524438 180962
11179 180962 -776869 -2281945 -3222791 -2411297 -640743 -83137 -1176317 -1857838 -648930
11170 -648930 1309622 2513891 3647956 6017015 8662962 9315843 7717417 5749055
11162 5749055 4286492 2222719 -803451 -2848146 -2109963 497577 2579213 3103620
11154 3103620 2764045 2260238 1567265 578434 -655192 -2209626 -3966400 -5134222 -4828549
$$ packed form
11214B667780l912445P05905M693980L210144o14595k030455j635730k143811
11206I40773k715508j081313J580091K269107R85344J88149N88285P67055K06256
11197C728239k34603l49212n74833m94874L14142O14671q11453k401926j519807
11188a729656J266506K510507Q26012j297001j401166j96266M10450J35052l43476
11179A80962r57831j505076r40846Q11494J770554N57606j093180o81521J208908
11170f48930J958552J204269J134065K369059K645947O52881j598426j968362
11162E749055j462563k063773l026170k044695P38183K607540K081636N24407
11154C103620l39575n03807o92973r88831j233626j554434j756774j167822L05673
$$ plain form
11145 -4828549 -3113900 -1054260 101987 -350476 -1984030 -3027978 -1722228 1366381
11137 1366381 3344736 2350561 13711 -717049 637932 2083027 2250684 1506034 197273
11128 197273 -1930025 -4127127 -4530467 -2630115 -292471 651530 477062 319876 363932
11119 363932 503587 1364060 2969536 3498005 1419195 -1651539 -2372675 -5630 2672359
11110 2672359 3289211 2833797 3577067 5486801 6404759 5280169 3583930 3175290 3867890
11101 3867890 3886015 2322518 336935 -300440 663012 1912162 2565126 3345068 5120308
11092 5120308 6910330 6568096 3567664 18253 -1636505 -1128171 34742 706483 955534
11083 955534 1231379 1601934 1727126 1099283 -347762 -1548969 -1147749 265435 76404
$$ packed form
11145d828549J714649K059640J156247m52463j633554j043948J305750L088609
11137A366381J978355r94175k336850p30760J354981J445095J67657p44650j308761
11128A97273k127298k197102m03340J900352K337644R44001j74468j57186M4056
11119C63932J39655Q60473J605476N28469k078810l070734p21136K367045K677989
11110B672359O16852m55414P43270J909734R17958j124590j696239m08640O92600
11101C867890J8125j563497j985583o37375R63452J249150O52964P79942J775240
11092E120308J790022l42234l000432l549411j654758N08334J162913O71741K49051
11083I55534K75845L70555J25192o27843j447045j201207M01220J413184j89031
$$ plain form
11074 76404 -2731897 -5242403 -4245634 -1243220 -591608 -2816469 -3685783 -1081737 1226767
11065 1226767 -705775 -4814408 -6135198 -3867062 -1360133 -358410 634032 2572410
11057 2572410 4255522 4809881 4597671 3327385 327994 -2924022 -3707540 -2111468 -1082539
11048 -1082539 -1685099 -1650414 133922 1122320 -871819 -4008757 -5186942 -4365098 -3759567
11039 -3759567 -4235225 -4599785 -3563561 -1050164 1534079 1827503 -1050007 -4259829 -3821285
11030 -3821285 -10784 2654192 1687107 -467242 -1173163 -1401738 -2447831 -2616290 -466163
11021 -466163 1762804 1583218 479341 994249 2091250 1475658 353277 1421903 3759655
11012 3759655 4289137 3147081 2943165 3442397 1775654 -2174752 -5175277 -5754836 -5687026
$$ packed form
11074G6404k808301k510506R96769L002414O51612k224861q69314K604046K308504
11065A226767j932542m108633j320790K268136K506929J001723R92442J938378
11057B572410J683112N54359k12210j270286k999391l252016p83518J596072J028929
11048a082539o02560L4685J784336R88398j994139l136938j178185Q21844O05531
11039c759567m75658l64560J036224K513397K584243K93424k877510l209822M38544
11030c821285L810501K664976r67085k154349p05921k28575j046093j68459K150127
11021d66163K228967j79586j103877N14908J097001o15592j122381J068626K337752
11012C759655N29482j142056k03916M99232j666743l950406l000525n79559O7810
$$ plain form
11003 -5687026 -5834926 -4640993 -1752529 529816 683443 -151013 -682507 -1166543 -1919574
10994 -1919574 -2695566 -3875466 -5709636 -6479478 -4377002 -967873 612137 627129 1928293
10985 1928293 4253285 4084183 1025659 -610157 1544434 4129408 3356989 265610
10977 265610 -1892009 -2088864 -780426 1986304 4898117 4776835 674579 -3820271 -5005790
10968 -5005790 -3379772 -1143300 1557658 4668990 5400797 1597852 -3744312 -5461079
10960 -5461079 -2846358 335203 1687613 2211783 2672293 1844201 -653757 -2830350 -3104027
10951 -3104027 -2602639 -3326650 -5371579 -7140055 -7423156 -6285369 -4391583 -2320213 -538786
10942 -538786 459842 381050 -496404 -1548551 -2642765 -4247751 -6288998 -7653017 -7631589
$$ packed form
11003e687026j47900J193933K888464K282345J53627q34456n31494m84036p53031
10994a919574p75992j179900j834170p69842K102476L409129J580010J4992J301164
10985A928293K324992j69102l058524j635816K154591K584974p72419l091379
10977B65610k157619j96855J308438K766730K911813j21282m102256m494850j185519
10968e005790J626018K236472K700958L111332P31807l802945n342164j716767
10960e461079K614721L181561J352410N24170M60510q28092k497958k176593k73677
10951c104027N01388p24011k044929j768476k83101J137787J893786K071370J781427
10942e38786R98628p8792q77454j052147j094214j604986k041247j364019K1428
$$ plain form
10933 -7631589 -6958332 -6227702 -4403453 -795264 2419130 2198825 -1171635 -4503573 -6102536
10924 -6102536 -6797589 -6638917 -4332561 -964447 -392809 -3685231 -6331316 -3906328 1685332
10915 1685332 4587002 2189330 -2737347 -6143798 -6461896 -4772366 -3322286 -3797479
10907 -3797479 -5717726 -6777129 -5594629 -3381707 -2039085 -1631924 -863211 847453
10899 847453 2917272 4583935 5419911 5395633 4992782 4680808 4148263 2969350 1920476
10890 1920476 2212053 3400727 3750586 2833480 1997475 2072737 2493590 2821469 3084279
10881 3084279 2591127 795824 -690670 190579 2106399 1563349 -1502864 -3112055 -1294550
10872 -1294550 1144229 1566790 1260621 1953663 2304603 709293 -1642920 -3404068 -5539786
$$ packed form
10933g631589O73257P30630J824249L608189L214394k20305l370460l331938j598963
10924f102536o95053J58672K306356L368114N71638l292422k646085K424988N591660
10915A685332K901670k397672m926677l406451l18098J689530J450080m75193
10907c797479j920247j059403J182500K212922J342622M07161P68713J710664
10899H47453K069819J666663Q35976k4278m02851l11974n32545j178913j048874
10890A920476K91577J188674L49859r17106q36005P5262M20853L27879K62810
10881C084279m93152j795303j486494Q81249J915820n43050l066213j609191J817505
10872a294550K438779M22561l06169O93042L50940j595310k352213j761148k135718
$$ plain form
10863 -5539786 -8054196 -7676637 -2882797 1632798 324204 -5038692 -7353980 -3633307
10855 -3633307 1977263 4671718 4448271 4144918 5055344 6042318 5601907 3838871 2641664
10846 2641664 3591792 5599794 5898064 3727230 1150892 -326983 -1374627 -2064198 -673269
10837 -673269 2823391 5171253 4276721 2396043 2152168 2307176 799194 -818572 55242
10828 55242 2240281 2622753 1149055 -43618 -940095 -2892541 -4787448 -4287858 -2117220
10819 -2117220 -963522 -810725 399713 2011022 1169748 -1765066 -2850035 -456199
10811 -456199 2381473 2613697 786043 -1073675 -2082047 -1908422 -338503 1471874 1690628
10802 1690628 549674 88890 654325 231757 -2015067 -4127664 -4260989 -2908949 -1217341
$$ packed form
10863e539786k514410L77559M793840M515595j308594n362896k315288L720673
10855c633307N610570K694455k23447l03353R10426R86974m40411j763036j197207
10846B641664R50128K008002K98270k170834k576338j477875j047644o89571J390929
10837f73269L496660K347862q94532j880678k43875J55008j507982j617766Q73814
10828E5242K185039L82472j473698j192673q96477j952446j894907M99590K170638
10819b117220J153698J52797J210438J611309q41274k934814j084969K393836
10811d56199K837672K32224j827654j859718j008372J73625J569919J810377K18754
10802A690628j140954m60784N65435m22568k246824k112597j33325J352040J691608
$$ plain form
10793 -1217341 779387 3103143 4842288 5352734 5086997 4520045 3595597 2657819 2397953
10784 2397953 2470681 1778539 525797 197688 899149 627206 -1703188 -4113254 -3939647
10775 -3939647 -1379920 903652 1329208 971620 1226298 1255749 -833085 -4636128 -7128042
10766 -7128042 -6470933 -4453910 -3567412 -3222353 -1377333 1161792 1358131 -1309226 -4091335
10757 -4091335 -5317349 -6022591 -6489593 -4939925 -1258383 1407353 768089 -1734353 -3812270
10748 -3812270 -5043282 -5152591 -3173349 -417821 -645363 -4686292 -8277348 -7858026 -5073504
10739 -5073504 -2898819 -1235622 411250 26014 -3022877 -4845544 -2313548 1656158
10731 1656158 2577243 1037395 126015 -649717 -3423608 -6399346 -5942242 -2697563 -402565
$$ packed form
10793a217341J996728K323756J739145N10446k65737n66952r24448r37778k59866
10784B397953P2728o92142j252742l28109P01461k71943k330394k410066J73607
10775c939647K559727K283572M25556l57588K54678K9451k088834l803043k491914
10766g128042O57109K017023Q86498L45059J845020K539125J96339k667357k782109
10757d091335j226014p05242m67002J549668L681542K665736o39264k502442k077917
10748c812270j231012j09309J979242K755528k27542m040929l591056M19322K784522
10739e073504K174685J663197J646872l85236l048891j822667K531996L969706
10731A656158R21085j539848r11380p75732k773891k975738M57104L244679K294998
$$ plain form
10722 -402565 79063 661986 1407405 893408 -32652 393455 973502 -431620 -2408006
10713 -2408006 -2102518 -325555 77495 -702022 -683767 -466691 -1347693 -1294806 1596217
10704 1596217 3898541 1550804 -2116758 -286004 6359264 10059509 7467919 3362634
10696 3362634 1952462 1485888 -600608 -3218808 -4565323 -4678625 -3346088 181823
10688 181823 4113920 4888138 2037286 -1384415 -3488787 -4864216 -5522293 -4801286 -3959897
10679 -3959897 -4569168 -5010764 -3048504 -695512 -1436983 -3930831 -4138519 -2414059 -2225168
10670 -2225168 -2997737 -1114548 2696261 4152457 3138627 3180637 3537081 -10098 -6051820
10661 -6051820 -7753530 -3538631 585437 1037985 822154 1705129 730706 -2613152 -3972795
$$ packed form
10722d02565M81628N82923P45419n13997r26060M26107N80047j405122j976386
10713b408006L05488J776963M03050p79517J8255K17076q81002N2887K891023
10704A596217K302324k347737l667562J830754O645268L700245k591590m105285
10696C362634j410172m66574k086496k618200j346515j13302J332537L527911
10688A81823L932097P74218k850852l421701k104372j375429o58077P21007Q41389
10679c959897o09271m41596J962260K352992p41471k493848k07688J724460J88891
10670b225168p72569J883189L810809J456196j013830M2010L56444l547179o041722
10661f051820j701710M214899M124068M52548k15831Q82975r74423l343858j359643
$$ plain form
10652 -3972795 -2347939 -2889042 -7565465 -10590107 -7690601 -3024750 -1935137 -2966491
10644 -2966491 -2122114 318517 2089841 3343765 4393492 3373231 7357 -2421277
10636 -2421277 -2154783 -1732581 -2843625 -3191749 -1517597 -807949 -3086190 -5516727 -5048968
10627 -5048968 -2912768 -1654986 -1562538 -2191728 -3394101 -3306766 48105 4008296 3432362
10618 3432362 -1306506 -4369779 -3485916 -2299916 -2571940 -1550701 1089807 1645866 3480
10609 3480 552097 2850098 495864 -7008993 -10845759 -6416537 -973924 -1464756 -3661786
10600 -3661786 -993387 3720569 4050489 1250962 906594 2835840 2672378 270713 -830405
10591 -830405 104640 1185634 2249672 3889340 4577687 3183696 1731612 1944255 2096641
$$ packed form
10652c972795J624856n41103m676423l024642K899506M665851J089613j031354
10644b966491Q44377K440631J771324J253924J049727j020261l365874k428634
10636b421277K66494M22202j111044l48124J674152P09648k278241k430537M67759
10627e048968K136200J257782R2448o29190j202373Q7335L354871L960191n75934
10618C432362m738868l063273Q83863J186000k72024J021239K640508N56059j642386
10609C480N48617K298001k354234p504857l836766M429222N442613m90832k197030
10600c661786K668399M713956L29920k799527l44368J929246j63462k401665j101118
10591h30405R35045J080994J064038J639668O88347j393991j452084K12643J52386
$$ plain form
10582 2096641 581089 -907859 -797335 -461258 -876529 -527221 913308 1226042 153342
10573 153342 532079 3023669 4698065 4292466 3478705 2158011 -1194135 -4180868 -2909077
10564 -2909077 54263 -1318318 -5402714 -4687930 785704 2892617 -340143 -2010793
10556 -2010793 79237 46910 -2972738 -2053051 3312606 4428071 -526488 -2440627 1357113
10547 1357113 1488333 -5105628 -7813608 -1747900 2279187 -2845713 -7694267 -4160781
10539 -4160781 44603 -2674611 -5042850 299771 6018379 4048100 157981 845380
10531 845380 324338 -5320552 -6430804 2503343 9034090 3019137 -4910606 -2333884
10523 -2333884 3421825 1149895 -2804094 1165951 5652196 932706 -5035991 -2153053
$$ packed form
10582B096641j515552j488948J10524L36077m15271L49308J440529L12734j072700
10573A53342L78737K491590J674396m05599q13761j320694l352146k986733J271791
10564b909077K963340j372581m084396P14784N473634K106913l232760j670650
10556b010793K090030l2327l019648R19687N365657J115465m954559j914139L797740
10547A357113J31220o593961k707980O065708M027087n124900m848554L533486
10539d160781M205384k719214k368239N342621N718608j970279l890119O87399
10531H45380n21042n644890j110252Q934147O530747o014953p929743K576722
10523b333884N755709k271930l953989L970045M486245m719490n968697K882938
$$ plain form
10515 -2153053 1730035 -2550993 -5334559 2943159 10321393 4765774 -1625378 4497352
10507 4497352 10740781 2826308 -6094503 -751355 4811117 -4656011 -11339843 2733238
10499 2733238 15739530 4150760 -8367723 6768533 23137073 6193377 -12040894
10492 -12040894 13889919 44944314 19086908 -3278010 109442090 334565618 459438299
10485 459438299 346684248 122495268 2248942 19498315 46341179 16631402 -11634879
10478 -11634879 3644322 20342750 4672424 -11071317 1787584 17761217 11533961
10471 11533961 2048780 9057181 15578426 4926777 -6411834 -1554830 6381938 2299495
10463 2299495 -3431573 1187209 6153265 1107383 -4093134 188063 4914121 1721908
$$ packed form
10515b153053L883088m281028k783566Q277718P378234n555619o391152O122730
10507D497352O243429p914473q920811N343148N562472r467128o683832J4073081
10499B733238J3006292j1588770j2518483J5136256J6368540j6943696j8234271
10492a2040894K5930813L1054395k5857406k2364918J12720100K25123528J24872681
10485D59438299j12754051k24188980j20246326J7249373K6842864k9709777k8266281
10478a1634879J5279201J6698428j5670326j5743741J2858901J5973633o227256
10471A1533961r485181P008401O521245j0651649j1338611M857004P936768m082443
10463B299495n731068M618782M966056n045882n200517M281197M726058l192213
$$ plain form
10455 1721908 -643843 4728675 8035053 2113261 -2759934 1885481 6997829 3500340
10447 3500340 -1843069 -1252214 -24896 -3304606 -4737461 -250990 2218904 -2088546
10439 -2088546 -4932626 -762385 2981823 1046020 138062 3801834 3823262 -2971636 -5904275
10430 -5904275 520129 5305562 559107 -4065126 463339 5908268 2682054 -2328012
10422 -2328012 822540 6956625 6526394 2916173 3733689 5516193 2335210 -237269
10414 -237269 4883516 11234347 9047421 2685858 2673100 7235419 6926407 1925331 -57233
10405 -57233 1439412 963141 -591176 1597412 4891820 3000265 -1640273 -1497869 2531740
10396 2531740 3191918 408210 814386 4747831 5239567 303116 -4019218 -3920836 -2385341
$$ packed form
10455A721908k365751N372518L306378n921792m873195M645415N112348l497489
10447C500340n343409N90855J227318l279710j432855M486471K469894m307450
10439b088546k844080M170241L744208j935803r07958L663772K1428o794898k932639
10430e904275O424404M785433m746455m624233M528465N444929l226214n010066
10422b328012L150552O134085m30231l610221Q17516J782504l180983k572479
10414b37269N120785O350831k186926o361563j2758M562319l09012n001076j982564
10405e7233J496645m76271j554317K188588L294408j891555m640538J42404M029609
10396B531740O60178k783708M06176L933445M91736m936451m322334R8382J535495
$$ plain form
10387 -2385341 -2324255 -2623883 -2169261 -1769192 -1509499 -1028155 -1798205 -4596361 -6251281
10378 -6251281 -3653991 858044 2833592 2297017 2362816 3592596 4329704 4324090 3811683
10369 3811683 1643839 -1811311 -3194350 -1381011 -257458 -2331867 -4161372 -2556487
10361 -2556487 -277715 -470188 -680520 1800546 3831691 2044473 -390362 578138 2270271
10352 2270271 646212 -1330024 1175560 5217639 4185400 -1127628 -3974298 -2302039
10344 -2302039 -26012 911186 2181508 3692459 3459870 2142248 1767158 1351375 -470186
10335 -470186 -770395 3175510 7142086 5141076 -463494 -1985668 1436085 2970276
10327 2970276 -499909 -4167415 -3906721 -1950532 -1712133 -2702763 -3035320 -2622140 -1937291
$$ packed form
10387b385341O1086k99628M54622M00069K59693M81344p70050k798156j654920
10378f251281K597290M512035J975548n36575O5799J229780P37108n614n12407
10369C811683k167844l455150j383039J813339J123553k074409j829505J604885
10361b556487K278772j92473k10332K481066K031145j787218k434835R68500J692133
10352B270271j624059j976236K505584M042079j032239n313028k846670J672259
10344b302039K276027R37198J270322J510951k32589j317622l75090m15783j821561
10335d70186l00209L945905L966576k001010n604570j522174L421753J534191
10327B970276l470185l667506K60694J956189K38399r90630l32557M13180O84849
$$ plain form
10318 -1937291 -886833 82658 467151 1150009 2602430 2794517 254738 -2419542 -2104919
10309 -2104919 -461659 -1216829 -3887404 -5172483 -4979349 -5616268 -6287646 -4250444 -718927
10300 -718927 319857 -1035944 -714658 2263364 4496785 4391444 4139377 4789592 4558268
10291 4558268 2995974 2000068 1775085 418198 -1700455 -1834349 18560 588376 -1087749
10282 -1087749 -2255417 -1798347 -2267172 -4884935 -6921691 -6083071 -3757127 -1981674 -580416
10273 -580416 934948 1769540 1713960 1674338 1207987 -1244014 -4554773 -4940569 -1405375
10264 -1405375 2260976 2812786 1644932 1404717 1573674 177855 -2370356 -4029610 -4386748
10255 -4386748 -4666473 -5203203 -4908950 -3120298 -778998 289834 -966244 -3534962 -4930122
$$ packed form
10318a937291J050458R69491L84493O82858J452421J92087k539779k674280L14623
10309b104919J643260p55170k670575j285079J93134o36919o71378K037202L531517
10300g18927J038784j355801L21286K978022K233421j05341k52067O50215k31324
10291D558268j562294r95906k24983j356887k118653j33894J852909N69816j676125
10282a087749j167668M57070m68825k617763k036756Q38620K325944J775453J401258
10273e80416J515364Q34592n5580l9622m66351k452001l310759l85796L535194
10264a405375L666351N51810j167854k40215J68957j395819k548211j659254l57138
10255d386748k79725n36730K94253J788652K341300J068832j256078k568718j395160
$$ plain form
10246 -4930122 -3880090 -1995245 -1584244 -2403161 -2283470 -603983 973958 1371656 1588054
10237 1588054 2648095 3777160 3690870 2682105 2326551 3318410 4305557 3413598 1036550
10228 1036550 123118 2427352 5365929 5021751 2026498 1164008 4302565 7321016 5998180
10219 5998180 1640293 -1760435 -2955656 -2913136 -1575191 1170700 3283272 3021577 2065650
10210 2065650 2737989 3718457 2230968 -891802 -2296152 -1384937 -691577 -1521223 -2757808
10201 -2757808 -3592712 -4142995 -3807151 -2153908 -875845 -1721261 -3132652 -2133198 1085088
10192 1085088 3601568 4027328 3170325 1457501 -818298 -1651951 486261 3316609 3310809
10183 3310809 841821 -921523 -1156990 -1191846 -355440 2823103 5746902 3688166 -2800512
$$ packed form
10246d930122J050032J884845M11001q18917J19691J679487J577941L97698K16398
10237A588054J060041J129065q6290j008765l55554R91859R87147q91959k377048
10228A036550r13432K304234K938577l44178k995253q62490L138557L018451j322836
10219E998180m357887l400728j195221M2520J337945K745891K112572k61695r55927
10210B065650O72339R80468j487489l122770j404350R11215O93360q29646j236585
10201b757808q34904n50283L35844J653243J278063q45416j411391R99454L218286
10192A085088K516480M25760q57003j712824k275799q33653K138212K830348n800
10183C310809k468988j763344k35467l4856Q36406L178543K923799k058736o488678
$$ plain form
10174 -2800512 -7616160 -7327031 -4875473 -3920199 -4304623 -4733398 -5325694 -5494063 -3408938
10165 -3408938 408832 2749663 2707479 3074662 5025743 5771802 3850610 2357046 3751349
10156 3751349 5320141 3483309 -472436 -2717145 -2465101 -1580103 -628177 977431 2279647
10147 2279647 1700198 -125382 -1322451 -1906484 -3339736 -5520060 -6658440 -5964546 -4510118
10138 -4510118 -3552995 -3451117 -3881652 -3920029 -2504624 -8538 1417049 365335 -1689062
10129 -1689062 -2147508 -598433 1040890 1376778 1140013 1702122 2862301 2727826 -6336
10120 -6336 -3767041 -4937935 -1840409 2782244 4609886 2710089 144111 -132681 1772368
10111 1772368 3757181 3825393 985278 -3862841 -7465979 -6715338 -2409103 1272500 1793474
$$ packed form
10174b800512m815648K89129K451558R55274l84424m28775n92296j68369K085125
10165c408938L817770K340831m2184L67183J951081P46059j921192j493564J394303
10156C751349J568792j836832l955745k244709K52044Q84998R51926J605608J302216
10147B279647n79449j825580j197069n84033j433252k180324j138380O93894J454428
10138d510118R57123J01878m30535l8377J415405K496086J425587j051714k054397
10129a689062m58446J549075J639323L35888k36765N62109J160179j34475k734162
10120f336l760705j170894L097526M622653J827642j899797k565978k76792J905049
10111A772368J984813O8212k840115m848119l603138P50641M306235L681603N20974
$$ plain form
10102 1793474 868055 1117539 2191041 1900389 -160933 -2068126 -2274555 -1533209 -1885117
10093 -1885117 -4081313 -6176644 -5278430 -1212955 2533208 2787660 596871 -695587
10085 -695587 -271516 -50996 -575385 -22893 2134738 3761782 3622158 3400539 4482297
10076 4482297 5428763 4885076 4652167 6974407 10232949 10475353 6898753 3106088 2446850
10067 2446850 4086994 4572802 2106443 -1663308 -3621545 -2250820 1207395 4086048
10059 4086048 4410458 2030883 -1445555 -3558888 -2770520 -82856 1801186 1613592 894641
10050 894641 1403272 2498268 2634729 2229768 2841670 4162764 4187794 2240132 -264286
10041 -264286 -1951061 -2313878 -668406 3179163 6978562 7321937 3687368 -818473 -3333675
$$ packed form
10102A793474r25419K49484J073502k90652k061322j907193k06429P41346l51908
10093a885117k196196k095331Q98214M065475L746163K54452k190789j292458
10085f95587M24071K20520n24389N52492K157631J627044j39624k21619J081758
10076D482297R46466n43687k32909K322240L258542K42404l576600l792665o59238
10067B446850J640144M85808k466359l769751j958237J370725L458215K878653
10059D086048L24410k379575l476438k113333P88368K687664J884042j87594p18951
10050H94641N08631J094996J36461m04961O11902J321094K5030j947662k504418
10041b64286j686775l62817J645472L847569L799399L43375l634569m505841k515202
$$ plain form
10032 -3333675 -3817662 -3327032 -2228764 -1170405 -1460864 -2956899 -3464041 -1844496 -89051
10023 -89051 -535020 -2309327 -2488514 -158922 2432173 2724923 618997 -1842699 -2906499
10014 -2906499 -2836387 -3167714 -4464835 -5542772 -5221343 -3819486 -2129240 -210937 1397531
10005 1397531 745440 -2906090 -6478196 -6005562 -1983930 1148286 1082022 33573 245325
9996 245325 452415 -1138332 -3003718 -2324154 424476 1677164 -499768 -3913147 -4975551
9987 -4975551 -2704369 773165 3137985 4184125 4695934 4075609 1053298 -3085344 -4553733
9978 -4553733 -2012317 704585 -567770 -4270915 -5154070 -1670452 2163612 2567562 401659
9969 401659 -1205330 -936505 403002 1714003 2302593 1840547 558046 -998793 -2329652
$$ packed form
10032c333675m83987M90630J098268J058359k90459j496035n07142J619545J755445
10023h9051m45969j774307j79187K329592K591095K92750k105926k461696j063800
10014b906499P0112l31327j297121j077937L21429J401857J690246J918303J608468
10005A397531o52091l651530l572106M72634M021632L132216o6264j048449K11752
9996B45325K07090j590747j865386O79564K748630J252688k176932l413379j062404
9987d975551K271182L477534K364820J046140N11809o20325l022311m138642j468389
9978d553733K541416K716902j272355l703145q83155L483618L834064M03950k165903
9969D01659j606989K68825J339507J311001N88590m62046j282501j556839j330859
$$ plain form
9960 -2329652 -2577128 -862335 1733446 2174243 -366211 -2136005 244132 4057758 3903194
9951 3903194 -62075 -2209785 47232 2963199 2901614 1128765 119244 -345038 -684890
9942 -684890 683679 3763649 4823511 1645950 -2003552 -1272856 2645982 4634271 3433679
9933 3433679 2699026 4496759 6077393 4255631 -145393 -3896994 -5447335 -5695194 -5706283
9924 -5706283 -5348921 -4316852 -3359811 -3515709 -4343342 -4165790 -2545551 -1126465 -925478
9915 -925478 -334394 2267675 5234683 5577225 3336131 1142559 -71309 -1629385 -3423093
9906 -3423093 -3316884 -1073159 471508 -521659 -2502294 -3589537 -4343126 -5860634 -7384654
9897 -7384654 -7549314 -6425880 -5056799 -4227435 -4390271 -5552579 -6961111 -7919065 -8352502
$$ packed form
9960b329652k47476J714793K595781M40797k540454j769794K380137L813626j54564
9951C903194l965269k147710K257017K915967o1585j772849j009521m64282l39852
9942f84890J368569L079970J059862l177561l649502P30696L918838J988289j200592
9933C433679p34653J797733J580634j821762m401024l751601j550341k47859j1089
9924e706283L57362J032069R57041j55898q27633J77552J620239J419086K00987
9915i25478N91084K602069K967008L42542k241094k193572j213868j558076j793708
9906c423093J06209K243725J544667r93167j980635j087243p53589j517508j524020
9897g384654j64660J123434J369081Q29364j62836j162308j408532r57954m33437
$$ plain form
9888 -8352502 -7636540 -4956126 -2636723 -5456068 -12850719 -16410319 -11778340 -8385282
9880 -8385282 -16651645 -27776458 -20605462 8133500 34654836 37126987 22031985 10835506
9872 10835506 10226015 9804702 3760716 -1104996 732537 5079176 6934433 7741528 9534012
9863 9534012 9811005 6860115 4106929 4633193 5946283 4376767 1185640 394632 2868833
9854 2868833 5843398 6967860 6426191 5789558 6171882 7137386 7241907 6253665 5933708
9845 5933708 7186059 7803990 5400715 1365400 -989792 -1314167 -2110048 -4338837 -6302267
9836 -6302267 -6591795 -5270652 -2597217 630349 2273126 1401898 604219 2483788 5216567
9827 5216567 5410594 3844541 3655569 4108459 1827624 -2211021 -3097521 -17683 2234707
$$ packed form
9888h352502P15962K680414K319403k819345p394651l559600M631979L393058
9880h385282q266363j1124813P170996K8738962K6521336K472151j5095002j1196479
9872A0835506o09491m21313o043986m865712J837533M346639J855257Q07095J792484
9863I534012K76993k950890k753186N26264J313090j569516l191127p91008K474201
9854B868833K974565J124462n41669o36633L82324R65504J04521r88242l19957
9845E933708J252351O17931k403275m035315k355192l24375p95881k228789j963430
9836f302267k89528J321143K673435L227566J642777q71228p97679J879569K732779
9827E216567J94027j566053j88972M52890k280835m038645q86500L079838K252390
$$ plain form
9818 2234707 1136155 -195613 441304 391865 -2197496 -4200695 -2734341 35604 1168357
9809 1168357 1778180 3397824 3517632 -203872 -4255706 -3253235 1966871 5236631 3431714
9800 3431714 -365016 -2030052 -1027239 620715 1157059 132115 -1675371 -2997517
9792 -2997517 -3522967 -4000966 -4271086 -2747530 908909 4350522 5364944 4463855 3118901
9783 3118901 1490928 -173533 -245279 1575146 2395489 40612 -3069192 -3377954 -1828743
9774 -1828743 -1981677 -3634050 -3007566 628735 3129643 1530431 -1826733 -2973867 -1203193
9765 -1203193 1476926 3327343 3551405 1976616 -265018 -1297110 -961282 -1063196 -2215644
9756 -2215644 -2656136 -1589943 -1181795 -2974936 -4603148 -3177390 -452006 -961974 -5373601
$$ packed form
9818B234707j098552j331768O36917m9439k589361k003199J466354K769945J132753
9809A168357O09823J619644J19808l721504m051834J002471N220106L269760j804917
9800C431714l796730j665036J002813J647954N36344j024944j807486j322146
9792b997517n25450m77999k70120J523556L656439L441613J014422r01089j344954
9783C118901j627973j664461p1746J820425Q20343k354877l109804l08762J549211
9774a828743j52934j652373O26484L636301K500908j599212l357164j147134J770674
9765a203193K680119J850417K24062j574789k241634j032092L35828j01914j152448
9756b215644m40492J066193M08148j793141j628212J425758K725384n09968m411627
$$ plain form
9747 -5373601 -9291303 -9290973 -6847939 -4831257 -3018438 345629 4220136 5040244 1384153
9738 1384153 -3698393 -5772201 -3468265 670448 3193390 2992160 1571539 602240 120104
9729 120104 -339513 75326 2433776 5375992 5884686 3427693 1088109 1192346 1999371
9720 1999371 832453 -1445869 -1965559 -566785 327658 45895 435343 2062942 2921591
9711 2921591 1757174 -170856 -1606138 -2838196 -3666610 -2678971 -110335 1192142 -447040
9702 -447040 -2944487 -3455759 -1949407 -110799 1170985 1409718 -125922 -2583591 -3263757
9693 -3263757 -1457154 -296020 -2210917 -4853519 -4663968 -2440470 -1738732 -3272071 -4762713
9684 -4762713 -5322286 -5974663 -6303504 -4598527 -1513992 73206 -629757 -1415931 -1019194
$$ packed form
9747e373601l917702L30K443034K016682J812819L364067L874507Q20108l656091
9738A384153n082546k073808K303936M138713K522942k01230j420621r69299m82136
9729A20104m59617M14839K358450K942216N08694k456993k339584J04237Q07025
9720A999371j166918k278322n19690J398774Q94443k81763L89448J627599Q58649
9711B921591j164417j928030j435282j232058q28414R87639K568636J302477j639182
9702d47040k497447n11272J506352J838608J281784K38733j535640k457669o80166
9693c263757J806603J161134j914897k642602J89551K223498P01738j533339j490642
9684d762713n59573o52377l28841J704977L084535J587198p02963p86174L96737
$$ plain form
9675 -1019194 -813423 -1748330 -2507623 -1887375 -681735 -108274 -164851 -274370 -53223 738806
9665 738806 1522539 672882 -2052857 -3759748 -1895608 1242939 993365 -2844031 -5492522
9656 -5492522 -3977165 -549255 1619524 2297456 2266218 1303069 199053 1459413 5448020
9647 5448020 8524316 7597076 4317636 2300811 2173173 1858493 138069 -2439358 -4877708
9638 -4877708 -5917499 -4201536 -209735 3113915 3403258 1502884 -248572 -966207 -1106672
9629 -1106672 -998692 -990517 -1589770 -2194312 -1455926 -59331 -677853 -3466359 -4494464
9620 -4494464 -1359585 2339526 1740176 -2116330 -4078343 -2676558 -1455883 -2437317 -2855196
9611 -2855196 -487 4212052 5829059 3825045 345599 -2553181 -4328393 -4840061
$$ packed form
9675a019194K05771r34907p59293O20248J205640N73461n6577j09519K21147P92029
9665G38806P83733q49657k725739j706891J864140L138547k49574l837396k648491
9656e492522J515357L427910K168779O77932l1238r63149j104016J260360L988607
9647E448020L076296r27240l279440k016825j27638l14680j720424k577427k438350
9638d877708j039791J715963L991801L323650K89343j900374j751456p17635j40465
9629a106672J07980Q175n99253o04542P38386J396595o18522k788506j028105
9620d494464L134879L699111n99350l856506j962013J401785J220675r81434m17879
9611b855196K854709M212539J617007k004014l479446k898780j775212n11668
$$ plain form
9603 -4840061 -3796082 -1640475 74092 -67952 -1757414 -3014317 -2296789 -525613 -279130
9594 -279130 -2619700 -5479402 -5861544 -3069017 921012 3682012 4130009 2672197 653837
9585 653837 -420015 91648 1538015 2773133 3218956 3099839 3072518 3663374 4519998
9576 4519998 4376027 2636594 751691 664313 1998058 2583346 1962663 2055302 3431230
9567 3431230 3446980 70535 -4334888 -5612513 -3252025 -761575 -890088 -2691893 -3637816
9558 -3637816 -2897894 -1761468 -1675868 -2560255 -3052895 -2400726 -1702715 -2389335 -3636794
9549 -3636794 -2858782 714728 4510280 5527151 3395604 -243501 -3641342 -5062714
9541 -5062714 -3024380 1598806 5147214 4988170 2715385 1544871 1671242 720175 -1848499
$$ packed form
9603d840061J043979K155607J714567j42044j689462j256903P17528J771176K46483
9594b79130k340570k859702l82142K792527L990029K761000M47997j457812k018360
9585F53837j073852N11663J446367J235118M45823j19117k7321N90856Q56624
9576D519998j43971j739433j884903q7378J333745N85288o20683R2639J375928
9567C431230J5750l376445m405423j277625K360488K490450j28513j801805r45923
9558c637816P39922J136426Q5600q84387m92640O52169O98011o86620j247459
9549c636794P78012L573510L795552J016871k131547l639105l397841j421372
9541e062714K038334M623186L548408j59044k272785j170514J26371r51067k568674
$$ plain form
9532 -1848499 -3645120 -3015745 -1512561 -1724969 -3940423 -5848553 -5095070 -1774335 1593298
9523 1593298 2817700 2510919 2764344 3665213 3274392 1481704 1023081 3084448 4738190
9514 4738190 3307743 815183 801975 2636648 2799393 636260 -1207883 -1601704 -2156403
9505 -2156403 -3541452 -4353906 -4137146 -4029298 -3910520 -2501453 -921173 -2142294 -5628497
9496 -5628497 -6637843 -3035754 957276 694101 -2399136 -3655893 -2068869 -557653
9488 -557653 -760478 -1331401 -1085689 -691270 -955201 -1714346 -2671874 -3554556 -3434501 -1630959
9478 -1630959 608246 903502 -1483409 -4807623 -6880561 -6972900 -5696011 -3949848 -2184334
9469 -2184334 -278804 1752582 3024082 2760555 2172562 3519856 6284154 6426623 1698142
$$ packed form
9532a848499j796621O29375J503184k12408k215454j908130P53483L320735L367633
9523A593298J224402l06781K53425R00869l90821j792688m58623K061367J653742
9514D738190j430447k492560j3208J834673J62745k163133j844143l93821n54699
9505b156403j385049q12454K16760J07848J18778J409067J580280j221121l486203
9496e628497j009346L602089L993030k63175l093237j256757J587024J511216
9488e57653k02825n70923K45712L94419k63931p59145r57528q82682J20055J803542
9478a630959K239205K95256k386911l324214k072938r2339J276889J746163J765514
9469b184334J905530K031386J271500k63527n87993J347294K764298J42469m728481
$$ plain form
9460 1698142 -3921006 -4171862 1641181 7911531 10005893 9030438 8266281 8045470 6656754
9451 6656754 4378781 3518381 4755284 5942534 5127459 3103136 2026341 2466698 2932233
9442 2932233 2131251 781544 689939 2380296 4352909 4946736 4352526 4172584 5349058
9433 5349058 7317735 8998185 9593176 8375421 5028647 922902 -1071478 646282
9425 646282 4192293 5922494 4376482 1564266 245992 923613 1940436 1707060 65231
9416 65231 -2099522 -3711759 -3950806 -2583043 -296864 1549072 1951903 1149018 290837
9407 290837 94721 -13205 -1104345 -3125487 -4605560 -4392473 -3271204 -3076121 -4253082
9398 -4253082 -5247780 -4672626 -3113627 -1958553 -1277706 -282293 497337 -553991 -3140244
$$ packed form
9460A698142n619148k50856N813043O270350K094362r75455p64157k20811j388716
9451F656754k277973q60400J236903J187250q15075k024323j076795M40357M65535
9442B932233q00982j349707r1605J690357J972613N93827n94210j79942J176474
9433E349058J968677J680450N94991j217755l346774m105745j994380J717760
9425F46282L546011J730201j546012k812216j318274O77621J016823k33376j641829
9416F5231k164753j612237k39047J367763K286179J845936M02831q02885q58181
9407B90837j96116j07926j091140k021142j480073K13087J121269J95083j176961
9398d253082r94698N75154J558999J155074O80847R95413P79630j051328k586253
$$ plain form
9389 -3140244 -4233589 -1926053 1168855 785894 -2964250 -5169624 -2702791 1290769
9381 1290769 1715959 -1366433 -3145779 -1245515 997322 -256710 -3712259 -4971626
9373 -4971626 -2532065 1027926 3131527 3661520 3275076 1977657 297794 -219048 1081243
9364 1081243 3059135 4723894 6411631 7936393 7555989 4660174 1824345 1692331 2864280
9355 2864280 1722059 -2022111 -4621057 -3571274 -696546 1237480 2366200 4134284
9347 4134284 5741139 4857512 1328610 -2143192 -3223580 -2239574 -970893 -547485 -1017383
9338 -1017383 -1771503 -1625730 576785 4361100 7025486 5805438 902566 -4322760 -6572890
9329 -6572890 -5659170 -4048630 -3826678 -4710207 -4943142 -3503459 -1133803 576748 927141
$$ packed form
9389c140244j093345K307536L094908l82961l750144k205374K466833L993560
9381A290769M25190l082392j779346J900264K242837j254032l455549j259367
9373d971626K439561L559991K103601N29993l86444j297419j679863n16842J300291
9364A081243J977892J664759J687737J524762l80404k895815k835829j32014J171949
9355B864280j142221l744170k598946J049783K874728J934026J128720J768084
9347D134284J606855q83627l528902l471802j080388R84006J268681M23408m69898
9338a017383p54120J45773K202515L784315K664386j220048m902872n225326k250130
9329f572890R13720J610540K21952q83529k32935J439683K369656J710551L50393
$$ plain form
9320 927141 832258 1575125 2906476 3245377 2245383 1912408 3694454 5474532 3946057
9311 3946057 -130089 -2034187 506456 3927427 3895762 1250778 -95148 587844 426878
9302 426878 -1732074 -3366364 -2420918 -382653 225748 -623594 -879813 887999 4160587
9293 4160587 6904382 6972118 4172817 1030383 188305 1265081 1989657 2035464 3145167
9284 3145167 5306130 5875129 3586357 603095 -981319 -2068790 -4020007 -5608383
9276 -5608383 -5030499 -3171573 -2196695 -2083222 -1069702 1303302 3906844 6007774 7310260
9267 7310260 6806454 4083840 1346018 1524818 4262122 6070524 4809980 1871179 -581850
9258 -581850 -2364803 -4149928 -5260597 -4264556 -1330993 1197675 960644 -1832777 -4227484
$$ packed form
9320I27141r4883P42867J331351L38901r99994l32975J782046J780078j528475
9311C946057m076146j904098K540643L420971l1665k644984j345926O82992j60966
9302D26878k158952j634290R45446K038265O08401q49342k56219J767812L272588
9293D160587K743795O7736k799301l142434q42078J076776P24576M5807J109703
9284C145167K160963N68999k288772k983262j584414j087471j951217j588376
9276e608383N77884J858926R74878J13473J013520K373004K603542K100930J302486
9267G310260n03806k722614k737822J78800K737304J808402j260544k938801k453029
9258e81850j782953j785125j110669R96041K933563K528668k37031k793421k394707
$$ plain form
9249 -4227484 -3435056 -388 2721091 2501335 475383 -1178952 -2190129 -3315353 -3886692
9240 -3886692 -2532304 112098 1658332 1094981 -159943 -577455 -171849 561919 1706639
9231 1706639 3183071 4224596 4368219 4057995 3704888 3039354 1948616 1128065 1284678
9222 1284678 2303254 3670139 5095184 6192433 6128758 4368426 1695127 -72311 297710
9213 297710 2163996 3620761 3545111 2627040 1861467 659764 -2152374 -5584759 -6678239
9204 -6678239 -4256836 -727196 1164636 1771173 2999862 4735261 5111374 3639850 1768719
9195 1768719 593918 98837 456851 1912058 3371484 3344023 2476197 2850501 4332718
9186 4332718 4102449 792292 -3229271 -5103116 -4957318 -4442701 -3653706 -1802415 178557
$$ packed form
9249d227484P92428L434668K721479k19756k025952j654335j011177j125224n71339
9240c886692J354388K644402J546234n63351j254924m17512M05606P33768J144720
9231A706639J476432J041525J43623l10224l53107o65534j090738q20551J56613
9222A284678J018576J366885J425045J097249o3675j760332k673299j767438L70021
9213B97710J866286J456765p5650r18071p65573j201703k812138l432385j093480
9204f678239K421403L529640J891832O06537J228689J735399L76113j471524j871131
9195A768719j174801m95081L58014J455207J459426k7461q67826L74304J482217
9186D332718k30269l310157m021563j873845J45798N14617P88995J851291J980972
$$ plain form
9177 178557 246925 -1682540 -3328060 -3022771 -1613224 -940181 -1561699 -2521880 -2618993 -1409107
9167 -1409107 592252 2346194 3139626 3077744 2566982 1607949 177572 -907481 -481634
9158 -481634 1306603 2691854 2343330 1103523 722006 1178817 542983 -2188466 -5267838
9149 -5267838 -6061993 -4062018 -1133097 785282 1307046 1264224 1739066 3270679 5097175
9140 5097175 5344720 2931359 -874328 -3760801 -4925231 -5168743 -4986388 -4334237 -4034036
9131 -4034036 -5151515 -6662805 -6120684 -3464563 -1810265 -3190416 -5765564 -6893475
9123 -6893475 -6772763 -6903602 -6855506 -5225389 -2551737 -584422 583723 2130569 3794552
9114 3794552 4060955 2860491 1763868 1456089 1082799 192555 -587853 -947246 -1211912
$$ packed form
9177A78557O8368j929465j645520L05289J409547O73043o21518r60181r7113J209886
9167a409107K001359J753942P93432o1882n10762r59033j430377j085053M25847
9158d81634J788237J385251l48524j239807l81517M56811o35834k731449l079372
9149e267838p94155J999975K928921J918379N21764m2822M74842J531613J826496
9140E097175K47545k413361l805687k886473j164430k43512J82355O52151L00201
9131d034036j117479j511290N42121K656121J654298j380151k575148j127911
9123f893475J20712j30839M8096J630117K673652J967315J168145J546846J663983
9114C794552K66403j200464j096623l07779l73290q90244p80408l59393k64666
$$ plain form
9105 -1211912 -1189821 -362335 695856 677413 -604649 -2124987 -3230224 -3862587 -3630584
9096 -3630584 -2455221 -1788172 -3095307 -5162684 -5038503 -1964660 1498747 2655058 1379537
9087 1379537 -592173 -1584861 -1045172 7245 -256867 -2083643 -3347009 -2779872 -2563087
9078 -2563087 -4960434 -7661558 -6373628 -1723499 850775 -1089755 -3661103 -2922226
9070 -2922226 -402934 296025 -1010182 -2323615 -3555709 -5612299 -6932062 -4731399
9062 -4731399 597576 5287145 6538512 4934316 2508794 368955 -1431250 -3042193
9054 -3042193 -4299598 -4540162 -3152886 -632745 1691800 3360595 4976689 6143478
9046 6143478 5009310 1195948 -2531675 -3456177 -2520231 -2636615 -4324616 -5353301 -4248099
$$ packed form
9105a211912K2091Q27486J058191j8443j282062j520338j105237o32363K32003
9096c630584J175363O67049j307135k067377J24181L073843L463407J156311j275521
9087A379537j971710r92688N39689J052417k64112j826776j263366N67137K16785
9078b563087k397347k701124J287930M650129K574274j940530k571348P38877
9070b922226K519292O98959j306207j313433j232094k056590j319763K200663
9062d731399N328975M689569J251367j604196k425522k139839j800205j610943
9054c042193j257405k40564J387276K520141K324545J668795J616094J166789
9046F143478j134168l813362l727623r24502R35946j16384j688001j028685J105202
$$ plain form
9037 -4248099 -1813253 731786 2812263 3459039 1619486 -1576196 -2964033 -1275709
9029 -1275709 626674 -632986 -3987749 -4861341 -1130352 4046895 6346986 5370104 3809220
9020 3809220 2883940 1355687 -1053875 -2310334 -1305531 76000 -54609 -626163 155868
9011 155868 1462491 1493030 1062375 2337116 4808511 5926084 5449743 5634052 6832223
9002 6832223 6524767 3670213 753011 146857 1219105 2342015 3093942 3140690 1663800
8993 1663800 -567401 -1195724 45877 341822 -1737123 -3574720 -2552549 -122632 788792
8984 788792 183461 -38060 369356 404418 360151 1155589 2193697 2322558 1868908 1541155
8974 1541155 659277 -1205045 -2298660 -1018596 1138978 1720865 1227664 1922061 3623885
$$ packed form
9037d248099K434846K545039K080477O46776j839553l195682j387837J688324
9029a275709J902383j259660l354763q73592L730989N177247K300091r76882j560884
9020C809220r25280j528253k409562j256459J004803J381531j30609n71554P82031
9011A55868J306623L0539m30655J274741K471395J117573m76341J84309J198171
9002F832223l07456k854554k917202o06154J072248J122910P51927M6748j476890
8993A663800k231201o28323J241601K95945k078945j837597J022171K429917R11424
8984G88792o05331k21521M07416L5062m4267P95438J038108J28861m53650l27753
8974A541155q81878j864322j093615J280064K157574N81887m93201O94397J701824
$$ plain form
8965 3623885 3816184 1645059 -898027 -1698670 -357368 2093928 3302342 582621 -5674159
8956 -5674159 -10771469 -10780797 -7646013 -5919065 -5734753 -3444779 1217495 3736288 1720590
8947 1720590 -1362375 -1504570 464843 1356965 541624 -410186 -881736 -1273427 -1350426
8938 -1350426 -944932 -1180954 -2736823 -3801876 -2121011 1350770 3141876 1792086 -293236
8929 -293236 -147340 2255805 4881471 6636775 7617065 6927727 2936208 -3170026 -6485437
8920 -6485437 -3783491 1355074 2178082 -2571402 -7279800 -7480258 -5091685 -3622603 -2443079
8911 -2443079 373696 2899803 2081941 -280107 368964 3900571 5388881 2762096 -418423
8902 -418423 -983099 -330974 -669421 -1170313 -478032 181670 -720378 -1983217 -1687012 -536345
$$ packed form
8965C623885J92299k171125k543086q00643J341302K451296J208414k719721o256780
8956e674159n097310r328L134784J726948J84312K289974M662274K518793k015698
8947A720590l082965j42195J969413Q92122q15341r51810m71550l91691p6999
8938a350426M05494k36022j555869j065053J680865L471781J791106j349790k085322
8929b93236J45896K403145K625666J755304R80290o89338l991519o106234l315411
8920f485437K701946N138565Q23008m749484m708398k00458K388573J469082J179524
8911b443079K816775K526107q17862k362048O49071L531607J488310k626785l180519
8902d18423n64676O52125l38447n00892O92281O59702r02048j262839K96205J150667
$$ plain form
8892 -536345 -659093 -2281712 -3871088 -4741950 -5437094 -5842106 -4642124 -1026077 3679765
8883 3679765 6398965 4851802 279168 -3193478 -3077264 -1398518 -1390291 -2712720 -2733043
8874 -2733043 -1413032 -1118474 -1865259 -1040528 1566201 2860486 1846358 1493742 3259573
8865 3259573 4181792 2165665 -49369 376282 1572442 917441 243982 2270326 4748483
8856 4748483 3705513 559787 31654 1880942 1075856 -3258552 -5256103 -886617 5921157
8847 5921157 8867352 7249783 4847831 3523344 1922413 -433360 -1416726 599900
8839 599900 3996167 5487128 3826467 1053169 -123443 357588 33092 -2627833 -6056013
8830 -6056013 -7463859 -5792373 -2072776 1761330 3417896 1392375 -2691404 -4553089
$$ packed form
8892e36345j22748j622619j589376q70862o95144m05012J199982L616047M705842
8883C679765K719200j547163m572634l472646J16214J678746Q227j322429k0323
8874b733043J320011K94558p46785Q24731K606729J294285j014128l52616J765831
8865C259573R22219k016127k215034M25651J196160o55001o73459K026344K478157
8856D748483j042970l145726n28133J849288q05086m334408j997551M369486O807774
8847E921157K946195j617569k401952j324487j600931k355773r83366K016626
8839E99900L396267J490961j660661k773298j176612M81031l24496k660925l428180
8830f056013j407846J671486L719597L834106J656566k025521m083779j861685
$$ plain form
8822 -4553089 -2258903 822543 640759 -1676909 -2068153 -301302 -28418 -2283389 -3708078
8813 -3708078 -2285542 -403585 -412173 -1141920 -1115763 -1461537 -2795609 -2681314 278036
8804 278036 2700812 886957 -3029540 -3783610 -689216 1813137 1106798 -400824 160877
8795 160877 2010236 2738731 1920385 1054414 1386674 2818577 3986613 3264461 921621
8786 921621 -175832 1991334 4955703 4419680 621167 -1395650 1085804 4612026 4988600
8777 4988600 3309209 3277866 4831115 4586958 1877535 147522 1570737 3677830 3106358
8768 3106358 367376 -1390231 -1144606 -1073694 -2776508 -4480824 -3370527 193007 2667110
8759 2667110 2006990 600702 1866917 5050137 6073064 3653065 1557433 3288274
$$ packed form
8822d553089K294186L081446j81784k317668l91244J766851K72884k254971j424689
8813c708078J422536J881957q588p29747K6157l45774j334072J14295K959350
8804B78036K422776j813855l916497p54070L094394K502353p06339j507622N61701
8795A60877J849359P28495q18346q65971L32260J431903J168036p22152k342840
8786I21621j097453K167166K964369n36023l798513k016817K481454L526222L76574
8777D988600j679391l1343J553249k44157k709423j730013J423215K107093n71472
8768C106358k738982j757607K45625P0912j702814j704316J110297L563534K474103
8759B667110o60120j406288J266215L183220J022927k419999k095632J730841
$$ plain form
8751 3288274 7014060 8180809 5598518 2342174 1421804 2894764 4747241 4615124 1360821
8742 1360821 -2968949 -3850024 368038 4966388 4275539 -174321 -1463751 2531123 6059984
8733 6059984 4458685 906071 587557 2485286 2026867 -882032 -2096246 -372935 1147342
8724 1147342 777489 681716 2212780 3036683 1007739 -2093853 -2984543 -1127824 1331904
8715 1331904 2571817 2541896 2307278 2894110 4112054 4306952 2312316 -545014 -1966690
8706 -1966690 -1944342 -2377233 -3570773 -3843122 -2972624 -2930837 -4178120 -4422760 -2635255
8697 -2635255 -1074235 -1216062 -1028866 769309 1076043 -2822317 -7445375 -7199713 -2855911
8688 -2855911 -404516 -1717046 -2218585 983094 4433857 4476512 3045829 3537238 4904694
$$ packed form
8751C288274L725786J166749k582291l256344r20370J472960J852477j32117l254303
8742A360821m329770q81075M218062M598350o90849m449860j289430L994874L528861
8733F059984j601299l552614l18514J897729m58419k908899j214214J723311J520277
8724A147342l69853r5773J531064Q23903k028944l101592q90690J856719K459728
8715A331904J239913k9921k34618N86832J217944J94898j994636k857330j421676
8706a966690K2348m32891j193540k72349Q70498M1787j247283k44640J787505
8697b635255J561020j41827J87196J798175L06734l898360m623058K45662M343802
8688b855911K451395j312530n01539L201679L450763M2655j430683M91409J367456
$$ plain form
8679 4904694 4405473 3184392 3966856 5125867 2682395 -2358668 -4357031 -1500247 1378212
8670 1378212 333491 -2109926 -1821488 515476 1639742 1376915 1726321 2136190 279345
8661 279345 -3064543 -4289438 -2615367 -1694815 -4335949 -8545209 -10340015 -8371497 -4396226
8652 -4396226 -848548 879711 1085852 1498974 3189810 4570935 3234525 -165596 -2323148
8643 -2323148 -2013827 -1507984 -2249558 -2454370 -1013162 -507596 -3181072 -6406331 -6010439
8634 -6010439 -2679935 -1107806 -3261030 -6177540 -6604612 -4503143 -1358092 1982665
8626 1982665 4721083 5793518 5403633 5150800 5684531 5716158 4110110 1572660 -437070
8617 -437070 -1352790 -1635404 -2249571 -3982132 -6109704 -6163045 -2769786 1615527 3072580
$$ packed form
8679D904694m99221j221081P82464J159011k443472n041063j998363K856784K878459
8670A378212j044721k443417K88438K336964J124266k62827L49406M09869j856845
8661B79345l343888j224895J674071R20552k641134m209260j794806J968518L975271
8652d396226L547678J728259K06141M13122J690836J381125j336410l400121k157552
8643b323148L09321N05843p41574k04812J441208N05566k673476l225259L95892
8634f010439L330504J572129k153224k916510m27072K101469L145051L340757
8626A982665K738418J072435l89885k52833N33731L1627j606048k537450k009730
8617d37070r15720k82614o14167j732561k127572n3341L393259M385313J457053
$$ plain form
8608 3072580 1318581 -76218 1000637 2447225 1608094 -954550 -3127793 -4501374
8600 -4501374 -5705855 -6023451 -4173980 -883592 1532517 2156171 2317630 3177236 3908435
8591 3908435 3134622 1389256 882912 2490958 4031779 2941189 320140 102290 3336167
8582 3336167 5774361 3420129 -1477101 -3269824 -799149 1322491 -534624 -4583325
8574 -4583325 -6886305 -5905786 -2479465 1924965 5285943 5655241 3329770 639040 -1330920
8565 -1330920 -3533565 -5711165 -5476424 -2348685 333759 -41034 -1450930 -584271 2051724
8556 2051724 3282470 1887096 -772335 -3408452 -5333971 -5434849 -3359091 -1028390
8548 -1028390 -618489 -1685860 -2220181 -1489118 111928 2565486 5182383 5550529 2441604
$$ packed form
8608C072580j753999j394799J076855J446588q39131k562644k173243j373581
8600d501374j204481l17596J849471L290388K416109O23654J61459Q59606P31199
8591C908435p73813j745366n06344J608046J540821j090590k621049k17850L233877
8582C336167K438194k354232m897230j792723K470675K121640j857115m048701
8574d583325k302980R80519L426321M404430L360978L69298k325471k690730j969960
8565a330920k202645k177600K34741L127739K682444l74793j409896Q66659K635995
8556B051724J230746j395374k659431k636117j925519j00878K075758K330701
8548a028390M09901j067371n34321P31063J601046K453558K616897L68146l108925
$$ plain form
8539 2441604 -1344913 -2061410 -63515 1281576 899050 731666 1536333 1735915 938624
8530 938624 1063632 2734829 3432179 903656 -3467215 -6141149 -5149406 -1597277 1569057
8521 1569057 1977267 -92753 -2097481 -2367149 -1927381 -2067919 -1729908 452051 2923907
8512 2923907 3001436 1040008 -330717 -548430 -1260170 -2404988 -1951859 101338 1245514
8503 1245514 785396 976667 2712502 3738102 2732210 1621876 1855877 1792673 288522
8494 288522 -266764 2363142 5933393 6461102 3811271 1431729 1385105 2334886 2039333
8485 2039333 -203154 -3162624 -4254122 -1430336 3966138 7360443 5687578 978147
8477 978147 -2418671 -2965043 -2353102 -1991763 -1553447 -642716 256602 640654 434804 -235389
$$ packed form
8539B441604l786517p16497J997895J345091l82526j67384Q04667J99582p97291
8530I38624J25008J671197O97350k528523m370871k673934R91743L552129L166334
8521A569057M08210k070020k004728k69668M39768j40538L38011K181959K471856
8512B923907P7529j961428j370725k17713p11740j144818M53129K053197J144176
8503A245514m60118J91271J735835J025600j005892j110334K34001o3204j504151
8494B88522n55286K629906L570251N27709k649831k379542m6624R49781k95553
8485B039333k242487k959470j091498K823786N396474L394305j672865m709431
8477I78147l396818n46372O11941L61339M38316R10731Q99318L84052k05850o70193
$$ plain form
8467 -235389 -714912 45278 1869760 2819438 1674834 -62600 -327317 336621 -244507
8458 -244507 -2430203 -4447339 -5147154 -4972350 -4290874 -2847039 -1100306 -258127 -499247
8449 -499247 -616378 152265 1162961 1570867 1412441 1199336 1312192 1896645 2556566 2274937
8439 2274937 539484 -1675207 -3033745 -3609590 -4307014 -4800516 -3637817 -691844 1848116
8430 1848116 1673136 -1069251 -3825680 -4028002 -1520195 1123584 1113691 -1356323 -3178939
8421 -3178939 -2227715 -116660 159958 -1590768 -2731860 -1632455 333403 992318 162831
8412 162831 -492059 276762 1815143 2386933 1459108 647336 1434052 2434375 1007264
8403 1007264 -2191181 -3150473 -395223 2181307 1009051 -1521036 -937040 2039285 2963014
$$ packed form
8467b35389m79523P60190J824482R49678j144604j737434k64717O63938n81128
8458b44507k185696k017136o99815J74804O81476J443835J746733Q42179k41120
8449d99247j17131P68643J010696M07906j58426k13105J12856N84453O59921k81629
8439B274937j735453k214691j358538n75845o97424m93502J162699K945973K539960
8430A848116j74980k742387k756429k02322K507807K643779r893k470014j822616
8421c178939R51224K111055K76618j750726j141092J099405J965858O58915q29487
8412A62831o54890P68821J538381N71790r27825q11772P86716J000323j427111
8403A007264l198445r59292K755250K576530j172256k530087N83996K976325R23729
$$ plain form
8394 2963014 1245897 731130 2495111 2789576 -155773 -2536970 -1019403 2013872 2691464
8385 2691464 1461756 795074 128659 -2438279 -5437818 -5645408 -3418744 -2127192 -2603434
8376 -2603434 -2275564 -155616 1152991 -398751 -3163656 -4324389 -3495219 -2453730 -2672316
8367 -2672316 -4055253 -5152635 -4306483 -1613192 414101 -440099 -2989962 -4066184 -2871273
8358 -2871273 -1738799 -2349521 -3595694 -4001452 -3984091 -4316831 -4098524 -1967799 1600518
8349 1600518 4644344 5982330 6314511 7286821 9621781 11727292 10573300 5094569 -1675369
8340 -1675369 -5466331 -5455099 -4107638 -2752892 -352938 2795247 3691738 958809 -2334132
8331 -2334132 -2801091 -1479945 -1479667 -2615920 -1864883 1560732 4933482 5872756 4677082
$$ packed form
8394B963014j717117n14767J763981K94465k945349k381197J517567L033275O77592
8385B691464j229708o66682o66415k566938k999539k07590K226664J291552m76242
8376b603434L27870K119948J308607j551742k764905j160733Q29170J041489k18586
8367b672316j382937j097382Q46152K693291K027293q54200k549863j076222J194911
8358b871273J132474o10722j246173m05758J7361l32740K18307K130725L568317
8349A600518L043826J337986L32181R72310K334960K105511j153992n478731o769938
8340a675369l790962J1232J347461J354746K399954L148185Q96491k732929l292941
8331b334132m66959J321146K78j136253P51037L425615L372750R39274j195674
$$ plain form
8322 4677082 2489413 -286148 -3020225 -4401518 -3843493 -2009877 321824 2447283
8314 2447283 2892924 530278 -3006961 -4150908 -1599725 2014747 3594694 3088900 2484213
8305 2484213 2847772 3746817 4462616 4383604 2953409 423969 -1878931 -2896572 -2803372
8296 -2803372 -1974893 -14639 3117661 5869864 6368692 4642065 2534939 1560360 1563134
8287 1563134 1288315 -293636 -2906856 -4814532 -4338178 -1974939 -135087 -79540 -153590
8278 -153590 1765073 4932743 6495636 5308438 3309525 2715575 3218230 2856732 959310
8269 959310 -832300 -593689 1417490 2901329 2197941 270706 -539683 657803 2582910
8260 2582910 3638243 3304499 1675476 -917259 -3304478 -3930941 -2761177 -1537102 -1319239
$$ packed form
8322D677082k187669k775561k734077j381293N58025J833616K331701K125459
8314B447283M45641k362646l537239j143947K551183L614472J579947n05794o04687
8305B484213L63559Q99045P15799p9012j430195k529440k302900j017641R3200
8296b803372Q28479J960254L132300K752203M98828j726627k107126r74579K774
8287A563134k74819j581951k613220j907676M76354K363239J839852N5547p4050
8278a53590J918663L167670J562893j187198j998913n93950N02655l61498j897422
8269I59310j791610K38611K011179J483839p03388j927235q10389J197486J925107
8260B582910J055333l33744j629023k592735k387219o26463J169764J224075K17863
$$ plain form
8251 -1319239 -1153412 -218328 370464 -376288 -932133 670497 3180850 3225793 76703
8242 76703 -3149770 -3622734 -2034467 -851986 -1117235 -2129718 -2966621 -3033394 -1937199
8233 -1937199 -30623 1246548 487672 -2105969 -4531192 -4457514 -1270108 2958378 5030420
8224 5030420 3875669 1706506 1030032 1356535 464138 -1794141 -3339265 -3547068 -4374794
8215 -4374794 -6827373 -8761487 -7961106 -5539179 -4142772 -3991259 -3003791 -394665 1954723
8206 1954723 1886607 -650677 -3700351 -4773821 -2484719 2097934 5840845 6401358 4628556
8197 4628556 3198574 3276590 3871156 4175294 4689436 5635179 5999786 5116549 3915696
8188 3915696 3468469 3226935 1987558 26754 -1108106 -859398 -466400 -1158313 -2463521
$$ packed form
8251a319239J65827R35084N88792p46752n55845J602630K510353M4943l149090
8242G6703l226473m72964J588267J182481k65249j012483q36903o6773J096195
8233a937199J906576J277171p58876k593641k425223P3678L187406M228486K072042
8224E030420j154751k169163o76474L26503q92397k258279j545124k07803q27726
8215d374794k452579j934114Q00381K421927J396407J51513R87468K609126K349388
8206A954723o8116k537284l049674j073470K289102M582653L742911N60513j772802
8197D628556j429982P8016N94566L04138N14142R45743L64607q83237j200853
8188C915696m47227k41534j239377j960804j134860K48708L92998o91913j305208
$$ plain form
8179 -2463521 -2966636 -2254667 -1339884 -1142668 -1227080 -566356 677066 945723 -722151
8170 -722151 -3137167 -4304836 -4047717 -4022463 -4915709 -5186344 -3639042 -1819339 -1913400
8161 -1913400 -3026467 -2054478 1552506 4512804 4288204 2496345 1828656 1670882 -316747
8152 -316747 -3474453 -4476363 -2428261 -326552 -431644 -1021265 568773 3820531 5927213
8143 5927213 5403462 3027181 243362 -1792564 -2488687 -2532463 -3452989 -5298769 -5935248
8134 -5935248 -3969607 -974412 838228 1666408 2772055 3512629 2387220 204415 -585981
8125 -585981 560606 1863043 2026985 1045292 -1345324 -5151067 -8210593 -7840220 -4658181
8116 -4658181 -1887906 -640960 922101 3364789 4617309 3929082 3488479 4460499 4945938
$$ packed form
8179b463521n03115P11969R14783J97216q4412O60724J243422K68657j667874
8170g22151k415016j167669K57119K5254q93246k70635J547302J819703r4061
8161a913400j113067R71989L606984K960298k24600j791859o67689j57774j987629
8152c16747l157706j001910K048102K101709j05092n89621J590038L251758K106682
8143E927213n23751k376281k783819k035926o96123m3776r20526j845780o36479
8134e935248J965641K995195J812640Q28180J105647P40574j125409k182805p90396
8125e85981J146587J302437J63942r81693k390616l805743l059526L70373L182039
8116d658181K770275J246946J563061K442688J252520o88227m40603R72020M85439
$$ plain form
8107 4945938 3856545 3216015 4091834 3839458 644333 -2494491 -2212521 -370652 -800145
8098 -800145 -2856940 -3235865 -2429879 -3633234 -5890734 -4522309 811989 4345115 2510224
8089 2510224 -1184507 -2347258 -2000655 -2908453 -3567072 -728963 4397143 7418490 7277110
8080 7277110 6980664 7990213 8251571 6649623 5413779 6163726 6721316 4557848 1317716
8071 1317716 723448 2783273 3300154 -287947 -5172693 -6786241 -4478358 -1624939 -890393
8062 -890393 -1635722 -2193956 -2450195 -2831905 -2316169 434752 4308252 6120584 4361022
8053 4361022 1229107 20713 1221954 2181519 492534 -3088398 -5424922 -4486903 -1661871
8044 -1661871 -230872 -1618622 -3827866 -3973384 -1647296 1069207 2379431 2301509 1599325
$$ packed form
8107D945938j089393o40530Q75819k52376l195125l138824K81970J841869m29493
8098h00145k056795l78925Q05986j203355k257500J368425N334298L533126j834891
8089B510224l694731j162751L46603r07798o58619K838109N126106L021347j41380
8080G277110k96446J009549K61358j601948j235844P49947N57590k163468l240132
8071A317716n94268K059825N16881l588101m884746j613548K307883K853419P34546
8062h90393p45329n58234k56239l81710N15736K750921L873500J812332j759562
8053D361022l131915j208394J201241R59565j688985l580932k336524R38019K825032
8044a661871J430999j387750k209244j45518K326088K716503J310224p7922p02184
$$ plain form
8035 1599325 714501 236694 1023445 2800818 3643644 2233271 116087 124078 2484596
8026 2484596 4158942 2852414 279923 -108727 2067706 3596987 2165793 -630435
8018 -630435 -1908298 -1492835 -1374363 -2088031 -2053301 -639058 424530 -317218 -1733017
8009 -1733017 -1808550 -514935 484435 334854 -213510 -341413 -370128 -1191833 -2954021 -4493034
7999 -4493034 -4275618 -2285657 -523922 -600959 -1289209 -268096 1798544 1549400 -1799730
7990 -1799730 -4325918 -2698988 705843 1001539 -2297226 -4881245 -3766533 -676446
7982 -676446 1070689 479870 -1082282 -1889557 -1179224 290308 859566 234291 498780
7973 498780 3124863 5797140 4851921 651462 -2435416 -1870615 116595 374005 -1113777
$$ packed form
8035A599325q84824m77807P86751J777373Q42826j410373k117184P991K360518
8026B484596J674346j306528k572491l88650K176433J529281j431194k796228
8018f30435j277863M15463J18472p13668L4730J414243J063588p41748j415799
8009a733017p5533J293615R99370j49581n48364j27903k8715q21705j762188j539013
7999d493034K17416J989961J761735p7037o88250J021113K066640k49144l349130
7990a799730k526188J626930L404831K95696l298765k584019J114712L090087
7982f76446J747135n90819j562152q07275P10333J469532N69258o25275K64489
7973D98780K626083K672277r45219m200459l086878N64801J987210K57410j487782
$$ plain form
7964 -1113777 -2480497 -3030210 -3247510 -3295643 -3047851 -2556651 -1564738 236308 1865655
7955 1865655 1582504 -560136 -2442777 -2868488 -2886180 -3369804 -3543854 -3037748 -3052834 -4013681
7945 -4013681 -4349495 -3294956 -2569731 -3258664 -3357286 -958396 2111486 2718666 1016513
7936 1016513 -274821 -106803 183852 -339955 -1285094 -2215034 -2670563 -1723230 323591
7927 323591 928420 -1454739 -4269779 -3899047 -895103 1006899 488954 -112286 1030158
7918 1030158 3135304 4905458 5516553 3579739 -1296408 -5645439 -4831349 355767 3621049
7909 3621049 1276488 -3188589 -4741788 -3543034 -3036354 -3863583 -3255780 377889 4926147
7900 4926147 6622547 3547058 -2228775 -5605264 -3245201 2031578 3924913 601358
$$ packed form
7964a113777j366720n49713k17300m8133K47792M91200R91913J801046J629347
7955A865655k83151k142640j882641m25711j7692m83624j74050N06106j5086r60847
7945d013681l35814J054539P25225o88933r8622K398890L069882O07180j702153
7936A016513j291334J68018K90655n23807r45139r29940m55529R47333K046821
7927C23591O04829k383159k815040L70732L003944J902002n17945o01240J142444
7918A030158K105146J770154O11095j936814m876147m349031Q14090N187116L265282
7909C621049k344561m465077j553199J198754N06680q27229O07803L633669M548258
7900D926147J696400l075489n775833l376489K360063N276779J893335l323555
$$ plain form
7892 601358 -2923792 -1953685 1598439 2909972 1424813 420544 1022284 941241 -932021
7883 -932021 -2377918 -1224065 1575284 3264345 2336320 -196623 -1752236 -635370 1756384
7874 1756384 2143249 -282644 -2319351 -1203952 1229374 1350038 -767435 -1720302 135697
7865 135697 3089666 5165721 5734894 4256800 686622 -2584601 -2341948 1241925 4696879
7856 4696879 5914921 5818335 5137104 3159386 718411 656793 3376149 5189686 3448941
7847 3448941 481309 -144377 1252311 1933643 1270457 754248 965103 1387674 2087493
7838 2087493 2965116 2527329 28772 -2385496 -2533244 -2020563 -3881649 -7102110 -7250942
7829 -7250942 -2880557 2108010 3485026 1378054 -1187212 -2190080 -1773487 -1100261 -1174900
$$ packed form
7892F01358l525150R70107L552124J311533j485159j004269O01740q1043j873262
7883i32021j445897J153853K799349J689061r28025k532943j555613J116866K391754
7874A756384L86865k425893k036707J115399K433326J20664k117473r52867J855999
7865A35697K953969K076055N69173j478094l570178l271223K42653L583873L454954
7856D696879J218042r6586o81231j977718k440975o1618K719356J813537j740745
7847C448941k967632o25686J396688O81332o63186n16209K10855M22571O99819
7838B087493Q77623m37787k498557k414268j47748N12681j861086l220461j48832
7829g250942M370385M988567J377016k106972k565266j002868M16593O73226p4639
$$ plain form
7820 -1174900 -1903837 -2030153 -928452 43611 -402751 -885794 656305 2851040 2109864
$$ packed form
7820a174900p28937j26316J101701R72063m46362m83043J542099K194735p41176
$$ [...]
##END NTUPLES=NMR SPECTRUM
##END=
