##TITLE=31Pdec_SR39H_1_4_Rep
 , 124 sc
 5.04.2021
##JCAMPDX= 6.0         $$ Bruker NMR JCAMP-DX V2.0
##DATA TYPE= NMR SPECTRUM
##DATA CLASS= NTUPLES
##ORIGIN= UXNMR, Bruker Analytische Messtechnik GmbH
##OWNER= root
$$ XWIN-NMR		Version 3.5
$$ Mon Apr  5 13:23:22 2021 Russian Standard Time (UT+4h)  she@DPX200
##.OBSERVE FREQUENCY= 81.013821
##.OBSERVE NUCLEUS= ^31P
##.ACQUISITION MODE= SIMULTANEOUS
##.ACQUISITION SCHEME= undefined
##.AVERAGES= 124
##.DIGITISER RES= 16
##SPECTROMETER/DATA SYSTEM= spect
##.PULSE SEQUENCE= zgpg30
##.SOLVENT NAME= DMSO
##.SHIFT REFERENCE= (INTERNAL, DMSO, 0, 248.564)
##AUDIT TRAIL= $$ (NUMBER, WHEN, WHO, WHERE, WHAT)
$$ ##TITLE= Audit trail, XWIN-NMR		Version 3.5
$$ ##JCAMPDX= 5.01
$$ ##ORIGIN= Bruker BioSpin GmbH
$$ ##OWNER= she
$$ F:/spectra/data/she/nmr/P31/1/pdata/1/auditp.txt
$$ ##AUDIT TRAIL=  $$ (NUMBER, WHEN, WHO, WHERE, WHAT)
(   1,<2021-04-05 13:21:30.28 +0400>,<she>,<DPX200>,
      <continue with go, POWCHK disabled, PULCHK disabled
       configuration hash MD5:
       00 E9 B6 7A A2 85 ED C7 34 08 36 98 17 FE 4E 26
       data hash MD5: 32K
       55 02 93 A9 05 B6 57 D9 5D 17 AD 10 28 13 27 70>)
(   2,<2021-04-05 13:21:34.40 +0400>,<she>,<DPX200>,
      <Start of raw data processing
       efp BC_mod = 2 LB = 1 FT_mod = 6 PKNL = 1 PHC0 = -4965.595 PHC1 = 994.2018 SI = 64K 
       data hash MD5: 64K
       3D 5A 5B 71 64 69 F5 41 C5 A0 AA 32 D2 C0 64 6D>)
(   3,<2021-04-05 13:22:03.15 +0400>,<she>,<DPX200>,
      <pk PHC0 = 52.35547 PHC1 = -101.6 
       data hash MD5: 64K
       41 70 99 8E 46 BB FE 8A 77 C3 13 B8 4D EA 91 58>)
(   4,<2021-04-05 13:22:48.59 +0400>,<she>,<DPX200>,
      <pk PHC0 = -437.6382 PHC1 = 520.9999 
       data hash MD5: 64K
       95 92 9D 84 9C D5 79 B8 E5 FD 82 D4 99 F4 69 22>)
(   5,<2021-04-05 13:22:52.06 +0400>,<she>,<DPX200>,
      <abs ABSG = 5 
       data hash MD5: 64K
       02 16 16 B1 2B E2 FB 3E 53 43 90 7A 74 AD 04 45>)
$$ ##END=
$$ 
$$ hash MD5
$$ 55 AD 43 A9 F6 AE 64 8C CC D6 60 5A 43 07 39 DC
##$RELAX= 
##$RELAX= 
##$RELAX= 
##$RELAX= 
##$RELAX= 
##$RELAX= 
##$RELAX= 
##$RELAX= 
$$ Bruker specific parameters
$$ --------------------------
##$DU= <F:/spectra>
##$EXPNO= 1
##$NAME= <P31>
##$PROCNO= 1
##$TYPE= <nmr>
##$USER= <she>
##$AMP= (0..31)
100 100 100 100 100 100 100 100 100 100 100 100 100 100 100 100 100 100 
100 100 100 100 100 100 100 100 100 100 100 100 100 100 
##$AQSEQ= 0
##$AQ_mod= 1
##$AUNM= <au_zg>
##$AUTOPOS= <>
##$BF1= 81.014009
##$BF2= 200.13
##$BF3= 200.13
##$BF4= 200.13
##$BF5= 200.13
##$BF6= 200.13
##$BF7= 200.13
##$BF8= 200.13
##$BYTORDA= 1
##$CFDGTYP= 0
##$CFRGTYP= 5
##$CHEMSTR= <none>
##$CNST= (0..31)
1 1 145 1 1 1 1 1 1 1 1 1 1 1 1 1 1 1 1 1 1 1 1 1 1 1 1 1 1 1 1 1 
##$CPDPRG= <waltz16>
##$CPDPRG1= <>
##$CPDPRG2= <waltz16>
##$CPDPRG3= <>
##$CPDPRG4= <mlev>
##$CPDPRG5= <mlev>
##$CPDPRG6= <mlev>
##$CPDPRG7= <mlev>
##$CPDPRG8= <mlev>
##$CPDPRGB= <>
##$CPDPRGT= <>
##$D= (0..31)
$$ [...]
##$SUBNAM3= <"">
##$SUBNAM4= <"">
##$SUBNAM5= <"">
##$SUBNAM6= <"">
##$SUBNAM7= <"">
##$SUBNAM8= <"">
##$SUBNAM9= <"">
##$SW= 501.771253377433
##$SWIBOX= (0..15)
0 1 3 0 0 0 0 0 0 0 0 0 0 0 0 0 
##$SW_h= 40650.406504065
##$TD= 32768
##$TD0= 1
##$TE= 0
##$TE2= 300
##$TE3= 300
##$TEG= 300
##$TL= (0..7)
0 120 53 12 22 120 120 120 
##$TP= (0..7)
150 150 150 150 150 150 150 150 
##$TP07= 0
##$TPNAME0= <>
##$TPNAME1= <>
##$TPNAME2= <>
##$TPNAME3= <>
##$TPNAME4= <>
##$TPNAME5= <>
##$TPNAME6= <>
##$TPNAME7= <>
##$TPOAL= (0..7)
0.5 0.5 0.5 0.5 0.5 0.5 0.5 0.5 
##$TPOFFS= (0..7)
0 0 0 0 0 0 0 0 
##$TUNHIN= 0
##$TUNHOUT= 0
##$TUNXOUT= 0
##$USERA1= <user>
##$USERA2= <user>
##$USERA3= <user>
##$USERA4= <user>
##$USERA5= <user>
##$V9= 5
##$VALIST= <valist>
##$VCLIST= <CCCCCCCCCCCCCCC>
##$VD= 0
##$VDLIST= <DDDDDDDDDDDDDDD>
##$VPLIST= <PPPPPPPPPPPPPPP>
##$VTLIST= <TTTTTTTTTTTTTTT>
##$WBST= 1024
##$WBSW= 4
##$XGAIN= (0..3)
0 0 0 0 
##$XL= 0
##$YL= 0
##$YMAX_a= 13033
##$YMIN_a= -14050
##$ZGOPTNS= <>
##$ZL1= 120
##$ZL2= 120
##$ZL3= 120
##$ZL4= 120
##$ABSF1= 248.5645
##$ABSF2= -253.2056
##$ABSG= 5
##$ABSL= 3
##$ALPHA= 0
##$AQORDER= 0
##$ASSFAC= 0
##$ASSFACI= 0
##$ASSFACX= 0
##$ASSWID= 0
##$AUNMP= <proc_1d>
##$AZFE= 0.1
##$AZFW= 0.5
##$BCFW= 0
##$BC_mod= 2
##$BYTORDP= 0
##$COROFFS= 0
##$CY= -3
##$DATMOD= 1
##$DC= 0
##$DFILT= <>
##$DTYPP= 0
##$F1P= 0
##$F2P= 0
##$FCOR= 1
##$FTSIZE= 65536
##$FT_mod= 6
##$GAMMA= 0
##$GB= 0
##$INTBC= 1
##$INTSCL= 5.30512e-09
##$ISEN= 30
##$LB= 1
##$LEV0= 0
##$LPBIN= 0
##$MAXI= 10000
##$MC2= 0
##$MEAN= 0
##$ME_mod= 0
##$MI= 50
##$NCOEF= 0
##$NC_proc= -5
##$NLEV= 6
##$NOISF1= 182.463
##$NOISF2= 159.3651
##$NSP= 0
##$NTH_PI= 0
##$NZP= 0
##$OFFSET= 248.5645
##$PC= 4
##$PHC0= -5350.878
##$PHC1= 1413.602
##$PH_mod= 1
##$PKNL= yes
##$PPARMOD= 0
##$PSCAL= 0
##$PSIGN= 0
##$REVERSE= no
##$SF= 81.014009
##$SI= 65536
##$SIGF1= 159.3651
##$SIGF2= -187.1042
##$SINO= 113.3802
##$SIOLD= 16384
##$SREGLST= <1H.CDCl3>
##$SSB= 0
##$STSI= 65536
##$STSR= 0
##$SW_p= 40650.406504065
##$SYMM= 0
##$S_DEV= 0
##$TDeff= 32768
##$TDoff= 0
##$TI= <>
##$TILT= no
##$TM1= 0
##$TM2= 0
##$TOPLEV= 0
##$USERP1= <user>
##$USERP2= <user>
##$USERP3= <user>
##$USERP4= <user>
##$USERP5= <user>
##$WDW= 1
##$XDIM= 65536
##$YMAX_p= 294559557
##$YMIN_p= -21459044
$$ End of Bruker specific parameters
$$ ---------------------------------
##NTUPLES= NMR SPECTRUM
##VAR_NAME=  FREQUENCY,     SPECTRUM/REAL,   SPECTRUM/IMAG
##SYMBOL=    X,             R,               I
##VAR_TYPE=  INDEPENDENT,   DEPENDENT,       DEPENDENT
##VAR_FORM=  AFFN,          ASDF,            ASDF
##VAR_DIM=   65536,         65536,           65536
##UNITS=     HZ,            ARBITRARY UNITS, ARBITRARY UNITS
##FACTOR=    0.620285442955139, 1,           1
##FIRST=     20137.2065510759, 0,            0
##LAST=      -20513.1999529892, 0,           0
##MIN=       -20513.1999529892, -21459044,   0
##MAX=       20137.2065510759, 294559557,    0
$$ Real data points
##PAGE= N=1
##DATA TABLE= (X++(R..R)), XYDATA
$$ [...]
##PAGE= N=2
##DATA TABLE= (X++(I..I)), XYDATA
13097A003851n33487o23981Q66557j38387k694913k340827P70010J996191M49084
13088a245902K02507K326574K633154n74583l020516j679784L97251P5492l74806
13079a260613J833639M006615J948363k845572m886504k265079J472700K511592
13071E15141Q10338j006403q56328Q23413J625719J10266k021464k052759r8391
13062b150468J366605J454055J467022J603766M39640j741106k510696j178773
13054a249955O1835j38561n55546l10429k04826j61197J118900K789867J956777
13045C306865j351277l156245j341519J280737J773181J148586J255325J302109
13037D217762K69928n39624j71661j32177j195597j330269M64127J653310N13731
$$ plain form
13097 1003851 470364 -153617 712940 574553 -2120360 -4461187 -3691177 -1694986 -1245902
13088 -1245902 -1043395 1283179 3916333 3341750 321234 -1358550 -961299 -885807 -1260613
13079 -1260613 573026 4579641 6528004 3682432 -1204072 -3469151 -1996451 515141
13071 515141 1325479 319076 -537252 286161 1911880 2022146 682 -2052077 -2150468
13062 -2150468 -783863 670192 2137214 3740980 4180620 2439514 -71182 -1249955
13054 -1249955 -1188120 -1326681 -1882227 -2192656 -2397482 -2558679 -1439779 1350088 3306865
13045 3306865 1955588 -1200657 -2542176 -1261439 511742 1660328 2915653 4217762
13037 4217762 4487690 3948066 3776405 3644228 2448631 1118362 1582489 3235799 3749530
13028C749530n08587P84120K001603K17414k717502l272923k054525j926423k400645
13019f127938p21862K669619M275332K651079k14493k046615j863646M07142K944138
13010A972756K297704k057806n251550k889765K295591L959036R88480j851402
13002e36956j469770K19099P96573O91439R18903R58178J78998r97378k026990
12993a267904k448172j331109J394335L591346L166193R78038p22738j572235
12985A787754k226071j799558M85225K455258J548310q29243j369435k18390k2818
12976a88968o37985L21079K159816J675716p77304j293989P19305J305568r39263
12967B343975k211574l03862J425665J44589j404614k5517K058637J211505j111270
$$ plain form
13028 3749530 3240943 4025063 6026666 6244080 3526578 253655 -1800870 -3727293 -6127938
13019 -6127938 -6849800 -4180181 95151 2746230 2531737 485122 -1378524 -971382 1972756
13010 1972756 4270460 2212654 -3038896 -5928661 -3633070 325966 1314446 -536956
13002 -536956 -2006726 -1787627 -991054 -299615 619288 1577466 1756464 759086 -1267904
12993 -1267904 -3716076 -5047185 -3652850 -61504 3104689 4082727 3359989 1787754
12985 1787754 -438317 -2237875 -1752650 702608 2250918 1421675 52240 -166150 -188968
12976 -188968 -826953 -505874 1653942 3329658 2552354 1258365 1977670 3283238 2343975
12967 2343975 132401 -171461 1254204 1398793 -5821 -31338 2027299 3238804 2127534
12958B127534j100683M96256k03263k922527k997966R91630M393219L253190L9135
12949D076525m40519J588271J381132k813603o472679m788897N52737L662912
12941c254121K458254N33814N99010M79731j871033l461658p49274L644356M000619
12932B379698P0375k864929k254870j017723j286003j051087J000811K366043
12924b657685J191459l15161J70453J355922J312062P15284L88466p82103k532426
12915a153729j744634K091462L929426L07791m153761l085720J531708K269798
12907g659j982937m342041q27369L730139L404744l71021j924153K83089K421804
12898C84596J235671j959880l403541j381120J922294K882796P49008j259571
$$ plain form
12958 2127534 1026851 1523107 1319844 -1602683 -4600649 -3609019 784200 4037390 4076525
12949 4076525 3636006 5224277 6605409 3791806 -2680873 -7469770 -6917033 -3254121
12941 -3254121 -795867 -262053 336957 816688 -1054345 -4516003 -5265277 -1620921 2379698
12932 2379698 2450073 -414856 -2669726 -3687449 -4973452 -6024539 -5023728 -2657685
12924 -2657685 -1466226 -1781387 -1610934 -255012 1057050 1772334 2160800 1378697 -1153729
12915 -1153729 -2898363 -806901 3122525 3430316 -723445 -3809165 -2277457 -7659
12907 -7659 -1990596 -6332637 -7160006 -3429867 -25123 -396144 -2320297 -2037208 384596
12898 384596 1620267 -339613 -3743154 -5124274 -3201980 -319184 429824 -829747
12890h29747j59096K465334K451965r06880l523446k067463J507431K761571O35370
12881B335039j639548j192697Q87163J483419j05081j303355j26263J759719J459318
12872C557714o75881j520582o6569J143137L90883n64087j20036O532j743396
12863D07715k860241m08129L270205L310778M6276j280266R89360K179869q75652
12854D779915m263600l017275R59976J812053j283866l111953m42215L443841
12846a123124L886759J189551p97288n18689m5893r63388j943133j450682m83939
12837b249826o09045r08560L84074K071467J203059j744685k696891l20482J402639
12828c468250m06733k284418J96162M585746M546291l96899l775418j415869L311564
$$ plain form
12890 -829747 -988843 1476491 3928456 3021576 -501870 -2569333 -1061902 1699669 2335039
12881 2335039 695491 -497206 389957 1873376 1768295 464940 338677 2098396 3557714
12872 3557714 2881833 1361251 1294682 2437819 2828702 2264615 2144579 2151111 407715
12863 407715 -2452526 -2860655 409550 3720328 3766604 2486338 3475698 5655567 4779915
12854 4779915 516315 -2500960 -1540984 271069 -1012797 -4124750 -4566965 -1123124
12846 -1123124 2763635 3953186 3155898 2637209 2591316 1627928 -315205 -1765887 -2249826
12837 -2249826 -2858871 -3767431 -3383357 -1311890 -108831 -1853516 -4550407 -4870889 -3468250
12828 -3468250 -3874983 -6159401 -5963239 -1377493 3168798 2771899 -1003519 -2419388 892176
12819H92176M989552K593913j443199m783214n581694k698034J992425M148932
12811A10857K063637j125289k033527j074204j04648P28726J371574L12265k366748
12802b117357l343504p73424K093291J595920o91000j032189K18923J12302j057861
12793d994899m90016J655185K552926J854237J604177J483497o68872l602070
12785f05835l375123R120K047073Q99181k56530M63850N64166j313748k251404
12776c819250n08470R79515J62698K8072K837526M801469J889677k677381k790111
12767I03745J116948L193255J422448m33158p934L91918j159460k695780j848781
12758H83201M74976J721414Q81654r80411j856156l30398K480644L193404K74307
$$ plain form
12819 892176 5881728 8475641 7032442 2249228 -3332466 -6030500 -4038075 110857
12811 110857 2174494 1049205 -984322 -2058526 -2163174 -1434448 -62874 249391 -2117357
12802 -2117357 -5460861 -6234285 -4140994 -2545074 -3236074 -4268263 -4049340 -3937038 -4994899
12793 -4994899 -5484915 -3829730 -1276804 577433 2181610 3665107 2996235 -605835
12785 -605835 -3980958 -3971838 -1924765 -1025584 -1282114 -818264 -254098 -1567846 -3819250
12776 -3819250 -4327720 -3348205 -3185507 -3157435 -319909 4481560 6371237 3693856 903745
12767 903745 2020693 5213948 6636396 6203238 6195304 6587222 5427762 2731982 883201
12758 883201 1358177 3079591 3961245 2980834 1124678 794280 3274924 6468328 6742635
12749F742635l254108l661510j613903l35575k68129M00860J105835l31424k694751
12740c910070k311676O20768J890252L74658j81662J820731K702736J66191k255952
12731a084024j177309R38768N67421m46433J455613M479014L878184k20441l033356
12722E357437k552621j488344j597230j082688J113426K660695J484883r69821
12714B925737k134475j738893r54098J19469J974937L565315K737407p87351m040655
12705A667393l562647L64167L377142K071350j497365k441570J53529K097443
12697B229442N84622j645704r46178J441650J687912m63239j729583o44489Q76224
12688A390657J228283R59123N19596p33622k465049k896019j458503J30493L88459
$$ plain form
12749 6742635 3488527 -172983 -1786886 -2122461 -2390590 -1989730 -883895 -1215319 -3910070
12740 -3910070 -6221746 -5600978 -3710726 -3336068 -3517730 -1696999 1005737 1171928 -1084024
12731 -1084024 -2261333 -1322565 -755144 -1201577 254036 4733050 8611234 8390793 5357437
12722 5357437 2804816 1316472 -280758 -1363446 -250020 2410675 3895558 2925737
12714 2925737 791262 -947631 -1901729 -1782260 192677 3757992 6495399 5708048 1667393
12705 1667393 -1895254 -1531087 1846055 3917405 2420040 -21530 131999 2229442
12697 2229442 2814064 1168360 222182 1663832 3351744 2888505 1158922 514433 1390657
12688 1390657 2618940 3578063 4097659 3364037 898988 -1997031 -3455534 -3325041 -2936582
12679b936582n3481R0793R04496J593167J493550L51282j313260k040082q92921
12670b803038R45467J441455M90438j50124L01502O46365j30324j302553j619764
12661b180576r27229n0647K17026j50308k57994P16324J957252J527292p40467
12652A10673k379830j650980m2716L87147K52723R81755J638267P34907m22787
12643c90841J66854J132305j40438k391846k168325J4417M23855r60454r6772
12634d411245L456192M577391P04132l632804l696901j097406K99235N50820J405743
12625a844843J773096K41750r86891M01741K051149P07403j604486p61853J890344
12616A867410J346612k394971l900439j114561J561597P66617q62351m9478J557954
$$ plain form
12679 -2936582 -2990063 -2899270 -1994774 -401607 1091943 1443225 129965 -1910117 -2803038
12670 -2803038 -1857571 -416116 74322 -75802 225700 872065 741741 -560812 -2180576
12661 -2180576 -3107805 -3158452 -2941426 -3091734 -3349728 -2633404 -676152 851140 110673
12652 110673 -2269157 -3920137 -3962853 -3575706 -3322983 -2341228 -702961 31946 -390841
12643 -390841 -223987 908318 767880 -1623966 -3792291 -3777874 -3354019 -4314473 -4411245
12634 -4411245 -955053 3622338 4326470 693666 -3003235 -4100641 -3801406 -3250586 -1844843
12625 -1844843 -71747 170003 -816888 -415147 1636002 2343405 738919 -22934 1867410
12616 1867410 3214022 819051 -3081388 -4195949 -2634352 -1867735 -2730086 -2779564 -1221610
12607a221610R08715q78165n93634J545215K431184J077020m19753o19697m18299
12598A810976p07652q71802l32798K82402L55115K19399R1539o17632j872229
12589a642682k061106P573K801184L488139J599883m78825r88231q06626j057249
12580H62060q16472Q15980J998012L53952k708466l010003N89481M154179L651950
12571E890673j49344l226866l187012j085552O56281Q11086J30554J17901Q57105
12562H14826O54985j160152k211518q5036L415298M127876J521869p51754p55202
12553E571192o38719j814752k133284l60412N96017j606609m187368l372731m17822
12544h364488P38355k30502m92125O42873J287666J003102J083661J306071K93320
$$ plain form
12607 -1221610 -312895 -1191060 -1784694 -239479 2191705 3268725 2848972 2229275 1810976
12598 1810976 1103324 231522 -101276 181126 536241 755640 847179 229547 -1642682
12589 -1642682 -3703788 -3696215 -895031 2593108 4192991 3714166 2725935 1919309 862060
12580 862060 45588 861568 2859580 3213532 505066 -2504937 -1915456 2238723 5890673
12571 5890673 5741329 2514463 -672549 -1758101 -1101820 -290734 -160180 -42279 814826
12562 814826 1469811 309659 -1901859 -1986895 1428403 5556279 7078148 6326394 5571192
12553 5571192 4932473 3117721 984437 624025 1220042 -386567 -4573935 -7946666 -8364488
12544 -8364488 -7626133 -7856635 -8348760 -7705887 -6418221 -5415119 -4331458 -3025387 -2732067
12535b732067j204089j113721J56248L61050m53565k17886J042726J307886O51063
12526b202355J020030J823493L28803k855643l502052m45388K089810J027726
12518b715576r93449m64565J339893J113192q03458j289410M83464K155941J791152
12509F17184J1576j206998m91582J637261K729666Q36103k512776l556110j253408
12500c189084J229490J113124l27751m03053Q74759J487052O48967p39263j744298
12491a050057j774907l83820J784849K880683J950592J06661j276840k036662
12483B00499k074987p68417J273080K028532J134648Q47333K190142K686982L37953
12474G855765k565737k665306o62909J78868p23835j198780p10990j013916k308216
$$ plain form
12535 -2732067 -3936156 -5049877 -4893629 -4532579 -4986144 -5204030 -4161304 -2853418 -2202355
12526 -2202355 -1182325 641168 969971 -1885672 -5387724 -5833112 -3743302 -2715576
12518 -2715576 -3709025 -4173590 -2833697 -1720505 -2523963 -3813373 -3329909 -1173968 617184
12509 617184 628760 -578238 -1069820 567441 3297107 4133210 1620434 -1935676 -3189084
12500 -3189084 -1959594 -846470 -1174221 -1577274 -702515 784537 1433504 694241 -1050057
12491 -1050057 -2824964 -3208784 -1423935 1456748 3407340 3514001 2237161 200499
12483 200499 -1874488 -2642905 -1369825 658707 1793355 2640688 4830830 7517812 7855765
12474 7855765 5290028 2624722 1961813 2140681 1416846 218066 -492924 -1506840 -3815056
12465c815056k295879K5272K445233K668644J284250L29705L58090K22114r00551
12456C21822k192153j980908J41422K205551J847356l97631j366732L72324K354433
12447A305484J896147k4221p76059k88333m74069j552207j918345j152722l70971
12438c355296Q3327O43289O33366p73572k066554j040441J154106J116922j259790
12429d864643k156791J14426K203773R38545j807184k168970K09792K602015L378735
12420a550302K953652J752194o0647j483560j606984j150468j148633q63509P84888
12411b373369K374989J312112j866902l245235o65822K957549L147839m18805
12403A222356l490225k487700J169552K842488M41586k780854k237401J804223
$$ plain form
12465 -3815056 -6110935 -6085663 -3640430 -971786 312464 642169 1000259 1222373 321822
12456 321822 -1870331 -3851239 -3709817 -1504266 343090 -54541 -1421273 -1048949 1305484
12447 1305484 3201631 3177410 2401351 2113018 1638949 86742 -1831603 -2984325 -3355296
12438 -3355296 -3271969 -2628680 -1995314 -2768886 -4835440 -5875881 -4721775 -3604853 -4864643
12429 -4864643 -7021434 -6907008 -4703235 -3764690 -5571874 -7740844 -7531052 -4929037 -1550302
12420 -1550302 1403350 3155544 3094897 1611337 4353 -1146115 -2294748 -3158257 -2373369
12411 -2373369 1620 1313732 -553170 -3798405 -4464227 -1506678 1641161 1222356
12403 1222356 -2267869 -4755569 -3586017 -743529 -301943 -3082797 -5320198 -3515975
12395c515975M124871J449266k744747k630769K020028N526984M048102K30125
12387H507885j430191q73391j190610k856013l017903n07064J933272J716196
12379B282181J01469j23053J110844J516792K34883r89601m44408J376997K590919
12370G657023J913487k97348k277376k341013q22536M4961q98395j853812p02896
12361D22095J441810J675686j51799j187543j98805N77080o29936k176250j895468
12352b123130n75163j83678m25636L24646J867647K557119K071184J385321N88045
12343E486355q21669j879528j020284R93314J573252J35911r91193j98989J179614
12334D456783J384026Q46805O77010J97465j830959m283279m289055j204952J773875
$$ plain form
12395 -3515975 608896 2058162 -686585 -3317354 -1297326 4229658 8277760 8507885
12387 8507885 7077694 6204303 5013693 2157680 -860223 -1367287 565985 2282181
12379 2282181 2383650 2260597 3371441 4888233 5123116 4133515 3689107 5066104 7657023
12370 7657023 9570510 9273162 6995786 4654773 3832237 3877198 2978803 1124991 422095
12361 422095 1863905 3539591 3387792 2200249 2001444 2578524 1948588 -227662 -2123130
12352 -2123130 -2698293 -2881971 -3307607 -2982961 -1115314 1441805 3512989 4898310 5486355
12343 5486355 4664686 2785158 1764874 2758188 4331440 4467351 3476158 3277169 4456783
12334 4456783 5840809 6687614 7364624 7562089 5731130 1447851 -2841204 -4046156 -2272281
12325b272281J257031j861509l225176n88586L089739L465011M71041k060430
12317a725160j910957p04695j81565N02655K074391K715972R88196j108460j030228
12308c79851J95756P6608p65626n2362J254528J11518k740677k967932L52263
12299d915775K681450J041645j168260M80114M440088N300088J309857l585327
12291E583880m830244j995099J598603K558328O48360j237063p14527R13147O66255
12282C191640j405374k247121q17284K35108p77858j561447K55316K919676L040494
12273B833150L80720k387670l201536j762918J094685L157531J997269j382350
12265G28881k425779Q01683L998455K635258j111413j985057p9570p460k488751
$$ plain form
12325 -2272281 -1015250 -2876759 -6101935 -6690521 -3600782 -135771 335270 -1725160
12317 -1725160 -3636117 -4340812 -4522377 -4019722 -1945331 770641 1758837 650377 -379851
12308 -379851 -184095 -107487 -873113 -925475 329053 440571 -2300106 -5268038 -4915775
12299 -4915775 -2234325 -1192680 -2360940 -1880826 2559262 7859350 9169207 5583880
12291 5583880 753636 -1241463 357140 2915468 3563828 2326765 1612238 2525385 3191640
12282 3191640 1786266 -460855 -1278139 -1043031 -1820889 -3382336 -3127020 -207344 2833150
12273 2833150 3213870 826200 -2375336 -4138254 -3043569 113962 2111231 728881
12265 728881 -1696898 -895215 3103240 5738498 4627085 2642028 2562458 2554998 66247
12256F6247k960595N07182L628507K486173r39554k638572k225751j622031j046279
12247d744673L17671J627665J482669M80254J02001J04215o17148j462992q08270
12238c518608J186773K484972J782738k85443k300946l107736k074172L21976
12230e510446K325849K471856J243096L22424M46582Q42171N40864n34504j632315
12221E15577j775834n92738J067494J810956J283958L72495l95014j431090k483275
12212a627471j983147O24507L086335K704384p3320k221247k057011p80139J2129
12203b314980M45235J220882J865704J453454L69790L5246Q79646J587410Q07019
12194F349406r36189j750907p89652O14693P32682k81658r20011q09916j155472
$$ plain form
12256 66247 -2894348 -2387166 1241341 3727514 2787960 149388 -2076363 -3698394 -4744673
12247 -4744673 -4427002 -2799337 -1316668 -836414 -734413 -630198 -1247346 -2710338 -3518608
12238 -3518608 -2331835 153137 1935875 1650432 -650514 -3758250 -5832422 -5510446
12230 -5510446 -3184597 -712741 530355 852779 1299361 2141532 2682396 2147892 515577
12221 515577 -1260257 -1852995 -785501 1025455 2309413 2681908 2286894 855804 -1627471
12212 -1627471 -3610618 -2986111 100224 2804608 2731288 510041 -1546970 -2327109 -2314980
12203 -2314980 -1869745 -648863 1216841 2670295 3040085 3075331 3954977 5542387 6349406
12194 6349406 5413217 3662310 2872658 3487351 4220033 3938375 3018364 2208448 1052976
12185A052976k322294k647003q75875J469230J914394N60861j76412P26055J493918
12176A195850M54014j410796j916669n21484J398250K283962J504924l69401j512067
12167A106583k14987K461404K829491o78686m226002k976313J823423L909058
12159D033971P32490k973510k423270L42113M70048j731049j743424J461253L836807
12150B005429K745357L97550m91597m56744q07164q64142M2396O41448P3245k98534
12140B987244M12799O06451q15787j984074j164225J53946J14158n2693J306692
12131A564511K546238J414810o56455j083524r83645k793875m637002k531221
12123g160163K420566M739121K740835M65438N54769P18214j039081k873222l078501
$$ plain form
12185 1052976 -1269318 -3916321 -4792196 -3322966 -1408572 -847711 -1024123 -298068 1195850
12176 1195850 1649864 239068 -1677601 -2199085 -800835 1483127 2988051 2618650 1106583
12167 1106583 891596 3353000 6182491 5503805 1277803 -1698510 124913 4033971
12159 4033971 4766461 1792951 -630319 -288206 181842 -1549207 -3292631 -1831378 2005429
12150 2005429 4750786 5148336 4656739 4199995 3392831 2528689 2571085 3212533 3285778 2987244
12140 2987244 3400043 4006494 3190707 1206633 42408 196354 310512 257819 1564511
12131 1564511 4110749 5525559 4869104 3785580 2801935 8060 -4628942 -7160163
12123 -7160163 -4739597 -476 2740359 3205797 3760566 4478780 3439699 566477 -2512024
12114b512024k931591l053369j373838K422859M608135K796037j05583o33666
12106g83040R1209n05757j560968r52583M60061P44846N92666J289698J427315
12097H03447m22656k119027j207511M93208J5563j196559J71944K907114K818885
12088B264408k37409k279464j733002p56570j58345J497998L273665K037594j460505
12079B448370k265226R18842K782803n80723n202466m692650Q95400N585751N097293
12070D987394P08594l383782m034375j195088K225917L080832J300473n77132
12062C112833j222774j612456k015425j036162J127993J773385K2355j067081
12054i17332O80633K567057J201813j690906j718204J181987K432491m13119m220282
$$ plain form
12114 -2512024 -5443615 -8496984 -9870822 -7447963 -2839828 -43791 -149374 -783040
12106 -783040 -691831 -1197588 -2758556 -3711139 -3251078 -2506232 -1913566 -623868 803447
12097 803447 380791 -1738236 -2945747 -2452539 -2436976 -3633535 -3461591 -554477 2264408
12088 2264408 2026999 -252465 -1985467 -2742037 -2900382 -1402384 1871281 3908875 2448370
12079 2448370 183144 1101986 3884789 3304066 -1898400 -6591050 -5695650 -109899 4987394
12070 4987394 5695988 2312206 -1722169 -2917257 -691340 2389492 3689965 3112833
12062 3112833 1890059 277603 -1737822 -2773984 -1645991 127394 149749 -917332
12054 -917332 -236699 2330358 3532171 1841265 123061 1305048 3737539 3324420 -895862
12045h95862m606090j194443K664496L839806K071083m47597j482623r66054n86308
12036a603592j077731j108479K91932J652686J046979r27277k073048j700062
12028e498592p47222M90127K270965L335519J779679j470625k787488o44690K071469
12019a200858K189371N94114K38064J413471J779628L77087j278279k133761k774393
12010g95556l019605j273115K204130M060759K270646m02564l69724J115730J44423
12001C935124k922387l459684r7464K603401J092434j812353j708045O58708J381638
11992c28628k34156j472991j012552J0735R22107J871728J912454K10844j376678
11983E02863m47278J748879J894984j23901j515646j699813k524438l334370j114996
$$ plain form
12045 -895862 -5501952 -6696395 -4031899 -192093 1878990 1431393 -51230 -1017284 -1603592
12036 -1603592 -2681323 -3789802 -3497870 -1845184 -798205 -1725482 -3798530 -5498592
12028 -5498592 -6245814 -5755687 -3484722 -149203 1630476 159851 -2627637 -3272327 -1200858
12019 -1200858 988513 1582627 1820691 3234162 5013790 5390877 4112598 1978837 -795556
12010 -795556 -3815161 -5088276 -2884146 1176613 3447259 3044695 2674971 3790701 3935124
12001 3935124 1012737 -2446947 -2544411 58990 1151424 -660929 -2368974 -1710266 -328628
11992 -328628 -562784 -2035775 -3048327 -3037592 -2115485 -243757 1668697 1879541 502863
11983 502863 55585 1804464 3699448 3575547 2059901 360088 -2164350 -5498720 -6613716
11974f613716L292040M509178N47773l398702k306194J577269K753472M50557
11966H11677j541109j046773L55500N55861o24412j854269j542793N86428K387691
11957a912199J397606j380754k314397n33012Q19373O3422j87132K010046M032816
11948A995769K934599J27126j639528k655769l786889k996992J015155M525322
11940d81207L277457q12029k567039j311890l16685j37837J381908L265070K003183
11931D300931j686764k888809l12005J736749O93831o63559q8004K01808j577153
11922b82975k855975j247684J139193J621398J482570K609581K917862k20979
11914E162991m368147m777045j540338P16686q1676j110617J18627K134263K532447
$$ plain form
11974 -6613716 -3321676 1187502 1735275 -1663427 -3969621 -2392352 361120 811677
11966 811677 -729432 -1776205 -1420705 -864844 -1489256 -3343525 -4886318 -4299890 -1912199
11957 -1912199 -514593 -1895347 -4209744 -4742756 -3923383 -3859961 -4047093 -2037047 1995769
11948 1995769 4930368 5057494 3417966 762197 -3024692 -6021684 -5006529 -481207
11940 -481207 2796250 1984221 -582818 -1894708 -2211393 -2349230 -967322 2297748 4300931
11931 4300931 2614167 -274642 -586647 1150102 1843933 1180374 1092370 1294178 -282975
11922 -282975 -3138950 -4386634 -3247441 -1626043 -143473 2466108 5383970 5162991
11914 5162991 794844 -3982201 -5522539 -4805853 -4887529 -5998146 -5879519 -3745256 -1212809
11905a212809J601360J045725J101858Q19298N7611m45676m38826l36106l38655
11896A853780l47360n12791r35091r67652Q0432J420388J270809m71797j429017
11887c8299Q513J813223R12724j937499k764931k79272J960368Q05644j891516
11878a411045k380403m75064J071619J121961P99185M27091p63294j954553j026909
11869d591412J837037L538310K060237r61073k616874k061069o37532N0951m83502
11860c864927j330667j054671N19129J835369J768545J274565J566551J924273
11852B638167J263595N66128J144270J583602l75883l497848m175770j944543
11844b798282j39061l79035k21544K123871M244346L172277N5825j632548j080700
$$ plain form
11905 -1212809 388551 1434276 2536134 3355432 3413043 2967367 2528541 2192435 1853780
11896 1853780 1506420 993629 58538 -909114 -828682 591706 1862515 1390718 -38299
11887 -38299 -29786 1783437 2696161 758662 -2006269 -2285541 -325173 480471 -1411045
11878 -1411045 -3791448 -4266512 -3194893 -2072932 -1273747 -846656 -1609950 -3564503 -4591412
11869 -4591412 -2754375 783935 2844172 1883099 -733775 -2794844 -3432376 -3381425 -3864927
11860 -3864927 -5195594 -6250265 -5731136 -3895767 -2127222 -852657 713894 2638167
11852 2638167 3901762 4467890 5612160 7195762 6819879 3322031 -853739 -2798282
11844 -2798282 -2937343 -3316378 -3537922 -1414051 2830295 6002572 6058397 4425849 3345149
11835C345149o28996j787523l059247k239428L91229K181234J427775k89327k17001
11826h76135J528399K128091O65141l09758O73579J171551o67299k070126k69840
11817A973603J739315l97010m192662l178111K473953N301783J795244k563789
11809B952326k192758P80558J418368k88590j035190m3371R19031R66260K03634
11800C680268j480347l129515k564267K03158J988904J012330m39118n9067R81163
11791A93509R17965L71525n1802j476792l371567k472968J659354M182173J849915
11782A801312j810673k390505j218115j136056l49262L170811N333226J659154
11774E059892l663329k966151K368201L644777j052546l911753l61596L879827
$$ plain form
11835 3345149 2716153 928630 -2130617 -4370045 -3978816 -1797582 -369807 -659134 -876135
11826 -876135 652264 2780355 3445496 3135738 3809317 4980868 4313569 2243443 1973603
11817 1973603 3712918 3315908 -876754 -4054865 -1580912 3720871 5516115 2952326
11809 2952326 759568 1540126 2958494 2669904 1634714 1591343 2510374 3476634 3680268
11800 3680268 2199921 -929594 -3493861 -3290703 -1301799 -289469 -728587 -787654 193509
11791 193509 1111474 1482999 1431197 -45595 -3417162 -5890130 -4230776 -48603 1801312
11782 1801312 -9361 -2399866 -3617981 -4754037 -5103299 -1932488 3400738 5059892
11774 5059892 1396563 -1569588 798613 4443390 3390844 -520909 -882505 2997322
11766B997322K469907k220518m220006k725725p44257P28620K245749K721842
11758A252934J160878o28652o65121q9710o97242j428315o03520M79025k67779
11749a487502j652058j015060J088689J764262P13260N50002K015618K408745
11741D385956l4140k876648k427804J408664M855177M478226P28855k796327l230153
11732D491806j258325J56327m25384j358137n52338J373240J786511m03097l131378
11723F79225l571258j444816P70896Q63581n82869j212576j15014J006714L15644
11714c290473j430987j750824J94159K268775J883918p77882k769282j687114
11706g359710J491045L461032K474331K39656o74446k21184j27272n58999P1312
$$ plain form
11766 2997322 5467229 3246711 -973295 -3699020 -4443277 -3714657 -1468908 1252934
11758 1252934 2413812 1785160 1120039 1030329 333087 -1095228 -1698748 -1219723 -1487502
11749 -1487502 -3139560 -4154620 -3065931 -1301669 -588409 -38407 1977211 4385956
11741 4385956 4351816 1475168 -952636 456028 5311205 9789431 10518286 7721959 4491806
11732 4491806 3233481 3389808 2964424 1606287 1053949 2427189 4213700 3810603 679225
11723 679225 -2892033 -4336849 -3565953 -2702372 -3285241 -4497817 -4612831 -3606117 -3290473
11714 -3290473 -4721460 -6472284 -6278125 -4009350 -2125432 -2903314 -5672596 -7359710
11706 -7359710 -5868665 -2407633 66698 306354 -368092 -589276 -716548 -1275547 -1204235
11697a204235J835155K430181O45663j565940j958185r82247k28415K78564J177620
11688D28161J714026Q90770m32571q19060o54949j019301j138505L92473K425948
11679A786992K187057m69965k382874j391866Q09057J225066n14330k045618j480332
11670b276813L01878Q92340l10137r12666J185552M005621L377439j018583m362873
11661H81758k954151R20818K625190J305373m78684j334497j847915j921321p36837
11652c540266R18878J188644k7090j083583j188595q91300m07402N29707J618738
11643b882269K461863L192841L208520J063447k474716l721040j197582J200954
11635H52018j79672k678683j612933J665552J914460j041029k070140M07485J914027
$$ plain form
11697 -1204235 630920 3061101 3706764 2140824 182639 -799608 -1028023 -749459 428161
11688 428161 2142187 3032957 2600386 1781326 1126377 107076 -1031429 -638956 1786992
11679 1786992 3974049 3504084 1121210 -270656 538401 1763467 1249137 -796481 -2276813
11670 -2276813 -1974935 -1082595 -1392732 -2305398 -1119846 2885775 6263214 5244631 881758
11661 881758 -2072393 -1151575 1473615 2778988 2300304 965807 -882108 -2803429 -3540266
11652 -3540266 -2621388 -1432744 -1459834 -2543417 -3732012 -4623312 -5030714 -4501007 -2882269
11643 -2882269 -420406 2772435 5980955 7044402 4569686 848646 -348936 852018
11635 852018 672346 -2006337 -3619270 -1953718 -39258 -1080287 -3150427 -2742942 -828915
11626h28915k92787k928076k515055l67276R06057J417246J832255J183100m49592
11617b043043o48529J383175K910205K034914N83839L53733P4823j333012k093937
11608A222168j041354k79012j293077j806450P9199J902666Q99360r13002o9441
11599a298943K269439K266356r8381j200832J66586J265644J24605j869564k722842
11590a097932k343522j534989n26721P77793K230076L288140K978643Q55741j486542
11581C140687j510310O96138J982003O01936j292549j482033j234958k255225
11573a354311k708894j44904L361760L361116k39375k785972j570802Q35745J022756
11564b22881o06604j351135l39456P57188L56284j034874j573626m86298P45748
$$ plain form
11626 -828915 -1121702 -4049778 -6564833 -6932109 -6026052 -4608806 -2776551 -1593451 -2043043
11617 -2043043 -2691572 -1308397 1601808 3636722 4220561 4574294 4649117 3316105 1222168
11608 1222168 180814 -98198 -1391275 -3197725 -3118526 -1215860 -316500 -1229502 -1298943
11599 -1298943 970496 3236852 3138471 1937639 2104225 3369869 3494474 1624910 -1097932
11590 -1097932 -3441454 -4976443 -5503164 -4725371 -2495295 792845 3771488 4627229 3140687
11581 3140687 1630377 2326515 4308518 4910454 3617905 2135872 900914 -1354311
11573 -1354311 -4063205 -4208109 -846349 2514767 2275392 -510580 -2081382 -1245637 -222881
11564 -222881 -829485 -2180620 -2520076 -1762888 -1406604 -2441478 -4015104 -4501402 -3755654
11555c755654L20605j040194q04997J451192K952252J711964m80337q77815K26808
11546b96176N38490n53273j610051j554082m67574J144379K227673J520248l22769
11537F26865n84575J523143K697495J06536l731791m095039q28835J812934J465874
11528a007393q5652q62744j021250p21950O43008K119279J465750r87212j938070
11519b396234r6834J544255M54218j325293n86561J735108K002534m64502k532635
11510a665944k040773m53583J23887J25872J029116K239647J735134m93025j818161
11501a217830n75603J360214J069356j309328k817819j765204L55634J414912
11493c485668J318153J189678J239374O99687p38191k324323k819201j474789
$$ plain form
11555 -3755654 -3435049 -4475243 -5280240 -3829048 -876796 835168 354831 -522984 -296176
11546 -296176 242314 -310959 -1921010 -3475092 -3942666 -2798287 -570614 949634 626865
11537 626865 42290 1565433 4262928 4369464 637673 -3457366 -4286201 -2473267 -1007393
11528 -1007393 -1093045 -1955789 -2977039 -3698989 -3055981 -936702 529048 -458164 -2396234
11519 -2396234 -2493068 -948813 -494595 -1819888 -2406449 -671341 1331193 866691 -1665944
11510 -1665944 -3706717 -4160300 -4036413 -3910541 -2881425 -641778 1093356 600331 -1217830
11501 -1217830 -1793433 -433219 636137 -673191 -3491010 -5256214 -4900580 -3485668
11493 -3485668 -2167515 -977837 261537 961224 223033 -2101290 -4920491 -6395280
11485f395280R58304K369917J530329m6795n6883J023188O17208j468554k147787
11476c616353J37857K519794J709001j267402k749275j322594J313000L153022
11468a22950L339957J774096o03789j828363r77065M88721Q50009M33574K50262
11459C604452j70549j522812k591450j733798L35695J413336Q13633l59652j152248
11450a363393j185631j43652J306714J236710q71633k442362j118585J469148
11442c112684J905642J555j264459l09680J280241J426159k17403k483179l346974
11433f120782j144852K967792M980209K689780j035351k246592j383312j356028
11425b649136j909001m01587K574010L292622R68442q63438q609J539790J691340
$$ plain form
11485 -6395280 -5436976 -3067059 -1536730 -1583525 -1640408 -617220 -12 -1468566 -3616353
11476 -3616353 -3478496 -958702 750299 -517103 -3266378 -4588972 -3275972 -122950
11468 -122950 3217007 4991103 4387314 2558951 1581886 2070607 2920616 3354190 3604452
11459 3604452 3433903 1911091 -680359 -2414157 -2078462 -665126 148507 -211145 -1363393
11450 -1363393 -2549024 -2692676 -1385962 -149252 -1020885 -3463247 -4581832 -3112684
11442 -3112684 -1207042 -1205487 -2469946 -2779626 -1499385 -73226 -290629 -2773808 -6120782
11433 -6120782 -7265634 -4297842 682367 3372147 2336796 90204 -1293108 -2649136
11425 -2649136 -4558137 -4959724 -2385714 906908 1875350 1011912 1003303 2543093 4234433
11416D234433J196053Q49761m53999k781338l614010j655421N81331L90984j271761
11407b523967j873292j116134l07048L07617J203604J901836J729102J189384
11399E11102Q62893J14646j437747k413696j467233M13719J249161R09259P63289
11390d94607J062745O68560o02833j195072q3965J377918J062742q38163j680825
11381g23500o572J882835Q13502k273943k985153J47561L096783K211459m06085
11372A756887p15511O94891M11613j141966l99912K284834K241158j576733l982177
11363d26916j562527J775949J062296k037843k448082J41235J414611l60770k014461
11354d456508p42913J933152K724973R55376q76740j87400K526768L780786J158555
$$ plain form
11416 4234433 5430486 6280247 5826248 3044910 -569100 -2224521 -1643190 -1252206 -2523967
11407 -2523967 -4397259 -5513393 -5820441 -5512824 -4309220 -2407384 -678282 511102
11399 511102 1373995 1488641 50894 -2362802 -3830035 -3416316 -2167155 -1257896 -494607
11390 -494607 568138 1236698 633865 -561207 -645172 732746 1795488 957325 -723500
11381 -723500 -730072 1152763 1966265 -307678 -3292831 -3145270 -48487 2162972 1756887
11372 1756887 1041376 1736267 2147880 1005914 606002 2890836 5131994 3555261 -426916
11363 -426916 -1989443 -213494 848802 -1189041 -3637123 -3495888 -2081277 -2442047 -4456508
11354 -4456508 -5199421 -3266269 -541296 414080 -462660 -650060 1876708 5657494 6816049
11345F816049k901523l403492M99117L731920J978470k435803m113142k077003
11337a905407j59930p78816k030512j370327Q62094K629793K784639J477420m06849
11328A102105j394659l97556J641108K252359M32307j859046k118756m84740O24082
11319b02796j66277j396488q98323J043047J976725R19143N4669J397291L095953
11310E822944J697616k193479l811384r35567K455015J685713j914080l226227
11302d19449q81953J360224P64689o94435j36215J744074K155555M01817j541391
11293B752916j805153l94330J321496J802638N86338r15097p54104P46879R93880
11284D335463r54001k383148r68906J031673k6770k862790k523738J668367M212746
$$ plain form
11345 6816049 3914526 511034 1010151 4742071 6720541 4284738 171596 -1905407
11337 -1905407 -2065337 -2844153 -4874665 -6244992 -5382898 -2753105 31534 1508954 1102105
11328 1102105 -292554 -690110 950998 3203357 3635664 1776618 -342138 -826878 -202796
11319 -202796 -369073 -1765561 -2663884 -1620837 355888 1275031 1329700 2726991 5822944
11310 5822944 7520560 5327081 1515697 580130 3035145 4720858 2806778 -419449
11302 -419449 -1301402 58822 823511 129076 -7139 1736935 3892490 4294307 2752916
11293 2752916 947763 553433 1874929 3677567 4263905 3348808 2594704 3341583 4335463
11284 4335463 3381462 998314 29408 1061081 1034311 -1828479 -4352217 -2683850 1528896
11275A528896J581766k139863j460187K093064K631306r37203l790380k887971
11267c380572o13565J68089R3091N80961R50429M29417N6308N23596P12920J53150
11257c26176K64934J379316J420159l47291j285244K94573J721269R3756k692770
11248E22526k702286J02131K356389K411676J416925K81138j051236j978935j962579
11239f04251k143959l375534l673411r03677K890865L532167P70952j331409l23771
11230e162028J717659J960572O72171J04036J287073K904787K727299K72943j850641
11221D633871q32197J745503J205133k902144m789567q54103M026744L388016
11213E621256j124852k978863j145889k51523j501637j048606J970614L022803
$$ plain form
11275 1528896 3110662 970799 -489388 1603676 4234982 3297779 -492601 -3380572
11267 -3380572 -3994137 -3826048 -3732957 -3151996 -2201567 -1772150 -1715842 -1192246 -479326 -326176
11257 -326176 -61242 1318074 2738233 2390942 1105698 1400271 3121540 3215296 522526
11248 522526 -2179760 -2077629 278760 2690436 4107361 4388499 3337263 1358328 -604251
11239 -604251 -2748210 -6123744 -9797155 -10700832 -7809967 -4277800 -3506848 -4838257 -5162028
11230 -5162028 -3444369 -1483797 -811626 -707590 579483 3484270 6211569 6484512 4633871
11221 4633871 3801674 5547177 6752310 3850166 -939401 -1793504 2233240 5621256
11213 5621256 4496404 1517541 371652 120129 -1381508 -2430114 -459500 2563303
11205B563303l7019k934888j736485J248225J582550r17705l007019k759113j078917
11196g077068R1504j04255k28357J927718N305767N429262J068471k294661l15986
11187C802395K578343J93825m086162k125453M422800N310475j611881o265072
11179B219270k448741K741557J357772l071751l056228O40313K356018J404916
11171B143126Q35903O80197n63692j420738n55548n13984k608370k609026K120795
11162b491337N927035K690535l744422n023808r37192J835362J284713J463358
11154A004244L233949K467211j677090m297600k391586J038456K247834J271037
11146B896455j54694j091860r15523K86928O89303q25510k018728n18511J737027
$$ plain form
11205 2563303 2526284 -408604 -2145089 -896864 685686 -232019 -3239038 -5998151 -7077068
11196 -7077068 -6985564 -7089819 -7318176 -5390458 -84691 5344571 6413042 4118381 3802395
11187 3802395 6380738 6574563 2488401 362948 4785748 10096223 8484342 2219270
11179 2219270 -229471 2512086 3869858 798107 -2258121 -1617808 738210 2143126
11171 2143126 2979029 3659226 3095534 1674796 1119248 605264 -2003106 -4612132 -2491337
11162 -2491337 3435698 6126233 2381811 -2641997 -3579189 -1743827 -459114 1004244
11154 1004244 4238193 6705404 5028314 730714 -1660872 -622416 1625418 2896455
11146 2896455 2741761 1649901 734378 1021306 1710609 885099 -1133629 -1652140 84887
11137H4887J356305p19190r29193O85110R98875k79970k99605J604181K911313
11128E412713K154854K25225j901189l091873j329020K800800M149661l63211
11120H057960n557433m516775Q55037K905396L02747j067850J024132J949540
11112C952754p67628l205158k239281r4271Q54733J538839K053089K77034k849639
11103d79528k912662L76346J565208j340686k755608J051209M775606K137119
11095B417004l874804n366820j034197L012736K407946q91204k816098j820332
11087g965769R24660L171319L131852Q82775j791661l265106k895883m97052K883744
11078e421121M220796J689219j665117j186122K493550M172809J926067q48218
$$ plain form
11137 84887 1441192 722002 -207191 477919 1476794 1196824 897219 2501400 5412713
11128 5412713 7567567 7792792 5891603 2799730 1470710 4271510 8421171 8057960
11120 8057960 2500527 -2016248 -1161211 1744185 2046932 979082 2003214 3952754
11112 3952754 3185126 -20032 -2259313 -2353584 -1498851 39988 2093077 2370111 -479528
11103 -479528 -3392190 -3015844 -1450636 -2791322 -5546930 -4495721 279885 2417004
11095 2417004 -1457800 -6824620 -7858817 -4846081 -2438135 -3329339 -6145437 -7965769
11087 -7965769 -7041109 -3869790 -737938 144837 -1646824 -4911930 -7807813 -8304865 -5421121
11078 -5421121 -1200325 488894 -1176223 -2362345 131205 4304014 6230081 5381863
11070E381863j924349k939542l982080j916515K909838M607112O15928l113689
11062c61434r80009L311120K731218k098113m579120k287372J016095K224693
11054a022922J926796J149649M7847l89272N48643R88133r62930l313558k829185
11045c856799n13267o1174j575176j543607R70439K822794K139724Q66578P76621
11036B6133P66621k38312r24436r0706R57518N11920p54891r13223L80466J622447
11026A343537J513879L10014o91978n73733L00919Q95091R13619Q99569Q39449
11017E750366r4036j876733l077215k801141j847048j036729M6178J506130J996909
11008a433319O85545j002148j134210L33932K027584K635862J131544k393810
$$ plain form
11070 5381863 3457514 517972 -3464108 -5380623 -2470785 2136327 2752255 -361434
11062 -361434 -1341443 1969677 4700895 2602782 -1976338 -4263710 -3247615 -1022922
11054 -1022922 903874 2053523 2101370 1712098 2260741 3248874 2285944 -1027614 -3856799
11045 -3856799 -4370066 -4431240 -6006416 -7550023 -6579584 -3756790 -1617066 -750488 26133
11036 26133 792754 554442 -369994 -460700 496818 1008738 253847 -659376 -278910 1343537
11026 1343537 2857416 3167430 2475452 1901719 2202638 3097729 4011348 4910917 5750366
11017 5750366 5656330 3779597 702382 -2098759 -3945807 -4982536 -4936358 -3430228 -1433319
11008 -1433319 -747774 -1749922 -2884132 -2550200 -522616 2113246 3244790 850980
11000H50980n117892l525131J311226L768838J453529p53353J769717N343333
10992E101247L061762m149838q008605m350691J894708M446976L010373O83091
10984A689023j285862k942286l121021r51789J884231L016760K289796J022311
10976A601163j74552j135586j172479j93082L97282l70772j228605m65668J356493
10967a385806K195831J477403O21792P71300J310101Q98024p12040k189793k016709
10958I70103m71687L57468o60105j765260q17061J015075P84279j095910q71551
10949b554649K211526L592978K23585l908687l361110L11709J164452j377597
10941c697793j791611J837184M046345R05077l107999j982957K259102K848428
$$ plain form
11000 850980 -4266912 -7792043 -6480817 -2711979 -1258450 -2011803 -242086 5101247
10992 5101247 8163009 4013171 -3995434 -8346125 -6451417 -2004441 1005932 1689023
10984 1689023 403161 -2539125 -5660146 -6611935 -4727704 -1710944 578852 1601163
10976 1601163 1426611 291025 -881454 -1074536 -677254 -1048026 -2276631 -2742299 -1385806
10967 -1385806 810025 2287428 2909220 3680520 4990621 5888645 5176605 2986812 970103
10958 970103 498416 855884 195779 -1569481 -2386542 -1371467 -587188 -1683098 -2554649
10949 -2554649 -343123 3249855 3473440 -435247 -3796357 -3484648 -2320196 -3697793
10941 -3697793 -5489404 -3652220 394125 1299202 -1808797 -3791754 -1532652 1315776
10933A315776j185737m067651k433547N36826J196254L99773K58264K11292p80426
10924d549176j260511M17678K865035L490510K141984O28856j54431n37211n50140
10915B492594m0249M22889K76449r9715k43316m11559o43002l19928N09344R23521
10905B867028R16067J341380J400345r67763m864194n897127k127189K529656
10897d801797L590685J783665M48100J21478n32081j004471l08108J67774o39422
10888a174177k87897K904293M902359J141994n079062o112165j283896K286198
10880b702353P53621j617949n54777J886704K155508R35946M99204N78675J77959
10871B112538n0740j683j225718l343724l014404P93538M090362L380530N28047
$$ plain form
10933 1315776 130039 -3937612 -6371159 -5834333 -4638079 -4238306 -3980042 -3768750 -4549176
10924 -4549176 -5809687 -5392009 -2526974 963536 3105520 3734376 3579945 3042734 2492594
10915 2492594 2452345 2875234 3151683 3051968 2808652 2397093 1754091 1434163 1943507 2867028
10905 2867028 3783095 5124475 6524820 5557057 692863 -5204264 -7331453 -4801797
10897 -4801797 -1211112 572553 1020653 1142131 610050 -394421 -702529 -534755 -1174177
10888 -1174177 -1462074 1442219 6344578 7486572 2407510 -3704655 -4988551 -2702353
10880 -2702353 -1948732 -3566681 -4121458 -2234754 -79246 856700 1355904 1934579 2112538
10871 2112538 2061798 2060115 834397 -2509327 -5523731 -4730193 -639831 2740699 3268746
10862C268746r17598r58150j380065j769905r23179J65836J51778P6838J102245
10853a183454J640811J8196j969613j539180O38788J741418J207448P41889R81576
10844B277879J031117N19505k54668j315177k203677j571152M99345J583754N30150
10835A097076j58866J677190L622909J988474k162054m184930k431998Q7027O76925
10826B11753J64616L62982J085936J034759O9952o04490L738J404679J913303
10817E647228N63720j406136k060707j627868j984801l061818k372070P52292
10809e550160L190885K298051j65325q02023N33733J318298O15053M488O76065
10800B119065J790575J784038r844k846328m867329m440437j780856J356748L572088
$$ plain form
10862 3268746 2351148 1392998 12933 -1756972 -2680151 -2514315 -2362537 -2285699 -1183454
10853 -1183454 457357 475553 -1494060 -3033240 -2394452 -653034 554414 1296303 2277879
10844 2277879 3308996 3828501 3573833 2258656 54979 -1516173 -1016828 566926 1097076
10835 1097076 938210 2615400 6238309 8226783 6064729 1879799 -552199 -465172 211753
10826 211753 376369 739351 1825287 2860046 2929998 2325508 2329246 3733925 5647228
10817 5647228 6210948 4804812 2744105 1116237 -868564 -3930382 -6302452 -5550160
10809 -5550160 -2359275 -61224 -226549 -1028572 -494839 823459 1438512 1443000 2119065
10800 2119065 3909640 5693678 5683834 2837506 -2029823 -6470260 -8251116 -6894368 -3322280
10791c322280M297143K940144k84694k940655k532105j80180Q39185K52849Q07209
10782a23384K837006L298330J300182k24217j19359j135579l935255m404738o27232
10773c134246K629015J036545k277925k131954L77277Q71244l38404K51950K226669
10764d89829K176183K65245l63785K59464n40580k110394j164371J705133K269253
10755B006319j96367j778131o49926O30822N27670P19561J535159O30060j930338
10746A494829k543289l50793N20410j955908l319012N00905N845782N894828L16414
10737F404166m542782m259503q02658J730221K124424J624815J116999N10362
10729C906044k10179p39357r68308r76729p15681k83954k56551q94957j108361
$$ plain form
10791 -3322280 974863 3915007 3630313 689658 -1842447 -2022627 -1183442 -930593 -123384
10782 -123384 2713622 6011952 7312134 7087917 6968558 5832979 1897724 -2507014 -3134246
10773 -3134246 -505231 531314 -1746611 -3878565 -3501288 -2630044 -2968448 -2716498 -489829
10764 -489829 1686354 1951599 1587814 1847278 1306698 -803696 -1968067 -262934 2006319
10755 2006319 1809952 31821 -618105 12717 540387 1259948 2795107 3425167 1494829
10746 1494829 -1048460 -1399253 -878843 -2834751 -6153763 -5652858 192924 6087752 6404166
10737 6404166 1861384 -2398119 -3200777 -1470556 653868 2278683 3395682 3906044
10729 3906044 3695865 2956508 1988200 1011471 295790 11836 -244715 -1139672 -2248033
10720b248033N14534L137450L709138R19338k338318k581820o43233j11722j583561
10711a226227k021374n0798J838208J432789k55161j494006k045759j554655P87270
10702d589713L380146K790317p69886k467736N9457K687062J235894j912977j852963
10693a440399J220449K970611J492627j235102l007366k984714j053563J430722
10685b606735J924266K28759n43074J059416K023564L72k342384j784805J76547
10676a864074O76824N73527J647623K262517P95253j37120J714312L019440K80417
10667H968719l183781k492372Q350r89282l648726k027014K650599L360406n12753
10658B134146k100828R01920K732467L25290j571893M53818K467081P43974j731309
$$ plain form
10720 -2248033 -1733499 1403951 5113089 6032427 3694109 1112289 469056 357334 -1226227
10711 -1226227 -3247601 -3298399 -1460191 -27402 -282563 -1776569 -3822328 -5376983 -4589713
10702 -4589713 -1209567 1580750 810864 -1656872 -1597415 1089647 2325541 412564 -1440399
10693 -1440399 -219950 2750661 4243288 3008186 820 -2983894 -4037457 -2606735
10685 -2606735 -682469 -453710 -996784 62632 2086196 2086568 -255816 -2040621 -1864074
10676 -1864074 -1187250 -613723 1033900 3296417 4091670 3954550 5668862 8688302 8968719
10667 8968719 5784938 3292566 3300916 2311634 -1337092 -3364106 -713507 2646899 2134146
10658 2134146 33318 935238 3667705 3992995 2421102 2874920 5342001 6085975 4354666
10649D354666j188060M70569P1929r92782k24026R14166P5085j328855r20411
10640A232281K61021K29746J03538J642788L115246J723621j423132k552481o17605
10631C715023J664985J799608J53078j288832j183321J64114J241611Q93431m84342
10622F675355j739460k376770k218720o91298J860842L197466J740662p39984
10614E708093j391920l59281N5878n61322n95947K16352M24401k45391n03789
10605B747074J5622L84515K67438m0583p86747j739914j159126J634800L978487
10596E301566L050120O8071j624147j274912m90988J50244R57797J061508j96604
10587G002655j195795m28778O81645K56945q26466j074961j117624j352957j51472
$$ plain form
10649 4354666 3166606 3637175 3709104 2716322 2492296 3406462 3481547 2152692 1232281
10640 1232281 1493302 1723048 1826586 3469374 6584620 8308241 6885109 4332628 3715023
10631 3715023 5380008 7179616 7332694 6043862 4860541 5024655 6266266 7159697 6675355
10622 6675355 4935895 2559125 340405 -350893 1509949 4707415 6448077 5708093
10614 5708093 4316173 3956892 4012770 3451448 2855501 3071853 3496254 3250863 2747074
10605 2747074 2762696 3147211 3414649 3374066 2587319 847405 -311721 1323079 5301566
10596 5301566 8351686 8419757 6795610 5520698 5029710 5179954 6137751 7199259 7002655
10587 7002655 5806860 5378082 6059727 6316672 5490206 4415245 3297621 1944664 1793192
10578A793192K261365K088156j852821m560404k206373J470542J481706m54612
10570B0751l53594N33873m33824p82225K056362L906826M87375l566929j539278
10561C29337L523894L671956o93239k710868j292065q80520j445371M94942K877379
10552C875445R73962k538402j279988K908203K957858l88659l50553K669970J989538
10543A0817374k260538l417121r90302o60476k286752n50336L194719K651460
10535F498028p19925K1129L543991K640252j248150p45579K100136o39577n734308
10526E715997l058777M460169M418778k131996k062070N042494N606934k322664
10518A5668865n176223P19174L050172k235350l921638J521756L353461j165192
$$ plain form
10578 1793192 4054557 6142713 4289892 -270512 -2476885 -1006343 475363 20751
10570 20751 -332843 201030 -232794 -1015019 1041343 4948169 5435544 1868615 329337
10561 329337 3853231 7525187 6831948 4121080 2829015 1948495 503124 998066 3875445
10552 3875445 4849407 2311005 1031017 3939220 6897078 6508419 6157866 8827836 10817374
10543 10817374 8556836 5139715 4149413 3488937 1202185 651849 3846568 6498028
10535 6498028 5778103 5799232 9343223 11983475 10735325 9989746 12089882 11450305 5715997
10526 5715997 2657220 7117389 11536167 9404171 7342101 12384595 17991529 15668865
10518 15668865 10492642 11211816 14261988 12026638 8105000 9626756 12980217 11815025
10510A1815025j657950K748391Q31235n680403k070580R102853Q389651l794513
10502A9683709n060728O705298P632413n402662n927059J0040459J1926981n789134
10494C3809277o853743J6808044K0964413n704584l042065N2188548P0418844
10487A78588734k5772552j52817385j56723587l1649504P0936768N7462618r18901
10480f0893809q502614J8802194J8735993l371264m079595J1457211Q305236p839132
10472b7385780n783695R389126Q344076n992802o576858N919996P415634k774363
10464a7444666l605431N633929N711937m004210m972590M397341O475461k038341
10456i846570n670490J24788L389435O18809R53661M677950K242513m592665m091737
$$ plain form
10510 11815025 10157075 12905466 13736701 8056298 5985718 15088571 23478222 19683709
10502 19683709 14622981 21328279 28960692 23558030 17630971 27671430 39598411 33809277
10494 33809277 26955534 43763578 64727991 59023407 55981342 108169890 178588734
10487 178588734 152816182 -1203 -156724790 -188374294 -117437526 -59974908 -60893809
10480 -60893809 -69396423 -50594229 -31858236 -35229500 -39309095 -27851884 -19546648 -27385780
10472 -27385780 -33169475 -23780349 -15436273 -21429075 -28005933 -22085937 -14670303 -17444666
10464 -17444666 -21050097 -15416168 -9704231 -13708441 -18681031 -14283690 -7808229 -9846570
10456 -9846570 -15517060 -15392272 -12002837 -11384028 -10430367 -5752417 -3509904 -8102569 -12194306
10447a2194306K622327K784879l782525m288837K555063M293262j375548k691113
10439a2076798L227837M995128j227528m758126n62084K364415j139997l349990
10431a2527143Q61987M819778L036254k1664j72847l79907k217985j839305J141997
10422g298835J483084j454539j892099J190187J950934p53880r79977K455259
10414e299866L163962o41247k432312O12031K735314O25290j078678O18341J800934
10405A03769J41472o19601J169268J224179k257302m549827k685952j54844J08728
10396g520110O6345R70857P63845l43330R11819L808118L494995p0218j172822
10387I09499J477711K240848j012378k804792p7726K208870Q611k947826k136136
$$ plain form
10447 -12194306 -9571979 -6787100 -10569625 -14858462 -12303399 -8010137 -9385685 -12076798
10439 -12076798 -8848961 -3853833 -5081361 -9839487 -10401571 -8037156 -9177153 -12527143
10431 -12527143 -11665156 -6845378 -3809124 -3830788 -4003635 -4383542 -6601527 -8440832 -7298835
10422 -7298835 -5815751 -7270290 -9162389 -7972202 -6021268 -6775148 -7755125 -5299866
10414 -5299866 -2135904 -2777151 -5209463 -4597432 -1862118 -1236828 -2315506 -1697165 103769
10405 103769 245241 -374360 794908 2019087 -238215 -4788042 -7473994 -7628838 -7520110
10396 -7520110 -7453765 -6482908 -5719063 -6062393 -5150574 -1342456 2152539 2082321 909499
10387 909499 2387210 4628058 3615680 810888 733162 2942032 2950643 2817 -2133319
10378b133319N15567J154595J38653n75913j131984j400240J79195K579884K097520
10369A423958j322515l029503j154088N45127l80017j205391K32692J661933J071091
10360b156713M6459j01805n00574r81989N26464L113315K979828O6278j383374
10351A607889m34415r96839l789167l975335K63292L840306K991078P35358L31675
10342E73842j51873k422919l408204r67534J453199Q14182j27238J525656K846747
10333A35858M06102k875232k245751Q90337J538734p25914j925956n96883O80009
10324d718696K06124o40751l44375O36716J047532L62189q76082j430013o47602
10315f404958M68474O27530L56060R00551J642368J146193J39697L64204J089304
$$ plain form
10378 -2133319 -1617752 -463157 -324504 -900417 -2032401 -3432641 -3253446 -673562 1423958
10369 1423958 101443 -2928060 -4082148 -3537021 -3917038 -5122429 -4889737 -3227804 -2156713
10360 -2156713 -2110254 -2212059 -2712633 -3694622 -3168158 -54843 2924985 2991263 1607889
10351 1607889 1173474 176635 -3612532 -7587867 -7324575 -3484269 -493191 242167 573842
10342 573842 421969 -2000950 -5409154 -6376688 -4923489 -4109307 -4236545 -2710889 135858
10333 135858 541960 -2333272 -4579023 -3688686 -2149952 -2875866 -4801822 -5398705 -4718696
10324 -4718696 -4512572 -5153323 -5497698 -4860982 -3813450 -3451261 -4327343 -5757356 -6404958
10315 -6404958 -5936484 -5308954 -4952894 -4052343 -2409975 -1263782 -1124085 -759881 329423
10306C29423L46367r45950j58264K129882K765410J341254K78514j18298j597727
10297D370611l146282j938534O89891L70819k504224k654703J111487L564864
10289a36071J760123o66103o11286k89094j520182j605439J031868K831739J104047
10280A899602j115662o21693M40527p86379k289816j177885P20380K54677j377054
10271d053303j185038K39426M97806Q1679R79593K616296L011637K176310J114797
10262E479203n48788k935557m009982k253845O20282K060230J837261R45796k53166
10253I41434j092348n04346O81026L76974q27616k41568J568813J024364j541761
10244C84972j341809K127907K749461j917938n133957j436391L918645L151911
$$ plain form
10306 329423 675790 -270160 -428424 1701458 4466868 5808122 6086636 5968338 4370611
10297 4370611 1224329 -714205 -24314 346505 -2157719 -4812422 -3700935 -136071
10289 -136071 1624052 957949 346663 57569 -1462613 -3068052 -2036184 795555 1899602
10280 1899602 783940 162247 602774 -183605 -2473421 -3651306 -2930926 -2676249 -4053303
10271 -4053303 -5238341 -4998915 -4501109 -4419430 -3439837 -823541 2188096 4364406 5479203
10262 5479203 4930415 1994858 -2015124 -4268969 -3648687 -1588457 248804 1194600 941434
10253 941434 -150914 -655260 25766 402740 -424876 -666444 902369 1926733 384972
10244 384972 -956837 1171070 3920531 2002593 -3131364 -4567755 -649110 2502801
10236B502801j738566l091119j61405J198956o49405j372740O51125J819111L74005
10227d67237p37033M12570J661218J011345n64270j826708k801359k745456n00477
10218f557407K319669K361553l28417j956468q02840M42961l17477j003666Q12462
10209e029630L419568L357276O72281j225606n62828N72058k29973j831251j140097
10200a998202J912474L403917O42605l593051m409903j267787J801285J947222
10192a561440K40749j381108k372091k122206J28958K709610K370145p18374k278592
10183d984349n8495K838809K896673R51035n16606j395142k234826j710612P78462
10174c435051K649997J714807j89359m97975l49225j921507l585009k087525J701519
$$ plain form
10236 2502801 764235 -2326884 -2488289 -1289333 -1938738 -3311478 -2660353 -841242 -467237
10227 -467237 -1204270 -791700 869518 1880863 1316593 -510115 -3311474 -6056930 -6557407
10218 -6557407 -4237738 -1876185 -2204602 -4161070 -4963910 -4520949 -4838426 -5842092 -5029630
10209 -5029630 -1610062 1747214 2419495 1193889 631061 1203119 973146 -858105 -1998202
10200 -1998202 -85728 3318189 3960794 367743 -4042160 -5309947 -3508662 -1561440
10192 -1561440 -1320691 -2701799 -5073890 -7196096 -7067138 -4357528 -1987383 -2705757 -4984349
10183 -4984349 -5042844 -2204035 692638 1643673 1127067 -268075 -2502901 -4213513 -3435051
10174 -3435051 -785054 929753 740394 242419 -106806 -2028313 -5613322 -7700847 -5999328
10165e999328L475936J519239j472454k491187j294533N46644J427913P06986
10157c580784n33414m27211Q71129R49757r62677k168290n69365J836878K055690
10148b528287M63396o77314r46974j043629l52746J523076K577935J090269j042481
10139i36755r89650M72471N80453o34996r49526k93641n25272j336590l79735
10130d993241K284180L470335J430696j701368k936981j724969N07995K282132
10122a381221K800583K063349Q41243p6305n71610p80652o65458m75601o65611
10113A088717r21975n54222j39729r12412k091508j283927J546782L250278K004672
10104A986676j33655q93051j047354j805040j860575Q0693K210481K125299O33942
$$ plain form
10165 -5999328 -2523392 -1004153 -2476607 -4967794 -6262327 -5715683 -4287770 -3580784
10157 -3580784 -4114198 -4541409 -3670280 -2720523 -3683200 -5851490 -6420855 -4583977 -2528287
10148 -2528287 -2064891 -2742205 -3689179 -4732808 -5085554 -3562478 -984543 105726 -936755
10139 -936755 -1926405 -1453934 -873481 -1508477 -2458003 -2751644 -3276916 -4613506 -4993241
10130 -4993241 -2709061 761274 2191970 490602 -2446379 -4171348 -3663353 -1381221
10122 -1381221 1419362 3482711 4323954 4247649 3676039 2895387 2229929 1754328 1088717
10113 1088717 166742 -387480 -527209 -1439621 -3531129 -4815056 -3268274 -17996 1986676
10104 1986676 1853021 959970 -87384 -1892424 -3752999 -3672306 -1461825 663474 1297416
10095A297416J84139R94115J429114R21548O5055j033813k340230k918467k140354
10086c541477p65305L65887J210081J365033K56890q52099N0422J847608J107733
10077A044773k057237l183967l82533K409017J658340p03624j510121j309483
10069d034835j629000j418206R0744Q68354L148Q6393K204342L120045J204713
10060D95698j6333J374953J207949k957425n563969j641360L825917L296557j202006
10051a180019k329728J9810K67334j473978j20912L429465K761574k173706l865574
10042d665734K69173L661725J649042j794217j958405n61862q99216j957770j470199
10033g727463k2758J224787K680052L638165J801598k190787m086573k171455
$$ plain form
10095 1297416 1481555 2475670 3904784 4826332 4891387 3857574 1517344 -1401123 -3541477
10086 -3541477 -4306782 -3940895 -2730814 -1365781 -1108891 -1960990 -1910568 -62960 1044773
10077 1044773 -1012464 -4196431 -4578964 -2169947 -511607 -1215231 -2725352 -4034835
10069 -4034835 -5663835 -7082041 -6991297 -6122943 -6119795 -6033402 -3829060 -709015 495698
10060 495698 479365 1854318 3062267 104842 -5459127 -7100487 -3274570 21987 -1180019
10051 -1180019 -3509747 -3489937 -3222603 -4696581 -4817493 -1388028 1373546 -800160 -4665734
10042 -4665734 -4396561 -734836 914206 -880011 -2838416 -3400278 -4299494 -6257264 -7727463
10033 -7727463 -7750221 -6525434 -3845382 -207217 1594381 -596406 -4682979 -6854434
10025f854434Q8781k06415j152515k1304K246451L134014K196902M99810j118927
10016a187637j751806p22829R03788J328119P08982M49957L12254p65448j722205
10007b446825p13215J355134K156752J743700J368766K61804k110932k797219
9999a182035L10103L151315Q24177l749415l681657Q48304L367921K035216J175517
9990C099446J999414R34180j871463j692000J350195J313859k663806l966646
9982a496821k55929K044153n47588j985759K185535N907030K232760n071584p335125
9973d323328l288217J462492L185211K147359m15839k300507q08120K698061K924394
9964A281506j145670l592718r96980J862287O42289j077243Q17539K753120K12276
$$ plain form
10025 -6854434 -6765653 -6972068 -8124583 -8145887 -5899436 -2765422 -568520 -68710 -1187637
10016 -1187637 -2939443 -3662272 -2758484 -1430365 -721383 -271426 40828 -724620 -2446825
10007 -2446825 -3160040 -1804906 351846 2095546 3464312 3726116 1615184 -1182035
9999 -1182035 -871932 2279383 3103560 -645855 -4327512 -3479208 -111287 1923929 3099446
9990 3099446 5098860 6033040 4161577 2469577 3819772 5133631 2469825 -1496821
9982 -1496821 -1752750 291403 -256185 -2241944 -56409 5850621 8083381 3011797 -4323328
9973 -4323328 -7611545 -6149053 -2963842 -816483 -1232322 -3532829 -4340949 -1642888 1281506
9964 1281506 135836 -3456882 -4453862 -2591575 -1949286 -3026529 -2208990 544130 756406
9955G56406l111049j434922K461579J760819k562450l628691l66717J624707K02388
9946d297930p14718Q81401J885747K15822j779578j665620j99101J007836J696866
9937b969275K051194K010311J581158L60323k032648l893348k469634J365796
9929c996123L105090J332204l0372J104692J060154k322649m337430j028076L143575
9920a968935K038668k128155k866813j6827J409295L83514J50350J090944O78093
9911a229866n65194P9749J624457P69341j683382k017408l10011J31429q20647
9902d021532l28707J404624J218758j148367k493920j287116Q44904K075569J532428
9893b203359p21059k271364l70155K395356L26718m675613l550758L771991M530417
$$ plain form
9955 756406 -2354643 -3789565 -1327986 432833 -2129617 -5758308 -6125025 -4500318 -4297930
9946 -4297930 -5012648 -4131247 -2245500 -2029678 -3809256 -5474876 -5673977 -4666141 -2969275
9937 -2969275 -918081 1092230 2673388 3033711 1001063 -2892285 -5361919 -3996123
9929 -3996123 -891033 441171 410799 1515491 2575645 252996 -4084434 -5112510 -1968935
9920 -1968935 69733 -2058422 -4925235 -4942062 -3532767 -3149253 -2998903 -1907959 -1229866
9911 -1229866 -1795060 -1715311 -90854 678487 -1004895 -3022303 -3332314 -3200885 -4021532
9902 -4021532 -4350239 -2945615 -1726857 -2875224 -5369144 -6656260 -5811356 -3735787 -2203359
9893 -2203359 -2924418 -5195782 -5565937 -3170581 -2843863 -7519476 -11070234 -7298243 -2767826
9884b767826n339023r359296M470164J9123277J0720931j2356052j8495277k8025
9876a4031127J5859537R194107n858799q086976n28307K070632m86026P77421
9868a089538M329251K523372k032663j315684K406410R27747m184012m544513
9860b979630k93923J098085j108642j039073J395011P70820k205722j496283K226611
9851c632746K197458j568825j826233K403961L640450m65148k755686N21792L048299
9842A563322k59344m536998l624409J35578J191924k8050L35301K143219K408324
9833f71133J092566O76253J650440K258525J480346k94533k223626l060469k036939
9824a128570o33007j071810k458457j596687J590883L260471J570041n80012n76088
$$ plain form
9884 -2767826 -8106849 -17466145 -12995981 6127296 16848227 4492175 -14003102 -14031127
9876 -14031127 1828410 11022517 5163718 -2923258 -3451565 -1380933 -1866959 -1089538
9868 -1089538 3239713 5763085 3730422 2414738 4821148 5748895 1564883 -2979630
9860 -2979630 -3273553 -2175468 -3284110 -4323183 -2928172 -2157352 -4363074 -5859357 -3632746
9851 -3632746 -1435288 -3004113 -4830346 -2426385 1214065 748917 -2006769 -1484977 1563322
9842 1563322 1303978 -3233020 -6857429 -6721851 -5529927 -5557977 -5222676 -3079457 -671133
9833 -671133 421433 1097686 2748126 5006651 6486997 6192464 3968838 908369 -1128570
9824 -1128570 -1761577 -2833387 -5291844 -6888531 -5297648 -2037177 -467136 -1047148 -1623236
9815a623236R8718n11868j098842J03889J824107K032918J220307P38808K78793
9806C063594n23860m80711N88227L46227k105489l438843p90773K997075K886080
9797B541527j023279l807909k758914j15354J320282J553959J492879P86693q40281
9788h50397k061292j309517J158818L303031K993585p3917l383213l332812N64266
9779b991448M097703L109134q75051k635481p25191P51621j072202l256322k115735
9770e712972M63571J17803k488524k467012J176968L674776K216432K95450J270114
9761a453394K351495j73199l340205j471326L966344N480754R05200l273849k078016
9752I13804R16453N00407j736739j225379J264523J225835j724191l448033k009434
$$ plain form
9815 -1623236 -1524518 -2036386 -3135228 -3031339 -1207232 825686 2045993 2784801 3063594
9806 3063594 2539734 2059023 2647250 2993477 887988 -2550855 -3341628 -344553 2541527
9797 2541527 1518248 -2289661 -5048575 -5163929 -3843647 -2289688 -796809 -10116 -850397
9788 -850397 -2911689 -4221206 -3062388 240643 3234228 3160311 -222902 -3555714 -2991448
9779 -2991448 1106255 4215389 3340338 704857 -20334 731287 -340915 -3597237 -5712972
9770 -5712972 -5249401 -5131598 -7620122 -10087134 -8910166 -5235390 -3018958 -2723508 -1453394
9761 -1453394 898101 724902 -2615303 -4086629 -120285 5360469 6265669 2991820 913804
9752 913804 1830257 2330664 593925 -631454 633069 1858904 134713 -3313320 -5322754
9743e322754L90499K001918L240876L615661J592160j696440k829005j217383
9735b24468J6482p13021j296466l03119N60412J70013J78739J202401P47515k043985
9725a705497l277523J02208M478760L992819q39597l775505j726267J610907J823602
9716F83907m93553k016457j844817j731615k428480k383500l82065K171230K786666
9707e638684J225270p5195O38893K031826J949888Q59529P53121J353332N29722
9698C627702j330669j061927J787386K969184k52139m181450l795848l64497O61486
9689a940772j845551l382090j241415J680648K095622J088778J096470J480404
9681i67906M48341q56482O2518K355864K422855n49319k941409j867627O87879
$$ plain form
9743 -5322754 -4932255 -2930337 310539 3926200 5518360 3821920 992915 -224468
9735 -224468 -207986 -921007 -2217473 -2520592 -1960180 -1790167 -1611428 -409027 338488 -1705497
9725 -1705497 -4983020 -4880812 -402052 3590767 2751170 -1024335 -2750602 -1139695 683907
9716 683907 190354 -1826103 -3670920 -5402535 -7831015 -10214515 -10596580 -8425350 -5638684
9707 -5638684 -4413414 -4488609 -3849716 -1817890 131998 991527 1744648 3097980 3627702
9698 3627702 2297033 1235106 3022492 5991676 5739537 1558087 -2237761 -2602258 -1940772
9689 -1940772 -3786323 -7168413 -8409828 -6729180 -4633558 -3544780 -2448310 -967906
9681 -967906 -519565 -1376047 -1313529 1042335 3465190 2915871 -25538 -1893165 -1205286
9672a205286J071345n23369p37012J262635K176037j71440k942814k236352J030892
9663b275364K535088R20335j023367j562347k202545l505547l027076J04123K452346
9654g584354J541153L74193K336652M598445K226536k951079m080567K93897M064512
9645H19388L013341J55156p20824q61364k243968k690275n3305K694852J763533
9636A876534r76855j097456R93841J258338p59485j592346l05002K24880j104976
9627a482527j903658j113792o72846r80600M14649L524093M100813K33519l391493
9618a271842j820946K673055L870682M19016l107816l090200o54656J407730J937111
9609C62134J070265m94924j162944L07326K562656K713545K07183k290719k456367
$$ plain form
9672 -1205286 -133941 -657310 -1394322 -131687 2044350 1872910 -1069904 -3306256 -2275364
9663 -2275364 259724 1180059 156692 -1405655 -3608200 -7113747 -10140823 -10036700 -7584354
9654 -7584354 -6043201 -5669008 -3332356 1266089 3492625 541546 -3539021 -3245124 819388
9645 819388 3832729 3987885 3267061 2405697 161729 -2528546 -2581851 113001 1876534
9636 1876534 899679 -197777 796064 2054402 1294917 -297429 -602431 -377551 -1482527
9627 -1482527 -3386185 -4499977 -5172823 -6153423 -5738774 -2214681 1886132 2119651 -1271842
9618 -1271842 -3092788 -419733 3450949 3869965 762149 -2328051 -2982707 -1574977 362134
9609 362134 1432399 937475 -225469 81857 2644513 5358058 5565241 3274522 818155
9600H18155q51046P26319J477439J298899R1077j411769j618819j53526J264246
9591A640975J114772K0409p19750j131217j655424j596596l44963Q76328N93645
9582a201821k86089K59795J795091J669089q33844l031941k440199J87567K431653
9573a450699K948141J536858j461990m179148l600866O54718M303261K921524
9565A671799k129034n167072l519942m02529K83655q48655n64094J778257L361201
9556e536414J939431j081937k239119j23899K739048K679726m50182k618758o46900
9547e339004L372225M707041K228329p07039j493968j214194j509818j732203
9539a688631r96963l82692q00228q48284P25211K254874J535857m76959j131864
$$ plain form
9600 818155 -32891 693428 2170867 3469766 3560843 2149074 530255 376729 1640975
9591 1640975 2755747 2776156 2056406 925189 -730235 -2326831 -2671794 -1795466 -1201821
9582 -1201821 -1487910 -1228115 566976 2236065 1402221 -1629720 -4069919 -3882352 -1450699
9573 -1450699 1497442 3034300 1572310 -2606838 -6207704 -5552986 -1249725 1671799
9565 1671799 -457235 -5624307 -9144249 -9546778 -9263123 -10111778 -10675872 -8897615 -5536414
9556 -5536414 -3596983 -4678920 -6918039 -7041938 -4302890 -1623164 -2073346 -4692104 -5339004
9547 -5339004 -1966779 2740262 4968591 4261552 2767584 1553390 43572 -1688631
9539 -1688631 -2685594 -3068286 -3868514 -4716798 -3991587 -1736713 -200856 -677815 -1809679
9530a809679j63855M58670k4407n95416p39001o60106K33937K358783L885272
9521B944198K499894q88513k957770k469095j233012o18518o9469O30284O58295
9512a503706L35678J081267K380998J697939j485410m212173l906815j330646
9504f942868J394913L265774L755447K273177k58153j547862j053807p74630j751989
9495a639998k307273j193720J78171M74463P71720K010837K586205R99091j125232
9486G54264j306682P1036P41584l5118j150107j519766o02969J478213K943732
9477A374187J538817j771619k906278m27586J832480N82415j688680r08052J971729
9468d02587K936131J366009j32658q25305j956609k790782j485602N75342K54500
$$ plain form
9530 -1809679 -1973534 -1514864 -1539271 -2134687 -2873688 -3533794 -3299857 -941074 2944198
9521 2944198 5444092 4555579 1597809 -871286 -2104298 -2722816 -2792285 -2162001 -1503706
9512 -1503706 -1168028 -86761 2294237 3992176 2506766 -1705407 -5612222 -6942868
9504 -6942868 -5547955 -2282181 1473266 3746443 3488290 1940428 886621 111991 -1639998
9495 -1639998 -3947271 -5140991 -4962820 -4488357 -3716637 -1705800 880405 1879496 754264
9486 754264 -552418 -481382 260202 225084 -925023 -2444789 -3047758 -1569545 1374187
9477 1374187 2913004 1141385 -1764893 -2192479 -359999 222416 -1466264 -2374316 -402587
9468 -402587 2533544 3899553 3766895 2941590 984981 -1805801 -3291403 -2716061 -2461561
9459b461561j636643j091550K283304M233904K524996k24965j601661k373245
9451c47421k720695o22019L277809M000728p06006n451240l860321K348884N591885
9442A511604K524071k387573l428587k91415K819656K607745p5566j845590r79272
9433D55073O07094K36351j521764j737147J92337J492885L94565j252752j204104
9424b337462q7902M64159O70270J316266J516390K20819j450883j733544r22951
9415b344838m08766j81650M78942R42360K02674r57612j036562k25932M04707
9406c126677J091269K284320K505960L47364k177606j813892O14542R87372j432209
9397g19557k310749R32832M484600L408784j205703m061839l021213q36507r8276
$$ plain form
9459 -2461561 -4098204 -5189754 -2906450 1327454 3852450 3627485 2025824 -347421
9451 -347421 -3068116 -3690135 -412326 3588402 2882396 -2568844 -6429165 -4080281 1511604
9442 1511604 4035675 1648102 -1780485 -2071900 747756 3355501 3279935 1434345 455073
9433 455073 1062167 1298518 -223246 -1960393 -1768056 -275171 119394 -1133358 -2337462
9424 -2337462 -2425364 -1961205 -1290935 25331 1541721 1762540 311657 -1421887 -2344838
9415 -2344838 -2753604 -2935254 -2456312 -1513952 -1311278 -2268890 -3305452 -3531384 -3126677
9406 -3126677 -2035408 248912 2754872 3102236 924630 -889262 -274720 712652 -719557
9397 -719557 -3030306 -2097474 2387126 5795910 4590207 528368 -2492845 -3329352 -3427628
9388c427628k29841m5903j8753o34642r31496k36095M85662M70441O18363J519763
9378b430129J741766J21271j676455j315299N24998J262204N12072J54735O04258
9369e00579K40388j150007j694336r91886r50477j813130r88083K106431L702165
9360b039514J258633j835733j068288K172448K940071N52228r14309L68859J358926
9351B793321n12655l385551l995042j805973J315623L390371L243616J030102
9343B073812j385047k122742j540304j170019r04788M30452K178241K385027J100026
9334A044658J74633j47892j224033k598596k211550l28484N66135L38611J437599
9325b948919L589496L005331j116823l939833j846457K022967K642441K48096
$$ plain form
9388 -3427628 -3657469 -3703372 -3722125 -4356767 -5288263 -5524358 -5038696 -4568255 -3949892 -2430129
9378 -2430129 -688363 -567092 -2243547 -3558846 -3033848 -1771644 -1259572 -1104837 -500579
9369 -500579 -260191 -1410198 -3104534 -4096420 -5046897 -6860027 -7848110 -5741679 -2039514
9360 -2039514 -780881 -2616614 -3684902 -1512454 1427617 1979845 1065536 1434395 2793321
9351 2793321 2280666 -1104885 -5099927 -6905900 -5590277 -2199906 1043710 2073812
9343 2073812 688765 -1433977 -2974281 -4144300 -5049088 -4618636 -2440395 -55368 1044658
9334 1044658 1219291 1071399 -152634 -2751230 -4962780 -5291264 -4725129 -4386518 -2948919
9325 -2948919 640577 3645908 2529085 -1410748 -3257205 -1234238 1408203 1656299
9317A656299j264663o36641M2604n15892j373969j371856k34498J444050J944655
9308c09911l6009k416470j228639L126840M802351O36923m368362l915670L84947
9299c324000J915401q15668k735062n80514K670370K890804L11417j690702q15815
9290b173769K257213M632037L656339q4320k869235k335652m58647j23696o83585
9281A816685J47925J722955J484513m43036j488544r85634o34788q41678k34144
9272E44254J045147J048721n45341j819155j836944j590019j439762n20432R48946
9263d164585J537816J146268J085370J472363J155477K18678j50552j44498q42379
9254A313958j566143q64023K90399j87298j414721q24911P79370J88216k015166
$$ plain form
9317 1656299 391636 -245005 -202401 -718293 -2092262 -3464118 -3698616 -2254566 -309911
9308 -309911 -345920 -2762390 -3991029 -864189 3938162 4575085 206723 -3708947 -3324000
9299 -3324000 -1408599 -2224267 -4959329 -5539843 -2869473 21331 332748 -1357954 -2173769
9290 -2173769 83444 4715481 8371820 8287500 5418265 3082613 2623966 2500270 1816685
9281 1816685 1964610 3687565 5172078 4729042 3240498 2254864 1620076 778398 544254
9272 544254 1589401 2638122 2092781 273626 -1563318 -3153337 -4593099 -5113531 -4164585
9263 -4164585 -2626769 -1480501 -395131 1077232 2232709 2451387 2300835 2156337 1313958
9254 1313958 -252185 -1116208 -825809 -1013107 -2427828 -3252739 -2473369 -2285153 -4300319
9245d300319j605660J853081L467867J089955q29684J106280L113124N59175l849362
9236F04457m000541J54062K977063J806907l36689p00949l72942p62819p00148
9227a331599Q94809K295183J290218j280469k410042q62237J351546J670415J48176
9218A766000r04033j39911J164884J234786L32052j70132k44467p77016j293453
9209I68710n31324Q11307N34905j400931k278393n79312J832049K578929J659252
9200C595192L29650q15375j435807j031366q2315J24487m33334n56165l12536
9191f17569r01602j653025n39277J517594R38390k315498l368709J06762L673819
9182c159115L054964P50391Q87273J656943p95797m086075k718739J963603K998064
$$ plain form
9245 -4300319 -5905979 -4052898 -585031 504924 -324760 781520 3894644 4453819 604457
9236 604457 -3396084 -3242022 -264959 1541948 1205259 504310 131368 -631451 -1331599
9227 -1331599 -436790 1858393 3148611 1868142 -541900 -1404137 -52591 1617824 1766000
9218 1766000 861967 722056 1886940 3121726 3453778 3283646 3039179 2262163 968710
9209 968710 437386 1248693 1783598 382667 -1895726 -2475038 -642989 1935940 3595192
9200 3595192 3924842 3109467 1673660 642294 559979 684466 251132 -305033 -617569
9191 -617569 -1519171 -3172196 -3711473 -2193879 -1255489 -3570987 -6939696 -6832934 -3159115
9182 -3159115 -104151 646240 1533513 3190456 2394659 -1691416 -4410155 -2446552 551512
9173E51512p30081k319451J688702N306905K650643k811029m010557p53088J625628
9164A199184J214226Q23962J416835L46640l004366m836509k348929J781126K843728
9155e64103J53120k583018k086114J088126L795784L717668J242208j431430k515379
9146H16862j840120k91551J127670J529919M70919j221409j775481n63219R16967
9137h29443J211247J061832J730341K140586K73737k810593l492552r88279R58740
9128g44384l48542k309502j304020J283943J408903o87268p22814K322812M070801
9119B969929J517603k319786l118791j194387L29395N49585N70178L10764q43853
9110a229363j506782O0679K462742K565086K8984k365840k582088r88451J187648
$$ plain form
9173 551512 -178569 -2498020 -809318 4497587 7148230 4337201 326644 -426444 1199184
9164 1199184 2413410 3237372 4654207 5000847 1996481 -2840028 -5188957 -3407831 -564103
9155 -564103 -410983 -2994001 -5080115 -3991989 -196205 3521463 4763671 3332241 816862
9146 816862 -1023258 -1314809 -187139 1342780 1813699 592290 -1183191 -1746410 -829443
9137 -829443 381804 1443636 3173977 5314563 5588300 2777707 -714845 -1703124 -744384
9128 -744384 -1092926 -3402428 -4706448 -3422505 -2013602 -2700870 -3423684 -1100872 2969929
9119 2969929 4487532 2167746 -951045 -2145432 -1816037 -1266452 -696274 -385510 -1229363
9110 -1229363 -2736145 -2675466 -212724 2352362 2381346 15506 -2566582 -3555033 -2367385
9101b367385K487579J255843k008907l443192m40187L599281L297639p24465k822161
9092a165955j077240N60475k83110q67732N71225J084088j163451k572642p5393
9083d989735K993911K128753p75350p86180J625250J665602j396484l028856r03995
9074c467084J824024J952389M68495l96616p17840j354285j577797m56225J091069
9065b633870J513967Q87816N15715R10429J284280Q34118j79359q08964o92848
9056A631284m88172n98885j63757J378984K319304N39736k669194l576325j482788
9047c109813J24801o83295j196083P40533K338540N66533k073542j388821J263263
9038c417884J156729j690800k514089K19271K659459K311628J440922J983962
$$ plain form
9101 -2367385 120194 1376037 -632870 -4076062 -4516249 -916968 2380671 1656206 -1165955
9092 -1165955 -2243195 -1682720 -1965830 -2833562 -2262337 -1178249 -2341700 -4914342 -4989735
9083 -4989735 -1995824 132929 -642421 -1428601 196649 1862251 465767 -2563089 -3467084
9074 -3467084 -1643060 309329 777824 381208 -336632 -1690917 -3268714 -3724939 -2633870
9065 -2633870 -1119903 -232087 283628 1194057 2478337 3312455 3133096 2324132 1631284
9056 1631284 1143112 544227 380470 1759454 4078758 4618494 1949300 -1627025 -3109813
9047 -3109813 -2985012 -3668307 -4864390 -4123857 -1785317 -1218784 -3292326 -4681147 -3417884
9038 -3417884 -2261155 -3951955 -6466044 -6246773 -3587314 -1275686 165236 2149198
9030B149198K055239R9685j652678r13394P09029N07293j033868j568746o51903
9021c00145L13948N14200J85714j76636J49301J440407K218739P61949j474774
9012C632703r45432K323833L696544O00162l364456l903612k180780j651154j766862
9003c559054K32346L143905K983283m5000j190825J308752L259363J087274k698564
8994D521480l477705j027368J122483J079513K22417J17933M15960J4520j278915
8985A710318k557155k602848j135974L43157r7477k014904k570472m73999J767471
8976g631883J509855J83541Q28031K592951J849856j122722j428343K577624N453346
8967D812256K450225k739894l277260K91788J234383k265957m260462r89187K942276
$$ plain form
9030 2149198 4204437 4304122 2651444 1738050 2447079 2954372 1920504 351758 -300145
9021 -300145 13803 528003 713717 537081 686382 2126789 4345528 5107477 3632703
9012 3632703 2687271 5011104 8707648 9307810 5943354 2039742 -141038 -1792192 -3559054
9003 -3559054 -3326708 -182803 2800480 2755480 1564655 2873407 6132770 7220044 4521480
8994 4521480 1043775 16407 1138890 2218403 2440820 2558753 2974713 2989233 1710318
8985 1710318 -846837 -3449685 -4585659 -4242502 -4339979 -6354883 -8925355 -9399354 -7631883
8976 -7631883 -6122028 -5938487 -5110456 -2517505 -667649 -1790371 -3218714 -641090 4812256
8967 4812256 7262481 4522587 1245327 1537115 2771498 505541 -3754921 -4744108 -1801832
8958a801832K160558j014204r69991J908915K368782r01415l472727k333511J82525
8949c872900Q72357J23744M4915Q93437J356936Q56688R2344l905P30548J288770
8939B382934M17422j431269k132681r57302M8156m94411o26734J295687K521641
8930A023443j86202l996279k876476K913327O087492K754393k038718k215161
8922A465819Q20463J824165J9503j360333j493009k523277m398499m076118n29694
8913a0250980L253481M356713L139211J379618j64126j099860o47426P53726Q40914
8904A561271j476798l674497k425675J536885L814524K164877m40279k59596J682596
8895B483308J452789j280590k473762k36102J863839M56135k114885j683691Q41502
$$ plain form
8958 -1801832 358726 -655478 -1625469 283446 2652228 1750813 -1721914 -4055425 -3872900
8949 -3872900 -3000543 -2876799 -2831884 -1938447 -581511 275177 367521 363616 1094164 2382934
8939 2382934 2800356 1369087 -763594 -1720896 -1672740 -2167151 -2793885 -1498198 1023443
8930 1023443 837241 -3159038 -6035514 -3122187 2965305 5719698 3680980 1465819
8922 1465819 2286282 4110447 4129950 2769617 1276608 -1246669 -5645168 -9721286 -10250980
8913 -10250980 -6997499 -2640786 498425 1878043 1713917 614057 -33369 720357 1561271
8904 1561271 84473 -3590024 -6015699 -4478814 -664290 1500587 1060308 800712 2483308
8895 2483308 3936097 2655507 181745 -54357 1809482 2265617 150732 -1532959 -691457
8886f91457J186464r90111j742825J75244J269068l94344j706818J95840L176542
8877D77603L655543J814588Q9700j034536k444654l474949k821615j219461l89404
8868e347185k42464L42110Q72428J8134j475825j185479J550698M415762M613767
8859C561946J587868k524494m428316k396827J680691L798907K178781q18618
8851B639938j769205j0389K247476K369368n74381m605819n662784j820777L216112
8842c970461L869494L39196j462315J133752L463927J218400k580233k782706
8834g70946m10274j01252j847475j547688J233825K297632P388k088084j215612
8825d442486O52497O92844n58849r81475j77792Q49899J447183J429892R27069
$$ plain form
8886 -691457 495007 -495104 -2237929 -2062685 -793617 -1187961 -2894779 -2698939 477603
8877 477603 4133146 5947734 6037434 5002898 2558244 -916705 -3738320 -4957781 -5347185
8868 -5347185 -5589649 -5247539 -4375111 -4356977 -5832802 -7018281 -5467583 -1051821 3561946
8859 3561946 5149814 2625320 -1802996 -4199823 -2519132 1279775 3458556 2639938
8851 2639938 870733 860344 3107820 5477188 4902807 296988 -5365796 -7186573 -3970461
8842 -3970461 -100967 238229 -1224086 -90334 3373593 4591993 2011760 -770946
8834 -770946 -1181220 -1282472 -3129947 -4677635 -3443810 -1146178 -1138790 -3226874 -4442486
8825 -4442486 -3789989 -3097145 -3655994 -4637469 -4815261 -3965362 -2518179 -1088287 -161218
8816a61218P38639J407302J847528O38833j423099k072445q05742O48932R68922
8807A787652L45845p30543j694803j380796M53244J655540K28036k270195k555425
8798d161445k57170K074028K895173K605216J377483o01518j550415l46774O00784
8789B635362j255539l556578k290085R87409J188382j440734j479533J875539
8781c335777K846045p35744k991953J60867L788253K033072k422274l265447m05862
8772d328820J550407J279149Q91698O76426m05212j066184M0739N87933j589799
8763b363663l441023j270126K218198J998648m67640M8350K721774K010891j706002
8754b50593k000014J978630L100390j567318n136684k142683K588813K433485
$$ plain form
8816 -161218 577421 1984723 3832251 4471084 3047985 975540 169798 818730 1787652
8807 1787652 2133497 1402954 -291849 -1672645 -1219401 436139 664175 -1606020 -4161445
8798 -4161445 -4418615 -2344587 550586 3155802 4533285 3931767 2381352 2034578 2635362
8789 2635362 1379823 -2176755 -4466840 -3479431 -2291049 -3731783 -5211316 -3335777
8781 -3335777 -489732 -1225476 -4217429 -4056562 -268309 1764763 -657511 -3922958 -4328820
8772 -4328820 -2778413 -1499264 -607566 68860 -336352 -1402536 -1361797 -773864 -2363663
8763 -2363663 -5804686 -7074812 -4856614 -2857966 -3325606 -3277256 -555482 1455409 -250593
8754 -250593 -2250607 -271977 2828413 1261095 -3875589 -6018272 -3429459 -995974
8746i95974l88716Q8439K960688K908781j675j039758K35880m93142l805830m675538
8736e206845o02485M169059M819070J964116p70052j718059j443629o57136K3737
8727E77776m7896n17351k94483N11427O28004p8137m00801j87047n36557j217166
8717a562231o19551J025242J390352R7355k10846J522825K454837N55473j569632
8708C083824q53726R21600K6743k806842l342797n35860K036367J680288k49563
8699c9966j389213j304781n20088N73405J039136J54181p71238r3083O50428j369393
8689c070612m481288l369332K531601O461644L462276k245475l401931J79399
8681c933718K781905J737272l88026j496685k306456k846944j552552J226693
$$ plain form
8746 -995974 -1384690 -1296251 1664437 4573218 4571543 3531785 3767665 3274523 -531307 -5206845
8736 -5206845 -5809330 -1640271 3178799 5142915 4372863 2654804 1211175 554039 577776
8727 577776 529880 12529 -281954 229473 857477 779340 378539 191492 -345065 -1562231
8717 -1562231 -2181782 -1156540 233812 331167 120321 1643146 4097983 4653456 3083824
8708 3083824 2230098 3151698 3178441 371599 -2971198 -3507058 -1470691 209597 -39966
8699 -39966 -1429179 -2733960 -3254048 -2680643 -1641507 -1487326 -2258564 -2351647 -1701219 -3070612
8689 -3070612 -7551900 -10921232 -8389631 -1927987 1534289 -711186 -4113117 -3933718
8681 -3933718 -1151813 585459 197433 -1299252 -3605708 -6452652 -8005204 -6778511
8673f778511K805899K129965P39062n29615k045876k438882L43052M261775M376208
8664B863077L59305k198398l79961J325997j458288n454827m721273J55022L416281
8655f093065K776098J227361R76757P53501m48952j305841r02734l03808l64141
8646c684824m42631l744M75879M90788k06031j796930l092888j381592L602421
8637f039552O977550L983105k691614n447641j930252K230525K069769l52945
8629a201055p99438M78228O82721k25876l28583L07325L87983M73048J517870
8620A292223J742521r26057m116669l187770J679730M879631K976414r62728k439855
8611I37440j529999j186384k025935j978810p1394K181794K995977K069525K37472
$$ plain form
8673 -6778511 -3972612 -1842647 -1103585 -1633200 -3679076 -6117958 -5774906 -1513131 2863077
8664 2863077 3222382 1023984 644023 1970020 511732 -4943095 -9664368 -9509346 -6093065
8655 -6093065 -3316967 -2089606 -1112849 -359348 -808300 -2114141 -3016875 -3320683 -3684824
8646 -3684824 -4127455 -4131199 -3655320 -3164532 -3370563 -5167493 -8260381 -9641973 -6039552
8637 -6039552 937998 4921103 2229489 -3218152 -5148404 -2917879 -848110 -1201055
8629 -1201055 -2000493 -1522265 -839544 -1065420 -1394003 -1086678 -698695 -225647 1292223
8620 1292223 3034744 2108687 -2007982 -5195752 -3516022 1363609 4340023 3377295 937440
8611 937440 -592559 -1778943 -3804878 -5783688 -5855082 -3673288 -677311 1392214 1629686
8602A629686j244749j300647p0095R98838J033815R48727J607760J907145N68106
8593F078586j104852q31041O38047J57503k663297m142442j864885J544028K321521
8584A33168Q78338J85123N49939k88549k397498k832187l30643K398321K548672
8575H44684R10397k8775K58444N14544J93541k01313n64630j214859j719139j096023
8565b103129P11016K423059K612262R76111j360077k653605k106868p16944k6491
8556b244666k14490l66196l37706q13449j495753j110628L78183J530330J966965
8547b707410K831524L765492K219686k241137n537815l917238N83370K801246
8539b202282J478426N8603P50977J564398K68946j782049j768451M05740K065367
$$ plain form
8602 1629686 384937 -915710 -985805 13033 1046848 1995575 3603335 5510480 6078586
8593 6078586 4973734 4142693 4780740 4938243 2274946 -1867496 -3732381 -2188353 133168
8584 133168 1011506 1196629 1746568 1458019 -939479 -3771666 -4102309 -1703988 844684
8575 844684 1755081 1726306 1984750 2499294 2692835 2491522 1926892 712033 -1007106 -2103129
8565 -2103129 -1392113 1030946 3643208 4619319 3259242 605637 -1501231 -2218175 -2244666
8556 -2244666 -2459156 -2825352 -3163058 -3976507 -5472260 -6582888 -6204705 -4674375 -2707410
8547 -2707410 124114 3889606 6109292 3868155 -1669660 -5586898 -5003528 -2202282
8539 -2202282 -723856 -665253 85724 1650122 1919068 137019 -1631432 -1225692 839675
8530H39675J367792n33308j189989J840J160063O62091m72349m01108K3363j725014
8520b66944m890589m948875j00640M911319M719059O36369j865252j175308l74718
8511c355579q57581k99701K248695L891548K353146n97934k134152j975331j253595
8502a980484k99153O73511Q25195K32632K51426J087378J095110k83668j205277
8493C96670n43330p14j223412k808775k318804J43674K285825K532168J139201
8484c97497o06001j205571k6662J657415J889593O81432j74742j18060l62298
8475A337609j048159o78623P10446Q64412p92259j622526j5738J741370J093525
8466A590057q53489j445043l06385J224883K420915K811666J593416o89125k023349
$$ plain form
8530 839675 2207467 1674159 484170 486010 1646073 2308164 1835815 1434707 1458070 -266944
8520 -266944 -5157533 -10106408 -10207048 -5295729 -576670 59699 -1805553 -2980861 -3355579
8511 -3355579 -4213160 -4512861 -2264166 1627382 3980528 3382594 1248442 -726889 -1980484
8502 -1980484 -2279637 -1606126 -780931 -548299 -296873 790505 1885615 1601947 396670
8493 396670 -146660 -147374 -1370786 -4179561 -6498365 -6354691 -4068866 -1536698 -397497
8484 -397497 -1003498 -2209069 -2235731 -578316 1311277 1992709 1817967 1699907 1337609
8475 1337609 289450 -389173 321273 1185685 393426 -1229100 -1244838 496532 1590057
8466 1590057 736568 -708475 -1014860 210023 2630938 5442604 7036020 6346895 4323546
8457D323546k005907k326587k894341j315180J865006K143287j597567l750239
8449e557982l71844L961034L252710m09269j140084P10320N32048j250229l35425
8440f08721K417011J887525j553322j980151J547708L111770M40129j362387N10398
8431D409960J624002q72888k496182J48770K324339r84977n932717n580927o13746
8422g974366K663852K064158O88263L82139P9250m41830j99268M32832P00211
8413a604759J500866K992538K623312n99320k919088j483180K24731j744004l955514
8404d964418q85679M469552M003727k111855m770236k39384L939739J183672l940912
8395c315794l508915J648933M371425K251019l78705k64575P52177R308j879829
$$ plain form
8457 4323546 2317639 -8948 -2903289 -4218469 -2353463 -210176 -1807743 -5557982
8449 -5557982 -5929826 -1968792 1283918 874649 -265435 444885 976933 -273296 -608721
8440 -608721 1808290 3695815 2142493 162342 1710050 4821820 5261949 3899562 4409960
8431 4409960 6033962 5161074 2664892 2813662 5138001 4153024 -1779693 -7360620 -7974366
8422 -7974366 -5310514 -3246356 -2558093 -2175954 -2096704 -2538534 -2737802 -2304970 -1604759
8413 -1604759 -103893 2888645 5511957 4912637 1993549 510369 735100 -1008904 -4964418
8404 -4964418 -5850097 -1380545 2623182 511327 -4258909 -4498293 -558554 625118 -3315794
8395 -3315794 -6824709 -5175776 -804351 1446668 1067963 803388 1555565 1564873 -314956
8386c14956k524286j032481J245128K199259R32870j203186j920096o66854R25827
8377b358775J553772J653075J673038Q36024j093467k483303j906543k50794Q05921
8368a571052J169821J492127J225915l24284j837615j284283P64895J499689k4610
8359A110603j350058k95578J663497J567234n00542j439588J80337J878889J066817
8350C881611q70662p31781J321363J930577K2150j364946j57444J140877m40160
8341D731585l223262l381053q94291Q62757O92155O40454J430438R95517j253214
8332F01086k416985m59230K221194K041724p25275k565365j464339R48025J785073
8323c4092K03115j800898j611131Q80133K869643K102172j67180j154425n42100
$$ plain form
8386 -314956 -2839242 -3871723 -2626595 -427336 505534 -697652 -2617748 -3284602 -2358775
8377 -2358775 -805003 848072 2521110 3357134 2263667 -219636 -2126179 -2376973 -1571052
8368 -1571052 -401231 1090896 2316811 1992527 154912 -1129371 -364476 1135213 1110603
8359 1110603 -239455 -535033 1128464 2695698 2195156 755568 935905 2814794 3881611
8350 3881611 3010949 2279168 3600531 5531108 5553258 4188312 4030868 5171745 4731585
8341 4731585 1508323 -1872730 -2767021 -1904264 -1212109 -571655 858783 1854300 601086
8332 601086 -1815899 -2275129 -53935 1987789 1262514 -1302851 -2767190 -1819165 -34092
8323 -34092 169023 -1631875 -3243006 -2362873 506770 2608942 2441762 1287337 745237
8314G45237k67427r65977j387980j217529j510914k068837j384706L21130J144395
8305f592608J120426K264093M098715L236361p78121l360111j413462J757230
8297C32523J577573q96719j373789N85775J331052r52116l899653m363966j464310
8288i123630L194239O161969M256089j485080n393890l485252J294135L127399
8280a454021J027022j127769r39246K85423J141350J821465K027309Q51297q36937
8271B795893j050917P6328P13115P26667J237359J168764j544632n114757m929036
8262e921216n17775L049754K466207M84445N45059J338287P1453k218557k506327
8253c208670p35413P07206J025419J295860J741766J561007P57683j30928j261611
$$ plain form
8314 745237 477810 -488167 -1876147 -3093676 -4604590 -6673427 -8058133 -7737003 -6592608
8305 -6592608 -5472182 -3208089 890626 4126987 3348866 -11245 -1424707 332523
8297 332523 1910096 1013377 -360412 225363 1556415 604299 -3295354 -7659320 -9123630
8288 -9123630 -5929391 232578 4488667 3003587 -2390303 -5875555 -4581420 -1454021
8280 -1454021 -426999 -1554768 -2494014 -2208591 -1067241 754224 2781533 3632830 2795893
8271 2795893 1744976 1821304 2534419 3261086 4498445 5667209 4122577 -992180 -5921216
8262 -5921216 -6438991 -3389237 -923030 -438585 106474 1444761 1516214 -702343 -3208670
8253 -3208670 -3944083 -3236877 -2211458 -915598 826168 2387175 3144858 3013930 1752319
8244A752319k457287k261803k69893J081613j86767j844214l87738L043075L662523
8235B131828K92797k424149p81709K444799K151228j523400l441275r05286K659633
8226F04466K723942k75669k246141j373546K11328M95084J30093j16271j406342
8217a253056m040538n069904j975466K688499L970775J305123j053579m08127
8209e836273J370111J907008J596385J387267Q03254L0722P68191K860049L176920
8200H063634L44640k366920j784608K82839K48695j571197k262507j407657q52118
8191a305199p12891L06250J496679J051459k48229k53722K59266j077696k965714
8182c449797j600217K399079L675494M35831k290391n36496K408457J731409j102938
$$ plain form
8244 1752319 -704968 -2966771 -3236664 -2155051 -2341818 -4186032 -4573770 -1530695 2131828
8235 2131828 2424625 476 -781233 1663566 3814794 2291394 -1149881 -2055167 604466
8226 604466 3328408 3052739 806598 -566948 -355620 139464 269557 153286 -1253056
8217 -1253056 -5293594 -10363498 -12338964 -9650465 -5679690 -4374567 -5428146 -5836273
8209 -5836273 -4466162 -2559154 -962769 424498 1227752 1258474 2026665 4886714 8063634
8200 8063634 8408274 6041354 4256746 4539585 4788280 3217083 954576 -453081 -1305199
8191 -1305199 -2018090 -1711840 -215161 836298 588069 334347 593613 -484083 -3449797
8182 -3449797 -5050014 -2650935 1024559 1460390 -830001 -1366497 1041960 2773369 1670431
8173A670431j404558O39389O31958k310578m034972k032189J039571J892178R48408
8164b960362L72816O69070J142208J521582J371178j59417k293062k280194Q58756
8155a757425L905901L148195o31966l306366k750988n38818J191127J806014J153267
8146B218941o84967k078084j019966J473782J824759r81403l456385k564559J19993
8137e147889J592849K040351K984510L125461L85575l105872k908572P70541K718270
8128B455224M06292k343040j415986J625236K443488J12635k524965l028026j467273
8119c736415M85933Q89700q52829k633002j617751J565799L117014J643613K43293
8110h94645J151390J963013J86627j920874j123930R93179O93154j457669j826731
$$ plain form
8173 1670431 265873 905262 1537220 -773358 -4808330 -6840519 -5800948 -3908770 -2960362
8164 -2960362 -2587546 -1918476 -776268 745314 2116492 1957075 -335987 -2616181 -1757425
8155 -1757425 2148476 5296671 4664705 1358339 -1392649 -1931467 -740340 1065674 2218941
8146 2218941 1533974 -544110 -1564076 -90294 1734465 753062 -2703323 -5267882 -5147889
8137 -5147889 -3555040 -1514689 1469821 4595282 4980857 1874985 -1033587 -263046 2455224
8128 2455224 2861516 518476 -897510 727726 3171214 3283849 758884 -2269142 -3736415
8119 -3736415 -3250482 -2360782 -3213611 -5846613 -7464364 -5898565 -2781551 -1137938 -894645
8110 -894645 256745 2219758 2406385 485511 -638419 354760 1047914 -409755 -2236486
8101b236486j69072L28022j020049j488656j33549Q86798O67171O99004J086261
8092a380556K02184j170547k10143K390875K417472p16307k275791p6004J615642
8083G96825m23794k493129m67664K585184J345119k691498l757003j271840J80253
8074f197547n76488R9209K913994L409819k91849l540440k330251N02102M20726
8065e590725j347638m90926K648411L459969O39946j696775m87509J890349J784218
8056H09320l62637j627716j470930j616800k031415o96197K183589L261536J028183
8047e23067j256598k95397J894601J060722k153214k772548M52789K412947o20872
8038a800637m681494l438609K578400O601076M759724L23584j829010j295130
$$ plain form
8101 -2236486 -2405558 -2077536 -3097585 -4586241 -4719790 -3832992 -3165821 -2466817 -1380556
8092 -1380556 -1178372 -2348919 -2559062 -168187 2249285 1532978 -742813 -818817 796825
8083 796825 373031 -2120098 -2587762 -2578 1342541 -1348957 -5105960 -6377800 -6197547
8074 -6197547 -6774035 -6674826 -3760832 -351013 -642862 -4183302 -6513553 -6011451 -5590725
8065 -5590725 -6938363 -7429289 -4780878 -1320909 -680963 -2377738 -2865247 -974898 809320
8056 809320 446683 -1181033 -2651963 -4268763 -6300178 -6996375 -4812786 -1551250 -523067
8047 -523067 -1779665 -2075062 -180461 880261 -1272953 -4045501 -3592712 -1179765 -1800637
8038 -1800637 -6482131 -9920740 -7342340 -741264 4018460 4342044 2513034 1217904
8030A217904r07420j919745k783958j786533Q21481L153704L366565J307682j160021
8021A309659j982987j150278k68483L5422P70610K165479K469119O07479j487565
8012B468455j354776Q8124k25801k439605k953034J58713L672609L463314K31607
8003C109606j972390j716378j133178j227614k99649J896646K375098l18720k786261
7994b072840j417903K004521K926474N82054j843927k464410k064245q83148J578333
7985c655091L466224J857512j987693l140596k51473K216087J182199k30689J507045
7976I63525L815398J992328k932206n421834l368335j51416J019618P28965Q19982
7967b533975J527525K003396J504863k74658k333031k326314M65157K969498J858880
$$ plain form
8030 1217904 310484 -1609261 -4393219 -6179752 -5358271 -2204567 1161998 2469680 1309659
8021 1309659 -673328 -1823606 -2092089 -2056667 -1286057 879422 3348541 3956020 2468455
8012 2468455 1113679 1201803 976002 -1463603 -4416637 -4257924 -585315 2877999 3109606
8003 3109606 1137216 -579162 -1712340 -2939954 -3239603 -1342957 1032141 713421 -2072840
7994 -2072840 -3490743 -1486222 1440252 2022306 178379 -2286031 -4350276 -5233424 -3655091
7985 -3655091 -188867 1668645 -319048 -3459644 -3711117 -1495030 -312831 -543520 963525
7976 963525 4778923 6771251 3839045 -1582789 -4951124 -5102540 -4082922 -3353957 -2533975
7967 -2533975 -1006450 996946 2501809 2227151 -105880 -2432194 -1967037 1002461 2861341
7958B861341j428050k430854j51905J817872J040653o02869o59721L32057P41192
7949A519716N27399J52220q54159k348258k653747j086682M27633J22619r58381
7940e151640r62449j32467L83531R25453K044591K288684J74710k530597k623938
7931e584122k66909J180387M02122k7767J824231L814869K870216m75472l055854
7922F81701l369757k542534j618350k96746J453594K515824K067608O66175n87220
7913a029705r67945j02797J631612K496999R01440j895579k514401K120K366921
7904H88665J476818j235981k241688j065117N8979N39532J674709K804874J411394
7895D312185k027128l327912o35427K463670K374467O80613N57901R41613j228705
$$ plain form
7958 2861341 1433291 -997563 -1149468 668404 1709057 1106188 446467 778524 1519716
7949 1519716 2047115 2199335 1345176 -1003082 -3656829 -4743511 -4315878 -4193259 -5151640
7940 -5151640 -6114089 -6246556 -5863025 -4937572 -2892981 -604297 -429587 -2960184 -5584122
7931 -5584122 -5851031 -4670644 -4268522 -4296289 -2472058 1342811 4213027 3737555 681701
7922 681701 -2688056 -5230590 -6848940 -7145686 -5692092 -3176268 -1108660 -442485 -1029705
7913 -1029705 -1997650 -2100447 -468835 2028164 2929604 1034025 -1480376 -1478256 888665
7904 888665 2365483 1129502 -1112186 -2177303 -2118324 -1578792 95917 2900791 4312185
7895 4312185 2285057 -1042855 -1678282 785388 3159855 3840468 4398369 5339982 4111277
7886D111277m593590m326306L05040L944647K354526j840351k981890K05855L604671
7877G83879L279233j08462k719683k096931N02083K097402J494011O3579o39274
7868B655837p01464q48014r54061o04295k12653m33787j024005j196422o23537
7859c942401M77844J545718J623418K39051j351878j317378M0662P31811N83473
7850a369680J459172L084196K324849j287228l206316m31329L115875K216565
7842E906104j544346k657276o50776o9828k194569l089488o83680J931374J972464
7833a080021Q48697N24921K23878r78310j793217j130762K6551P65214J404340
$$ plain form
7886 4111277 -482313 -4808619 -4503579 -558932 1795594 -44757 -3026647 -2820792 783879
7877 783879 4063112 3954650 1234967 -861964 -359881 1737521 3231532 3295111 2655837
7868 2655837 1954373 1106359 152298 -451997 -664650 -1098437 -2122442 -3318864 -3942401
7859 -3942401 -3464557 -1918839 -295421 -56370 -1408248 -2725626 -2684964 -1953153 -1369680
7850 -1369680 89492 3173688 5498537 4211309 1004993 573664 3689539 5906104
7842 5906104 4361758 1704482 1053706 983878 -1210691 -4300179 -4983859 -3052485 -1080021
7833 -1080021 -231324 293597 517475 -460835 -2254052 -3384814 -3358263 -2593049 -1188709
$$ [...]
##END NTUPLES=NMR SPECTRUM
##END=
