##TITLE=31Pdec_SR39H_1_1 rep
 , 124 sc
 5.04.2021
##JCAMPDX= 6.0         $$ Bruker NMR JCAMP-DX V2.0
##DATA TYPE= NMR SPECTRUM
##DATA CLASS= NTUPLES
##ORIGIN= UXNMR, Bruker Analytische Messtechnik GmbH
##OWNER= root
$$ XWIN-NMR		Version 3.5
$$ Mon Apr  5 13:14:12 2021 Russian Standard Time (UT+4h)  she@DPX200
##.OBSERVE FREQUENCY= 81.013821
##.OBSERVE NUCLEUS= ^31P
##.ACQUISITION MODE= SIMULTANEOUS
##.ACQUISITION SCHEME= undefined
##.AVERAGES= 124
##.DIGITISER RES= 16
##SPECTROMETER/DATA SYSTEM= spect
##.PULSE SEQUENCE= zgpg30
##.SOLVENT NAME= DMSO
##.SHIFT REFERENCE= (INTERNAL, DMSO, 0, 248.564)
##AUDIT TRAIL= $$ (NUMBER, WHEN, WHO, WHERE, WHAT)
$$ ##TITLE= Audit trail, XWIN-NMR		Version 3.5
$$ ##JCAMPDX= 5.01
$$ ##ORIGIN= Bruker BioSpin GmbH
$$ ##OWNER= she
$$ F:/spectra/data/she/nmr/P31/1/pdata/1/auditp.txt
$$ ##AUDIT TRAIL=  $$ (NUMBER, WHEN, WHO, WHERE, WHAT)
(   1,<2021-04-05 13:07:25.40 +0400>,<she>,<DPX200>,
      <continue with go, POWCHK disabled, PULCHK disabled
       configuration hash MD5:
       00 E9 B6 7A A2 85 ED C7 34 08 36 98 17 FE 4E 26
       data hash MD5: 32K
       36 34 05 E8 BB EE 6A 9C D3 92 D9 51 94 C9 35 B2>)
(   2,<2021-04-05 13:13:11.81 +0400>,<she>,<DPX200>,
      <Start of raw data processing
       efp BC_mod = 2 LB = 1 FT_mod = 6 PKNL = 1 PHC0 = -4911.695 PHC1 = 983.2018 SI = 64K 
       data hash MD5: 64K
       6C 06 18 21 39 CE A3 C1 D7 E4 E4 A7 C8 24 5F C6>)
(   3,<2021-04-05 13:13:34.54 +0400>,<she>,<DPX200>,
      <pk PHC0 = -10.69306 PHC1 = 11 
       data hash MD5: 64K
       8B B5 67 5D DA 21 63 90 8F BA 4B CD 9B 64 B2 C5>)
(   4,<2021-04-05 13:13:38.20 +0400>,<she>,<DPX200>,
      <abs ABSG = 5 
       data hash MD5: 64K
       39 67 72 FD 15 4A F1 6F E5 60 5A 3D A5 AC 37 43>)
$$ ##END=
$$ 
$$ hash MD5
$$ 6A AF 29 77 DD F2 EF 1A 8C 66 98 5F 61 9F 9A 9F
##$RELAX= 
##$RELAX= 
##$RELAX= 
##$RELAX= 
##$RELAX= 
##$RELAX= 
##$RELAX= 
##$RELAX= 
$$ Bruker specific parameters
$$ --------------------------
##$DU= <F:/spectra>
##$EXPNO= 1
##$NAME= <P31>
##$PROCNO= 1
##$TYPE= <nmr>
##$USER= <she>
##$AMP= (0..31)
100 100 100 100 100 100 100 100 100 100 100 100 100 100 100 100 100 100 
100 100 100 100 100 100 100 100 100 100 100 100 100 100 
##$AQSEQ= 0
##$AQ_mod= 1
##$AUNM= <au_zg>
##$AUTOPOS= <>
##$BF1= 81.014009
##$BF2= 200.13
##$BF3= 200.13
##$BF4= 200.13
##$BF5= 200.13
##$BF6= 200.13
##$BF7= 200.13
##$BF8= 200.13
##$BYTORDA= 1
##$CFDGTYP= 0
##$CFRGTYP= 5
##$CHEMSTR= <none>
##$CNST= (0..31)
1 1 145 1 1 1 1 1 1 1 1 1 1 1 1 1 1 1 1 1 1 1 1 1 1 1 1 1 1 1 1 1 
##$CPDPRG= <waltz16>
##$CPDPRG1= <>
##$CPDPRG2= <waltz16>
##$CPDPRG3= <>
##$CPDPRG4= <mlev>
##$CPDPRG5= <mlev>
##$CPDPRG6= <mlev>
##$CPDPRG7= <mlev>
##$CPDPRG8= <mlev>
##$CPDPRGB= <>
##$CPDPRGT= <>
##$D= (0..31)
0 1 0 0 0 0 0 0 0 0 0 0.03 2e-05 3e-06 0 0 0 0 0 0 0 0 0 0 0 0 0 0 0 0 
0 0 
##$DATE= 1617613420
##$DBL= (0..7)
120 120 120 11 120 120 24 19 
##$DBP= (0..7)
150 150 150 150 150 150 150 150 
##$DBP07= 0
##$DBPNAM0= <>
##$DBPNAM1= <>
##$DBPNAM2= <>
$$ [...]
##$SUBNAM3= <"">
##$SUBNAM4= <"">
##$SUBNAM5= <"">
##$SUBNAM6= <"">
##$SUBNAM7= <"">
##$SUBNAM8= <"">
##$SUBNAM9= <"">
##$SW= 501.771253377433
##$SWIBOX= (0..15)
0 1 3 0 0 0 0 0 0 0 0 0 0 0 0 0 
##$SW_h= 40650.406504065
##$TD= 32768
##$TD0= 1
##$TE= 0
##$TE2= 300
##$TE3= 300
##$TEG= 300
##$TL= (0..7)
0 120 53 12 22 120 120 120 
##$TP= (0..7)
150 150 150 150 150 150 150 150 
##$TP07= 0
##$TPNAME0= <>
##$TPNAME1= <>
##$TPNAME2= <>
##$TPNAME3= <>
##$TPNAME4= <>
##$TPNAME5= <>
##$TPNAME6= <>
##$TPNAME7= <>
##$TPOAL= (0..7)
0.5 0.5 0.5 0.5 0.5 0.5 0.5 0.5 
##$TPOFFS= (0..7)
0 0 0 0 0 0 0 0 
##$TUNHIN= 0
##$TUNHOUT= 0
##$TUNXOUT= 0
##$USERA1= <user>
##$USERA2= <user>
##$USERA3= <user>
##$USERA4= <user>
##$USERA5= <user>
##$V9= 5
##$VALIST= <valist>
##$VCLIST= <CCCCCCCCCCCCCCC>
##$VD= 0
##$VDLIST= <DDDDDDDDDDDDDDD>
##$VPLIST= <PPPPPPPPPPPPPPP>
##$VTLIST= <TTTTTTTTTTTTTTT>
##$WBST= 1024
##$WBSW= 4
##$XGAIN= (0..3)
0 0 0 0 
##$XL= 0
##$YL= 0
##$YMAX_a= 7258
##$YMIN_a= -11280
##$ZGOPTNS= <>
##$ZL1= 120
##$ZL2= 120
##$ZL3= 120
##$ZL4= 120
##$ABSF1= 248.5645
##$ABSF2= -253.2056
##$ABSG= 5
##$ABSL= 3
##$ALPHA= 0
##$AQORDER= 0
##$ASSFAC= 0
##$ASSFACI= 0
##$ASSFACX= 0
##$ASSWID= 0
##$AUNMP= <proc_1d>
##$AZFE= 0.1
##$AZFW= 0.5
##$BCFW= 0
##$BC_mod= 2
##$BYTORDP= 0
##$COROFFS= 0
##$CY= -3
##$DATMOD= 1
##$DC= 0
##$DFILT= <>
##$DTYPP= 0
##$F1P= 0
##$F2P= 0
##$FCOR= 1
##$FTSIZE= 65536
##$FT_mod= 6
##$GAMMA= 0
##$GB= 0
##$INTBC= 1
##$INTSCL= 5.30512e-09
##$ISEN= 30
##$LB= 1
##$LEV0= 0
##$LPBIN= 0
##$MAXI= 10000
##$MC2= 0
##$MEAN= 0
##$ME_mod= 0
##$MI= 50
##$NCOEF= 0
##$NC_proc= -5
##$NLEV= 6
##$NOISF1= 182.463
##$NOISF2= 159.3651
##$NSP= 0
##$NTH_PI= 0
##$NZP= 0
##$OFFSET= 248.5645
##$PC= 4
##$PHC0= -4922.388
##$PHC1= 994.2018
##$PH_mod= 1
##$PKNL= yes
##$PPARMOD= 0
##$PSCAL= 0
##$PSIGN= 0
##$REVERSE= no
##$SF= 81.014009
##$SI= 65536
##$SIGF1= 159.3651
##$SIGF2= -187.1042
##$SINO= 113.3802
##$SIOLD= 16384
##$SREGLST= <1H.CDCl3>
##$SSB= 0
##$STSI= 65536
##$STSR= 0
##$SW_p= 40650.406504065
##$SYMM= 0
##$S_DEV= 0
##$TDeff= 32768
##$TDoff= 0
##$TI= <>
##$TILT= no
##$TM1= 0
##$TM2= 0
##$TOPLEV= 0
##$USERP1= <user>
##$USERP2= <user>
##$USERP3= <user>
##$USERP4= <user>
##$USERP5= <user>
##$WDW= 1
##$XDIM= 65536
##$YMAX_p= 332770188
##$YMIN_p= -23607597
$$ End of Bruker specific parameters
$$ ---------------------------------
##NTUPLES= NMR SPECTRUM
##VAR_NAME=  FREQUENCY,     SPECTRUM/REAL,   SPECTRUM/IMAG
##SYMBOL=    X,             R,               I
##VAR_TYPE=  INDEPENDENT,   DEPENDENT,       DEPENDENT
##VAR_FORM=  AFFN,          ASDF,            ASDF
##VAR_DIM=   65536,         65536,           65536
##UNITS=     HZ,            ARBITRARY UNITS, ARBITRARY UNITS
##FACTOR=    0.620285442955139, 1,           1
##FIRST=     20137.2065510759, 0,            0
##LAST=      -20513.1999529892, 0,           0
##MIN=       -20513.1999529892, -23607597,   0
##MAX=       20137.2065510759, 332770188,    0
$$ Real data points
##PAGE= N=1
##DATA TABLE= (X++(R..R)), XYDATA
$$ [...]
##PAGE= N=2
##DATA TABLE= (X++(I..I)), XYDATA
13099f0685n091861j460015L818020M828296Q14942l096277k770272J99370J662736
$$ -60685 -5152546 -6612561 -2794541 2033755 2848697 -247580 -3017852 -2818482 -1155746
13090a155746O57298k27802M96222R44465o48540k400233j286250J922284L396911
$$ -1155746 -498448 -726250 -230028 714437 65897 -2334336 -3620586 -1698302 1698609
13081A698609J861635M4254k14097n70211k148957k674659n33637J598234Q87368
$$ 1698609 3560244 3604498 3390401 2820190 671233 -2003426 -2537063 -938829 -51461
13072e1461o88539J43401J785603L29439l116375l491378p7876K146735N24476
$$ -51461 -740000 -596599 1189004 1518443 -1597932 -5089310 -5167186 -3020451 -2495975
13063b495975j529208q76124M39458k43621j167251L34315K564630K078147m46542
$$ -2495975 -4025183 -4901307 -4461849 -4705470 -5872721 -5538406 -2973776 -895629 -1342171
13054a342171j195643Q12281K509374J520646q43107j856980o65360J276695J974643
$$ -1342171 -2537814 -1725533 783841 2304487 1461380 -395600 -1060960 215735 2190378
13045B190378Q88226m62283l10958R04073J143146q6052j158774j386001k031883
$$ 2190378 3078604 2616321 2305363 3209436 4352582 4266530 3107756 1721755 -310128
13036c10128l106367k141090J600210M457758L041546n31105j590444L81863J796896
$$ -310128 -3416495 -5557585 -3957375 500383 3541929 3010824 1420380 1802243 3599139
13027C599139Q21880p82768j524017j944833k034615n85687J764813K178868j47370
$$ 3599139 4421019 3638251 2114234 169401 -1865214 -2450901 -686088 1492780 1345410
13018A345410k211261j415240Q53415J720053Q22669k16699o61933q86087q55540
$$ 1345410 -865851 -2281091 -1427676 292377 1115046 898347 236414 -649673 -1505213
13009a505213l33042J29471k6584k19038L37311J211482J444137R51499J89741
$$ -1505213 -1838255 -1708784 -1735368 -1954406 -1617095 -405613 1038524 1990023 2179764
13000B179764p39622j566607j414815j65062O80338o7989j302315j075347O62387
$$ 2179764 1440142 -126465 -1541280 -1706342 -1026004 -1093993 -2396308 -3471655 -2809268
12991b809268K301120K856659K428953J121539o55871j451895m35963O80690k58829
$$ -2809268 -508148 2348511 4777464 5899003 5243132 3791237 3355274 4035964 3777135
12982C777135k127238j678592J293707L054482J289614j560730k153287q50042
$$ 3777135 1649897 -28695 1265012 4319494 5609108 4048378 1895091 1045049
12974A045049o8881j53487J39288M70508m40439j668240r97604R51506R59297
$$ 1045049 976168 822681 961969 1432477 992038 -676202 -1673806 -722300 236997
12965B36997j601906l165705j281717J459784J427999m00854j78711K570169M113180
$$ 236997 -1364909 -4530614 -5812331 -4352547 -2924548 -3325402 -3504113 -933944 3179236
12956C179236K083581j384179l116120k765333j692070l32480J189672J580840
$$ 3179236 5262817 3878638 762518 -2002815 -3694885 -4027365 -2837693 -1256853
12948a256853O2454j485579p20013J345368J551235l62277j077306R96308K875314
$$ -1256853 -1194399 -2679978 -3399991 -2054623 -503388 -865665 -1942971 -946663 1928651
12939A928651J500957j475168k242952m65257R01632N71727K52099R30326J191399
$$ 1928651 3429608 1954440 -288512 -753769 147863 719590 971689 1902015 3093414
12930C093414J61436p76762o11422n38894j461777j891532m91758J088345M21671
$$ 3093414 3254850 2478088 1866666 1327772 -134005 -2025537 -2517295 -1428950 -1007279
12921a007279j816973k710404j239988P82946J677884J608074J281282Q85918
$$ -1007279 -2824252 -5534656 -6774644 -5991698 -4313814 -2705740 -1424458 -538540
12913e38540O24791P54840Q30653J63039r47035j596916j613151j216154n441
$$ -538540 86251 841091 1671744 1834783 887748 -709168 -2322319 -3538473 -3543914
12904c543914J952046K740672P31221k245733k706340o12483N19409p26214j505935
$$ -3543914 -1591868 1148804 1880025 -365708 -3072048 -3684531 -3165122 -3891336 -5397271
12895e397271J05219J418763l75752k905634j813730K310201M514704K740263
$$ -5397271 -5292052 -3873289 -4249041 -7154675 -8968405 -6658204 -2143500 596763
12887E96763L62848O05512K021358J468708j049982k997025l198552k570886j569299
$$ 596763 959611 1565123 3586481 5055189 4005207 1008182 -2190370 -4761256 -6330555
12878f330555N29185L302346M218400J521148k809852m683192k580076P88644
$$ -6330555 -5801370 -2499024 1719376 3240524 430672 -4252520 -6832596 -6043952
12870f043952K099070J348657Q93112J562354J771180M38472j264939j781417
$$ -6043952 -3944882 -2596225 -1703113 -140759 1630421 2068893 803954 -977463
12862i77463j157168k73635N18338J012323O99698j77505l38679N71248R27583
$$ -977463 -2134631 -2408266 -1889928 -877605 -177907 -355412 -694091 -122843 804740
12853H04740n81950k696046l122629j441326R42876K720629L086174J518511r81953
$$ 804740 222790 -2473256 -5595885 -7037211 -6094335 -3373706 -287532 1230979 249026
12844B49026j777153J9005J425916k47429k493479q43065L505928M184405j074265
$$ 249026 -1528127 -1509122 -83206 -330635 -2824114 -3667179 -161251 4023154 2948889
12835B948889o391763n626595m52923K952531K389656O74903L4814o2301L0150
$$ 2948889 -3442874 -9069469 -9522392 -6569861 -4180205 -3505302 -3470488 -3532789 -3502639
12826c502639J070917K394582J891206n04962k154157j566620k57318L90490J271570
$$ -3502639 -2431722 -37140 1854066 1349104 -805053 -2371673 -2628991 -2238501 -966931
12817i66931K799317K804548l8147k801766j841943J359410J822184j378447l285762
$$ -966931 1832386 4636934 4598787 1797021 -44922 1314488 3136672 1758225 -1527537
12808a527537l74650L894851L840750m37273l553059k485561J14126Q14393J21995
$$ -1527537 -1902187 1992664 5833414 5396141 1843082 -642479 -528353 286040 408035
12799D08035M88377K067530K913693K132858N56680j070471k520941l065511k063436
$$ 408035 896412 2963942 5877635 8010493 8567173 7496702 4975761 1910250 -153186
12790a53186n86881n30134j770214k018935j13628K208931K713152J410835j40115
$$ -153186 -740067 -1270201 -3040415 -5059350 -5172978 -2964047 -250895 1159940 1019825
12781A019825j047140j375993j204376o70807l04625k16649L36392J537401K091026
$$ 1019825 -27315 -1403308 -2607684 -3278491 -3583116 -3799765 -3463373 -1925972 165054
12772A65054J083875j66332J21555J301586J260515j86474j258857j456975k070020
$$ 165054 1248929 1082597 1204152 2505738 3766253 3579779 2320922 863947 -1206073
12763a206073k980228k032186J062731L116814J855581o03653j182204m14638
$$ -1206073 -4186301 -6218487 -5155756 -2038942 -183361 -787014 -1969218 -2383856
12755b383856m79779p37977Q05059K891274K356133l12778j400768k48752k23282
$$ -2383856 -2863635 -3601612 -2796553 94721 2450854 2138076 737308 488556 265274
12746B65274k287176k760876J53816K559520J109616j215731n8017K944618K845264
$$ 265274 -2021902 -4782778 -4628962 -2069442 -959826 -2175557 -2233574 711044 3556308
12737C556308o95470l309448k595612k61283J626118K272164Q64369k127531l300493
$$ 3556308 2860838 -448610 -3044222 -3305505 -1679387 592777 1457146 -670385 -3970878
12728c970878m21752K902657J722934k101598k257515J829724L950774J141244
$$ -3970878 -4392630 -1489973 232961 -1868637 -4126152 -2296428 1654346 2795590
12720B795590k218402k316432j088187o26738Q68169L749788L915773j79135l306597
$$ 2795590 577188 -1739244 -2827431 -3454169 -2586000 1163788 5079561 4900426 1593829
12711A593829j461830J377604K54655k277736j409477Q63275l11978l168244k127034
$$ 1593829 131999 1509603 1764258 -513478 -1922955 -1059680 -1371658 -4539902 -6666936
12702f666936K131457L751422J679045L72296R45326k02709l332555l877231o20556
$$ -6666936 -4535479 -784057 894988 1267284 2212610 2009901 -1322654 -5199885 -5820441
12693e820441J786512N95544j124267n28101Q96664J393721J631254J466762n39522
$$ -5820441 -4033929 -3438385 -4562652 -5090753 -4194089 -2800368 -1169114 297648 -241874
12684b41874k798958j676236J711458K110078p44582r93202K729618L743843j244248
$$ -241874 -3040832 -4717068 -3005610 -895532 -1640114 -2633316 96302 3840145 2595897
12675B595897n285726j990113L917070M312219J81733j763627n28063k92647j497491
$$ 2595897 -2689829 -4679942 -762872 3549347 3731080 1967453 1439390 1146743 -350748
12666c50748j035938M57353k94662j878927N5367M070317L917172j141015m601220
$$ -350748 -1386686 -929333 -1223995 -3102922 -3047555 1022762 4939934 3798919 -802301
12657h02301k842224J13075K42921o01865L75628J686745R67527o46556j067742
$$ -802301 -3644525 -3531450 -3288529 -3890394 -3514766 -1828021 -860494 -1507050 -2574792
12648b574792p66271o99647R8935J938889K460174K71906j966067j218729J310501
$$ -2574792 -3341063 -4040710 -3941775 -2002886 457288 729194 -1236873 -2455602 -1145101
12639a145101K352494J570141J149348J641686J517846L98239k98738j27521m67543
$$ -1145101 1207393 2777534 3926882 5568568 7086414 7484653 7185915 7058394 6590851
12630F590851j912468k875565j956930k43642K81646j47552N32031K516423K900433
$$ 6590851 4678383 1802818 -154112 -397754 -116108 -263660 268371 2784794 5685227
12621E685227k85294m260631m341348k73117L208548K730564J91162j010771o34023
$$ 5685227 5399933 1139302 -3202046 -3475163 -266615 2463949 2655111 1644340 1010317
12612A010317l26014l61883l00248o46043j169163N4356K916631L363891q09268
$$ 1010317 684303 322420 22172 -623871 -1793034 -1738678 1177953 4541844 3732576
12603C732576m912387l258557J816309K899438j326429m415423k214952J889257
$$ 3732576 -1179811 -4438368 -2622059 277379 -1049050 -5464473 -7679425 -5790168
12595e790168L493805K879690J633955q19943l957132m330935q78844K085151
$$ -5790168 -2296363 583327 2217282 1397339 -2559793 -6890728 -7769572 -5684421
12587e684421J107964r63367M7816K765950L086075J044608j57352N3772j53518
$$ -5684421 -4576457 -5539824 -5492008 -2726058 360017 1404625 1247273 1301045 1147527
12578A147527m37171R99220K820111J623669k340091m892879l776520r43337J288966
$$ 1147527 710356 1709576 4529687 6153356 3813265 -1079614 -4856134 -5799471 -4510505
12569d510505K511180K231372k64058k966482k043514K510260N577070L498971
$$ -4510505 -1999325 232047 -32011 -2998493 -5042007 -2531747 3045323 6544294
12561F544294r72870k837940j465130n1816k05540m75697J79553N87207k68996
$$ 6544294 5571424 2733484 1268354 1216538 1010998 535301 714854 1302061 1033065
12552A033065j223677n38730J497956K759671J849985l18176j736438j606702
$$ 1033065 -190612 -729342 768614 3528285 5378270 5060094 3323656 1716954
12544A716954q55127m72893k49441L59270R40007O77124k82364j093436j521364
$$ 1716954 861827 388934 139493 498763 1438770 2115894 1833530 740094 -781270
12535g81270j812397j529644k4972J829830K053276L24014j154830n46535J122389
$$ -781270 -2593667 -4123311 -4148283 -2318453 -265177 58837 -1095993 -1642528 -520139
12526e20139J607671N70828m83052p25556o70450m78617M83957J890667K005357
$$ -520139 1087532 1658360 1175308 449752 -220698 -699315 -215358 1675309 3680666
12517C680666J18185j842147j615990K12611J000804k08197j423298o12375J502854
$$ 3680666 3798851 1956704 340714 553325 1554129 1345932 -77366 -689741 813113
12508H13113K421519Q93923j764583l055441j664334J215536K929501K210355
$$ 813113 3234632 4128555 2363972 -691469 -2355803 -1140267 1789234 3999589
12500C999589N74217p2163m10614k211436m240384k927958J790133M723359K105186
$$ 3999589 4573806 4501643 4091029 1879593 -2360791 -5288749 -3498616 1224743 3329929
12491C329929k674044l492781J30253L055132K078544o71950k087042j940722
$$ 3329929 655885 -2836896 -2706643 348489 2427033 1755083 -331959 -2272681
12483b272681j380214p41033k25391l28803m92358N55062K387769K982710J708812
$$ -2272681 -3652895 -4393928 -4619319 -4948122 -5440480 -4885418 -2497649 485061 2193873
12474B193873q1395j599824k971011l020126l40730K956076K775765n37661j886985
$$ 2193873 2112478 512654 -2458357 -5478483 -5819213 -2863137 -87372 -625033 -2512018
12465b512018O48698K537828K96845k786065k470776m29522k16270m87998J657219
$$ -2512018 -1863320 674508 971353 -1814712 -4285488 -4715010 -4931280 -5419278 -3762059
12456c762059L788851J540092l015479l631259J31609K379832O93269o86655J003480
$$ -3762059 26792 1566884 -1448595 -5079854 -4948245 -2568413 -1875144 -2561799 -1558319
12447a558319K481564P18877j942981k260027r76888n1171Q38546J904041J348318
$$ -1558319 923245 1642122 -300859 -2560886 -3537774 -3588945 -2750399 -846358 501960
12438E01960r17809j479094J204753L289365J266145k182335k370788J57363J224696
$$ 501960 -415849 -1894943 -690190 2599175 3865320 1682985 -687803 -530440 694256
12429F94256k32230j642104j609940q99631L23110K132254K672525L95172k329307
$$ 694256 462026 -1180078 -2790018 -3689649 -3366539 -1234285 1438240 1833412 -495895
12420d95895j871318J040798K433829J217986j13294m86366j231541k013245p94437
$$ -495895 -2367213 -1326415 1107414 2325400 2212106 1725740 494199 -1519046 -2313483
12411b313483J424117R75006j964629k451838J356742M491595K603404j419387
$$ -2313483 -889366 85640 -1878989 -4330827 -2974085 1517510 4120914 2701527
12403B701527k384227n76802J94706m59132J62116K054899K274002K34142j327149
$$ 2701527 317300 -259502 -64796 -523928 -361812 1693087 3967089 4201231 2874082
12394B874082j074146p88010j628372k208856j444966k83568N48158J800853L477064
$$ 2874082 1799936 1011926 -616446 -2825302 -4270268 -4553836 -4005678 -2204825 1272239
12385A272239L816956J919585o52715k134750k520325k184427p01588J490890
$$ 1272239 5089195 7008780 6356065 4221315 1700990 -483437 -1185025 305865
12377C05865K293886P12333j138897p64811J139423J776925R6056k224795l124515
$$ 305865 2599751 3312084 2173187 1408376 2547799 4324724 4420780 2195985 -928530
12368i28530k049965L4034J393405Q89988n28096o94694O11225J054951l68667
$$ -928530 -2978495 -2944461 -1551056 -661068 -1189164 -1883858 -1272633 -217682 -586349
12359e86349j068168J038747L206188J379752l030030m348322q74680K644264
$$ -586349 -1654517 -615770 2590418 3970170 940140 -3408182 -4282862 -1638598
12351a638598K296652L55716M76368J373558l14949l199217k492442K025547M510090
$$ -1638598 658054 1013770 1490138 2863696 2548747 -650470 -3142912 -1117365 3392725
12342C392725J227796l770606m103496L56705L863777K707394q02139k591418
$$ 3392725 4620521 849915 -3253581 -2896876 966901 3674295 2872156 280738
12334B80738j931607p25684O6462Q80194J394069M78749j482731k285400p69331
$$ 280738 -1650869 -2376553 -2310091 -1429897 -35828 442921 -1039810 -3325210 -4094541
12325d094541J469473K238634J433149M23014j57339n01446k65969J042593K439812
$$ -4094541 -2625068 -386434 1046715 1469729 1312390 810944 544975 1587568 4027380
12316D027380K026789l42656k359170j962426J95530J698867J132120p10589j964281
$$ 4027380 6054169 5711513 3352343 1389917 1585447 3284314 4416434 3705845 1741564
12307A741564j600679l90720o819r01196j443666O5461K792902L898500J839731
$$ 1741564 140885 -249835 -256654 -1157850 -2601516 -2536055 256847 4155347 5995078
12298E995078j763449l845853k852254L3212J968799R92241j775524k971033j006477
$$ 5995078 4231629 385776 -2466478 -2433266 -464467 527774 -1247750 -4218783 -5225260
12289e225260J673050J966847O11163N92165J775241R20000k391052m021068j491378
$$ -5225260 -3552210 -1585363 -974200 -382035 1393206 2313206 -77846 -4098914 -5590292
12280e590292J820748J741500n23694j041085L97230Q85049N8191L60338J940423
$$ -5590292 -3769544 -2028044 -2551738 -3592823 -3195593 -2310544 -2252353 -1892015 48408
12271D8408J995787o1752j124308M23220J856176N37449k014005k884374j935762
$$ 48408 2044195 1982443 858135 1281355 3137531 3674980 1660975 -1223399 -3159161
12262c159161o77312O85771K228499K296699k06993k791712k057629J143302K616325
$$ -3159161 -3836473 -3150702 -922203 1374496 1167503 -1624209 -3681838 -2538536 77789
12253G7789R48954p02387J47366J519132M07214k327781l155055r30374J740579
$$ 77789 1026743 324356 471722 1990854 2398068 70287 -3084768 -4015142 -2274563
12244b274563K149716N44296r55381j106508m00375J04102K7562j20233L11334
$$ -2274563 -124847 419449 -535932 -1642440 -2042815 -1938713 -1911151 -2031384 -1720050
12235a720050J102847J076235n04313k562573l066776j507941L27082O08812l13175
$$ -1720050 -617203 459032 -45281 -2607854 -5674630 -7182571 -6855489 -6246677 -6559852
12226f559852p85057k31358N63972J155151J893714K592883K292079R69858J68219
$$ -6559852 -7344909 -7576267 -7012295 -5857144 -3963430 -1370547 921532 1891390 2059609
12217B059609R75772K378209K619955J436591m6243r28786j039135n22115n9895
$$ 2059609 3035381 5413590 8033545 9470136 9423893 8495107 7455972 6933857 6873962
12208F873962q35671k943466m353982k986020M07498K870112K649195O18063j436819
$$ 6873962 6038291 3094825 -1259157 -4245177 -3837679 -967567 1681628 2299691 862872
12199H62872k292563j253375J280224K978735J575571j662086k811909o73774
$$ 862872 -1429691 -2683066 -1402842 1575893 3151464 1489378 -1322531 -1996305
12191a996305J359653N56379q43134M37657K761595J835498k010367l662076j054116
$$ -1996305 -636652 -80273 -923407 -485750 2275845 4111343 2100976 -1561100 -2615216
12182b615216J582263N23747j587755l65978K880037L075384n62249l316202k103933
$$ -2615216 -1032953 -509206 -2096961 -2462939 417098 3492482 2930233 -385969 -2489902
12173b489902O20718J456457P13982K99835L5291j119081k305976k096332j100551
$$ -2489902 -1869184 -412727 301255 601090 636381 -482700 -2788676 -4885008 -5985559
12164e985559n95881J39284K265105M217807L350776L27592j387558n41342O13748
$$ -5985559 -6581440 -6442156 -4177051 40756 3391532 3719124 2331566 1790224 2403972
12155B403972N48542O50435J908483K491193P48764j635990j933792m31706J13963
$$ 2403972 2952514 3602949 5511432 8002625 8751389 7115399 5181607 4749901 4863864
12146D863864j501009l349352k880846J3351K656670K277914p00247k729160j492804
$$ 4863864 3362855 13503 -2867343 -2853992 -197322 2080592 1380345 -1348815 -2841619
12137b841619R21727J250350J89656Q44272K625087J450186k989161n275388k159124
$$ -2841619 -1919892 -669542 -479886 364386 2989473 4439659 1450498 -3824890 -5984014
12128e984014K243655K781866O63187Q69N41667o33021k606906j880491J032122
$$ -5984014 -3740359 -958493 -295306 -294437 247230 -385791 -2992697 -4873188 -3841066
12119c841066K119981O79960M4281J298369J688321P1814j166915p79149l99814
$$ -3841066 -1721085 -1041125 -996844 301525 1989846 2061660 894745 115596 -284218
12110b84218m39073Q63455K844165K047513j513892k960800j52209K412154P81590
$$ -284218 -723291 140164 2984329 5031842 3517950 557150 404941 2817095 3598685
12101C598685k162070j896003M86321J138956J71156J99107P88574j94446j506499
$$ 3598685 1436615 -459388 26933 1165889 1337045 1536152 2324726 2130280 623781
12092F23781l20967J968100J220933k401609m051808j377499K467555L844647
$$ 623781 302814 2270914 3491847 1090238 -2961570 -4339069 -1871514 1973133
12084A973133K667742N82227j124261r51182J692962L837340J435175m060996
$$ 1973133 4640875 5223102 4098841 3147659 4840621 8677961 10113136 6052140
12076F052140n887608j201688L902089K361745l809150o146122j226716N215990
$$ 6052140 164532 -1037156 2864933 5226678 1417528 -4728594 -5955310 -739320
12068g39320O341821K416916j142139j360821k70138n37091j577679j271515L37027
$$ -739320 5602501 8019417 6877278 5516457 5246319 4709228 3131549 1860034 2197061
12059B197061J188150M54233n39442p90687q61767r89790k45092J115710P98025
$$ 2197061 3385211 3839444 3300002 2509315 1647548 657758 412666 1528376 2326401
12050B326401j884349l593340j203422K949179L655158J96446k695875j744504
$$ 2326401 442052 -3151288 -4354710 -1405531 2249627 2446073 -249802 -1994306
12042a994306P53834J223885l3992m17191N18329R96062L00081m78970p01314
$$ -1994306 -1240472 -16587 -50579 -467770 50559 1046621 1346702 867732 166418
12033A66418j057201j896886k226597j051225J064176K427013K047176O70645
$$ 166418 -890783 -2787669 -5014266 -6065491 -5001315 -2574302 -527126 143519
12025A43519j63453O4243M20123k1231r68943j589222j610088j082423O3954J260498
$$ 143519 -19934 44309 464432 443201 -525742 -2114964 -3725052 -4807475 -4743521 -3483023
12015c483023J136035m68143j334500L69724K990223L402678J607449M94946J070685
$$ -3483023 -2346988 -2815131 -4149631 -3779907 -789684 2612994 4220443 4715389 5786074
12006E786074J156270m17434j704780j343262j149831k540896l140820l71093
$$ 5786074 6942344 6524910 4820130 3476868 2327037 -213859 -3354679 -3725772
11998c725772L425831L456883m68098l306546j847932J134886J498431l36596
$$ -3725772 -299941 3156942 2688844 -617702 -2465634 -1330748 167683 -168913
11990a68913p83882J052629K077220J9418k979576l123089m0704K755120K358059
$$ -168913 -952795 99834 2177054 2196472 -783104 -3906193 -3946897 -1191777 1166282
11981A166282k44768j961094j350331M90388J903182K147582J278232q5511q51678
$$ 1166282 921514 -1039580 -2389911 -1899523 3659 2151241 3429473 3343962 2492284
11972B492284m18451M12035M26371k34005l89095K69550Q65693Q46859M16483
$$ 2492284 2073833 2485868 2912239 2678234 2289139 2558689 3424382 4271241 4687724
11963D687724m58156j833971k549177j145133J534959K688754J300041m13824
$$ 4687724 4229568 2395597 -153580 -1298713 236246 2925000 4225041 3811217
11955C811217l88370L78266j59038j751234k387058j241133N28233J407828Q52083
$$ 3811217 3422847 3801113 3642075 1890841 -496217 -1737350 -1209117 198711 1050794
11946A050794m80152j148201l96399N17381j39426j524125r68615J549228K599872
$$ 1050794 570642 -577559 -973958 -456577 -596003 -2120128 -3088743 -1539515 1060357
11937A060357N33300j615646r75106M59256m89701k370279j470110J635336K859082
$$ 1060357 1593657 -21989 -997095 -537839 -1027540 -3397819 -4867929 -3232593 -373511
11928c73511J298343J29642O68025O19088p73872q69362J240745K431315R15299
$$ -373511 924832 1054474 1722499 2341587 1567715 698353 1939098 4370413 5285712
11919E285712m07468Q41669J910294m84233m116809m419257j566489L18415j82033
$$ 5285712 4878244 5719913 7630207 7145974 3029165 -1390092 -2956581 -2638166 -2820199
11910b820199n93779L87434J132191P59360N69677R41772L69029j264854j734452
$$ -2820199 -3413978 -3026544 -1894353 -1134993 -565316 376456 745485 -519369 -2253821
11901b253821k30241R52439K05603p17914N8746J166091N16952p85043k04026
$$ -2253821 -2484062 -1531623 -1326020 -2043934 -1985188 -819097 -302145 -1087188 -1291214
11892a291214J716458J944685j16384j504657k73511J564391J290399l39955m86869
$$ -1291214 425244 2369929 2253545 748888 475377 2039768 3330167 2990212 2503343
11883B503343J099509J377225j521559n157867n583977k238910J627569L065931
$$ 2503343 3602852 4980077 3458518 -1699349 -7283326 -9522236 -7894667 -4828736
11875d828736K216100Q30124j22142n11005l34525k21872j274052k941082k526960
$$ -4828736 -2612636 -1782512 -1904654 -2415659 -2750184 -2972056 -4246108 -7187190 -9714150
11866i714150J153510M949560M918854J843774l2618N23907M16703j887352l309357
$$ -9714150 -8560640 -3611080 1307774 3151548 3118930 3642837 4059540 2172188 -1137169
11857a137169j240161J807283J811113q86854k671565j959231j08127J734560
$$ -1137169 -2377330 -570047 1241066 354212 -2317353 -4276584 -4384711 -2650151
11849b650151L319256L608229J747701o50517j313198r76951j959479l493066
$$ -2650151 669105 4277334 6025035 5374518 4061320 3084369 1124890 -2368176
11841b368176k478036Q31310K259595J28340j934880p43993J669000J875329M28137
$$ -2368176 -4846212 -4014902 -1755307 -1626967 -3561847 -4305840 -2636840 -761511 -333374
11832c33374k1049M78518O4548q35600j59881J698990J999003j06120k283204
$$ -333374 -354423 124095 188643 -646957 -806838 892152 2891155 2785035 501831
11823E01831k237524j6956K828858M325432K717223j545102m735067l447340O73255
$$ 501831 -1735693 -1752649 1076209 5401641 8118864 6573762 1838695 -1608645 -935390
11814i35390K553222L94675k150406j397560J654565L608336L216756J537067
$$ -935390 1617832 2012507 -137899 -1535459 119106 3727442 6944198 8481265
11806H481265o54124l113848m666962l867560j215838R35684J092198J84905j66
$$ 8481265 7827141 4713293 46331 -3821229 -5037067 -4101383 -3009185 -2824280 -2824446
11797b824446P94110J198886L42612p49551n20506Q13336J529214J038212O83109
$$ -2824446 -2030336 -831450 -488838 -1238389 -1758895 -945559 583655 1621867 2304976
11788B304976J227912J344746j3869j479913j486907j000464j497722j738258
$$ 2304976 3532888 4877634 4863765 3383852 1896945 896481 -601241 -2339499
11780b339499J43725K446003J873530o84839j004943J330711J753073j563734
$$ -2339499 -2195774 250229 2123759 1438920 433977 1764688 3517761 1954027
11772A954027l983521j668484K039350J978834o63339q94990J633691K484050
$$ 1954027 -2029494 -3697978 -1658628 320206 -343133 -1238123 395568 2879618
11764B879618j3441k477485k147465j92539J474692K564137K577271N42210k104096
$$ 2879618 2866177 388692 -1758773 -1951312 -476620 2087517 4664788 5206998 3102902
11755C102902k112755N09829J713377l67837k186668n39266K020440J321654j588365
$$ 3102902 990147 1499976 3213353 2845516 658848 119582 2140022 3461676 1873311
11746A873311k287660j57054J057766l69873j745589q17102Q93179J223633O05204
$$ 1873311 -414349 -571403 486363 116490 -1629099 -2446201 -1553022 -329389 275815
11737B75815K18035l01515j096341n90554J533702K183771q10797l957122k112850
$$ 275815 493850 192335 -904006 -1494560 39142 2222913 1412116 -2545006 -4657856
11728d657856L360642N477615J568849k769985k198328O58156K82358k641371
$$ -4657856 -1297214 4180401 5749250 2979265 780937 1439093 1721451 -919920
11720i19920k986489j95774R13309j410716k808775k06807L085974K899939O06147
$$ -919920 -3906409 -4102183 -3188874 -4599590 -7408365 -7615172 -4529198 -1629259 -1023112
11711a023112O5037J250331J176680p04011k090047j785247o02911Q72404K310283
$$ -1023112 -958075 292256 1468936 764925 -1325122 -3110369 -3713280 -2840876 -530593
11702e30593K312362K31429j537324m17190J946691J786170p75507j867707j68300
$$ -530593 1781769 2013198 475874 58684 2005375 3791545 3016038 1148331 980031
11693I80031J198875M6684j614804j422150l12967j95280p26211o19641q30M97142
$$ 980031 2178906 2225590 610786 -811364 -1124331 -1319611 -2045822 -2665463 -2666293 -2169151
11683b169151J082966J578030P90925j219552k223158r23007Q66026R01752m24352
$$ -2169151 -1086185 491845 1282770 63218 -2159940 -3082947 -2216921 -1315169 -1739521
11674a739521j448466j758805j469811N2932K502622L461260J430280j419693
$$ -1739521 -3187987 -4946792 -6416603 -6363671 -3861049 -399789 1030491 -389202
11666c89202k037584o96161J99797J98580O50716J343859O38793j127081j550743
$$ -389202 -2426786 -3122947 -2923150 -2724570 -2073854 -729995 -91202 -1218283 -2769026
11657b769026j1347J170225L93480p12874J67338K556201L748293K195134p69168
$$ -2769026 -2780373 -1610148 -1216668 -1929542 -1762204 793997 4542290 6737424 5968256
11648E968256k515674j920615l02681N34357O09998J050751J462449J22127k665485
$$ 5968256 3452582 1531967 1229286 1763643 2373641 3424392 4886841 5008968 2343483
11639B343483l864167j895759O81628P83410q73704j532499o73559L97025J637542
$$ 2343483 -1520684 -3416443 -2734815 -1951405 -2825109 -4357608 -5031167 -4634142 -2996600
11630b996600L477170M104978J513296k231307k914826n42193M78903j616161
$$ -2996600 480570 4585548 6098844 3867537 952711 410518 889421 -726740
11622g26740l048413n57023L422588M400266J929778q32125j844629j731319j638148
$$ -726740 -3775153 -4332176 -909588 3490678 5420456 4588331 2743702 1012383 -625765
11613f25765j791173j804079j151363J81430J069596M16834q47966p27990O57450
$$ -625765 -2416938 -4221017 -5372380 -5190950 -4121354 -3704520 -4552486 -5280476 -4623026
11604d623026J224084O48001Q37659J767516O69753k602206l518973L54332M169887
$$ -4623026 -3398942 -2750941 -1913282 -145766 523987 -2078219 -5597192 -5242860 -1072973
11595a072973K138682l450694n062558o29518M213051M719849K406216O02695
$$ -1072973 1065709 -2384985 -7447543 -8077061 -3864010 855839 3262055 3864750
11587C864750l53062j228075j306974m33382m30439j799300j885425Q10882L230058
$$ 3864750 3511688 2283613 976639 543257 112818 -1686482 -3571907 -2761025 469033
11578D69033K054631q55062j297196N14381N19038k193775l551672q26933L024379
$$ 469033 2523664 1668602 371406 885787 1404825 -788950 -4340622 -5167555 -2143176
11569b143176L519619N43750k297790k584198j045038N01669J122991Q38093J34143
$$ -2143176 1376443 1920193 -377597 -2961795 -4006833 -3505164 -2382173 -1544080 -1409937
11560a409937l99749n16568k54248N53470J802249K136602J31935k927268l529105
$$ -1409937 -1809686 -2326254 -2580502 -2027032 -224783 1911819 2043754 -883514 -4412619
11551d412619o07639K326590J828475o61521j489388n49413n01402j190577L33636
$$ -4412619 -5020258 -2693668 -865193 -1526714 -3016102 -3565515 -4066917 -5257494 -4923858
11542d923858L735190M399792O17257k823603j564861J581331J190414k168582
$$ -4923858 -1188668 3211124 3828381 1004778 -560083 1021248 2211662 43080
11534D3080l043932K75367L409304K610223n30530k417237k058287o60771P84983
$$ 43080 -3000852 -2725485 683819 3294042 2763512 346275 -1712012 -2372783 -1587800
11525a587800J747587J748876J123320R07129J183552R43335R4400j52484M11511
$$ -1587800 159787 1908663 3031983 3939112 5122664 6065999 6160399 6007915 6419426
11516F419426J96252j620186l384572l114581j130608O50711J135659P30550K50187
$$ 6419426 6615678 4995492 1610920 -1503661 -2634269 -1983558 -847899 -117349 132838
11507A32838j5488l98726j244827k004117j467666L94850J735323J210643N9705
$$ 132838 117350 -281376 -1526203 -3530320 -4997986 -4603136 -2867813 -1657170 -1597465
11498a597465J38241J017010J194356R89283J470024J629277j0101j901682j516502
$$ -1597465 -1459224 -442214 752142 1741425 3211449 4840726 4830625 2928943 1412441
11489A412441j39288r68592k809350j293866L058989M347479O72365k515706j446667
$$ 1412441 1273153 304561 -2504789 -3798655 -739666 3607813 4280178 1764472 317805
11480C17805K19623j046377j936612Q76149L112529l22797n363805m211398J950908
$$ 317805 537428 -508949 -2445561 -1569412 1543117 1220320 -4143485 -8354883 -6403975
11471f403975M628558J340471j650631l88816J573183R44832r3896N05967M89442
$$ -6403975 -1775417 -434946 -2085577 -2474393 -901210 43622 -50274 455693 945135
11462I45135j658217l025288j365680Q00792P59803L0163O79802J219490o0663
$$ 945135 -713082 -3738370 -5104050 -4303258 -3543455 -3513292 -2833490 -1614000 -1674663
11453a674663j246262k17134J211745N35475p91231M767K014708K336303R50294
$$ -1674663 -2920925 -3138059 -1926314 -1390839 -2182070 -2177303 -162595 2173708 3124002
11444C124002L9684o0686n37239j024913m09707M85945M15690N58855K241087
$$ 3124002 3163686 3103000 2565761 1540848 1131141 1617086 2032776 2591631 4832718
11435D832718L264256Q20198k912574k986854N65922K334590j18179k559533j023555
$$ 4832718 8096974 8917172 6004598 3017744 3583666 5918256 5800077 3240544 2216989
11426B216989J992757J738588j529879l486220k216572N5449J086994J057984
$$ 2216989 4209746 5948334 4418455 932235 -1284337 -1228888 -141894 916090
11418I16090P42873Q2917p22998q38846k61777O8k51742j39030K29875m89142
$$ 916090 1658963 1741880 1018882 180036 -81741 -81673 -333415 -472445 -242570 -731712
11408g31712k119330k250430P8385K195380J612671m977K53884J421824M54508
$$ -731712 -2851042 -5101472 -5023087 -2827707 -1215036 -1220013 -966129 455695 910203
11399I10203j866490j710357J011150J951676k85352j639368J9803P38825k194879
$$ 910203 -956287 -2666644 -1655494 296182 10830 -1628538 -1608735 -869910 -3064789
11390c064789m221288o43159M582345M363566j17668j513970J503261K675724
$$ -3064789 -7286077 -7929236 -3346891 1016675 899007 -614963 888298 3564022
11382C564022p15514l549345j991877O69674Q53288O49832K470534L427295M06666
$$ 3564022 2848508 -700837 -2692714 -2023040 -1169752 -519920 1950614 5377909 5784575
11373E784575l556144l580247o16600N73790q95767j539001K75274K177560J907618
$$ 5784575 2228431 -1351816 -1968416 -1394626 -2290393 -3829394 -3554120 -1376560 531058
11364E31058J50685j107097q82441K49949P27371l29705j530514p97949J197498
$$ 531058 681743 -425354 -1307795 -1057846 -330475 -660180 -2190694 -2988643 -1791145
11355a791145J694331M28571K34751K024907L014877J597263j31453p60736j948118
$$ -1791145 -96814 331757 566508 2591415 5606292 7203555 7072102 6311366 4363248
11346D363248l805142k952026J193859L349452K86355l120374j436179K331204
$$ 4363248 558106 -2393920 -1200061 2149391 2435746 -684628 -2120807 210397
11338B10397K012562j309356j847893O81296J595964L90954R26312K919323J687337
$$ 210397 2222959 913603 -934290 -252994 1342970 1733924 2660236 5579559 7266896
11329G266896k806823m670473j638046J420513R25342l14999N61503J293396n99570
$$ 7266896 4460073 -210400 -1848446 -427933 497409 182410 743913 2037309 1437739
11320A437739k901856k654472j004543m95158p60135o7874J479778K743481L224035
$$ 1437739 -1464117 -4118589 -5123132 -5618290 -6378425 -6446299 -4966521 -2223040 1000995
11311A000995K412895N9422j974476j210496J416258K478708J327525L25429k73171
$$ 1000995 3413890 3473312 1498836 288340 1704598 4183306 5510831 5836260 5563089
11302E563089k459126m923596l493486J329303L637255J279791p45806R03556
$$ 5563089 3103963 -1819633 -5313119 -3983816 -346561 933230 187424 1090980
11294A090980K520852Q55586p27875J063438K728167K09765l333044k741551M53865
$$ 1090980 3611832 4467418 3739543 4802981 7531148 7740913 4407869 1666318 2120183
11285B120183J386511J43266k03513l68093k370367l414173j12224L667651J616043
$$ 2120183 3506694 3649960 3446447 3078354 707987 -2706186 -2818410 849241 2465284
11276B465284l959958m748977M02259M015183K387233L47298J380076J733596
$$ 2465284 -1494674 -6243651 -5841392 -1826209 561024 908322 2288398 4021994
11268D021994j634267m603073k490788K303666M299082K660399N07930m24985
$$ 4021994 2387727 -2215346 -4706134 -2402468 1896614 4557013 5064943 4639958
11260D639958n66162l08973j36626r20229j992470j318395Q86531J815609Q15519
$$ 4639958 4073796 3764823 3628197 2707968 715498 -602897 283634 2099243 2914762
11251B914762O20536J970676J506029k120019m636162k580926Q22706R19870q55491
$$ 2914762 3535298 5505974 7012003 4891984 255822 -2325104 -1502398 -582528 -1438019
11242a438019j96286K111487J657837j541477k800789o27437J032021l78456k035178
$$ -1438019 -1634305 477182 2135019 593542 -2207247 -2834684 -1802663 -2181119 -4216297
11233d216297p22539K133556L018696J269350r29837j780154j176736J09646J126316
$$ -4216297 -4938836 -2805280 213416 1482766 552929 -1227225 -2403961 -2294315 -1167999
11224a167999J238419O76233J49576j5573L43191J603792L214879L150055N10455
$$ -1167999 70420 746653 896229 880656 1223847 2827639 6042518 9192573 9703028
11215I703028k237096k206068n02876m46488j847239j237531J665211K481011
$$ 9703028 7465932 5259864 4756988 4310500 2463261 1225730 2890941 5371952
11207E371952q19006l907387k454530J204027J995391n3427q26465O34773J173199
$$ 5371952 4552946 645559 -1808971 -604944 1390447 1337020 510555 1145328 2318527
11198B318527m41862j558367n89001N25213K80543Q4635Q23791N81550j667308
$$ 2318527 1876665 318298 -270703 254510 535053 619688 1443479 2025029 357721
11189C57721l192380j445831J464971J616440r19135k431150r74504J600898K747348
$$ 357721 -2834659 -4280490 -2815519 -1199079 -2118214 -4549364 -5523868 -3922970 -1175622
11180a175622J795153m02548k170273j629628J208687L360247K174097p51437
$$ -1175622 619531 216983 -1953290 -3582918 -2374231 986016 3160113 2408676
11172B408676j614480L2944J017679n0610q48607R4084O37888r91767k652334
$$ 2408676 794196 827140 1844819 1794209 945602 1039686 1677574 685807 -1966527
11163a966527j630260Q09531J495780M36940M36513K331112L836167L145226R42298
$$ -1966527 -3596787 -2787256 -1291476 -854536 -418023 1913089 5749256 8894482 9836780
11154I836780j421381l294826l878502k401831P8518J113058N752j243537r92686
$$ 9836780 8415399 5120573 1242071 -1159760 -1081242 31816 37568 -1205969 -2198655
11145b198655j08094L1008j88473J10045L43307k59427o62353M38469J866237
$$ -2198655 -2306749 -2275741 -2464214 -2354169 -2010862 -2270289 -2932642 -2494173 -627936
11136f27936J324072o68283j003160J172610K603074N85347k740470l226583m98391
$$ -627936 696136 27853 -975307 197303 2800377 3385724 645254 -2581329 -3079720
11127c079720J910958J744856M69160J68120O89714R88956J064665J029733P2080
$$ -3079720 -1168762 576094 1045254 1213374 1903088 2892044 3956709 4986442 5058522
11118E058522j911317l148715k344257q65973n19344m41539J172530L201604K679053
$$ 5058522 3147205 -1510 -2345767 -3211740 -3731084 -4172623 -3000093 201511 2880564
11109B880564l44279k332442j387395K70761K91142k50396O13973J977458J507110
$$ 2880564 2536285 203843 -1183552 -912791 -621649 -872045 -258072 1719386 3226496
11100C226496o99051k309868k146968j106800q7919Q93710J625894J663767J484972
$$ 3226496 2527445 217577 -1929391 -3036191 -3124110 -2230400 -604506 1059261 2544233
11091B544233J964743K514005J471288j161497k982427k078484M82790K001939
$$ 2544233 4508976 7022981 8494269 7332772 4350345 2271861 2754651 4756590
11083D756590J250453o22880j786526j537613o21968k93689j010789j884305j658791
$$ 4756590 6007043 5384163 3597637 2060024 1438056 1144367 133578 -1750727 -3409518
11074c409518l07592Q46773Q27161K11596J83749R28616J660272J834963J481743
$$ -3409518 -3717110 -2870337 -2043176 -1831580 -1647831 -719215 941057 2776020 4257763
11065D257763N81981q30704j952529j772137o41406m1559k76499J05517J611506
$$ 4257763 4839744 4009040 2056511 284374 -357032 -398591 -675090 -569573 1041933
11056A041933K245660M76839j712286j352476Q41115J467402j62524j206118l36273
$$ 1041933 3287593 3764432 2052146 699670 1540785 3008187 2845663 1639545 1303272
11047A303272L30631k68685J30679K389681K989400m44291m035324k871783J106853
$$ 1303272 1633903 1365218 1495897 3885578 6874978 6430687 2395363 -476420 630433
11038F30433J923566j081708k678454n17496J527882K45316k008025j740803N39418
$$ 630433 2553999 1472291 -1206163 -1723659 -195777 49539 -1958486 -3699289 -3159871
11029c159871K292574K640559J639838r55499l705097l329628O74529M024279
$$ -3159871 -867297 1773262 3413100 2457601 -1247496 -4577124 -3902595 121684
11021A21684L185387L93900l4126J844438K461763N22278j780083k623880k318744
$$ 121684 3307071 3700971 3666845 5511283 7973046 8495324 6715241 4091361 1772617
11012A772617j410063O2075J217191O60991j325157k590907j577670R88532K900736
$$ 1772617 362554 424629 1641820 2302811 977654 -1613253 -3190923 -2202391 698345
11003F98345K392320k63452k568832k046468Q41872L074204K679067M87713j917671
$$ 698345 3090665 2827213 258381 -1788087 -946215 2127989 4807056 5294769 3377098
10994C377098l774151m047805j565280K304517L743738J214511k168598k891997
$$ 3377098 -397053 -4444858 -6010138 -3705621 38117 1252628 -915970 -3807967
10986c807967j317933K88014J369593K201605J908379K67669o78045K94926J089392
$$ -3807967 -5125900 -4837886 -3468293 -1266688 641691 909360 231315 526241 1615633
10977A615633j59627j467383l75342J497697J252148k00115k55156K76187q09963
$$ 1615633 1456006 -11377 -386719 1110978 2363126 2163011 1907855 2184042 1374079
10968A374079j815956L00260L191255J525781l756721n461402r63760L563310
$$ 1374079 -441877 -141617 3049638 4575419 818698 -4642704 -5606464 -2043154
10960b043154K636098p52739r70908J420094J804657n63941k108868j162794J167
$$ -2043154 592944 -159795 -1130703 289391 2094048 1530107 -578761 -1741555 -1740388
10951a740388n39102j576232j114042P86918K436837K581592J433272K01974j58239
$$ -1740388 -2279490 -3855722 -4969764 -4182846 -1746009 835583 2268855 2470829 2312590
10942B312590J22440R7999n73923j273387j301160n33535O34723J394587R75840
$$ 2312590 2435030 2533029 1959106 685719 -615441 -1148976 -514253 880334 1856174
10933A856174k69837q59604j31737O71850L84820j73939K22608R90645J001890
$$ 1856174 1586337 726733 594996 1266846 1651666 1477727 1700335 2690980 3692870
10924C692870P73030J107692Q87861r96420k733307j901098K42644M95092q97219
$$ 3692870 4465900 5573592 6461453 5465033 2731726 830628 1073272 1568364 671145
10915F71145p75848J113300J514327l63664j047489J237127L181087J567697j761832
$$ 671145 -104703 1008597 2522924 2159260 1111771 2348898 5529985 7097682 5335850
10906E335850l047395j892807m97402J62347N86684Q20316O23298L15188j25540
$$ 5335850 2288455 395648 -101754 60593 647277 1467593 2090891 2406079 2280539
10897B280539j209394k063911p92385J903555K398449m88664k905115j605848
$$ 2280539 1071145 -992766 -1785151 118404 2516853 2028189 -876926 -2482774
10889b482774Q09113J31612k341020j701360K501225N019393K429379k179447
$$ -2482774 -1673661 -1542049 -3883069 -5584429 -3083204 1936189 4365568 2186121
10881B186121l743686j595986P89935P74665p54981j232150L93345K632409L331913
$$ 2186121 -1557565 -3153551 -2363616 -1588951 -2343932 -3576082 -3182737 -550328 2781585
10872B781585K173733P14730m3821r25343k668608l964943k920358Q2961K600647
$$ 2781585 4955318 5670048 5626227 4700884 2032276 -1932667 -4853025 -4770064 -2169417
10863b169417L146040K499979J730898M74028j733270l448576k497525O59589
$$ -2169417 976623 3476602 5207500 5681528 3948258 499682 -1997843 -1338254
10855a338254K524594Q50406j931379j745637J241587K721981O87220j663720
$$ -1338254 1186340 2036746 105367 -1640270 -398683 2323298 3010518 1346798
10847A346798j247589J04922o42565k101432r25575J893776K267447n4084j027143
$$ 1346798 99209 204131 -438434 -2539866 -3465441 -1571665 695782 641698 -385445
10838c85445P36173J745423j76202k292754j833892k91266j11735o49701k96588
$$ -385445 350728 2096151 1919949 -372805 -2206697 -2497963 -2609698 -3259399 -3555987
10829c555987M10846O22837J268257K573234K406432L6859j469681K9540J650692
$$ -3555987 -3145141 -2522304 -1254047 1319187 3725619 3762478 2292797 2322337 3973029
10820C973029Q3506k512086j984084O50189J010216r51613j037129J468500K276478
$$ 3973029 4056535 1544449 -439635 210554 1220770 269157 -767972 700528 2977006
10811B977006l51822k305643n39577J756534O96919j625422q03366K153570K203190
$$ 2977006 2625184 319541 -220036 1536498 2233417 607995 -195371 1958199 4161389
10802D161389j422484l732952j795156P94793j49596k705263j983824K029481
$$ 4161389 2738905 -994047 -2789203 -1994410 -2144006 -4849269 -6833093 -4803612
10794d803612M285731K259095m82048J23761K713787K894792k74911l187639k653816
$$ -4803612 -517881 1741214 1259166 1382927 4096714 6991506 6716595 3528956 875140
10785H75140M21385K641950J853260j117489l525037l305665j052969Q06471Q96377
$$ 875140 1296525 3938475 5791735 4674246 1149209 -2156456 -3209425 -2402954 -1506577
10776a506577L7118o28224r94342q40798N80879K517614K493339m7557k097892
$$ -1506577 -1469459 -2097683 -3092025 -3932823 -3351944 -834330 1659009 1611452 -486440
10767d86440j327260L83330M09648j44730Q78125J848857j36824l356348l237868
$$ -486440 -1813700 -1430370 -1020722 -1165452 -287327 1561530 1424706 -1931642 -5169510
10758e169510M39101L209216K860293J655441J136046r6398k202697k656739p10623
$$ -5169510 -4730409 -1521193 1339100 2994541 4130587 4034189 1831492 -825247 -1535870
10749a535870J073398J370304J795820K509340R73646k680341l966339p39764
$$ -1535870 -462472 907832 2703652 5212992 6186638 3506297 -460042 -1199806
10741a199806K870216K656476L99839p1254P65444M9937j933455k539313j322916
$$ -1199806 1670410 4326886 4726725 4655471 5420915 5470852 3537397 998084 -324832
10732c24832m8377N67031J003890J057032M39258Q2374P29733J550095J655290
$$ -324832 -373209 193822 1197712 2254744 2694002 2776376 3506109 5056204 6711494
10723F711494J176998k09028l074041n416602l779731R61388L169842N05941k062040
$$ 6711494 7888492 7679464 4605423 -811179 -4590910 -3629522 -459680 46261 -2015779
10714b015779L2182L708292L578727O85876n042J788812J930052m85386j877189
$$ -2015779 -1983597 1724695 5303422 5989298 5984256 7773068 9703120 9217734 7340545
10705G340545o50792M09851r09393l140008m031441l322683j758419J35876J739542
$$ 7340545 6689753 7099604 6190211 3050203 -981238 -4303921 -6062340 -5926464 -4186922
10696d186922K592882K822942K048997o51481l861776l398464J942441O461941
$$ -4186922 -1594040 1228902 3277899 2626418 -1235358 -4633822 -2691381 3770560
10688C770560L888853l549637p313334l742908J806298L056405N43121j006495
$$ 3770560 7659413 4109776 -3203558 -6946466 -5140168 -2083763 -1540642 -2547137
10680b547137K90386K101941K037826M70416q20684j217563j609788k423041k360476
$$ -2547137 -2256751 -154810 1883016 2353432 1532748 315185 -1294603 -3717644 -6078120
10671f078120k42407K385107K483246j78794k110075p06161K154220K867684J023468
$$ -6078120 -6320527 -3935420 -1452174 -1630968 -3741043 -4447204 -2292984 574700 1598168
10662A598168m59452N29555K741871L275770J055774j738431k127235k32112P96674
$$ 1598168 1138716 1668271 4410142 7685912 8741686 7003255 4876020 4643908 5440582
10653E440582m20334j283646M612N58797k273697m990325k684412K234656L078720
$$ 5440582 5020248 3736602 3741214 4300011 2026314 -2964011 -5648423 -3413767 -335047
10644c35047j69171q89975K648592M409232J410438j218742K12747J480278j460574
$$ -335047 -504218 -1394193 1254399 5663631 7074069 5855327 6068074 7548352 6087778
10635F087778n081078m637306j702538K71397K029857M463960M359223L54549
$$ 6087778 1006700 -3630606 -5333144 -5061747 -3031890 1432070 5791293 6145842
10627F145842k399251J1482L143192J517454k101316j938986J014173J973270
$$ 6145842 3746591 3758073 6901265 8418719 6317403 4378417 5392590 7365860
10619G365860R15140O64280L18733j920963l119581l80886K448673N92316k855661
$$ 7365860 8281000 8945280 9264013 7343050 4223469 3842583 6291256 6883572 4027911
10610D027911k054338J313866J605874k69841P03985L233688J584311l438260
$$ 4027911 1973573 3287439 4893313 4623472 5327457 8561145 10145456 6707196
10602F707196m948164j193474K333853K142989L96019o81169j071779j26034K130784
$$ 6707196 1759032 565558 2899411 5042400 5438419 4757250 3685471 3559437 5690221
10593E690221K240405j671295m557162j446913L208156J818705l449900l918411
$$ 5690221 7930626 6259331 1702169 255256 3463412 5282117 1832217 -2086194
10585b086194J234909M356180K556478R78367K077211J794068j623038l964090
$$ -2086194 -851285 3504895 6061373 7039740 9116951 10911019 9287981 5323891
10577E323891k668434n69730j0409K73658J116494J604457K074362L026745K192682
$$ 5323891 2655457 2085727 2075318 2348976 3465470 5069927 7144289 10171034 12363716
10568A2363716j581906l994747j519713J405085o05732l620531q20364M514879
$$ 12363716 10781810 6787063 5267350 6672435 6066703 2446172 1625808 6140687
10560F140687L760824j974491l778490m67685N02910k607665l300677L83871K658748
$$ 6140687 9901511 7927020 4148530 3680845 4183755 1576090 -1724587 -1340716 1318032
10551A318032J188539L36484J657573J661491K01322R06963K747025J334035j647650
$$ 1318032 2506571 2843055 4500628 6162119 6363441 7270404 10017429 11351464 9703814
10542I703814r14261J594026j76745m007741k718790J740604J206025l089368
$$ 9703814 8789553 10383579 10206834 6199093 3480303 5220907 6426932 3337564
10534C337564k512551K380777K828838j153863j131037K618539J533748l354705
$$ 3337564 825013 3205790 6034628 4880765 3749728 6368267 7902015 4547310
10526D547310k084015M660568N359002j177504l563418J036569L056336J34073
$$ 4547310 2463295 7123863 12482865 11305361 7741943 8778512 11834848 11968921
10518A1968921L50926L488412L33371o687730m700999M851581O439622j403476
$$ 11968921 12319847 15808259 16141630 9453900 4752901 9604482 16044104 14640628
10510A4640628l601335K367326K545567m157724k742515O502190N853465m343686
$$ 14640628 11039293 13406619 15952186 11794462 9051947 15554137 21407602 17063916
10502A7063916l492865Q576118Q293295n131385m651221J1019942J0094299q950103
$$ 17063916 13571051 22147169 30440464 25309079 20657858 31677800 41772099 32821996
10494C2821996o144701K2590871K5901454n732238k111243O2166504Q4658437
$$ 32821996 26677295 49268166 75169620 69437382 67326139 129492643 214151080
10487B14151080k3378919j69835642j80739750m4263636P3302004O3366345l46954
$$ 214151080 190772161 20936519 -159803231 -204066867 -130764863 -67398518 -67745472
10480f7745472j0336699K0121518K1343463m513409p671803J1682045J3745002
$$ -67745472 -78082171 -57960653 -36617190 -41130599 -48802402 -37120357 -23375355
10473b3375355l305766p214093M948771P480977j717168j567052P818091O840137
$$ -23375355 -26681121 -33895214 -28946443 -21465466 -23182634 -24749686 -16931595 -10091458
10465a0091458l587864m406839M132124M350627l677391l301076N460567O174291
$$ -10091458 -13679322 -18086161 -13954037 -9603410 -13280801 -16581877 -11121310 -4947019
10457d947019k396807n034935O22587J678046l497706k959292M068322N132387
$$ -4947019 -7343826 -12378761 -11756174 -10078128 -13575834 -16535126 -12466804 -7334417
10449g334417j370534l213618K644269N418996J066673k097716m36230L33777
$$ -7334417 -8704951 -11918569 -9274300 -3855304 -2788631 -4886347 -5322577 -4988800
10441d988800r53128Q14310L948488J385905m469612m221271J327959K416672
$$ -4988800 -5941928 -5127618 -1179130 206775 -4262837 -8484108 -7156149 -4739477
10433d739477j558714j576021L183378L711374j382033l087627J109597L030040
$$ -4739477 -6298191 -7874212 -4690834 -979460 -2361493 -5449120 -4339523 -1309483
10425a309483n71083k710384p392J619463j058699l003989j109858P98718L40212
$$ -1309483 -1880566 -4590950 -4598342 -2978879 -4037578 -7041567 -8151425 -7352707 -7012495
10416g012495J31520P19083n70614k264988J82150M871300M750261n29968l719069
$$ -7012495 -6880975 -6161892 -6732506 -8997494 -8815344 -3944044 806217 276249 -3442820
10407c442820j895969L12039L58308R70998K528481J608465j398666j897165N48306
$$ -3442820 -5338789 -5026750 -4668442 -3697444 -1168963 439502 -959164 -2856329 -2308023
10398b308023J631028O16906J012029K668119J569258k145936l930120k701015
$$ -2308023 -676995 -60089 951940 3620059 5189317 3043381 -886739 -3587754
10390c587754j475398q10119Q77170J882180m5333j644351Q66749L599886R99503
$$ -3587754 -5063152 -5873271 -4996101 -3113921 -3159254 -4803605 -3936856 -336970 662533
10381F62533l369029k518763J001190j66913l663793j234327M967796M818304
$$ 662533 -2706496 -5225259 -4224069 -4390982 -8054775 -9289102 -4321306 496998
10373D96998j410421k757711K876289M805894j239163n502446j492826L346456
$$ 496998 -913423 -3671134 -794845 4011049 2771886 -2730560 -4223386 -876930
10365h76930J532783k354381j607612J106522N27752j523572j058515N48776N89477
$$ -876930 655853 -1698528 -3306140 -2199618 -1671866 -3195438 -4253953 -3705177 -3115700
10356c115700L13724Q24675o7940k404790k085993J608395L416386Q52000j657750
$$ -3115700 -2801976 -1977301 -2045241 -4450031 -6536024 -4927629 -1511243 -659243 -2316993
10347b316993j080876m85214j527794m68602L693221N285100J418863k383578
$$ -2316993 -3397869 -3883083 -5410877 -5879479 -2186258 3098842 4517705 2134127
10339B134127j502152M09612q80822k590585j349338j66395k105909l381497k7967
$$ 2134127 631975 1041587 160765 -2429820 -3779158 -3945553 -6051462 -9432959 -9460926
10330i460926M046695L091533r45284k123726n4411J200639Q60954J429736K794546
$$ -9460926 -5414231 -2322698 -3267982 -5391708 -5446119 -4245480 -3384526 -1954790 839756
10321H39756K153809r31512l655300l620429q82438K465293L396517P38661k490045
$$ 839756 2993565 2062053 -1593247 -5213676 -6096114 -3630821 -234304 504357 -1985688
10312a985688k440685o3592P11708p0075J048385L484629K715750j205559k749526
$$ -1985688 -4426373 -4489965 -3778257 -3848332 -2799947 684682 3400432 2194873 -554653
10303e54653l21201J170917n07002j296745N79210Q84022j929748k794635N62560
$$ -554653 -875854 295063 -211939 -1508684 -929474 -45452 -1975200 -4769835 -4207275
10294d207275K732635L93329j537101N20955J734717j584429l896601k96623L489316
$$ -4207275 -1474640 -1081311 -2618412 -2097457 -362740 -1947169 -5843770 -6140393 -2651077
10285b651077O96302l782298j278375N233840N366431j834439o639811l594934
$$ -2651077 -1954775 -5737073 -7015448 -1781608 3584823 1750384 -4889427 -8484361
10277h484361K202615M320519K224536j544591m523594l963024Q22101N428930
$$ -8484361 -6281746 -1961227 263309 -1281282 -5804876 -9767900 -8945799 -3516869
10269c516869M753380K0069l252450l049708j567572J92456K697245L977065J545081
$$ -3516869 1236511 1256580 -1995870 -5045578 -6613150 -6420694 -3723449 253616 1798697
10260A798697k313976k889559l24346R00530o08098j736226p62048P32388K008259
$$ 1798697 -515279 -3404838 -3729184 -2828654 -3436752 -5172978 -5935026 -5202638 -3194379
10251c194379L926978N100529K551575k664364n262180k781411J065479J751596
$$ -3194379 732599 5833128 8384703 5720339 458159 -2323252 -1257773 493823
10243D93823o04248k776938k843313j411660r7327L5471o75443q69806J40928
$$ 493823 -110425 -2887363 -5730676 -7142336 -7239663 -7204192 -7879635 -8749441 -8608513
10234h608513J541072K247629J893071L71694j769601k367446J78164L375573
$$ -8608513 -7067441 -4819812 -2926741 -2555047 -4324648 -6692094 -6513930 -3138357
10226c138357K868403r62100k891282p48142J552841J091912M92832J976457K536869
$$ -3138357 -269954 -1232054 -4123336 -4871478 -3318637 -2226725 -1733893 242564 2779433
10217B779433k44733k751063j263716J191388L2223k807490k516023K28154J289799
$$ 2779433 2534700 -216363 -1480079 -288691 -256468 -3063958 -5579981 -5351827 -4062028
10208d062028P09636J428904K673354J547042o34988n09459N46049j106695l625998
$$ -4062028 -3352392 -1923488 749866 2296908 1661920 1152461 1698510 591815 -3034183
10199c034183k085052K247415L019516p05752k979733r70942J181789L05942j105588
$$ -3034183 -5119235 -2871820 147696 -558056 -3537789 -4508731 -3326942 -3021000 -4126588
10190d126588n85417K44190P6258P84412K968540L579080R54302j985263k278268
$$ -4126588 -4712005 -4467815 -4391557 -3607145 -638605 2940475 3894777 1909514 -368754
10181c68754r56958k32137j03344J55691K65632L20090R24978J035647r30024
$$ -368754 -1325712 -1557849 -1661193 -1505502 -1239870 -919780 5198 1040845 110821
10172A10821l214980k118826J795672L491605R79468j671981j038312N73849k07393
$$ 110821 -3104159 -5222985 -3427313 64292 1043760 -628221 -1666533 -1092684 -1300077
10163a300077k051524j546399J173818L026768K536369Q74915n45508j326678
$$ -1300077 -3351601 -4898000 -3724182 -697414 1838955 2713870 2168362 841684
10155H41684j676330k091646k738465k720526j182317Q97895J758018J454982
$$ 841684 -834646 -2926292 -5664757 -8385283 -9567600 -8669705 -6911687 -5456705
10147e456705J283196J089177o1666r84104M15945K981103L058239M745k643141
$$ -5456705 -4173509 -3084332 -3145998 -4130102 -3714157 -733054 2325185 2329930 -313211
10138c13211k356401n45137O06103Q58448M97984n13756j072917P8493J271502
$$ -313211 -2669612 -3214749 -2608646 -1750198 -1252214 -1765970 -2838887 -2760394 -1488892
10129a488892m01142l620790l526589P50593L948010K318677j077874j707814
$$ -1488892 -1890034 -5510824 -9037413 -8286820 -4338810 -2020133 -3098007 -4805821
10121d805821j41360K94385q08096j419655q92835J47261J822633L863384M257630
$$ -4805821 -4947181 -4652796 -5460892 -6880547 -7773382 -7626121 -5803488 -1940104 2317526
10112B317526J934286q65102j575870r57430j089545j556085o86715Q39782Q97226
$$ 2317526 4251812 3386710 1810840 853410 -236135 -1792220 -2478935 -1639153 -741927
10103g41927l65909p11990N70604J786736J541832K96710q11420j154965p22666
$$ -741927 -1107836 -1819826 -1249222 537514 2079346 2376056 1564636 409671 -312995
10094c12995j97503n49330j606580j777463k19294J645604J987969J030601L08655
$$ -312995 -510498 -1059828 -2666408 -4443871 -4663165 -3017561 -1029592 1009 309664
10085C09664K72976J10807n26375j051354j110643j091803j239388r56682N02347
$$ 309664 582640 693447 167072 -884282 -1994925 -3086728 -4326116 -5282798 -4780451
10076d780451K579361L131176O41522l090996m100490j229020J762507J047518
$$ -4780451 -2201090 930086 1571608 -1519388 -5619878 -6848898 -5086391 -4038873
10068d038873j856252k320271P94842M061968M614722K960052O48711j379123
$$ -4038873 -5895125 -8215396 -7420554 -3358586 1256136 4216188 4864899 3485776
10060C485776j749423M34109K830543J636666k663857m938003k490380R98836
$$ 3485776 1736353 2170462 5001005 6637671 3973814 -964189 -3454569 -2455733
10052b455733R67596j663885k578519m04225K080411K148983J83616j312824o13087
$$ -2455733 -1488137 -3152022 -5730541 -6134766 -4054355 -1905372 -1721756 -3034580 -3647667
10043c647667J228038J379388r75252k824855j230631K098553L089180J275709
$$ -3647667 -2419629 -1040241 -2015493 -4840348 -6070979 -3972426 -883246 392463
10035C92463k49602l26330o81795j334485j26724K202808J775751j745535l355194
$$ 392463 142861 -183469 -865264 -2199749 -2326473 -123665 1652086 -93449 -3448643
10026c448643j66630L946857M081819N97581l035611m723209l644837Q8517L320720
$$ -3448643 -3615273 331584 4413403 5010984 1975373 -2747836 -6392673 -6304156 -2983436
10017b983436K067418j859774j969224K561782M442714J14442l571938n55572
$$ -2983436 -916018 -2775792 -4745016 -2183234 2259480 2373922 -1198016 -1753588
10009a753588L923923K117308l114845l547944N57960K148436L5885o15203R86726
$$ -1753588 2170335 4287643 1172798 -2375146 -1817186 331250 367135 -248068 738658
10000G38658M34412k209921j979108J099377J434085j463645j503971K566574
$$ 738658 1173070 -1036851 -3015959 -1916582 -482497 -1946142 -3450113 -883539
9992h83539M051253Q5915k846750p41L490681J436353l526361n165756l053369
$$ -883539 3167714 3253629 406879 406138 3896819 5333172 1806811 -3358945 -6412314
9983f412314o17323J318530L126633K766613o06633l013752j061314K276348K390524
$$ -6412314 -7029637 -5711107 -2584474 182139 -424494 -3438246 -4499560 -2223212 167312
9974A67312K89100j18871J029056P73658q66053j538084j124232j021322p73673
$$ 167312 456412 337541 1366597 2140255 1274202 -263882 -1388114 -2409436 -3183109
9965c183109L40211O42779q29429j309856J080073K906388R03705j522334K68874
$$ -3183109 -2842898 -2200119 -3029548 -4339404 -3259331 -352943 550762 -971572 -702698
9956g02698L280167J270853l897081m200603J335253M520929R95265l317211k400377
$$ -702698 2577469 3848322 -48759 -4249362 -2914109 1606820 2602085 -715126 -3115503
9947c115503Q41293R22792r85940l77767K176335K394890j05675j515369m32320
$$ -3115503 -2274210 -1351418 -2337358 -2715125 -538790 1856100 1750425 235056 -197264
9938a97264M07662o17386j369813P4768J999927J597970q89887k653273k217427
$$ -197264 210398 -406988 -1776801 -1702033 297894 1895864 1005977 -1647296 -3864723
9929c864723r48992m19416Q724J601051L303826K618956m58080k724098j977892
$$ -3864723 -4813715 -5233131 -5224407 -3623356 -319530 2299426 1841346 -882752 -2860644
9920b860644J54988R80961L04334m50406o96853l27870J116253K845292K587584
$$ -2860644 -2705656 -1724695 -1420361 -1870767 -2567620 -2895490 -1779237 1066055 3653639
9911C653639K59154p67280J109089K311195k89562l545678k820886K15802O10127
$$ 3653639 3912793 3145513 4254602 6565797 6276235 2730557 -90329 125473 735600
9902G35600j218896p58117J850767J828654j492311l367553j802471J84167J243554
$$ 735600 -483296 -1241413 609354 2438008 945697 -2421856 -4224327 -4040160 -2796606
9893b796606L029204L899730j05292o154709n880206J184731N274354J764434
$$ -2796606 232598 4132328 4027036 -2127673 -8007879 -6823148 -1548794 215640
9885B15640j629271J060237L899684J374046k13507M909059Q020316j208621j4748293
$$ 215640 -1413631 -353394 3546290 4920336 4706829 9615888 17636204 16427583 1679290
9876A679290j5404343k651098P058328N182783J82722q7912P25302j066041j068709
$$ 1679290 -13725053 -16376151 -9317823 -4135040 -3952318 -4040230 -3314928 -4380969 -5449678
9867e449678K914339M352080n02217m558308j362847M061666M101083O43155l01994
$$ -5449678 -2535339 1816741 1314524 -3243784 -4606631 -544965 3556118 4199273 3897279
9858C897279M67972j238957l817511k985909k94170k11551j736517o99103K091325
$$ 3897279 4365251 3126294 -691217 -3677126 -3971296 -4182847 -5919364 -6618467 -4527142
9849d527142K461344O10099J77363J234903Q36954r09048j569535j594405k656660
$$ -4527142 -2065798 -1455699 -1278336 -43433 793521 -115527 -1685062 -3279467 -5936127
9840e936127k625775J194957N440481M428524m15652k152399R38249L468276K122865
$$ -5936127 -8561902 -7366945 -1926464 2502060 2086408 -65991 872258 4340534 6463399
9831F463399m34697j809475l055595m010865k102138J969665L423368P65218j617489
$$ 6463399 6028702 4219227 1163632 -2847233 -4949371 -2979706 443662 1208880 -408609
9822d08609p13510P93542K38949n26685K34660K58036j922839k982679k67142
$$ -408609 -1122119 -328577 -89628 -616313 -381653 -123617 -2046456 -5029135 -5296277
9813e296277K722358J455835k039362k194379J328380L312817R60348k599444
$$ -5296277 -2573919 -1118084 -3157446 -5351825 -4023445 -710628 249720 -2349724
9805b349724l361250j317387Q37835J355713O10378M1397O52459J916141K223203
$$ -2349724 -5710974 -7028361 -6190526 -4834813 -4224435 -4183038 -3530579 -1614438 608765
9796F08765R48846n52970p84149j38917q9033r61560j594859r40537O85787J817946
$$ 608765 1557611 1004641 220492 81575 -7458 -969018 -2563877 -3504414 -2818627 -1000681
9786a000681J200322o32071j443126Q1759K226234K241880J67643j264269n79020
$$ -1000681 199641 -432430 -1875556 -1793797 432437 2674317 2841960 1577691 998671
9777I98671P17322P95726j88504j111573j333262n48958R49735J471102m52591
$$ 998671 1715993 2511719 2323215 1211642 -121620 -670578 279157 1750259 1297668
9768A297668l187873l254634j82646K569872K527807J145085N36876L77649o9377
$$ 1297668 -1890205 -5144839 -5327485 -2757613 -229806 915279 1452155 1829804 1760427
9759A760427Q2893R49461M01093k132835l264434o28929K311723R18795k945240
$$ 1760427 1843320 2792781 3193874 1061039 -2203395 -2832324 -520601 398194 -2547046
9750b547046l120356J393073M608911K343984k037114l115021q18902R81398P53505
$$ -2547046 -5667402 -4274329 334582 2678566 641452 -2473569 -3292471 -2311073 -1557568
9741a557568M34628J300591K117428J599048J38184j503658l151867m006827k394212
$$ -1557568 -1122940 177651 2295079 3894127 4032311 2528653 -623214 -4630041 -7024253
9732g024253J720913N227222M845058J256262j558081j246834L54295J86821k033977
$$ -7024253 -5303340 -76118 4768940 6025202 4467121 3220287 3574582 3761403 1727426
9723A727426l834776l026894J72096L322519L575224M01248l059078k975163K21736
$$ 1727426 -2107350 -5134244 -4962148 -1639629 1935595 2336843 -722235 -3697398 -3475662
9714c475662K048168K55926j900521q70693J703039K198772J162641J560932K553872
$$ -3475662 -1427494 -1171568 -3072089 -3942782 -2239743 -40971 1121670 2682602 5236474
9705E236474O73866l060078l310622R27674L619872M34424m635227n074519o44445
$$ 5236474 5910340 2850262 -460360 467314 4087186 4521610 -113617 -5188136 -5832581
9696e832581L515554L960510J432335j722222l190419j303533K850079N154700
$$ -5832581 -2317027 1643483 3075818 1353596 -1836823 -3140356 -290277 4864423
9688D864423L016393j085994l005927k248244j232231r80873o94371l35543m39199
$$ 4864423 7880816 6794822 3788895 1540651 308420 -672453 -1366824 -1702367 -2141566
9679b141566k49999R73164J711671K53302j917906k008169l97998K31665l01852
$$ -2141566 -2391565 -1418401 293270 546572 -1371334 -3379503 -3777501 -3545836 -3847688
9670c847688L66863K344849K702254M75948j318253m16812J152560N95966j076484
$$ -3847688 -3480825 -1135976 1566278 2042226 723973 307161 1459721 2055687 979203
9661I79203q92641J051496J463937j210404m201142l907723o10425J999322J742093
$$ 979203 86562 1138058 2601995 1391591 -2809551 -6717274 -7327699 -5328377 -3586284
9652c586284M63836O46863J369146R6752k450979k682247J84507K410066J262596
$$ -3586284 -3122448 -2475585 -1106439 -1009687 -3460666 -6142913 -5958406 -3548340 -2285744
9643b285744j113422j675513j111292j327898j198368J099521L549564K685115
$$ -2285744 -3399166 -5074679 -6185971 -7513869 -8712237 -7612716 -4063152 -1378037
9635a378037n81807k086369q85597k8614p87694p90370J205290L001926K867245
$$ -1378037 -1959844 -4046213 -4931810 -4960424 -5748118 -6538488 -5333198 -2331272 535973
9626E35973J928848J104831o64397l226061l834148j420523Q25345n8718k242777
$$ 535973 2464821 3569652 2905255 -320806 -4154954 -5575477 -4750132 -4808850 -7051627
9617g051627j982896Q36461L014741K653188P92844p57435j007255J08858J341001
$$ -7051627 -9034523 -8198062 -5183321 -2530133 -1737289 -2494724 -3501979 -3393121 -2052120
9608b052120O50824k082216l816856j818193K361024M495581K908078j3922j494138
$$ -2052120 -1401296 -3483512 -7300368 -9118561 -6757537 -2261956 646122 632200 -861938
9599h61938j509178j648340k379857k578116j305275P53642J947538J691131J307923
$$ -861938 -2371116 -4019456 -6399313 -8977429 -10282704 -9529062 -7581524 -5890393 -4582470
9590d582470K193194L555618L225902P06171k035157l100461k443874p12630J737212
$$ -4582470 -2389276 1166342 4392244 5098415 3063258 -37203 -2481077 -3193707 -1456495
9581a456495L704211L086013l35715l651857m250082l071766k378603j788273
$$ -1456495 2247716 5333729 4998014 1346157 -2903925 -5975691 -8354294 -10142567
9573a0142567N25852L544088L911201J164934r48425J55594K091804J336882j310849
$$ -10142567 -9616715 -6072627 -2161426 -996492 -1944917 -1789323 302481 1639363 328514
9564C28514k124997k58628J166573M8852j655392j292760M06905Q11162l98237
$$ 328514 -1796483 -2055111 -888538 -839686 -2495078 -3787838 -3380933 -2569771 -2968008
9555b968008j013267P5272J472795J819141J538262J305902Q09209J23045L17259
$$ -2968008 -3981275 -3906003 -2433208 -614067 924195 2230097 3039306 3162351 3479610
9546C479610J193063M71345k588382m692707k716008R53028J186059k072495l241009
$$ 3479610 4672673 5144018 2555636 -2137071 -4853079 -3900051 -2713992 -4786487 -8027496
9537h027496M86550M582433L842794O8770r97300J593505L001620J80476l826795
$$ -8027496 -7540946 -2958513 884281 953051 -44249 1549256 4550876 4731352 904557
9528I04557m527844j759596J204086K227029J724177O83044m23129r94578m90583
$$ 904557 -3623287 -5382883 -4178797 -1951768 -227591 455453 32324 -962254 -1452837
9519a452837M21387L10674r12406j502233k43432J614340J851037K10466j337975
$$ -1452837 -1031450 -720776 -1633182 -3135415 -3378847 -1764507 86530 296996 -1040979
9510a040979j227632r2499L88425l79452j421781j383771P5688J744787J838723
$$ -1040979 -2268611 -2361110 -1972685 -2352137 -3773918 -5157689 -5082001 -3337214 -1498491
9501a498491J73965r90289M13674K931068K863680n54877l550901k861007k26116
$$ -1498491 -1324526 -2314815 -1901141 1029927 3893607 3338730 -212171 -3073178 -3299294
9492c299294N25778q13190j194648M11551J622751Q31171m71523o52510m57266
$$ -3299294 -2773516 -3586706 -4781354 -4369803 -2747052 -1915881 -2387404 -3039914 -3497180
9483c497180j009319j537835r27042K06771Q47324J502982K762569L157209R54132
$$ -3497180 -4506499 -6044334 -6971376 -6764605 -5917281 -4414299 -1651730 1505479 2459611
9474B459611k369867l039075Q2318L536744L493808N39629j469138p56312L40682
$$ 2459611 89744 -2949331 -2867013 669731 4163539 4703168 3234030 2477718 2818400
9465B818400o00240k099990j071536J917459K865323K75837k463281k314045r21473
$$ 2818400 2218160 118170 -953366 964093 3829416 4105253 1641972 -672073 -1593546
9456a593546q70975p30555J812391M107702J548451m150391n853569j324488L262925
$$ -1593546 -2464521 -3195076 -1382685 2725017 4273468 123077 -5730492 -7054980 -3792055
9447c792055K536575q49253j746705l54151J54624l0049J201794K639674J441327
$$ -3792055 -1255480 -2104733 -3851438 -4205589 -4050965 -4081014 -2879220 -239546 1201781
9438A201781j369016k166851o04366M98276L76413O58314J037775l34874k224856
$$ 1201781 -167235 -2334086 -2938452 -2440176 -2063763 -1405449 -367674 -702548 -2927404
9429b927404j319271J694495K440511K27657n50039J785654K850929k30090l379414
$$ -2927404 -4246675 -2552180 -111669 115988 -434051 1351603 4202532 3972442 593028
9420E93028k089732J111147J034204j590542j773391J245526L017625J179467
$$ 593028 -1496704 -385557 648647 -941895 -2715286 -1469760 1547865 2727332
9412B727332j402563j603757p0420R97488R90740M67069k16133p96738j129518
$$ 2727332 1324769 -278988 -349408 648080 1638820 2105889 1889756 1093018 -36500
9403c6500j627331k306368j831238N78479K920336K568258K35362j030294n70735
$$ -36500 -1663831 -3970199 -5801437 -5222958 -2302622 265636 500998 -529296 -1100031
9394a100031n79813j617716j327030J206251L199972K130208p73620k822915l184021
$$ -1100031 -1679844 -3297560 -4624590 -3418339 -218367 1911841 1138221 -1684694 -4868715
9385d868715k125952L91190L191239L520570Q43657j304463j40503J962010J305185
$$ -4868715 -6994667 -6603477 -3412238 108332 951989 -352474 -492977 1469033 2774218
9376B774218j049298j373753Q007o77298l456044l588564O84099M436499L069557
$$ 2774218 1724920 351167 359174 -318124 -3774168 -7362732 -6678633 -2242134 827423
9367H27423r60601k188801l0567J647521J116010L75476N64773J88964j202116
$$ 827423 -133178 -2321979 -2352546 -705025 410985 786461 1351234 1540198 338082
9358C38082j405457N19106J798803J7312k548976j876909J598286L289697J198814
$$ 338082 -1067375 -548269 1250534 1267846 -1281130 -3158039 -1559753 1729944 2928758
9349B928758j189870m04586J632401P71701k583715l791222r68570K232751K174415
$$ 2928758 1738888 1334302 2966703 3738404 1154689 -2636533 -3605103 -1372352 802063
9340H02063J23631p34094l27511n29523r86821L7658J689649J422222l77533p49371
$$ 802063 925694 191600 -135911 -665434 -1652255 -1614597 75052 1497274 1119741 370370
9330C70370N39083M22519j665671k142309L44151J616865j258738m101313j653230
$$ 370370 909453 1331972 -333699 -2476008 -2131857 -514992 -1773730 -5875043 -7528273
9321g528273L487808M177675l40487l432666j464320J317018N28607j537461p26507
$$ -7528273 -4040465 137210 -203277 -3635943 -5100263 -3783245 -3254638 -4792099 -5518606
9312e518606J780554J969669j5183n29304J061466J465696o63939k257296o74074
$$ -5518606 -3738052 -1768383 -1783566 -2312870 -1251404 214292 -449647 -2706943 -3381017
9303c381017K189585K701297M09731j889694j973068l17398J256447J737845J445621
$$ -3381017 -1191432 1509865 1919596 29902 -1943166 -2260564 -1004117 733728 2179349
9294B179349R71343J36292j531015l258389l058751l46808K348673K099075k71571
$$ 2179349 3150692 3286984 1755969 -1502420 -4561171 -4907979 -2559306 -460231 -731802
9285g31802r70781J335793L268277J446291k437494l672123q89079K167636J623709
$$ -731802 -1702583 -366790 2901487 4347778 1910284 -1761839 -2650918 -483282 1140427
9276A140427j717001l667512j808052J863208L449168J605790j202320k008835
$$ 1140427 -576574 -4244086 -6052138 -4188930 -739762 866028 -336292 -2345127
9268b345127r33461k04598k30754Q88799L308171L839227O72816k733737j981599
$$ -2345127 -3278588 -3483186 -3713940 -2825141 483030 4322257 4995073 2261336 279737
9259B79737J492795K201135j124269l688373k120550P52564R96262n09562o35000
$$ 279737 1772532 3973667 2849398 -838975 -2959525 -2206961 -1210699 -1720261 -2355261
9250b355261M56045K76465j232312j766867o38105N81358Q45017L69709o49663
$$ -2355261 -1899216 -1622751 -2855063 -4621930 -5260035 -4678677 -3833660 -3463951 -4113614
9241d113614j563152p29499J749443K370371j117689m927553l595412J728402
$$ -4113614 -5676766 -6406265 -4656822 -2286451 -3404140 -8331693 -11927105 -10198703
9233a0198703M410557J793843j690491j721582P29697K921826M097304L721611
$$ -10198703 -5788146 -3994303 -5684794 -7406376 -6676679 -3754853 342451 4064062
9225D064062P46548k983598l246231K4502J574204p81607k052146J374182M635410
$$ 4064062 4810610 1827012 -1419219 -1394717 179487 -602120 -2654266 -1280084 3355326
9216C355326J957783l238988l306503J417855L494617M13245k447654j579923
$$ 3355326 5313109 2074121 -1232382 185473 3680090 4093335 1645681 65758
9208F5758l25465j723863l033463j056866K054968K381379K06392j304417j046730
$$ 65758 -259707 -1983570 -5017033 -6073899 -4018931 -1637552 -1431160 -2735577 -3782307
9199c782307l89309k68653m65440o37348k84788J085945K506366J916720o89330
$$ -3782307 -4171616 -4440269 -4905709 -5543057 -5827845 -4741900 -2235534 -318814 -1008144
9190a008144k341017r07568J849563K771360J374080l91474j217352j291579q11533
$$ -1008144 -3349161 -4256729 -2407166 364194 1738274 1346800 129448 -1162131 -1973664
9181a973664L99323J812473K128633O65306j741500l352636k911238o31661J991675
$$ -1973664 -1574341 238132 2366765 3032071 1290571 -2062065 -4973303 -5604964 -3613289
9172c613289L374115K809662O10556j890242k677579r58834J039767L16295k189697
$$ -3613289 -239174 2570488 3181044 1290802 -1386777 -2345611 -1305844 -989549 -3179246
9163c179246k051676J805070M231203J100269l780815l791270O42065L033930
$$ -3179246 -5230922 -3425852 805351 1905620 -1875195 -5666465 -5024400 -1990470
9155a990470Q54660j598850r79592M37831j21150j257844o99694O58221R24555
$$ -1990470 -1135810 -2734660 -3714252 -3276421 -3397571 -4655415 -5355109 -4696888 -3772333
9146c772333M53335M16779N70219L73399J37572j69556q64196q01933J125843
$$ -3772333 -3318998 -2902219 -2332000 -1958601 -1821029 -1990585 -2854781 -3656714 -2530871
9137b530871K607923L97098l331499k649838K568382N070433J210445k956379
$$ -2530871 77052 474150 -2857349 -5507187 -2938805 2131628 3342073 385694
9129C85694j226188L044589K962941q71452k490282n97859Q32038L39171L62170
$$ 385694 -840494 2204095 5167036 4295584 1805302 1207443 2039481 2378652 2740822
9120B740822J356506Q83125j136123j766493k90443O52048k35165j290180j473691
$$ 2740822 4097328 4980453 3844330 2077837 1787394 2439442 2204277 914097 -559594
9111e59594j647368j846927q99864Q88681J880911J861085J627598O23574j569276
$$ -559594 -2206962 -4053889 -4953753 -4065072 -2184161 -323076 1304522 1928096 358820
9102C58820k563286k01054K808057K069178j441512k711909o60592R00448L58098
$$ 358820 -2204466 -2405520 402537 2471715 1030203 -1681706 -2342298 -1441850 -1083752
9093a083752K69730J364146P69363j998934l153140j058529R32995O06145M27282
$$ -1083752 -814022 550124 1319487 -679447 -3832587 -4891116 -3958121 -3351976 -2924694
9084b924694K042819K615701K50993j875869q19659J165808J051181J28725L73766
$$ -2924694 -881875 1733826 1984819 108950 -710709 455099 1506280 1635005 2008771
9075B008771k061k477159l727225p31302L084904K739074k14194q14288N55520
$$ 2008771 2006710 -470449 -4197674 -4928976 -1844072 895002 680808 -133480 422040
9066D22040l81846l070730k481417J704838L664295O84453k735467k360983J9877
$$ 422040 40194 -3030536 -5511953 -3807115 -142820 541633 -2193834 -4554817 -4534940
9057d534940J203893J722252K815470K666347j47300k683968j512340J558320
$$ -4534940 -3331047 -1608795 1206675 3873022 3725722 1041754 -470586 1087734
9049A087734J900294q86014k453319l44500K330635J232699l179245n842715l204910
$$ 1087734 2988028 2102014 -351305 -695805 1634830 2867529 -311716 -6154431 -9359341
9040i359341K125038M141744Q95904k822807j864336K213261L728695J416828
$$ -9359341 -7234303 -3092559 -2196655 -5019462 -6883798 -4670537 -941842 474986
9032D74986k13391J368834K633478K14297l088859k557588J039992K789011Q86400
$$ 474986 261595 1630429 4263907 4478204 1389345 -1168243 -128251 2660760 3547160
9023C547160j730502k388083j356596L60664K196270K663291L66012k896199l318528
$$ 3547160 1816658 -571425 -1928021 -1567357 628913 3292204 3658216 762017 -2556511
9014b556511m32046J837077P82209j432209j562897N3932J057599J048094J175809
$$ -2556511 -2988557 -1151480 -369271 -1801480 -3364377 -3310445 -2252846 -1204752 -28943
9005b8943J208066k7779j884263k271262q30519M23448k9206j322797j555815
$$ -28943 1179123 1151344 -732919 -3004181 -3834700 -3411252 -3440458 -4763255 -6319070
8996f319070R7509K723044M164315K485980j755382m917758l595241J159290M470134
$$ -6319070 -6221561 -3498517 665798 3151778 1396396 -3521362 -7116603 -5957313 -1487179
8987a487179L230680k49184j406072O15972K026679j70717l551754l076397J867046
$$ -1487179 1743501 1494317 88245 704217 2730896 2560179 -991575 -4067972 -2200926
8978b200926N908316M537272R3499j865358m70399K82098j168856j529878R22378
$$ -2200926 3707390 8244662 8338161 6472803 6002404 6284502 5115646 3585768 4508146
8969D508146K447363k50882m135606m227172j060832J051394J158698J735891
$$ 4508146 6955509 6704627 2569021 -1658151 -2718983 -1667589 -508891 1227000
8961A227000K732966J338554k095944l430130j297495O19164l26798j845268j151436
$$ 1227000 3959966 5298520 3202576 -227554 -1525049 -905885 -1232683 -3077951 -4229387
8952d229387O77717J418929J356065J457690Q79830q64136j798285m09739J446167
$$ -4229387 -3551670 -2132741 -776676 681014 1560844 696708 -1101577 -1511316 -65149
8943f5149J243804m80120j541625j452371j013809l17723O11278Q51885K78716
$$ -65149 1178655 698535 -843090 -2295461 -3309270 -3626993 -3015715 -2163830 -1885114
8934a885114M08823J717116K278770J043825l8759N65884J149849M681j311358
$$ -1885114 -1476291 240825 2519595 3563420 3524661 4090545 5240394 5245075 3933717
8925C933717j049023p84468k223771l202846j147805J766621J667717n35431p55650
$$ 3933717 2884694 2100226 -123545 -3326391 -4474196 -2707575 -1039858 -1575289 -2330939
8916b330939J310663K029662K47993j216439p73889q4626k48384j99365L30794
$$ -2330939 -1020276 1009386 1257379 40940 -732949 -817575 -1065959 -1265324 -934530
8907i34530J06422o41887j76067J230864J302150k40663j269028j160674j319089
$$ -934530 -828108 -1469995 -1646062 -415198 886952 646289 -622739 -1783413 -3102502
8898c102502j535175p9801K057649J654568r95908j610058J194383L284021J529822
$$ -3102502 -4637677 -4717478 -2659829 -1005261 -2001169 -3611227 -2416844 867177 2396999
8889B396999j515802k170013q16854L71722J180616J691969L79977k711064m025871
$$ 2396999 881197 -1288816 -2105670 -1733948 -553332 1138637 1518614 -1192450 -5218321
8880e218321j396841J843002J461602j301791k015239Q8379J772801J371889O22509
$$ -5218321 -6615162 -4772160 -3310558 -4612349 -6627588 -6539209 -4766408 -3394519 -2772010
8871b772010R38729J284835M61698q62655j290538o10193J431n78079j678068
$$ -2772010 -1833281 -548446 -86748 -949403 -2239941 -2850134 -2848703 -3426782 -5104850
8862e104850j101880J635653L300948R23128k791544k196386K585284M764596
$$ -5104850 -6206730 -4571077 -1270129 -347001 -3138545 -5334931 -2749647 2014949
8854B014949Q53112l740810k901241J165705K346683L31609m32605P88616N00552
$$ 2014949 2868061 -872749 -3773990 -2608285 -261602 70007 -362598 426018 926570
8845I26570j646551j703435J383617L380466J599120q38713k38762K089421K470046
$$ 926570 -719981 -2423416 -1039799 2340667 3939787 3101074 2862312 4951733 7421779
8836G421779K25414k435270l821049l522842j420116J621222L148357J490748
$$ 7421779 7647193 5211923 1390874 -2131968 -3552084 -1930862 1217495 2708243
8828B708243j728448l186052j742140O07575J534841R29981L61605P49958J249097
$$ 2708243 979795 -2206257 -3948397 -3340822 -1805981 -876000 -514395 235563 1484660
8819A484660N54119j116352k079373j349382J46853J041060J292235J578633J664243
$$ 1484660 2038779 922427 -1156946 -2506328 -2359475 -1318415 -26180 1552453 3216696
8810C216696N62238j878455m334368m853238k299812K110490M684948K539783
$$ 3216696 3778934 1900479 -2433889 -7287127 -9586939 -7476449 -2791501 -251718
8802b51718k176924l610877N18204N183944M275536j190157m543995k335737K042729
$$ -251718 -2428642 -6039519 -5521315 -337371 3938165 2748008 -1795987 -4131724 -2088995
8793b088995L814246K265809l91427k464400l171042j839965J059898L261052
$$ -2088995 1725251 3991060 3599633 1135233 -2035809 -3875774 -2815876 445176
8785D45176K893817P73487p23598n37530L09173L79949n89121j570016j278239
$$ 445176 3338993 4112480 3388882 2851352 3160525 3540474 2951353 1381337 103098
8776A03098L99548J909460J553178l75615j773252j314329J5882M66164k31753
$$ 103098 502646 2412106 3965284 3589669 1816417 502088 517970 984134 752381
8767G52381r20741p52511N9758J011523J866153K230067J437478m36620j958040
$$ 752381 -168360 -920871 -861113 150410 2016563 4246630 5684108 5247488 3289448
8758C289448j738610l71755J78220o84378j455380j115901p08363j073620r16139
$$ 3289448 1550838 1179083 1357303 672925 -782455 -1898356 -2606719 -3680339 -4596478
8749d596478P52089K005595Q33287q25393K99288K948382K717726o06117k333865
$$ -4596478 -3844389 -1838794 -1005507 -1830900 -1531612 1416770 4134496 3528379 1194514
8740A194514p17937J38722k159495l517413m05919L281512K105157j915967k633908
$$ 1194514 476577 615299 -1544196 -5061609 -5467528 -2186016 -80859 -1996826 -4630734
8731d630734L04532J713657l7100j091023M78489J803013J077965N10683J480909
$$ -4630734 -4326202 -2612545 -2649645 -3740668 -3262179 -1459166 -381201 129482 1610391
8722A610391J834234K74691j025757n78773k08311j072681j066876J005120K426844
$$ 1610391 3444625 3719316 2693559 2114786 1906475 833794 -233082 772038 3198882
8713C198882R32768j264492j248434k16106p89273k085777j578334N2544J91498
$$ 3198882 4131650 2867158 1618724 1402618 613345 -1472432 -3050766 -2998222 -2806724
8704b806724q45173m98384J120178J295999k36396n08899J503971K764963R63297
$$ -2806724 -3651897 -4150281 -3030103 -1734104 -1970500 -2479399 -975428 1789535 2752832
8695B752832j741175k084747m50343M33189j1067K043Q88261Q14603q11160j608707
$$ 2752832 1011657 -1073090 -1523433 -1090244 -1101311 -1099268 -211007 603596 -207564 -1816271
8685a816271L26791L008549K891393j54514k696846k620219j552585j464918j381595
$$ -1816271 -1489480 1519069 4410462 4255948 1559102 -1061117 -2613702 -4078620 -5460215
8676e460215M29998K776372K854539O00700j066890n70816K69229n52279j948396
$$ -5460215 -5030217 -2253845 600694 1201394 134504 -436312 -167083 -719362 -2667758
8667b667758j279542J727507M152772L166884n90910l515375k990237j81528J836866
$$ -2667758 -3947300 -2219793 1932979 5099863 4508953 993578 -1996659 -2178187 -341321
8658c41321J945453J265902J74690k020018l969349k591892J591907L271995j95932
$$ -341321 1604132 2870034 3044724 1024706 -2944643 -5536535 -3944628 -672633 -868565
8649h68565l717269j525817L593492M219381j96274k788350l98634K103544O95628
$$ -868565 -4585834 -6111651 -2518159 1701222 1504948 -1283402 -1682036 421508 1117136
8640A117136j435162j57819K574286K661394O29937m26039m89606j297655j821314
$$ 1117136 -318026 -475845 2098441 4759835 5389772 4963733 4474127 3176472 1355158
8631A355158r0975K055549J007503k537349m099927j998870O73371J084269N8974
$$ 1355158 1264183 3319732 4327235 1789886 -2310041 -4308911 -3635540 -2551271 -2492297
8622b492297m49535l10937l82506p42416q60156m27741L55565O39363l72348j684678
$$ -2492297 -2941832 -3252769 -3635275 -4377691 -5237847 -5665588 -5310023 -4670660 -5043008 -6727686
8612f727686q29211K473791M592985K411435j845830l301549j146123Q21348K45419
$$ -6727686 -7556897 -5083106 -490121 1921314 75484 -3226065 -4372188 -3550840 -3305421
8603c305421r22211m48836P35372Q22070J83386P8763J82302n02121j475948j452941
$$ -3305421 -4227632 -4676468 -3941096 -3119026 -2935640 -2856877 -2674575 -3176696 -4652644 -6105585
8593f105585n38702J7315o6075K15797J259647J990673J532120Q14402J332731
$$ -6105585 -6644287 -6626972 -6693047 -6477250 -5217603 -3226930 -1694810 -880408 452323
8584D52323K479948J675500j905929n087375m172773p4038K649718K047350R58268
$$ 452323 2932271 4607771 2701842 -2385533 -6558306 -6632344 -3982626 -1935276 -977008
8575i77008J753569K327429P6076k922533k669830K70795J369043r50827l075422
$$ -977008 776561 3103990 3180066 257533 -2412297 -2141502 -772459 -1723286 -4798708
8566d798708j801603J280914K635715J495433q4291l22821O07134J143963o5353
$$ -4798708 -6600311 -5319397 -2683682 -1188249 -1272540 -1595361 -988227 155736 90383
8557I0383k344640k993384n51932K495952K582869K59797n53454J205522J968499
$$ 90383 -2254257 -5247641 -5799573 -3303621 -720752 -460955 -1014409 191113 2159612
8548B159612n84391l515577l066449j60243J703903J824768J984213K257989J083076
$$ 2159612 1575221 -1940356 -5006805 -5167048 -3463145 -1638377 345836 2603825 3686901
8539C686901r35182j090977J032236K456237J089777j544827l029478l073997
$$ 3686901 2751719 1660742 2692978 5149215 6238992 4694165 1664687 -1409310
8531a409310k355046n97189K044779L302645J170711k516638l430014j83320L561833
$$ -1409310 -3764356 -4361545 -2316766 985879 2156590 -360048 -3790062 -3973382 -411549
8522d11549L591949L98914j737902m63248J811415J518613j155162k761658j516210
$$ -411549 3180400 3579314 1841412 1378164 3189579 4708192 3553030 791372 -724838
8513g24838M39131M26524j001354j383475k66285M99990J75945L71012J968875
$$ -724838 -285707 140817 -860537 -2244012 -2510297 -2010307 -1834362 -1463350 505525
8504E05525K912805R56725k476437l502938r62623J660310O73181k753035l850807
$$ 505525 3418330 4375055 1898618 -1604320 -2566943 -906633 -233452 -2986487 -6837294
8495f837294n50177L474001L367475n41508l187716j472533K079420L474283K479686
$$ -6837294 -7387471 -3913470 -545995 -1087503 -4275219 -5747752 -3668332 -194049 2285637
8486B285637J302032J51934k103949l759199j411464L790702N621213J027922
$$ 2285637 3587669 3739603 1635654 -2123545 -3535009 255693 5876906 6904828
8478F904828m839278n299263q95792K576850K525265J227846K87730j285699l201645
$$ 6904828 2065550 -3233713 -4129505 -1552655 972610 2200456 2488186 1202487 -1999158
8469a999158k996348l25935J812526J584034N81866L68265K96303R7406R15497
$$ -1999158 -4995506 -5321441 -3508915 -1924881 -1343015 -974750 -678447 -581041 334456
8460C34456K178842J305177j601805k817341r48181N80335k74991l76363K343077
$$ 334456 2513298 3818475 2216670 -600671 -1548852 -968517 -1243508 -1619871 723206
8451G23206L812918L31846m149082l687665m4122M49422k412496k828950Q91966
$$ 723206 4536124 4867970 718888 -2968777 -3012899 -2563477 -4975973 -7804923 -6912957
8442f912957L933442L230430J180182J5191j014722j556582K27854K375461K65700
$$ -6912957 -2979515 250915 1431097 1446288 431566 -1125016 -897162 1478299 1743999
8433A743999m715607m861964J993221P389623M103074l033706m504178K99608
$$ 1743999 -2971608 -7833572 -5840351 1549272 5652346 2618640 -1885538 -1585930
8425a585930L849870K112251j464440k720006j733982n87012k93535o64948p93592
$$ -1585930 2263940 4376191 2911751 191745 -1542237 -2129249 -2422784 -3087732 -3881324
8416c881324K95632K002076K280922P21737m70341k5387M27320l58096j057842
$$ -3881324 -3585692 -1583616 697306 1419043 948702 923315 1350635 992539 -65303
8407f5303q55055j155178j903276l84075L253492M021731j76249l737786j742132
$$ -65303 -920358 -2075536 -3978812 -4362887 -1109395 2912336 2736087 -1001699 -2743831
8398b743831J572992l09952m752522l921357J974549M678315J128054k280618
$$ -2743831 -1170839 -1480791 -6233313 -10154670 -8180121 -3501806 -2373752 -4654370
8390d654370n72463K706227K622842M97006J55680J357295J286448m31416j764345
$$ -4654370 -5226833 -2520606 102236 599242 754922 2112217 3398665 2967249 1202904
8381A202904j498537j98993O46118l97778k823969l493672m89191L059966K713934
$$ 1202904 -295633 -494626 151492 -246286 -3070255 -6563927 -7053118 -3993152 -1279218
8372a279218m32727j387742N83625J192344q89688j702082M41072J565032n82733
$$ -1279218 -1711945 -3099687 -2516062 -1323718 -2213406 -3915488 -3474416 -1909384 -2492117
8363b492117j916821Q20721L722995J984671j833523j925192J373538K655320
$$ -2492117 -4408938 -3588217 134778 2119449 285926 -1639266 -265728 2389592
8355B389592K76431k015109j921389j472022k317393k832343j460660N23495J325054
$$ 2389592 2666023 650914 -1270475 -2742497 -5059890 -7892233 -9352893 -8829398 -7504344
8346g504344J258330J492276J883479J508760L69330n76890o99868l38821j82775
$$ -7504344 -6246014 -4753738 -2870259 -1361499 -992169 -1569059 -2268927 -2607748 -2790523
8337b790523l05579j57662L19744K36111p85113j389467j61674J963885K732539
$$ -2790523 -3096102 -3253764 -2934020 -2697909 -3483022 -4872489 -5034163 -3070278 -337739
8328c37739J712004M07743m66416j374275j731278l06480J712686J339360j441307
$$ -337739 1374265 1782008 1315592 -58683 -1789961 -2096441 -383755 955605 -485702
8319d85702k779269n00968K519080K675467N87579p88997p02956m24603k08437
$$ -485702 -3264971 -3765939 -1246859 1428608 2016187 1227190 524234 99631 -108806
8310a08806O32315J517063J051833n80931j598689r83519L08242N27158q84808
$$ -108806 523509 2040572 3092405 2511474 912785 -70734 237508 764666 -120142
8301a20142k318205j471651J378440K766640O13927k014894r50049K361623K598685
$$ -120142 -2438347 -3909998 -2531558 235082 849009 -1165885 -2115934 245689 2844374
8292B844374j089513l609563j896663Q43051R96938k55071m72131k31972n94454
$$ 2844374 1754861 -1854702 -3751365 -2908314 -1911376 -2166447 -2638578 -2870550 -3465004
8283c465004k73374J278126J712435M3175q54791N27593R30983j720043l492510
$$ -3465004 -3738378 -2460252 -747817 -704642 -1559433 -1031840 -100857 -1820900 -5313410
8274e313410p28315L026692K421807q70259j378801Q80515J521805K94292Q88376
$$ -5313410 -6041725 -3015033 -593226 -1463485 -2842286 -1961771 -439966 -145674 742702
8265G42702L016629K350471j203360k490220J65618J966746k78139l043937k176266
$$ 742702 3759331 6109802 4906442 2416222 2581840 4548586 4270447 1226510 -949756
8256i49756P33810J562472k17082j890526j751367m43299N91126N22903p7333
$$ -949756 -215946 1346526 1129444 -761082 -2512449 -2955748 -2364622 -1841719 -1919052
8247a919052L03863J705911J738191q77799l355578k509362K39103J395566J298729
$$ -1919052 -1615189 90722 1828913 951114 -2404464 -4913826 -4674723 -3279157 -1980428
8238a980428K590933M023289J776009l092926m813182j609150J741932J760332
$$ -1980428 610505 4633794 6409803 3316877 -1496305 -3105455 -1363523 396809
8230C96809Q07231J388995J609245l45437k050523r84751J028976J123919j40237
$$ 396809 1204040 2593035 4202280 3856843 1806320 821569 1850545 2974464 2834227
8221B834227q47008j172730j698481j259988N18716J416089K15517q06407J21108
$$ 2834227 1987219 814489 -883992 -2143980 -1625264 -209175 6342 -800065 -678957
8212f78957Q77147o90045k525494j690599O43657J427274Q35950J091527J746082
$$ -678957 198190 -491855 -3017349 -4707948 -4064291 -2637017 -1801067 -709540 1036542
8203A036542L30116k905423m597864k795860P55041L061127K877226J339722O46538
$$ 1036542 1366658 -1538765 -6136629 -8932489 -8177448 -5116321 -2239095 -899373 -252835
8194b52835J565121J940587o91500m695634n271205r45030L880067M721596K435280
$$ -252835 1312286 3252873 2561373 -2134261 -7405466 -8350496 -4470429 251167 2686447
8185B686447N16287j96423j170569k648543l441858k979039j480805N34024J651903
$$ 2686447 3202734 3006311 1835742 -812801 -4254659 -7233698 -8714503 -8180479 -6528576
8176f528576O49073p93568M26288L401910L405195m79985k806577j20409L203349
$$ -6528576 -5879503 -6673071 -6246783 -2844873 560322 80337 -2726240 -2846649 356700
8167C56700K077270j089754j074152J321169J789080P26720J588669L188005J405217
$$ 356700 2433970 1344216 270064 1591233 3380313 4107033 5695702 8883707 10288924
8158A0288924k479224l067827l68480o5569l385562m709140j408537J665455Q42190
$$ 10288924 7809700 4741873 4373393 4307824 922262 -3786878 -5195415 -3529960 -2687770
8149b687770l73719J574023L443582J037936k919021k861524Q13224K913949J557924
$$ -2687770 -3061489 -1487466 1956116 2994052 75031 -2786493 -1973269 940680 2498604
8140B498604k89918m55884O2006J69401R2970m53587k126652l685049k871252
$$ 2498604 2208686 1752802 1814808 1984209 2077179 1623592 -503060 -4188109 -7059361
8131g059361J398K034811J878033J320073J879034K227597N87714k050996l079978
$$ -7059361 -7057963 -5023152 -3145119 -1825046 53988 2281585 2869299 818303 -2261675
8122b261675j833185j27907N97519Q86858J486057J629053M91704p33011k07447
$$ -2261675 -4094860 -4222767 -3625248 -2738390 -1252333 376720 868424 135413 -72034
8113g2034J417246J486877o29820k323391j640039j26678M741m58858N99201K625479
$$ -72034 1345212 2832089 2202269 -121122 -1761161 -1887839 -1883098 -2341956 -1742755 882724
8103H82724K876302M62070k469962l512011k162283M37913K304681J768995n50320
$$ 882724 3759026 4221096 1751134 -1760877 -3923160 -3485247 -1180566 588429 38109
8094C8109j817276o04517J011157R15995M18088J340114J931635j89151k791688
$$ 38109 -1779167 -2383684 -1372527 -456532 -38444 1301670 3233305 3044154 252466
8085B52466j824877J497595K143148k58768p16606K169468L247198l50094l693141
$$ 252466 -1572411 -74816 2068332 1809564 1092958 3262426 6509624 6159530 2466389
8076B466389j795826K300907K570822o99057k486756j391006m72625r81238r07168
$$ 2466389 670563 2971470 5542292 4843235 2356479 965473 492848 -488390 -1395558
8067a395558K70690L78469j183566k059958q67140Q24029J458297J562915J780876
$$ -1395558 -1124868 -746399 -1929965 -3989923 -4857063 -4033034 -2574737 -1011822 769054
8058G69054J399245J04184q14326k90447Q83874J227663L98827o90625q64931
$$ 769054 2168299 2272483 1458157 1167710 2051584 3279247 3678074 2987449 2122518
8049B122518K02935J161957n5983l257899n025001k707048J484847K995822J149260
$$ 2122518 2325453 3487410 3431427 173528 -4851473 -7558521 -6073674 -3077852 -1928592
8040a928592k49670J070647K531648R50390k572402m278726k671603L45851K321765
$$ -1928592 -2178262 -1107615 1424033 2374423 -197979 -4476705 -7148308 -6802457 -4480692
8031d480692K407144J233297K02222N80872K112483K865525J443139j099448k465696
$$ -4480692 -2073548 -840251 -638029 -57157 2055326 4920851 6363990 5264542 2798846
8022B798846j751774k5358J071162M17710j949695m107833l253900P92343M063434
$$ 2798846 1047072 1021714 2092876 2510586 560891 -3546942 -6800842 -6008499 -1945065
8013a945065K789123j280295k777923l2945K839020K194039k42867r62192j33027
$$ -1945065 844058 -436237 -3214160 -3247105 -408085 1785954 1543087 580895 447868
8004D47868k13802j177635r35476M42642O71349p47323j789904j305290j36404
$$ 447868 234066 -943569 -1879045 -1436403 -765054 -1512377 -3302281 -4607571 -4743975
7995d743975J167942K640361K945612P10435k013163j623681J127792J595398
$$ -4743975 -3576033 -935672 2009940 2720375 707212 -916469 211323 1806721
7987A806721j290878l028403j039240J142752L29092r31479K89225J457759m83695
$$ 1806721 515843 -2512560 -3551800 -2409048 -2079956 -3011435 -2722210 -1264451 -1748146
7978a748146k560092n12870L140102K761558r05635k157932L7921J245277l7837
$$ -1748146 -4308238 -4821108 -1681006 1080552 174917 -1983015 -1945094 -699817 -737654
7969g37654o33677K76147k17750j981252j062903K496026L373726L2296k139644
$$ -737654 -1371331 -1095184 -1312934 -3294186 -4357089 -1861063 1512663 1544959 -594685
7960e94685q8928J611509q55941l535347j605537K294309K814950N38023m31158
$$ -594685 -683613 927896 71955 -3463392 -5068929 -2774620 40330 578353 147195
7951A47195J2661p92796k139999j247003J044901J520037K11914l56059k07199
$$ 147195 159856 -632940 -2772939 -4019942 -2975041 -1455004 -1243090 -1599149 -1806348
7942a806348j103824j952418k87396K479516K593062L66072k20224J545908J877378
$$ -1806348 -2910172 -4862590 -5149986 -2670470 -77408 288664 68440 1614348 3491726
7933C491726q32515l043212j666245J339092K264887O68039j168209j842312j851320
$$ 3491726 2659211 -384001 -2050246 -711154 1553733 2221772 1053563 -788749 -2640069
7924b640069j928074j808386o52011J537531L089544K215477l07149j539550k22333
$$ -2640069 -4568143 -6376529 -7028540 -5491009 -2401465 -185988 -493137 -2032687 -2255020
7915b255020J636497J978886J209267K16572j309009k725275j720630J690656
$$ -2255020 -618523 1360363 2569630 2786202 1477193 -1248082 -2968712 -1278056
7907a278056L571651J559894j111920o35758J448862J486735j60103r46861j294151
$$ -1278056 2293595 3853489 2741569 2105811 3554673 5041408 4881305 3934444 2640293
7898B640293k597898k714516N16445L421322J015551l990049m156503R98575M029636
$$ 2640293 42395 -2672121 -2155676 1265646 2281197 -1708852 -5865355 -4866780 -837144
7889h37144J231911k373373j962935K76933O17279k8868N75939J340602O08979
$$ -837144 394767 -1978606 -3941541 -3664608 -3047329 -3076197 -2500258 -1159656 -550677
7880e50677j94653O13363J642715J140262J75523K26552L19107o84295j499254
$$ -550677 -745330 -131967 1510748 2651010 2826533 3053085 3372192 2687897 1188643
7871A188643p35615N06320O85724K90606K56220J56053k20909J71700J389763
$$ 1188643 453028 959348 1645072 1935678 2191898 2347951 2127042 2298742 3688505
7862C688505J606431Q3051j415725j630581j570546j843306j170777P48746J851244
$$ 3688505 5294936 5377987 3962262 2331681 761135 -1082171 -2252948 -1504202 347042
7853C47042J048244J78081Q41709K051303K618373K849562K301143o24136m798758
$$ 347042 1395286 1573367 2415076 4466379 7084752 9934314 12235457 11611321 6812563
7844F812563n789379j874686K627913K981419Q4412j976374j675194l54007P90406
$$ 6812563 1023184 -851502 1776411 4757830 4842242 2865868 1190674 836667 1627073
$$ [...]
##END NTUPLES=NMR SPECTRUM
##END=
