##TITLE=31Pdec_SR39H
 D2O, 24 sc
 11.03.2021
##JCAMPDX= 6.0         $$ Bruker NMR JCAMP-DX V2.0
##DATA TYPE= NMR SPECTRUM
##DATA CLASS= NTUPLES
##ORIGIN= UXNMR, Bruker Analytische Messtechnik GmbH
##OWNER= root
$$ XWIN-NMR		Version 3.5
$$ Thu Mar 11 13:45:26 2021 Russian Standard Time (UT+4h)  she@DPX200
##.OBSERVE FREQUENCY= 81.013821
##.OBSERVE NUCLEUS= ^31P
##.ACQUISITION MODE= SIMULTANEOUS
##.ACQUISITION SCHEME= undefined
##.AVERAGES= 24
##.DIGITISER RES= 16
##SPECTROMETER/DATA SYSTEM= spect
##.PULSE SEQUENCE= zgpg30
##.SOLVENT NAME= MeOD
##.SHIFT REFERENCE= (INTERNAL, MeOD, 0, 248.564)
##AUDIT TRAIL= $$ (NUMBER, WHEN, WHO, WHERE, WHAT)
$$ ##TITLE= Audit trail, XWIN-NMR		Version 3.5
$$ ##JCAMPDX= 5.01
$$ ##ORIGIN= Bruker BioSpin GmbH
$$ ##OWNER= she
$$ F:/spectra/data/she/nmr/P31/1/pdata/1/auditp.txt
$$ ##AUDIT TRAIL=  $$ (NUMBER, WHEN, WHO, WHERE, WHAT)
(   1,<2021-03-11 13:44:26.28 +0400>,<she>,<DPX200>,
      <created by zg, POWCHK disabled, PULCHK disabled
       configuration hash MD5:
       00 E9 B6 7A A2 85 ED C7 34 08 36 98 17 FE 4E 26
       data hash MD5: 32K
       AA A5 C8 A8 AA EA F4 22 44 15 56 92 34 6F 04 6E>)
(   2,<2021-03-11 13:44:28.85 +0400>,<she>,<DPX200>,
      <Start of raw data processing
       efp BC_mod = 2 LB = 1 FT_mod = 6 PKNL = 1 PHC0 = -4001.147 PHC1 = -92.39894 SI = 64K 
       data hash MD5: 64K
       E8 3D 8E 4A 78 67 C2 B6 43 79 7D 33 0F 6C 49 35>)
(   3,<2021-03-11 13:44:59.93 +0400>,<she>,<DPX200>,
      <pk PHC0 = -76.73936 PHC1 = 172.7999 
       data hash MD5: 64K
       40 37 C1 3C 0B 1D 51 BB D5 E9 C8 60 E4 B7 45 64>)
$$ ##END=
$$ 
$$ hash MD5
$$ 84 E5 D5 37 53 31 F5 A5 B3 96 39 8D 15 8F 6F 55
##$RELAX= 
##$RELAX= 
##$RELAX= 
##$RELAX= 
##$RELAX= 
##$RELAX= 
##$RELAX= 
##$RELAX= 
$$ Bruker specific parameters
$$ --------------------------
##$DU= <F:/spectra>
##$EXPNO= 1
##$NAME= <P31>
##$PROCNO= 1
##$TYPE= <nmr>
##$USER= <she>
##$AMP= (0..31)
100 100 100 100 100 100 100 100 100 100 100 100 100 100 100 100 100 100 
100 100 100 100 100 100 100 100 100 100 100 100 100 100 
##$AQSEQ= 0
##$AQ_mod= 1
##$AUNM= <au_zg>
##$AUTOPOS= <>
##$BF1= 81.014009
##$BF2= 200.13
##$BF3= 200.13
##$BF4= 200.13
##$BF5= 200.13
##$BF6= 200.13
##$BF7= 200.13
##$BF8= 200.13
##$BYTORDA= 1
##$CFDGTYP= 0
##$CFRGTYP= 5
##$CHEMSTR= <none>
##$CNST= (0..31)
1 1 145 1 1 1 1 1 1 1 1 1 1 1 1 1 1 1 1 1 1 1 1 1 1 1 1 1 1 1 1 1 
##$CPDPRG= <waltz16>
##$CPDPRG1= <>
##$CPDPRG2= <waltz16>
##$CPDPRG3= <>
##$CPDPRG4= <mlev>
##$CPDPRG5= <mlev>
##$CPDPRG6= <mlev>
##$CPDPRG7= <mlev>
##$CPDPRG8= <mlev>
##$CPDPRGB= <>
##$CPDPRGT= <>
##$D= (0..31)
0 1 0 0 0 0 0 0 0 0 0 0.03 2e-05 3e-06 0 0 0 0 0 0 0 0 0 0 0 0 0 0 0 0 
0 0 
##$DATE= 1615455865
##$DBL= (0..7)
120 120 120 11 120 120 24 19 
##$DBP= (0..7)
150 150 150 150 150 150 150 150 
##$DBP07= 0
##$DBPNAM0= <>
##$DBPNAM1= <>
##$DBPNAM2= <>
##$DBPNAM3= <>
##$DBPNAM4= <>
##$DBPNAM5= <>
##$DBPNAM6= <>
##$DBPNAM7= <>
##$DBPOAL= (0..7)
0.5 0.5 0.5 0.5 0.5 0.5 0.5 0.5 
##$DBPOFFS= (0..7)
0 0 0 0 0 0 0 0 
$$ [...]
##$SUBNAM2= <"">
##$SUBNAM3= <"">
##$SUBNAM4= <"">
##$SUBNAM5= <"">
##$SUBNAM6= <"">
##$SUBNAM7= <"">
##$SUBNAM8= <"">
##$SUBNAM9= <"">
##$SW= 501.771253377433
##$SWIBOX= (0..15)
0 1 3 0 0 0 0 0 0 0 0 0 0 0 0 0 
##$SW_h= 40650.406504065
##$TD= 32768
##$TD0= 1
##$TE= 0
##$TE2= 300
##$TE3= 300
##$TEG= 300
##$TL= (0..7)
0 120 53 12 22 120 120 120 
##$TP= (0..7)
150 150 150 150 150 150 150 150 
##$TP07= 0
##$TPNAME0= <>
##$TPNAME1= <>
##$TPNAME2= <>
##$TPNAME3= <>
##$TPNAME4= <>
##$TPNAME5= <>
##$TPNAME6= <>
##$TPNAME7= <>
##$TPOAL= (0..7)
0.5 0.5 0.5 0.5 0.5 0.5 0.5 0.5 
##$TPOFFS= (0..7)
0 0 0 0 0 0 0 0 
##$TUNHIN= 0
##$TUNHOUT= 0
##$TUNXOUT= 0
##$USERA1= <user>
##$USERA2= <user>
##$USERA3= <user>
##$USERA4= <user>
##$USERA5= <user>
##$V9= 5
##$VALIST= <valist>
##$VCLIST= <CCCCCCCCCCCCCCC>
##$VD= 0
##$VDLIST= <DDDDDDDDDDDDDDD>
##$VPLIST= <PPPPPPPPPPPPPPP>
##$VTLIST= <TTTTTTTTTTTTTTT>
##$WBST= 1024
##$WBSW= 4
##$XGAIN= (0..3)
0 0 0 0 
##$XL= 0
##$YL= 0
##$YMAX_a= 12534
##$YMIN_a= -11775
##$ZGOPTNS= <>
##$ZL1= 120
##$ZL2= 120
##$ZL3= 120
##$ZL4= 120
##$ABSF1= 0
##$ABSF2= 0
##$ABSG= 0
##$ABSL= 0
##$ALPHA= 0
##$AQORDER= 0
##$ASSFAC= 0
##$ASSFACI= 0
##$ASSFACX= 0
##$ASSWID= 0
##$AUNMP= <proc_1d>
##$AZFE= 0.1
##$AZFW= 0.5
##$BCFW= 0
##$BC_mod= 2
##$BYTORDP= 0
##$COROFFS= 0
##$CY= -3
##$DATMOD= 1
##$DC= 0
##$DFILT= <>
##$DTYPP= 0
##$F1P= 0
##$F2P= 0
##$FCOR= 1
##$FTSIZE= 65536
##$FT_mod= 6
##$GAMMA= 0
##$GB= 0
##$INTBC= 1
##$INTSCL= 5.30512e-09
##$ISEN= 30
##$LB= 1
##$LEV0= 0
##$LPBIN= 0
##$MAXI= 10000
##$MC2= 0
##$MEAN= 0
##$ME_mod= 0
##$MI= 50
##$NCOEF= 0
##$NC_proc= -5
##$NLEV= 6
##$NOISF1= 182.463
##$NOISF2= 159.3651
##$NSP= 0
##$NTH_PI= 0
##$NZP= 0
##$OFFSET= 248.5645
##$PC= 4
##$PHC0= -4077.886
##$PHC1= 80.40096
##$PH_mod= 1
##$PKNL= yes
##$PPARMOD= 0
##$PSCAL= 0
##$PSIGN= 0
##$REVERSE= no
##$SF= 81.014009
##$SI= 65536
##$SIGF1= 159.3651
##$SIGF2= -187.1042
##$SINO= 113.3802
##$SIOLD= 16384
##$SREGLST= <1H.CDCl3>
##$SSB= 0
##$STSI= 65536
##$STSR= 0
##$SW_p= 40650.406504065
##$SYMM= 0
##$S_DEV= 0
##$TDeff= 32768
##$TDoff= 0
##$TI= <>
##$TILT= no
##$TM1= 0
##$TM2= 0
##$TOPLEV= 0
##$USERP1= <user>
##$USERP2= <user>
##$USERP3= <user>
##$USERP4= <user>
##$USERP5= <user>
##$WDW= 1
##$XDIM= 65536
##$YMAX_p= 521229423
##$YMIN_p= -100576566
$$ End of Bruker specific parameters
$$ ---------------------------------
##NTUPLES= NMR SPECTRUM
##VAR_NAME=  FREQUENCY,     SPECTRUM/REAL,   SPECTRUM/IMAG
##SYMBOL=    X,             R,               I
##VAR_TYPE=  INDEPENDENT,   DEPENDENT,       DEPENDENT
##VAR_FORM=  AFFN,          ASDF,            ASDF
##VAR_DIM=   65536,         65536,           65536
##UNITS=     HZ,            ARBITRARY UNITS, ARBITRARY UNITS
##FACTOR=    0.620285442955139, 1,           1
##FIRST=     20137.2065510759, 0,            0
##LAST=      -20513.1999529892, 0,           0
##MIN=       -20513.1999529892, -100576566,  0
##MAX=       20137.2065510759, 521229423,    0
$$ Real data points
##PAGE= N=1
##DATA TABLE= (X++(R..R)), XYDATA
$$ [...]
40154a587967N77017j70069l40655l9732J27088o4598j71849K60635Q30430O09373
40144B9673l49925o82179K84869J116960L11312j000836m77466J513235J915250
40135B660893m30047k703112k056488L95452J499152N28847m88172j49432P80368
40126C7461J073255N36177l53375j035862r75375j58346N48057L87140j60322
40117a01190j35306L50639M01449o8473k14047K60725N95267J49495p37692j278634
40107g77767j062733k87151M44684O78880O84315R76974J084407j37426k312405
40098g08222l074997j159388J291039J428853j90795n90328R26234J773549K46920
40089e7135j890929k190755q65639K05351L93849N42921J064227J362787R45836
$$ y = [-1587967, -1010950, -1181019, -1521674, -1561406, -1434318, -1498916, -1670765, -1410130, -579700, 29673, -320252, -1002431, -717562, 399398, 710710, -290126, -767592, 745643, 2660893, 2230846, -472266, -2528754, -2133302, -634150, -105303, -593475, -742907, 37461, 1110716, 1646893, 1293518, 257656, -717719, -876065, -328008, 59132, -101190, -236496, 114143, 515592, 447119, 233072, 493797, 1089064, 1238559, 500867, -777767, -1840500, -2127651, -1682967, -1004087, -319772, 657202, 1741609, 1604183, -708222, -3783219, -4942607, -3651568, -2222715, -2413510, -3003838, -2077604, -304055, -57135, -1948064, -4138819, -5004458, -4799107, -4405258, -3862337, -2798110, -1435323, -489487]
40080d89487Q1888n74336m91504L15862J037986P43505l75763j056653o04583
40071a413085K31770M31952j1434m80932o76224o00874k40903K19124M24050M52806
40061a663750P14679R96623N83265l20026n18403J92828L82817o67699j436555
40052a736221n08977Q41402N01030r11663q45803R69882J830092K72544j529729
40043a117443j096878O54170J120983Q6212l97144L42273O69537k66179r26431
40034i30900l1489J105965O15531q67846j205517j21547O06717J94967j36198
40025g70317L50937N49613l38330j142955o67226K08853P3199n44503j70041R66829
40015a483941J342138P32846L13374L51496m4987p82269n83449O01417J120233
$$ y = [-489487, -407599, -981935, -1473439, -1157577, -119591, 623914, 248151, -808502, -1413085, -1181315, -749363, -760797, -1241729, -1917953, -2518827, -2759730, -2540606, -2116556, -1663750, -949071, 47552, 630817, 310791, -207612, -14784, 368033, -299666, -1736221, -2245198, -1403796, -902766, -1814429, -2660232, -1690350, 139742, 412286, -1117443, -2214321, -1560151, -439168, -352956, -750100, -407827, 261710, -4469, -930900, -962389, 143576, 759107, -108739, -1314256, -1435803, -829086, -634119, -770317, -419380, 130233, -208097, -1351052, -2018278, -1809425, -1736226, -2280729, -2450770, -1483941, -141803, 591043, 904417, 1255913, 1210926, 428657, -154792, 446625, 1566858]
40006A566858L20535l11447K42972P59384K3035r12625n38862M09715J50221j121160
39996E88626j552098o29129K20113J21822l6156N59088J149928O67304n23480
39987E66018j144541p67322j43808P5415J36658M64135P79199N51438L4134k2348
39977E28978K31443k71000j560215j886106j61331J875554J750597j05150r96431
39968e93661q0597O68812M1595n43239R3713O66737j58495j216719q25636L53242
39958a594248O81546L85292O62575J111183N86347k48861Q8509R23766K27741
39949B823850j770834k565043j195435N23576J062870R46293P90927O6849j147775
39940d64722j406840j77824R81909Q02499J62965K85509O66302K44633o98970
$$ y = [1566858, 1887393, 1575946, 1818918, 2578302, 2601337, 1688712, 1149850, 1559565, 1709786, 588626, -963472, -1592601, -1372488, -1250666, -1286822, -727734, 422194, 1089498, 566018, -578523, -1345845, -1489653, -1414238, -1277580, -813445, -34246, 517192, 551326, 528978, 760421, 489421, -1070794, -2956900, -3118231, -1242677, 507920, 402770, -593661, -674258, -5446, 36149, -507090, -413377, 253360, 94865, -1121854, -1947490, -1594248, -912702, -527410, 135165, 1246348, 1832695, 1583834, 1672343, 2596109, 2823850, 1053016, -1512027, -2707462, -2183886, -1121016, -174723, 616204, 683053, -464722, -1871562, -2049386, -1067477, -264978, -102013, 183496, 849798, 1094431, 395461]
39931C95461j237475j281570j102622m60241N71620J002916L97749j35074L22323
39922a526913R28033O51635K04633O66369J224159L68617j252549j393847L86084
39913B56221J871838J165101j017170k541842k207856m45375J396375K029905
39905E07197J156353k97803j222242j423994j236869o02779N29241J368230J066479
39896a56187J27715j96701J99472K89895j86687k82587M14094R73756O21722j27185
39886A677307m75529m79063m90404l58419N9698L05838P856l74123j80422M61429
39876A54168Q44308N57908k36428j046371j270371o21756L90505Q59044N50581
39867A81588N9846j82499l06543l00643J05539N81444L42374l98747l96822N38653
$$ y = [395461, -842014, -2123584, -3226206, -3686447, -3114827, -2111911, -1714162, -1849236, -1526913, -598880, 52755, 257388, 923757, 2147916, 2516533, 1263984, -129863, 256221, 2128059, 3293160, 2275990, -265852, -2473708, -2919083, -1522708, 507197, 1663550, 1365747, 143505, -1280489, -2517358, -3120137, -2590896, -1222666, -156187, -28472, -225173, -25701, 264194, 77507, -205080, 209014, 1182770, 1804492, 1677307, 1201778, 722715, 232311, -126108, -66410, 239428, 247284, -126839, -307261, 154168, 998476, 1556384, 1319956, 273585, -996786, -1618542, -1228037, -368993, 181588, 241434, 58935, -247608, -548251, -442712, 138732, 481106, 82359, -314463, 224190]
39857B24190Q79063j22484p97282M12788K120621J908886K30417k26562J146897
39848E776534K036506J201616N10517J679014L469497M084643M269289N427285
39840B8454901O055581L254205k397904o514986o269085l696102k408720k988570
39832A3489320l370798k415046j006035j56774N0908l40226j336586k083608j339828
39823A491327N32400J434857K95312j243197j111306J99974N54566n03765j281923
39814C68245q36169k97512n55997n18069Q65576K257136J598882n77765j634497
39805F69830n92461O09947J59486j133550j409200m37877O10313J162105J540541
39796A179134J684018R90597m54523j565155j506042o12869J88830M08124K28107
$$ y = [224190, 1103253, 980769, 183487, 596275, 2716896, 4625782, 4856199, 4629637, 5776534, 7813040, 9014656, 9525173, 11204187, 14673684, 18758327, 23027616, 28454901, 34510482, 37764687, 35366783, 28851797, 22582712, 18886610, 16477890, 13489320, 10118522, 7703476, 6697441, 6540667, 6591575, 6251349, 4914763, 2831155, 1491327, 2023727, 3458584, 3753896, 2510699, 1399393, 1599367, 2153933, 1650168, 368245, -467924, -765436, -1321433, -1839502, -973926, 1283210, 2882092, 2304327, 669830, 77369, 687316, 846802, -286748, -1695948, -2133825, -1523512, -361407, 1179134, 2863152, 3853749, 3399226, 1834071, 328029, -284840, -96010, 312114, 540221]
39787E40221P6604J57769K69075O7022m08055o60868l65816J94442N47246N76121
39777I93761L63781j10957o81677p89908j69698N27533M36698l49096r41071q64725
39767a585359m25352P9533P28368J374300J388825M44762q26370j366108p74409
39758i61810L06552Q33994L85703l94180n07144J54567O18918J71963n56709m43728
39748c91874M67310R42775K48978q54692j132643m05200L79558M44407J17343
39739a84038K25674P36558O10198n81635j513923o56164J246991J712733p5776
39730A520618j945051j741815k44622L34905l84062r42380n75297J19139P28335
39721c130230J433106J900930J424714K96976l85298l62659l26852m77986m09721
$$ y = [540221, 616825, 774594, 1043669, 1110691, 702636, 41768, -324048, -129606, 417640, 993761, 1357542, 1246585, 564908, -225000, -394698, 132835, 569533, 220437, -720634, -1585359, -2010711, -1931178, -1202810, 171490, 1560315, 2005077, 1178707, -187401, -961810, -655258, 178736, 564439, 170259, -336885, -182318, 436600, 608563, 51854, -391874, 75436, 1018211, 1267189, 412497, -720146, -1125346, -745788, -301381, -184038, 41636, 778194, 1388392, 806757, -707166, -1363330, -116339, 1596394, 1520618, -424433, -2166248, -2410870, -2075965, -2460027, -3402407, -3977704, -3858565, -3130230, -1697124, 203806, 1628520, 1925496, 1540198, 1177539, 850687, 372701, -37020]
39712c7020k96504o07179p80682M7946J124762Q74691m02093q52198j97998m2123
39702a168398o88646m69731R47715J529848M35332l43695L85585P19862p33179
39693F14693j832492m41347J493489R16475j160049j332430N30722J365479K14276
39684C68816n87405J55955O47735l40463j317455q75647L5701J86485J94440R28300
39674f03538J547397Q45568o40463j354742p85360K97204J050550J181060Q27510
39665B365186L62701q007m90728j078369j075283j35666P40011N03302j66835
39656A016312M8612P55944N36769l64246l79068L80866Q8997j408047j948336
39647a272197p34751J33660p17460j448750j86215J619713J542775J35408k43578
$$ y = [-37020, -333524, -940703, -1721385, -1673439, -548677, 326014, -76079, -928277, -1126275, -1168398, -1857044, -2326775, -1379060, 150788, 586120, 242425, 628010, 1347872, 614693, -1217799, -1659146, -165657, 750818, -409231, -1741661, -1210939, 154540, 368816, -218589, -62634, 585101, 244638, -1072817, -1948464, -1912763, -1726278, -1531838, -603538, 943859, 1789427, 1148964, -205778, -991138, -693934, 356616, 1537676, 2365186, 2727887, 2719880, 2229152, 1150783, 75500, -60166, 679845, 1183147, 1016312, 1064924, 1820868, 2357637, 1993391, 1614323, 1995189, 2084186, 676139, -1272197, -2006948, -1873288, -2590748, -4039498, -4225713, -2606000, -1063225, -927817, -1171395]
39638a171395O22247R10750K09107k4049N39563L52836j093889j926841o41344
39629b223015J464271K025985P86142l91125k64722L39464M2783j078016j697198
39620i95431j112432q2952M00008M26335O29982R08283O38404o0020l44608P610
39610D15179K76425J597m38196o75382q13614p51694o5683J011196J463803Q68408
39600A292039K6489k64805k18158l20857m34321k07735K77625P07309P79756J41228
39590A778570j076370j684957o47773J052596J285109j80467j240406o50329K96794
39581a067233K77364R3941P76191J326499L81472j177050j428077l80651L36533
39572h61011J67541j7752Q5859j25018n55693k99832O48804J128775N79141k12103
$$ y = [-1171395, -549148, 361602, 570709, 546660, 1086223, 1439059, 345170, -1581671, -2223015, -758744, 1267241, 2053383, 1662258, 1397536, 1737000, 1779783, 701767, -995431, -2107863, -2190815, -1790807, -1364472, -734490, 173793, 812197, 752177, 407569, 415179, 691604, 693201, 255005, -420377, -1233991, -1985685, -2051368, -1040172, 423631, 1292039, 1318528, 1053723, 835565, 514708, 80387, -127348, 150277, 857586, 1637342, 1778570, 702200, -982757, -1630530, -577934, 707175, 526708, -713698, -1364027, -1067233, -789869, -695928, 80263, 1406762, 1788234, 611184, -816893, -1197544, -861011, -693470, -711222, -625363, -750381, -1306074, -1605906, -957102, 171673, 750814, 538711]
39562E38711m34232k05395J07680N22424R93111J051143K97437j027866k030188
39553a87175j687274J01924J798831J458786p39309k206616j101603J203828K014141
39544F55533Q19617n32962o24967J04868N42616K24127n29237r17785k80758R45631
39534D06683J404503O03194l13558l61752j54720m58606o41189o8393K74566n49073
39524A41655j342658n72048P99352P91549j30916M3453J048677O67247j079650
39515C66661j491584L04444J669603O53429j001067q78588M54295R05549J83779
39506A166521m41502m68195l39682j37530L05442N90212K66372l88150r03292
39497c49804j163688q71604L54337J710313J532255k02064j314311n45633M83350
$$ y = [538711, 104479, -100916, 6764, 529188, 1522299, 2573442, 2870879, 1843013, -187175, -1874449, -1772525, 26306, 1485092, 745783, -1460833, -2562436, -1358608, 655533, 1475150, 942188, 317221, 422089, 964705, 1188832, 659595, -258190, -538948, 406683, 1811186, 2414380, 2100822, 1739070, 1584350, 1125744, 484555, 416162, 690728, 141655, -1201003, -1773051, -973699, -182150, -313066, -269613, 779064, 1446311, 366661, -1124923, -820479, 849124, 1502553, 501486, -377102, 77193, 982742, 1166521, 725019, 256824, -82858, -220388, 85054, 675266, 941638, 553488, -349804, -1513492, -2385096, -2030759, -320446, 1211809, 1009745, -304566, -850199, -366849]
39488c66849p672j001859n72516O50838N05098r24596j286221K27429J565564
39479a210784R95365m46650p54981K24160R87872N96186l71359p89610k14610
39470i84411Q11679J345678R41286L0230o43542q10330o97310n14190l11419k18998
39460a051327l77156n79058l20100N99056J590083J606035K49137j403912j614255
39451a301497o1345J431622J042533o48317j528300r06697q8878N6714L11778
39442a692387J211684J635215N44286j094670j559295p36582J30402M64784P25648
39433c70915J057038R01908M7933q71425j063653k71977J050217J870196J339358
39424C688680q7560r04125m91640j969n04146j201201p52124L79360N10893o14870
$$ y = [-366849, -374521, -1376380, -1948896, -1298058, -792960, -1717556, -3003777, -2776348, -1210784, -215419, -662069, -1417050, -1192890, -205018, 391168, 19809, -769801, -984411, -172732, 1172946, 2114232, 2144462, 1500920, 690590, -6720, -520910, -832329, -1051327, -1428483, -2007541, -2327641, -1728585, -138502, 1467533, 1716670, 312758, -1301497, -1362842, 68780, 1111313, 462996, -1065304, -1972001, -2060879, -2004165, -1692387, -480703, 1154512, 1698798, 604128, -955167, -1691749, -1561347, -1096563, -370915, 686123, 1588031, 1635964, 764539, -299114, -571091, 479126, 2349322, 3688680, 3601120, 2696995, 2205355, 2203386, 1699240, 498039, -254085, 125275, 636168, 21298]
39414B1298j425342r03386R6651L71193R463j29145K52728P26930Q24033M26635
39404B71058k16443o44408o13618l88253k84927r2646N21613J174605J060488
39395G87469J57377n54233l25712M47046Q32256M65488k63317q24679r94893p68441
39385a041639j47033P45654J364412R56116n15123j895895j949562q94427q1701
39376c459198q1477m8286P08880J592598J755390J285919O19230k44817j035989
39367A092250p95182N94892J405256J57654j916509k248288m45144J337766J493418
39358F76113O46648L978k31789k19862K08766Q02118O83307k92101j019232p42557
39348E15389j73536k17804n55469m18997M2784J95550P8580J25212K13897k0034
$$ y = [21298, -1404044, -2307430, -2210779, -1839586, -1830123, -1959268, -1706540, -979610, -155577, 271058, 54615, -589793, -1203411, -1591664, -1876591, -1969237, -1447624, -273019, 787469, 944846, 390613, 64901, 511947, 1344203, 1809691, 1546374, 721695, -273198, -1041639, -1188672, -443018, 921394, 1877510, 1362387, -533508, -2483070, -3377497, -3459198, -3540675, -3588961, -2880081, -1287483, 467907, 1753826, 2373056, 2128239, 1092250, 297068, 891960, 2297216, 2454870, 538361, -1709927, -2155071, -817305, 676113, 1322761, 1326739, 1094950, 875088, 1083854, 1885972, 2569279, 2277178, 1257946, 515389, 341853, 124049, -431420, -850417, -807633, -612083, -533503, -408291, -194394, -214428]
39338b14428k99464r5523L58505L77068j4263j44045J10762Q8629n49149j222649
39328a604557j208432m84736M02211Q98883P55260J82055k19591o8004K65483
39319a081428J90367j16018N4925O66415P81547M8976n53416j34392P34758R75852
39309A567586O78656O41908P08317M3876j016257j072664J9093O05180k12850
39300A962845j091504o89360J06949j63477q89198m46306Q67633J230465L55541
39291A243588j35265M53348Q94417L64549l04492m25872n94389j141842j232381
39282h78339m69914K52003M34472P59233J237924O00717j176035j890216m23356
39273a553511J052975L75466j032967n63523J168540J411009j96351j374011j066386
$$ y = [-214428, -513892, -609415, -250910, 126158, 111895, -32150, 78612, 167241, -381908, -1604557, -2812989, -3297725, -2895514, -1996631, -1241371, -1059316, -1278907, -1346911, -1081428, -891061, -1007079, -952154, -285739, 495808, 544784, -8632, -143024, 591734, 1567586, 2246242, 2888150, 3596467, 3640343, 2624086, 1551422, 1570515, 2175695, 1962845, 871341, 181981, 288930, 125453, -763745, -1210051, -342418, 888047, 1243588, 1108323, 1561671, 2456088, 2820637, 2516145, 2090273, 1495884, 354042, -878339, -1348253, -1096250, -661778, 97455, 1335379, 1936096, 760061, -1130155, -1553511, -500536, -125070, -1158037, -1721560, -553020, 857989, 661638, -712373, -1778759]
39264a778759m81371l12045J61866R47714J008945M33665M34915Q73525L41210
39255A629665r41469j062397J80426O85561k77689p44684L41608J117372J02388
39246A030781j156718q17003K07337J76525m71902l79815J65655K33721K98136
39237g13283R95123J297318K97233o23571K7711Q96522r1929j827410j567557
39228a309843L13345P72240p51786j395443J80934J522642O16327p59354j74243
39219i85181J364965J151607q47713k049986j133419M52940R02520J81084o10223
39210a573406p07502p2112Q08562J127225M28606o10153o70964N46155J680762
39201I57173J301612j90832j015413l59965N99309M51209n28457j085139r47038
$$ y = [-1778759, -2260130, -2572175, -2410309, -1462595, -453650, -19985, 414930, 1288455, 1629665, 688196, -374201, -193775, 491786, 214097, -530587, -188979, 928393, 1030781, -125937, -942940, -735603, -559078, -1030980, -1410795, -1245140, -1011419, -713283, 281840, 1579158, 1876391, 1252820, 1280531, 2177053, 2085124, 257714, -1309843, -996498, -224258, -976044, -2371487, -2190553, -667911, -51584, -810938, -985181, 379784, 1531391, 683678, -1366308, -2499727, -2046787, -1144267, -963183, -1573406, -2280908, -2353020, -1544458, -417233, 11373, -598780, -1269744, -723589, 957173, 2258785, 2067953, 1052540, 692575, 1291884, 1743093, 1214636, 129497, -817541]
39192h17541p85244n76507L29534J408767J126655m38067j074405K51929J443996
39183H69117M11000j484752j498088J28306O76863o04575j517914o49299O77948
39174b991394J009596Q54009R70186P23084l32150j001665k99581O33475K17307
39165b17133j022271j375386o33570l7017l829K59488R37970J094510L40169l15044
39155i72113J08682J149782J529443P05963o36179j397789j106498k68753K29110
39146f58352R2429j54961R837L85258M18857M2751k48005q5747K76674K34568
39136C13309m12404j000618n97613P01049J520534Q51248m79513q96593l11252
39127c11853L06l18096j37221R75466J614282N87794j126370j695150q34488K48534
$$ y = [-817541, -1602785, -2179292, -1849758, -440991, 685664, 247597, -826808, -574879, 869117, 1280117, -204635, -1702723, -1574417, -897554, -1502129, -3020043, -3669342, -2991394, -1981798, -1127789, -157603, 565481, 233331, -768334, -1067915, -434440, -217133, -1239404, -2614790, -3248360, -3285377, -3289206, -3029718, -2091748, -997238, -657069, -972113, -863431, 286351, 1815794, 2521757, 1885578, 487789, -618709, -887462, -658352, -565923, -720884, -711047, -325789, 93068, 135819, -112186, -197933, 78741, 313309, -99095, -1099713, -1697326, -996277, 524257, 1375505, 895992, -601, -311853, -311547, -629643, -766864, 208602, 1822884, 2410678, 1284308, -410842, -1245330, -996796]
39117i96796O19584K51302m70617q61970k05916J113951J503005K71006r90490
39108B33059m93569J070732J556875M91206o04935p19605l47579j3317M15551
39099A588418P36068L78963l30011l99521Q0374N230o43096n26157O83308J467690
39089C041266Q38302j46531k76455j4833j82890k82255L53074R01490K14895j156021
39079C290042j678909j029219j25088N36190J124868J395113Q04974l35167j032216
39070B950588r28362m96367p4265L41204N34154K70183j13993j91096k03642m45004
39060A643400l86113M13510J024629K48687j291819j799530r88418l77676o69708
39051b183038o69354M93181J701263J466490K7208j191118j334766n12362P13473
$$ y = [-996796, -377212, -125910, -596527, -1458497, -1664413, -550462, 952543, 1223549, 233059, -260510, 810222, 2367097, 2858303, 2253368, 1533763, 1186184, 1172867, 1588418, 2324486, 2703449, 2373438, 1973917, 2054291, 2059521, 1416425, 890268, 1573576, 3041266, 3879568, 3733037, 3456582, 3441749, 3258859, 2976604, 3329678, 4231168, 4446063, 3290042, 1611133, 581914, 456826, 993016, 2117884, 3512997, 4317971, 3982804, 2950588, 2022226, 1525859, 1451594, 1792798, 2326952, 2597135, 2483142, 2292046, 2088404, 1643400, 1257287, 1670797, 2695426, 2944113, 1652294, -147236, -1135654, -1513330, -2183038, -2852392, -2359211, -657948, 808542, 835750, -355368, -1690134, -2202496, -1489023]
39042a489023J449696R49909k66614o54612K44783R57555K68875q72741r37037
39033c49209k75253l07456r03223n41521R90086J976953J308111M971n23452m08796
39023I71211n17152p50108l95613L40281M01979m88123j223605o98305P40025
39014a619410J671456J266209J63059m24207j67275K23369K37352K90380P97360
39005B438293J119698L32931j128862j651033n71637P72205P63592l95982j139581
38996E39624p00223J22291L16827j19830n78214p15219m94228J03579Q49498J101223
38986D25328M65601n37991j018563q12323m93031l63077j06983M40939Q71955
38977a128145Q56480O49116N64335M60615J62784j04493j76918l29839o58842
$$ y = [-1489023, -39327, 910582, 643968, -10644, 234139, 1191694, 1460569, 587828, -349209, -624462, -931918, -1835141, -2376662, -1386576, 590377, 1898488, 1903459, 1380007, 971211, 454059, -296049, -691662, -351381, 50598, -437525, -1661130, -2359435, -1619410, 52046, 1318255, 1481314, 1057107, 889832, 1113201, 1350553, 1640933, 2438293, 3557991, 3890922, 2762060, 1111027, 539390, 1311595, 2075187, 1679205, 539624, -160599, -38308, 278519, 158689, -419525, -1134744, -1628972, -1525393, -675895, 425328, 890929, 352938, -665625, -1477948, -1970979, -2334056, -2441039, -2000100, -1128145, -271665, 377451, 941786, 1402401, 1565185, 1460692, 1283774, 953935, 295093]
38968B95093o59768j29107J33430n07626j184074o10087P85138J276408M33185
38959a67408k56401K55847J108836J139957N78340J53749k65675r42277j189349
38950D15619m08185N39774M50464k70351k90168L69486L97893m74409r08303j46016
38940c24196P27236M82702m30547p06032r1259M50336J46759p29339j305382r89885
38930b769607J9223R30371J169697R36829O90322L44311m02118j132709j045301
38921a258982k99971J891m53701n54501M67428J609711J478343L96598j24759
38912A262057K93143M77810k55467r60553o04027K45380K86542m70597p08418
38903d34130J31209R18886N27993m16882m44516N45585J134171M89398n37876
$$ y = [295093, -364675, -493782, -360352, -867978, -2052052, -2662139, -1877001, -600593, -167408, -423809, -167962, 940874, 2080831, 2659171, 2812920, 2547245, 1604968, 415619, 7434, 547208, 997672, 727321, 437153, 806639, 1204532, 730123, -178180, -324196, 403040, 885742, 455195, -250837, -342096, 108240, 254999, -474340, -1779722, -2769607, -2750384, -1820013, -650316, 286513, 976835, 1321146, 919028, -213681, -1258982, -1558953, -1557062, -2010763, -2565264, -2097836, -488125, 990218, 1386816, 1262057, 1555200, 2033010, 1777543, 816990, 212963, 458343, 744885, 274288, -434130, -302921, 615965, 1143958, 727076, 282560, 828145, 1962316, 2451714, 1913838]
38894A913838q69247p05171p96991j042764q26835k21920K14493M81253Q91205
38885i62139J097009N74865j16926L7741O38501K28647j149562j545050r8798
38876a295712J271115O26852r41115r63753N36659J091621l28521j694053r76468
38867b673375R05592J545562M27542o84692m27176N21524Q07840L51232J14460
38858H88509L89867K89327q30013k128145k117578n37597J243214J795761J088083
38849H1428J63896j65352O4926L50986K91375r5847l48450j3300O39438O39256
38839A608356n17366j893814j882399r4547J936624K280648O99068j115113j453942
38830d32485m41321L84529J70916k61581J41986R62083R25564q4619p78986l91064
$$ y = [1913838, 1044591, 339420, -457571, -1500335, -2327170, -2549090, -2334597, -1853344, -962139, 134870, 709735, 592809, 630550, 1269051, 1497698, 348136, -1196914, -1295712, -24597, 602255, -338860, -1302613, -765954, 325667, -2854, -1696907, -2673375, -1767783, -222221, 205321, -479371, -906547, -385023, 422817, 774049, 888509, 1278376, 1567703, 737690, -1390455, -3508033, -4045630, -2802416, -1006655, 81428, 245324, 79972, 144898, 495884, 787259, 691412, 342962, 329662, 969100, 1608356, 1090990, -802824, -2685223, -2779770, -843146, 1437502, 2136570, 1021457, -432485, -873806, -489277, -318361, -579942, -437956, 524127, 1449691, 1365072, 586086, 195022]
38820A95022K27948K588p37649q28074L1987R43764R71263P1032r92361j288931
38810a403411n20386N50612Q32924K74786r9624K02715L85049j92393p79753m30221
38800a179702M19444P73033P34383Q90991P15350n45909j751253r10329J415679
38791E61687K183484K46565j671474r52007J043863J320519p7042n66242M78005
38782B567358Q21993o67825k001075j245627M68980Q55963j52962q57498o54602
38773h65295m31826m75894J7273J117711J574018P26077l19330l26789K35960
38764A251905Q1107q02583j146187l59700O23824P48515K13512j05513j7630j1587
38754D75663j14471L16717J384747K047050J436943K72288n5728L89033J19092
$$ y = [195022, 422970, 425558, -312091, -1140165, -1108178, -164414, 806849, 877881, -114480, -1403411, -1923797, -1373185, -540261, -265475, -365099, -162384, 222665, 30272, -749481, -1179702, -760258, 12775, 747158, 1638149, 2353499, 1807590, 56337, -853992, 561687, 2745171, 2991736, 1320262, 368255, 1412118, 2732637, 2655595, 2089353, 2567358, 3389351, 2721526, 720451, -525176, -56196, 799767, 646805, -210693, -865295, -1297121, -1773015, -1755742, -638031, 935987, 1662064, 1342734, 1015945, 1251905, 1333012, 530429, -615758, -975458, -351634, 396881, 610393, 504880, 487250, 475663, 361192, 677909, 2062656, 4109706, 5546649, 5818937, 5763209, 6152242, 6271334]
38745F271334j344038k428691j764034k94796J70442l50324m33627J54290K34464
38736B15020m29439n93978J76506O55110K18720N8693R11615J387804K23743j316505
38726A507289j272997o9293L91915j22137k30074L35307M24368j94161m74857
38717B95360k27888m16899j017610p78539L62971Q13490L066o17689j73186K22252
38707a534672j71577j40772J093383J936337Q95831o72900n93883O10293P06960
38698B129000n06682j023183l8438Q39134K41461r74957j183617k21173O10469
38689a27986K26536r75258j437666k20200J549286J810508L79104o79714j34379
38680C90231N79499j19438j242295r55083K74579N66932j75009m09025J63299
$$ y = [6271334, 4927296, 2498605, 734571, 439775, 610217, 259893, -173734, -19444, 215020, -214419, -808397, -631891, 23219, 241939, 300632, 1212247, 2600051, 2823794, 1507289, 234292, 164999, 556914, 434777, 204703, 540010, 964378, 770217, 295360, 67472, -349427, -1367037, -2145576, -1782605, -969115, -966049, -1583738, -1756924, -1534672, -1706249, -1847021, -753638, 1182699, 2078530, 1405630, 811747, 1422040, 2129000, 1622318, 599135, 560697, 1399831, 1641292, 666335, -517282, -738455, -127986, 98550, -876708, -2314374, -2534574, -985288, 825220, 1204324, 524610, 390231, 969730, 850292, -392003, -1347086, -1072507, -505575, -680584, -1089609, -926310]
38671i26310L26760j66973k54463K03826J51154m67417m73038K85611O77569N93658
38661d9623J088500J800805R51399j239691j984163j76565J498481O03215j362807
38652A129551j650473n69772l46750j113008r89896M74435J642279J443347M94543
38643E14256m34613j154294j215378j46504J265242J505957M19922n62677m65643
38634b73732K21493P29182R44053Q78603L44499m55439q97159q04899o27305o04607
38624e45311m87361j74432P1455J01840l0009l38291o15817k06111J024480J815108
38614F15551Q29268j220652k091723q92573Q08682J211268M36383k47287l37658
38605h88741k52394j94009N2783L31661M6832q57709j422326o64063J053890K095680
$$ y = [-926310, -599550, -766523, -1020986, -817160, -666006, -1133423, -1606461, -1320850, -643281, -49623, 1038877, 2839682, 3791081, 2551390, 567227, 390662, 1889143, 2492358, 1129551, -520922, -1090694, -1437444, -2550452, -3540348, -3065913, -1423634, 19713, 514256, 79643, -1074651, -2290029, -2436533, -1171291, 334666, 754588, 191911, -273732, -52239, 676943, 1620996, 2499599, 2844098, 2388659, 1491500, 686601, 59296, -545311, -1032672, -1207104, -1135649, -1033809, -1063818, -1402109, -2017926, -2224037, -1199557, 615551, 1444819, 224167, -1867556, -2760129, -1951447, -740179, -303796, -551083, -888741, -1141135, -1335144, -1282361, -950700, -903868, -1761577, -3183903, -3847966, -2794076, -698396]
38595f98396J297914n65019j535929p01369Q86177J664206J282379M84132p5672
38586B038423k40849l0597L67521M92250O5763o03673j040686j104103p82114
38577h38065o1542N94488L97543n17962q26539J74718J329694J253051L71207
38568A876593K5075K43065k2368q64362j271975q58248k24025K92453P60620P44188
38558G01016j34864q88282k48923R94333Q27025o66542j158097J58632J129712
38549G14010J19479j393423j334990j67889M46875N09305J013959J575874J003542
38540B486742l69669j003865n15740O2152J84504L01415N36104L65169k85344
38531A761468q15446q55629m86173J93756Q36759P11885j88613o20090J21214
$$ y = [-698396, 599518, 34499, -1501430, -2202799, -1316622, 347584, 1629963, 2114095, 2038423, 1797574, 1766977, 2134498, 2626748, 2692511, 2088838, 1048152, -55951, -838065, -899607, -305119, 92424, -425538, -1252077, -1077359, 252335, 1505386, 1876593, 1901668, 2144733, 2122365, 1258003, -13972, -872220, -1096245, -803792, -43172, 701016, 566152, -322130, -571053, 423280, 1250305, 583763, -574334, -415702, 714010, 833489, -559934, -1894924, -2062813, -1615938, -1106633, -92674, 1483200, 2486742, 2117073, 1113208, 597468, 659620, 844124, 1145539, 1681643, 2046812, 1761468, 946022, 90393, -395780, -202024, 634735, 1346620, 1158007, 537917, 659131]
38522F59131P58775l7357j208053q48559N05971O25608o49480j141390j07249
38513a442603N61321k25335q63403l6262Q78883L12088o33603j23486J094666
38504d77734Q48561q15196j633771n76675Q81043J147442M05018l04005m90889
38495a016206k21066K66894N09135J47629m12978l49058L96034R01404M50702
38486F72490n71024j151316p20688L11254R46349O53583L9136K3866L87937K5625
38476F17212j119340j583742n43110P93475J013869N65822O05411Q39783K57646
38467A447026p60753r88222n03053l18097k63355N46365J335794L29064j913934
38458a089165k517773n49230J328306Q92303l14441K83709K104652K426787N71160
$$ y = [659131, 1417906, 1380549, 172496, -676063, -170092, 455516, -193964, -1335354, -1442603, -881282, -1106617, -1970020, -2006282, -1127399, -815311, -1448914, -1572400, -477734, 370827, -444369, -2078140, -2654815, -1773772, -626330, -221312, -525317, -1016206, -1237272, -970378, -461243, -313614, -726592, -1075650, -679616, 221788, 672490, 101466, -1049850, -1770538, -1459284, -512935, 140648, 179784, 203650, 591587, 617212, -502128, -2085870, -2628980, -1835505, -821636, -255814, 349597, 1189380, 1447026, 686273, -301949, -805002, -1123099, -1386454, -840089, 495705, 824769, -1089165, -3606938, -4156168, -2827862, -1935559, -2250000, -1966291, 138361, 2565148, 3136308]
38449C136308j355946j596861o05677K96987N48302L26417o267j47332j14425
38440D81506k29378n06414m94591j16338L3725k66347l71621P0650M54038M16284
38430e28486N51613J036697Q81245k76500j051115m80371J53194m56501j065734
38421a235958N7048J719539J407027m04081q22631O22179J161244n07593k013203
38412a6429j235025M60825Q41537L08859N22636J266667J088222Q841o26062m50194
38402B169877l30160n88599n81706r550O04236P94843O33120L35893K4113k44209
38392B807858n85778j131318j518862j115568j5653Q67111R72409O04001J18045
38383A002245m02733n16892K45267J122480O94158q01616j399869l70761O10599
$$ y = [3136308, 1780362, 183501, -422176, -125189, 423113, 749530, 743263, 595931, 481506, 252128, -254286, -748877, -865215, -831490, -1097837, -1469458, -1398808, -944770, -528486, 23127, 1059824, 1941069, 1664569, 613454, 133083, 286277, -170224, -1235958, -1178910, 540629, 1947656, 1543575, 720944, 1343123, 2504367, 1996774, -16429, -1251454, -790629, 50908, 359767, 882403, 2149070, 3237292, 3246133, 2620071, 2169877, 1839717, 1251118, 669412, 659862, 1264098, 2058941, 2692061, 3027954, 3052067, 2807858, 2222080, 1090762, -428100, -1543668, -1559321, -692210, 280199, 884200, 1002245, 599512, 82620, 327887, 1450367, 2144525, 1342909, -56960, -427721, 182878]
38374A82878K96369j30804N82054J312695N22780q89467j018824r3783K18453
38365I82351j85823k4291O82535N85554m42502j026704o52270k12113n5857M48210
38355I9090J137028Q77184l39162r92117l71586L46858P7630o06282o69264j48320
38345e88941K78075L14270N3232k87116l18082J22038M92942K55829j79557j82396
38335c9706j30988o20049r52736j12105J139355J119221L3459k60581O13833J019595
38325A809298K84186k84594j01043m48678j719413j991010r5508J988002J838353
38316A279593P3171r33423n26568J10313L47133N68464Q20303P79132O67135P22564
38306C907817K90626j073506k161002j432104N22039J498951O67579m78159m26434
$$ y = [182878, 479247, 348443, 930497, 2243192, 2765972, 1876505, 857681, 763898, 982351, 796528, 772237, 1454772, 2040326, 1597824, 571120, -81150, -293263, -349120, 99090, 1236118, 2113302, 1774140, 782023, 410437, 757295, 834925, 228643, -440621, -588941, -310866, 3404, 56636, -230480, -548562, -426524, 66418, 322247, 142690, -39706, -170694, -790743, -1743479, -1855584, -716229, 402992, 436451, 175870, 789703, 1809298, 2093484, 1808890, 1707847, 1259169, -460244, -2451254, -2546762, -558760, 1279593, 1352764, 419341, -107227, 3086, 350219, 918683, 1738986, 2518118, 3185253, 3907817, 4198443, 3124937, 963935, -468169, 53870, 1552821, 2220400, 1742241, 1315807]
38297A315807L77615M85092m05543j043837l67748Q58604Q35634o50577j450676
38288d5629r968J871946J267907j349840k497655r00607P17597K41235n65120
38279a270134M51325J843262J074911r90528j513460l53924J34312o22072p65569
38270b011877L63631J121908N74400j36443j15378M523j62263Q5620P85209P51920
38260A261250l34539j106658o57838J51836L86183M12369O71806N85892k59200
38251A111101j055904q96183l1586O75008P02366q2245j285030j684215l68002
38242b914690J573816J968630N06664q42524p87981k71480l41003l66267M41020
38233a033815J303138J050776q8402j026051j216489p00628K23381P30476R0294
$$ y = [1315807, 1693422, 2178514, 1772971, 729134, 361386, 1219990, 2055624, 1405047, -45629, -55597, 1816349, 3084256, 1734416, -763239, -1663846, -946249, -705014, -1270134, -818809, 1024453, 2099364, 1108836, -404624, -758548, -624236, -1246308, -2011877, -1648246, -526338, 48062, -88381, -203759, -199236, -361499, -275879, 509330, 1261250, 926711, -179947, -837785, -685949, -299766, 112603, 784409, 1370301, 1111101, 55197, -840986, -872572, -197564, 504802, 422557, -862473, -2546688, -2914690, -1340874, 627756, 1134420, 291896, -496085, -767565, -1108568, -1474835, -1033815, 269323, 1320099, 1231697, 205646, -1010843, -1711471, -1488090, -757614, -667320]
38224f67320r05767o50749O15031P97700n82735j260815M5443J242044L04826
38215a062342j128001l68121J817982K435474R36322m94796p63787q43946j076644
38206e47859n64496M60453N27414k82640j48617J178677J570699O1265j390792
38197H64104j050275O7521M53462O34821J412378J553692k24576k346245k181199
38188h16317n7464J175977L73666o77070m89249J24879J03685M8267P60034J432493
38178A978901Q51063n71872j423602j324525r67551n89231J26962P76101M04100
38169g39654p68359j211355k88969O58235L45371m35351j15550J071452J410028
38160g4152M02881m79495q7957Q00673Q93337K64945j37798j08429k31127p02960
$$ y = [-667320, -1573087, -2223836, -1608805, -811105, -1393840, -2654655, -2609212, -1367168, -1062342, -2190343, -2558464, -740482, 1694992, 2631314, 2136518, 1372731, 528785, -547859, -1112355, -651902, -124488, -407128, -555745, 622932, 2193631, 2254896, 864104, -186171, -118650, 334812, 969633, 2382011, 3935703, 3711127, 1364882, -816317, -873781, 302196, 675862, -1208, -490457, -365578, -261893, -213626, 546408, 1978901, 2829964, 2258092, 834490, -490035, -1457586, -2046817, -1919855, -1143754, -739654, -1508013, -2719368, -3008337, -2350102, -2004731, -2440082, -2555632, -1484180, -74152, 328729, -150766, -238723, 561950, 1455287, 1720232, 1582434, 1474005, 1242878, 539918]
38150E39918j065441r98966o50591k13053K44497N60741N70578L85138K58398
38141c68781K87322M65581P40533P75521J43782q41651j093131j89015P22721
38132F42882L41183r02698j428859p20962K28882O54590Q74578J090186O64409
38123A444191n79005j382535n62000J062210J503202K84941r23703o68098L81825
38114E61028O43153m3036m47171m5857K73898q6096l54581J30832M89112l13226
38104H08056j412351j109622L37258R33824J20698l61727N00435J185417K12258
38095A214246j246269j169514J53052P85502J60051n71842o98844n09508R234
38086a873892J099928J952152J369391j96468j024225o28041j32675q1064J76964
$$ y = [539918, -525523, -1524489, -2175080, -2388133, -2143636, -1582895, -1012317, -627179, -368781, -81459, 384122, 1124655, 1900176, 2043958, 1202307, 109176, -79839, 642882, 984065, 81367, -1347492, -2068454, -1839572, -1184982, -310404, 779782, 1444191, 865186, -517349, -1079349, -17139, 1486063, 1771004, 847301, 179203, 561028, 1204181, 1161145, 713974, 668117, 942015, 855919, 501338, 632170, 1121282, 808056, -604295, -1713917, -1376659, -442835, -322137, -683864, -183429, 1001988, 1214246, -32023, -1201537, -1048485, -262983, -102932, -674774, -1373618, -1883126, -1873892, -773964, 1178188, 2547579, 2351111, 1326886, 698845, 566170, 485106, 662070]
38077F62070O47634L42549o63440q94841j1754L48714o71769j530840p76289O32301
38067a915665J053480O27494L23731k3186q45335j242257k94136R44493Q14965
38058e56416k80774o26145l7955J70999k45640j62886O12074Q46405N4980o96569
38048i21927o53300l68776l10026m2882N62850P92716M71163N05770J229271J486564
38038B751423L64852j238531j843620j355002p61687n17064k58124K36161O90833
38029a930759P75154L57860m14309r45300n94204L36541O36148k17676j105867
38020c102412o66447Q06504J713306J195836M7842m37053P3520P88602P72971
38011A192669k5987p00053m66695K45897K82805n86453j193601n46663P68202
$$ y = [662070, 1309704, 1652253, 988813, 93972, 82218, 430932, -240837, -1771677, -2547966, -1915665, -862185, -234691, 89040, 65854, -779481, -2021738, -2315874, -1371381, -556416, -837190, -1463335, -1501290, -1330291, -1575931, -1738817, -1126743, -280338, -225358, -921927, -1575227, -1944003, -2254029, -2296911, -1734061, -941345, -470182, 35588, 1264859, 2751423, 3116275, 1877744, 34124, -1320878, -2082565, -2599629, -2857753, -2621592, -1930759, -1155605, -797745, -1212054, -2157354, -2751558, -2415017, -1778869, -1996545, -3102412, -3768859, -2962355, -1249049, -53213, -5371, -442424, -368904, 419698, 1192669, 1166682, 466629, -66, 245831, 528636, -57817, -1251418, -1798081, -1029879]
38002a029879J389885R06150N0887m74752n66295k70002L59957Q70852O60312
37993A897115r4515l95898K49000R59612N70896o41684j121391j40295R78531
37984B261371M83867j310153k223399j124676M71168N44565n82389q94067K03852
37975b169861J059693L98765p26884n51271Q22656J615698P62270q70608j639450
37966a298992q87510N22570J172479N95635k23557j47059N58406P29294K54143
37957A275409K78993J120762J395063J54239j350116j379081k53410L58856N2239
37948A652954j55687M0245j76220q59332q45012J97914Q47060L5046j139352r12171
37938a314555N81316J478461O79649q47325j377953m21235Q85231J180609M33620
$$ y = [-1029879, 360006, 1266156, 1317043, 842291, 275996, 5994, 365951, 1236803, 1897115, 1802600, 1406702, 1655702, 2615314, 3186210, 2544526, 1423135, 1282840, 2261371, 2745238, 1435085, -788314, -1912990, -1441822, -897257, -1479646, -2373713, -2169861, -1110168, -711403, -1438287, -1989558, -1166902, 448796, 1211066, 340458, -1298992, -2186502, -1663932, -491453, 104182, -119375, -266434, 291972, 1021266, 1275409, 1554402, 2675164, 4070227, 4224466, 2874350, 1495269, 1241859, 1600715, 1652954, 1497267, 1537512, 1361292, 501960, -343052, -145138, 701922, 736968, -402384, -1314555, -733239, 745222, 1424871, 577546, -800407, -1221642, -336411, 844198, 1277818]
37929A277818j55299J64868O57510K66879o78374q91471p8512O47038M38681k57769
37919A391369o63058o42736l20481K96306P99509M70848n07112r12228k53268
37910c40851L62863K3391m32774Q7208Q24937K37380j321729j827996n67344Q18539
37900b136376P87768m5219j88312M47740O92262O8723n05181r7218Q83781J167548
37890A075516K53088r13058j116596m13410N8919k54986o00119j37489Q23214
37881a224921J365744J169538N56264j47757o33525n02292J35547M47017N528
37872A171143m51331k33748O9402l04127p25262j99802O83737O38724O5572M09643
37862A123951J272048O63597j419690k304886o27169J434103J496916L64547O0808
$$ y = [1277818, 1122519, 1287387, 1944897, 2211776, 1533402, 641931, 563419, 1210457, 1649138, 1391369, 728311, 85575, -234906, 61400, 860909, 1331757, 824645, -87583, -340851, 22012, 45403, -387371, -300163, 524774, 762154, -559575, -2387571, -2954915, -2136376, -1348608, -1393827, -1582139, -1134399, -442137, -373414, -878595, -975813, -92032, 1075516, 1328604, 415546, -701050, -1114460, -1055541, -1310527, -1910646, -2048135, -1224921, 140823, 1310361, 1866625, 1718868, 1085343, 583051, 718598, 1165615, 1171143, 719812, 486064, 555466, 251339, -473923, -673725, 10012, 648736, 714308, 1123951, 2395999, 3059596, 1639906, -664980, -1292149, 141954, 1638870, 2003417, 2064225]
37853B064225L81852j16241j063793r32642K7781J89388m56701k91575R24621
37844G26915J513217O83987l93280q27848j148894j552575j154854Q6932P20740
37835a345660J70287j53430O25400J134684J77962r30934m97798N73719L38859
37826I3089p09841m57561R75868J124706o79075j828978l63536J852466J734473
37817A741611o13611k193775j323319M01087O40595o56325j577512q35721Q71450
37808c545520J947175J666929O56829l8174l3761J80610j14606j032919j808522
37799b121959j494127j12042J121314J116106K53424k17132k4823j65961j043973
37790b689173j424994j85004J664941K020049N45375q35941n81738N33635P96804
$$ y = [2064225, 2446077, 2329836, 1266043, 333401, 361182, 550570, 93869, -197706, 726915, 2240132, 2924119, 2530839, 1702991, 554097, -998478, -2153332, -2066400, -1345660, -1175373, -1328803, -703403, 431281, 609243, -321691, -819489, -245770, 93089, -616752, -1074313, -98445, 1026261, 347186, -1481792, -1845328, 7138, 1741611, 1128000, -1065775, -2389094, -1988007, -1347412, -2003737, -3581249, -4416970, -3545520, -1598345, 68584, 725413, 687239, 653478, 834088, 719482, -313437, -2121959, -3616086, -3728128, -2606814, -1490708, -1237284, -1454416, -1479239, -1645200, -2689173, -4114167, -4299171, -2634230, -614181, -68806, -904747, -1486485, -952850, -156046]
37781a56046k5499o51760k88489L98805M73306M1486j55389J9573J472m13857
37771g56398o60993l36605J00759Q3399j36291k4827J89436m5497m00087p9432
37761b066536N91216L91998o74425j010888J05045J185855Q08731j61447j76210
37752a006661L25911j72044j380045j435398O2312J338357J102401R9656n04886
37743a570397o24526m75086J54099J014213J103212J54128o90600n05326J68887
37734a271396M53389M14167M10033K65894k6792J20659P05220O61088l89723j114981
37724B27558m24868P35634R63907O00921O66781O89675l19459j495946j099433
37715E44770M15979P45765o49216j620545o64988R57056J425075Q34408K25737
$$ y = [-156046, -181545, -833305, -1121794, -722989, -249683, -208197, -363586, -344013, -342541, -756398, -1417391, -1753996, -1653237, -1569838, -1706129, -1730956, -1541520, -1587017, -1987104, -2066536, -1475320, -1083322, -1757747, -2768635, -2663590, -1477735, -669004, -830451, -1006661, -680750, -852794, -2232839, -3668237, -3605925, -2267568, -1165167, -1065511, -1570397, -2194923, -2670009, -2515910, -1501697, -398485, -244357, -934957, -1440283, -1271396, -818007, -403840, 6193, 272087, 245295, 365954, 1071174, 1732262, 1342539, 227558, -197310, 538324, 1502231, 2103152, 2769933, 3459608, 3140149, 1644203, 544770, 960749, 1706514, 1057298, -563247, -1228235, -271179, 1153896, 1988304, 2214041]
37706B214041l26751j175312j718058j093971K69109J033978O18737l60761r90384
37697a529372p32915L70718J530864J676374O91132k81009l06154J68786K52549
37688A840973J3928N0694K27403n5860o10779n79456J91038Q39424P10444J18317
37678B746126l13549m34773m27178l62075j79863J45249N48794Q20442O79948
37669C223121J50902l05916l67976l44701o31174q91042m66125M37399P74304
37660A578792J29605n76011l70924L43728L92682m37922j120260r06972l07509
37651a274791j38928k81709q0133M41471O42225M08541K95249M33746K84396k42928
37641D87139m91614l53602o16025j212631o10526J587609K871852R82640k068020
$$ y = [2214041, 1887290, 711978, -1006080, -2100051, -1830942, -796964, -178227, -538988, -1529372, -2262287, -1891569, -360705, 1315669, 2006801, 1725792, 1419638, 1588424, 1840973, 1854901, 1905595, 2132998, 2077138, 1466359, 886903, 1077941, 1917365, 2627809, 2746126, 2432577, 1997804, 1570626, 1208551, 1028688, 1173937, 1722731, 2543173, 3223121, 3374023, 3068107, 2700131, 2355430, 1724256, 833214, 367089, 804488, 1578792, 1708397, 1132386, 761462, 1105190, 1497872, 1059950, -60310, -967282, -1274791, -1413719, -1695428, -1775561, -1334090, -691865, -283324, 11925, 445671, 730067, 487139, -4475, -358077, -974102, -2186733, -2797259, -1209650, 1662202, 2644842, 576822]
37632E76822k129061R79612K829583Q38696j971138j751970N35763J335347K79233
37623A522887j995J038174R41002j208918k838075j799715M80956J437633Q77661
37614D49610K82324J49347q5650m49320m68136k59967k26513j07261M89571J051674
37604H25679P83979p8004o11036n64341l99324k39675K09352P97510R01584L23851
37594A949575m25029p53145m73899J48061M85265P3155o01560m76921M56404Q15887
37584A197793j13227j050940o65071K11903J3800p36219k25479J350875J770983
37575A754418L89908p04327m9829R48986N41136n72041p36112r6362J20453p5433
37565A520797J39532N29913L83449K30625Q26654J056120o21775k905028k692705
$$ y = [576822, -1552239, -572627, 2256956, 3095652, 1124514, -627456, -91693, 1243654, 1522887, 1520892, 2559066, 3500068, 2291150, -546925, -2346640, -1865684, -428051, 449610, 731934, 881281, 795631, 346311, -121825, -381792, -608305, -715566, -225995, 825679, 1609658, 1531654, 920618, 356277, -43047, -282722, -73370, 724140, 1625724, 1949575, 1524546, 771401, 297502, 445563, 930828, 1003983, 402423, -74498, 381906, 1197793, 1084566, 33626, -631445, -419542, -405742, -1141961, -1367440, -16565, 1754418, 2144326, 1439999, 1390170, 2339156, 2880292, 2308251, 1572139, 1475777, 1596230, 1520797, 1660329, 2190242, 2573691, 2804316, 3630970, 4687090, 4065315, 1160287, -1532418]
37556a532418K05743K296614J369709n25962p06083J29144j29654j055414p03627
37547f51948O06892P25113m51987o41318Q70931J797063M70376j470824j596908
37538c42610j41853Q23214N16187m1623l4452K40771L39030L06058K84812K94677
37528B244211M01744N68154N30075K77349K46843N34634M95623j97397p51288
37519D349948m06227K33789J39818m01482l27798K61940K57968m22829o06741
37510C078386M6854M08930l8901j51792Q03509J524519O18904r29021j005144
37501D356244N20146J726449J513267P90909O20434P99989Q36221R03486J060799
37492A3127944O83915m13951j245573r99933l27398k59912n81636m43124J4124
$$ y = [-1532418, -1326675, 969939, 2339648, 1813686, 1107603, 1236747, 1107093, 51679, -651948, -45056, 680057, 228070, -413248, 457683, 2254746, 2725122, 1254298, -342610, -484463, 338751, 854938, 813315, 778863, 1019634, 1358664, 1664722, 1949534, 2244211, 2645955, 3214109, 3744184, 4021533, 4268376, 4803010, 5298633, 5101236, 4349948, 3943721, 4177510, 4317328, 3915846, 3588048, 3849988, 4107956, 3685127, 3078386, 3125240, 3534170, 3495269, 3343477, 4146986, 5671505, 6290409, 5361388, 4356244, 4876390, 6602839, 8116106, 8907015, 9527449, 10327438, 11163659, 12067145, 13127944, 13811859, 13397908, 12152335, 11152402, 10825004, 10565092, 9983456, 9540332, 9554456]
37483I554456m580m02877m60737l95869r89754j666776q84856J105159J949362
37474G803528O46183o99535j54685Q77203M5986j795946j747591L96413J690499
37465G062055O48973p03675m52414K84490j98566j059461m95335J008953J410984
37456G506004L17842p01967o48263n1983M01698N48076J71577o99519j051647
37447E791818M4286J710801K134114J112757J77837J62006L31199J42424J41249
37438A1748491O27548R80570Q79027P92231P73794K47025m90028j76792J274847
37429A6656713K239510J911671J659937K604695L550045L040807K055551K540422
37421C6259351M169512M854167M176296M080070N826463Q179045R468648J0105430
$$ y = [9554456, 9549876, 9146999, 8686262, 8290393, 7300639, 5633863, 4749007, 5854166, 7803528, 8449711, 7750176, 7595491, 8472694, 8518680, 6722734, 4975143, 5371556, 7062055, 7711028, 7007353, 6554939, 6839429, 6640863, 5581402, 5086067, 6095020, 7506004, 7823846, 7121879, 6473616, 6421633, 6823331, 7371407, 7542984, 6843465, 5791818, 5836104, 7546905, 9681019, 10793776, 10971613, 11133619, 11464818, 11607242, 11748491, 12376039, 13356609, 14235636, 15027867, 15801661, 16048686, 15558658, 15381866, 16656713, 18896223, 20807894, 22467831, 25072526, 28622571, 31663378, 33718929, 36259351, 40428863, 45283030, 49459326, 53539396, 59365859, 67544904, 77013552, 87118982]
37413H7118982J1860842J5233880J8681691K0731122K2224897K5649885L2045514
37406B33546813L9451188M5221334M8881374N0830693M8671061L7764881J6862079
37399E21229423q733504l1191555m5966536n2571159n2090874m6663905l9922596
37392B44089294l4673084l0295359k4798445j8905619j5337196j4319792j3030722
37385I2729077j0067638p423611o846007o974068n840796m058951l474313m120506
37377D3923187m500830l965497l053899k077313r06483J22983L18076m26291j506259
37368B7927674k236321k208030j489038p69839o95235q69929l89217N20518O20048
37359B0410631k56980o78681J89931J319959J576738J265801Q96158n2585j741443
$$ y = [87118982, 98979824, 114213704, 132895395, 153626517, 175851414, 201501299, 233546813, 272998001, 318219335, 367100709, 417931402, 466602463, 504367344, 521229423, 512495919, 481304364, 435337828, 382766669, 330675795, 284011890, 244089294, 209416210, 179120851, 154322406, 135416787, 120079591, 105759799, 92729077, 82661439, 75237828, 68391821, 61417753, 55576957, 51518006, 48043693, 43923187, 39422357, 35456860, 32402961, 30325648, 29419165, 29542148, 29860224, 29433933, 27927674, 25691353, 23483323, 21994285, 21224446, 20529211, 19659282, 19270065, 19790583, 20410631, 20153651, 19474970, 19664901, 20984860, 22561598, 23827399, 24723557, 24670972, 22929529]
37350B2929529k769606k072695r09868j106782k174965k160196q06268J90019
37342A1119168o7897o24109n75050l12349l98439n69254m21417r7168J70617M23246
37332H647348N87880M04949m8381l47010l35279k48184k42955l07160n13081q56217
37322F741910j010383p27978k66488l700L7195q1402m44111q66153r03816o62693
37312A812381p31914r22601k95802R41252J134860j69332j007397J3779J238824
37303B014050N94569q45720n96084J051111J587553M84725k94839R2201L32614
37294D420180j61846l17840O4636k76225j312403j216890L57062J253870L37623
37285C148167o50430k30201M51786J26213k56963K99831O56586k61845j175394
$$ y = [22929529, 20159923, 18087228, 17177360, 16070578, 13895613, 11735417, 10929149, 11119168, 11051271, 10427162, 9852112, 9539763, 9141324, 8572070, 8150653, 8053485, 8224102, 8647348, 9235228, 9640177, 9591796, 9244786, 8909507, 8661323, 8418368, 8111208, 7598127, 6741910, 5731527, 5003549, 4737061, 4733361, 4770556, 4689154, 4245043, 3378890, 2475074, 1812381, 1080467, 157866, -137936, 803316, 1938176, 1768844, 761447, 775226, 2014050, 2608619, 1762899, 1166815, 2217926, 3805479, 4290204, 3995365, 4087566, 4420180, 4258334, 3940494, 4005130, 3728905, 2416502, 1199612, 1556674, 2810544, 3148167, 2497737, 2267536, 2719322, 2845535, 2588572, 2888403, 3544989, 3283144, 2107750]
37276B107750o78422J81294m5079m57677K93232J138583M70120o90066m38447
37267A881288N04702L05987k49061P68037K152301R54239k066624k791903k06410
37258A252556J807950O24453j209263n32048J371972J334626m85167j261944n1741
37249B851394J350261J551341J026686N43345J48473j21213m5750R8069j84195
37240G218411o01552l66206M75502R02359K52456r43915j595582j142032k4782
37231D174659P29723N58212M0077J47929Q65455J268652J063697J056170J680084
37222A1584658K070224J345832N6118n05468K6794P99034Q08879j76601j442181
37213A4567289j868733j163615n24373j179766k314171j872116K45539J553103
$$ y = [2107750, 1429328, 1610622, 1565543, 1107866, 1401098, 2539681, 3009801, 2319735, 1881288, 2385990, 2691977, 2442916, 3210953, 5363254, 6317493, 4250869, 1458966, 1252556, 3060506, 3684959, 2475696, 1943648, 3315620, 4650246, 4165079, 2903135, 2851394, 4201655, 5752996, 6779682, 7323027, 7471500, 7350287, 7304537, 7402606, 7218411, 6616859, 6250653, 6726155, 7628514, 7880970, 6937055, 5341473, 4199441, 4174659, 4904382, 5462594, 5502671, 5650600, 6516055, 7784707, 8848404, 9904574, 11584658, 13654882, 15000714, 15056832, 14551364, 14578158, 15377192, 16186071, 16009470, 14567289, 12698556, 11534941, 11010568, 9830802, 7516631, 5644515, 5890054, 7443157]
37205G443157M60423j371619j596196n33643o1436l99177l09638K01137j21885
37196C711123j175995j256234J70030J477985J312709K67081n36805r08122q65329
37187B196443n5394J119468J242142r2410j247429q05353K79703K45445p20801
37178B161814j008369k93075J46268k36395l90555M04230J222970R28050r1804
37169B843134n63600j53117K57830n4080p38255r70754n30051K7664J68984N5864
37159C43619J84949N02115L81050l28912q00416l19422N37195O09965j29040n10367
37149D70736N0182O77904M41027k05016j76073N52304R44397M45127l23471n18120
37139B358997p2975M65549O06253J93647n71276j149568j024650k84417L80879
$$ y = [7443157, 7903580, 6531961, 4935765, 4402122, 4340686, 3941509, 3631871, 3833008, 3711123, 2535128, 1278894, 1448924, 2926909, 4239618, 4506699, 3969894, 3061772, 2196443, 2141049, 3260517, 4502659, 4410249, 3162820, 2357467, 2637170, 2882615, 2161814, 1153445, 860370, 1006638, 770243, 379688, 783918, 2006888, 2934938, 2843134, 2279534, 2126417, 2384247, 2330167, 1591912, 621158, 91107, 118771, 287755, 343619, 528568, 1030683, 1411733, 1082821, 282405, -37017, 500178, 1110143, 981103, 470736, 520918, 1198822, 1639849, 1434833, 1258760, 1811064, 2755461, 3200588, 2877117, 2358997, 2286022, 2751571, 3357824, 3551471, 2980195, 1830627, 805977, 521560, 902439]
37130I02439M24952k1120m41281m65781k6581O26617Q97486K88522q03269j181747
37120B00237k41604J059069J226080P7737j070763j070672j49156O95303Q84462
37111A610693N00229j49641o73245o00041J50078Q60973O52216l56278j014406
37102I80578n59753L68642N98949n902n20509m10716j69129k14294m2878P54776
37092G79764J299751M28666j279729j789249k75687J623729J921492P23275l67905
37083C064107n94913n95419q69097r46185l50462N15466R04219O06816n4677o99655
37073I80200j020613p70058P794Q36620J133043O89337j66095q06602p72900j75985
37063f5259L80620M00042n0648n55947q25826p87162m39008J00623N42610O64500
$$ y = [902439, 1327391, 1306271, 864990, 399209, 372628, 999245, 1896731, 2185253, 1381984, 200237, -41367, 1017702, 2243782, 2321519, 1250756, 180084, 30928, 726231, 1610693, 2110922, 1961281, 1288036, 687995, 838073, 1699046, 2351262, 1994984, 980578, 420825, 789467, 1388416, 1382514, 862005, 451289, 282160, 67866, 24988, 779764, 2079515, 2508181, 1228452, -560797, -836484, 787245, 2708737, 3432012, 3064107, 2469194, 1873775, 1004678, 58493, -291969, 223497, 1127716, 1734532, 1679855, 980200, -40413, -810471, -802677, 33943, 1166986, 1856323, 1690228, 883626, 110726, -65259, 315361, 715403, 664755, 108808, -717018, -1504180, -1943188, -1842565, -1299955, -635455]
37053f35455N06166K19652o8225j86759p1573l9222l88589o62006j11398Q43139
37043e94270P05719q63485k034036j166337P37715J411378N06969k82622J6288
37034a562681N68166M84037k3822n69674j129683j240895k02179J377419J767170
37025e32142N79654m50886n7448O89990L06409o87224q25547j75228J2045m10941
37015a551318l18788N92165J114174L75523p29710o49386P80432J998146J489066
37006C100304l33015j421491n65077R35998R17034o34015j539573n71914Q90923
36997G79174J045423J21176m16096q5629L54930J96668o18947j573324j632848
36988a829473j88751J488115J170849j005730j934999J55638K601228J893520
$$ y = [-635455, -129289, 90363, 22138, -164621, -236194, -275416, -664005, -1326011, -1437409, -594270, 111449, -752036, -2786072, -3952409, -3214694, -1803316, -1296347, -1578969, -1562681, -994515, -510478, -534300, -1103974, -2233657, -3474552, -3676731, -2299312, -532142, 47512, -403374, -460822, 229168, 535577, -151647, -977194, -1152422, -1140377, -1551318, -1870106, -1277941, -163767, 211756, -517954, -1167340, -386908, 1611238, 3100304, 2767289, 1345798, 780721, 1716719, 2633753, 1999738, 460165, -111749, 779174, 1824597, 1945773, 1529677, 1444048, 1798978, 1995646, 1376699, -196625, -1829473, -2018224, -530109, 640740, -364990, -2299989, -2144351, 456877, 2350397]
36980B350397j026324k117623k45872J519699R02824n41250n54696M02766O33750
36971A323671Q9946j82256j29575l35218m62148J80892J036369Q79318j97962
36962B203037q09809l38713K70441Q2045m95767n40998j01244l5168n61292q14716
36952a142184j91569N46621L16377m88531l85472R04542J849441J349434K77025
36943C035684j77896l93770j114516j503903l48072J459165J780405L95865q09606
36934B323356q86948q61959j321172j185893J72247J498544J515104O84044o198
36925A931125n68771j144451j003172J65050J103016O13975n42158q00970r8493
36916c44849L89103K18599j4309L3464J21955J41363R8133l04732j093342j433422
$$ y = [2350397, 1324073, -793550, -1039422, 480277, 1383101, 841851, 287155, 689921, 1323671, 1413617, 1231361, 1101786, 766568, 304420, 485312, 1521681, 2400999, 2203037, 1393228, 1054515, 1324956, 1407001, 911234, 370236, 268992, 233824, -327468, -1142184, -1333753, -787132, -470755, -959286, -1344758, -440216, 1409225, 2758659, 3035684, 2857788, 2464018, 1349502, -154401, -502473, 956692, 2737097, 3132962, 2323356, 1436408, 574449, -746723, -1932616, -1760369, -261825, 1253279, 1937323, 1931125, 1362354, 217903, -785269, -620219, 482797, 1096772, 554614, -246356, -344849, 44254, 262853, 248544, 282008, 403963, 545326, 643459, 338727, -754615, -2188037]
36906b188037o68274M44138O62792J06531n8347M14453N26594j88201p93140l27555
36896b069046Q05139J401239R47723Q7162k56203M4942K25971k98761r92617q60876
36886i65327L821M09614j40129o46826k18071N15831N10038J5659N0193P02005
36876B36808J112681Q27137J47140n58455r60533n86374M59820J034630L49587
36867B062441o30219n05621K84431J71230p80747q28030M21481J035633k15266
36858A015333j706075j331295L35558J063201L09740m09973k40824r4110o55815
36849a714260j021222k62138Q81636J084276M26943N855P076l47632r73481o72745
36839b585692P32866J547195N89282p96268o58668N10048N80716p30643j394415
$$ y = [-2188037, -2856311, -2412173, -1749381, -1642850, -1701197, -1286744, -760150, -948351, -1741491, -2069046, -1263907, 137332, 1085055, 1172217, 916014, 960956, 1186927, 888166, -104451, -965327, -961506, -551892, -692021, -1338847, -1556918, -1041087, -531049, -515390, -465197, 236808, 1349489, 2176626, 2323766, 1765311, 804778, 218404, 678224, 1712854, 2062441, 1432222, 926601, 1211032, 1382262, 601515, -226515, 194966, 1230599, 1015333, -690742, -2022037, -1686479, -623278, -313538, -723511, -964335, -1058445, -1714260, -2735482, -2997620, -2115984, -1031708, -604765, -598910, -591834, -939466, -1912947, -2585692, -1852826, -305631, 283651, -512617, -1171285, -661237, -80521, -811164, -2205579]
36830b205579l82036P40808M66999l46434k31135M24029M01220l0876K23665Q71906
36820f7433O94510j55387l28555L10900M58246k03110l58080M91668Q40418m02228
36810A280949j841854j472246L53950J418220O57261p43588j211250n48042L43568
36801a763032O06379M2460p93711r47562k8045J130484J346754O43219J63122
36792D00068M00634M75078l16959j185032j024728j96246J13656j25780P2783
36783a386526O90544N30806n34229r20968J49291J158445O64700l35359j79268
36774a62564O05858M02901m64248l31709O24655N49587o98666j119110n0430P00722
36764E6996J42516k42384N23541R43910j14604j076019l88682N60439j35083j378492
$$ y = [-2205579, -2587615, -1846807, -1379808, -1726242, -1957377, -1533348, -1132128, -1163004, -939339, -67433, 627077, 471690, 143135, 454035, 912281, 709171, 351091, 842759, 1683177, 1280949, -560905, -2033151, -1679201, -260981, 396280, -347308, -1558558, -2106600, -1763032, -1156653, -1114193, -1907904, -2855466, -2883511, -1753027, -406273, 236946, 400068, 800702, 1275780, 958821, -226211, -1250939, -1447185, -1333529, -1459309, -1386526, -695982, -165176, -699405, -1620373, -1471082, -312637, 352063, 16704, -162564, 443294, 846195, 381947, 50238, 674893, 1224480, 525814, -593296, -643726, 56996, 199512, -42872, 480669, 1424579, 1309975, 233956, -154726, 405713, 270630, -1107862]
36754a107862q85857Q05451J229334Q0227o49411k21228J32184k1642K96195J057292
36744G14683R15484j59773m68121M81511R71341p0979j366603j499768r27236
36735a409461o23169m09420J31951N08437K99888J23023N14959Q68208M70505
36726D74921k82226n81002l39675L2623K34334j8575q13986j415880q26185O82443
36716b853208J684347J526173Q96240K67457o45288j459933r90999O37954J519750
36707E82493O91879l38792p3418O43241L66708l74097k04795N20512M12685l72767
36697A853649m11612M02147O26206k39881r24190n26889J10034n7209o13039n35662
36687c16446R0052K68920k81620o37449J6279J169592J549628P10799m37099p88698
$$ y = [-1107862, -1993719, -1188268, 41066, 121293, -528118, -749346, -617162, -638804, -342609, 714683, 1630167, 1470394, 1002273, 1483784, 2455125, 2384146, 1017543, -482225, -1409461, -2032630, -2442050, -2310099, -1801662, -1501774, -1378751, -863792, 4416, 474921, 192695, -388307, -727982, -695359, -461025, -479600, -1293586, -2709466, -3535651, -2853208, -1168861, 357312, 1253552, 1521009, 875721, -584212, -1575211, -937257, 582493, 1274372, 935580, 862162, 1505403, 1872111, 1498014, 1293219, 1813731, 2226416, 1853649, 1442037, 1844184, 2470390, 2230509, 1306319, 779430, 889464, 832255, 219216, -316446, -226394, 42526, -239094, -876543, -860264, 309328, 1858956, 2569755, 2132656, 1343958]
36677A343958k63668L97987N85931J44264p56006j475569j130589K84330J457201
36668E87839J304066M38810O7415M8352n01274j179620p55464M55496P12374l32071
36658H45923r58335j81112P33466N30275n8031J15547N61356J55252q66009j304750
36648d26418p06946L97004J339113J611099R97234L5821l73559k01871k07079
36639B464398m43955j74445N00234N50369n1619j68944K18942k47760j497438
36630A149782j443839M63031J657385L08035j628290j511924o3332L69602j64835
36621h64385J08473J202415J498565O78087q8719l61006n58637n04669L2247J53626
36611A295997o85323j077178J18092J230546K43636j421511q68453J401703K174196
$$ y = [1343958, 1080290, 1478277, 2064208, 2208472, 1452466, -23103, -1153692, -869362, 587839, 1891905, 2330715, 2398130, 2446482, 1945208, 765588, 10124, 465620, 1177994, 845923, -112412, -293524, 439942, 970217, 912186, 1027733, 1589089, 1744341, 878332, -426418, -1133364, -736360, 602753, 2213852, 3211086, 3246907, 2873348, 2671477, 2464398, 2020443, 1845998, 2346232, 2896601, 2844982, 2676038, 2894980, 2647220, 1149782, -294057, 168974, 1826359, 2134394, 506104, -1005820, -1069152, -699550, -864385, -755912, 446503, 1945068, 2623155, 2534436, 2173430, 1614793, 1110124, 1142371, 1295997, 610674, -466504, -348412, 882134, 1125770, -295741, -1164194, 237509, 2411705]
36602B411705O57702p56668q33942q39708j204024o12310P87790R00530m85445
36593B5630q36690P95295J928989Q04837p71015p01315J48430J44479k23723K8848
36583A343765P9877r81248j973681j466198k24407K93495L63157Q52154J150695
36574e62391L95213n61107n21686q4627l42383o55296Q7152J073134P75153k73939
36564f70777k82930P42360J053394N9606r38010r50272m20593M798L17349N92277
36554d92798P66861R76882J189424Q19733l36022j322952j256000o84737n37884
36545h77493m63361L05820J108851O53398o62309j025683J18886J261789J019111
36536A439009j27592p37761k23866O41383O80213k65441q61164J60473J911100
$$ y = [2411705, 3069407, 2312739, 1478797, 639089, -564935, -1177245, -389455, 511075, 25630, -811060, -15765, 1913224, 2718061, 1947046, 1245731, 1394161, 1538640, 1314917, 1343765, 1423642, 442394, -1531287, -2997485, -3221892, -2928397, -2565240, -1713086, -562391, -167178, -728285, -1249971, -1334598, -1676981, -2332277, -2245125, -1171991, -396838, -670777, -953707, -211347, 842047, 901653, -36357, -986629, -1407222, -1402424, -1085075, -492798, 274063, 1250945, 2440369, 3260102, 2924080, 1601128, 345128, -339609, -877493, -1340854, -1035034, 73817, 727215, 64906, -960777, -841891, 419898, 1439009, 1311417, 573656, 349790, 991173, 1671386, 1405945, 544781, 705254, 2616354]
36527B616354K049003N3816j760431j487041j92097K43200J31433P25364J369441
36518C749042N15865j215272j675033n70179L01330P7722l35346m51869p70789
36509c74529j013453k71749Q09024N46085o69416n23122J229226J851738N457
36500A589261j834761j237957M69503P47540k8585J55793J030890N67926j153828
36491C05782j666842L0486J879942J782763K72429p89381p47745l11024r3347
36482F63063m6708L1586J72728L51598N55374P24206P11880L16255m89732j255295
36472A734955j289321m72795M58846P55878M50665j9325n25208j031086j080013
36463a017404k79323Q45076J241921O31534k10269n27814l50845q0884Q2121Q1733
$$ y = [2616354, 4665357, 4719173, 2958742, 1471701, 1279604, 1522804, 1654237, 2379601, 3749042, 4264907, 3049635, 1374602, 804423, 1105753, 1183475, 848129, 396260, -374529, -1387982, -1659731, -850707, -304622, -974038, -1497160, -267934, 1583804, 1589261, -245500, -1483457, -1013954, -266414, -294999, -139206, 891684, 1459610, 305782, -1361060, -1330574, 549368, 2332131, 2604560, 1815179, 1067434, 756410, 663063, 616355, 647941, 820669, 1172267, 1727641, 2451847, 3163727, 3479982, 2990250, 1734955, 445634, -27161, 431685, 1187563, 1638228, 1618903, 1093695, 62609, -1017404, -1296727, -451651, 790270, 1421804, 1211535, 683721, 332876, 251992, 334113, 415846]
36453D15846r1743j72872K02709P81429O99848k91023j122910p05010L87544N37802
36443F41620n46826j246548l62109J036014J163281J74819k16413M74539Q08547
36434A926924j00653j056651p14597K53437K99542n38445q56389j85374M37702
36425e34504K29206l09246l83915P0973O55149R98862Q19838J89044k20278J09036
36415A624165O14591L90864k73161k53316M84884O90225j15077p91583m32936
36406A938656K74421M18680L52044O76770Q12076j2670j077250j044978j52081
36397B185668N8535q03095j310526m41113Q45249J042291K15524k98804J19530
36388A613259O89247N57820l6380l59512l55042m77399n74249O8964J256730J495100
$$ y = [415846, 324103, 151231, 353940, 1135369, 1835217, 1544194, 421284, -283726, 103818, 641620, 94794, -1151754, -1513863, -477849, 685432, 860251, 643838, 1118377, 1926924, 1826271, 769620, 55023, 308460, 608002, 69557, -786832, -972206, -534504, -305298, -614544, -998459, -927486, -272337, 726525, 1546363, 1735407, 1515129, 1624165, 2238756, 2629620, 2356459, 2103143, 2588027, 3278252, 3163175, 2371592, 1938656, 2213077, 2631757, 2983801, 3660571, 4472647, 4459977, 3382727, 2337749, 2185668, 2244203, 1441108, 130582, -310531, 534718, 1577009, 1792533, 1493729, 1613259, 2302506, 2860326, 2823946, 2464434, 2109392, 1631993, 1057744, 1126708, 2383438, 3878538]
36378C878538L189j646077j296375O57159J545355J03337j815616k015361q80708
36369a466559j74048j48412K89691J144217J100863j13273r36797k39319R52227
36360D08590R48018k47408j102563o72667L80030Q33381K89521o47505j161557
36351i72160r41049k53848M51318Q83595Q95730M00870m27266r69579n80084N99902
36341i12571J475786J016067m89602j491111q24950Q14882J549862N89289p87070
36332I40582r86410k16373O9332n34810q99301k75166N82014P29778L90086K51470
36322E1202L33657L64142M70697O26210K13531q55302j393286n22214P13205P17664
36312G19506k63748p28202m26651m05369p05479j67490J141449J488318K74825
$$ y = [3878538, 3881727, 2235650, 939275, 1596434, 3141789, 3245126, 1429510, -585851, -1466559, -1640607, -1789019, -1499328, -355111, 745752, 632479, -304318, -543637, 408590, 1356608, 1109200, 6637, -666030, -286000, 547381, 836902, 189397, -972160, -1913209, -2167057, -1715739, -832144, 63586, 464456, 37190, -932389, -1512473, -912571, 563215, 1579282, 1089680, -401431, -1226381, -411499, 1138363, 1727652, 940582, -45828, -262201, -192869, -727679, -1626980, -1902146, -1320132, -590354, -200268, 51202, 384859, 749001, 1219698, 1845908, 2059439, 1204137, -189149, -711363, 1842, 719506, 455758, -272444, -699095, -1104464, -1809943, -1977433, -835984, 652334, 927159]
36303I27159p70185l78226K20254l45378r58357O9945J717558J483569n93926
36294A372413j780685p14439P78069O88709m11203q05633k49768K51796K27318
36285f43423m5960m01790o84013l63413O56180J396744J078933M85251P75399
36276B253908J403293P79525j094553k326793j787729n05217J92760M49290Q75487
36267B39971J099483N72111j44389k32541l8231k83910n34988j0685N92600m6313
36257A213108j345148j212719O51010J916335R94882o34998q45438R56J48085
36248H86073m54935l24954P08262R98668k66737j682361j615537l48747O01321
36239a498947N12981P770l9288M78682R18298P07048J08278o1186L54370M28915
$$ y = [927159, 156974, -221252, -998, -346376, -1304733, -1234788, 482770, 1966339, 1372413, -408272, -1122711, -344642, 344067, -67136, -872769, -1122537, -870741, -643423, -689383, -1091173, -1775186, -2138599, -1482419, -85675, 993258, 1478509, 2253908, 3657201, 4436726, 3342173, 1015380, -772349, -1277566, -1084806, -635516, 239971, 1339454, 1911565, 1767176, 1534635, 1496404, 1212494, 677506, 666821, 1259421, 1213108, -132040, -1344759, -693749, 1222586, 2217468, 1582470, 737032, 737988, 886073, 431138, 106184, 814446, 1813114, 1546377, -135984, -1751521, -2100268, -1498947, -985966, -978196, -1017484, -538802, 379496, 1086544, 1194822, 1133636, 1488006, 1916921]
36229A916921n11241j664303j728327p17026K34219O14566Q71955J077490O50444
36220G44698k99456o88562q3052N21560K09301n32296o96753j47601N34849Q60867
36210D23555N35123m51050j307945r34762M91262J398267R51008J65304N1433
36201A322195l8676r07234j562541n73665J328262J917110N42150j173163j697620
36192h43182j084761q256J106757J633494Q75852p35704j672676j107509J56215
36183a679770R13841Q45685K57070n28489j076981r40666k64661L28541O28359
36174a517071Q72742Q82336J95079p70792q70078N8934P87924N26006J6249J33970
36164C15299M93757L43508o1918J7965N38599Q24978N61645o8260q13041j376014
$$ y = [1916921, 1405680, -258623, -1986950, -2703976, -2469757, -1855191, -983236, 94254, 744698, 445242, -243320, -326372, 195188, 404489, -127807, -824560, -972161, -437312, 423555, 958678, 507628, -800317, -1735079, -1243817, 154450, 1105458, 1270762, 1322195, 1283519, 376285, -1186256, -1759921, -431659, 1485451, 2027601, 854438, -843182, -1927943, -1936199, -829442, 804052, 1679904, 944200, -728476, -1835985, -1679770, -765929, 79756, 336826, -191663, -1268644, -2209310, -2473971, -2145430, -1517071, -644329, 238007, 433086, -337706, -1207784, -1148850, -360926, 165080, 181329, 315299, 809056, 1152564, 1090646, 1108611, 1647210, 2472188, 3033833, 2965573, 2152532, 776518]
36154G76518j459607j177950q84839m02752P00804J845728J689150J85796r40007
36145C32841n92658J87542J41210k24787M9658M33825N634o12625l42801K13596
36135d08565j91256r74293n53164P50167J050762P5443m79578k5967J8089r00948
36125a639310j188847R1645J304543P33904p03669r98821n8896N93346L02043
36116a564062k18988m22133n09559o13559m81238J1199O57546J104990R54515
36107a081289J50451n26953j36268R88272J454024P93251K5695j90742m63495
36098A012946j001971p99951L33580P16512n45466j503551j65127J996828J967770
36089B011570j89907j496764o18415N75685L53231o16422j092974j054987p02787
$$ y = [776518, -683089, -1861039, -2745878, -3148630, -2447826, -602098, 1087052, 1272848, 332841, -259817, -72275, 68935, -155852, -106194, 327631, 333265, -279360, -622161, -408565, -599821, -1574114, -2127278, -1377111, -326349, -250906, -730484, -756451, -738362, -1639310, -2828157, -2736512, -1431969, -698065, -1401734, -2400555, -2459451, -1866105, -1564062, -1783050, -2205183, -2714742, -3328301, -3809539, -3798340, -3140794, -2035804, -1081289, -930838, -1457791, -1594059, -605787, 848237, 1641488, 1667183, 1476441, 1012946, 10975, -788976, -455396, 261116, -284350, -1787901, -1953028, 43800, 2011570, 1821663, 324899, -293516, 282169, 635400, 18978, -1073996, -2128983, -2831770]
36080b831770L00268J538567J615612L02932p57852n52997j60503n32469o56919
36071a735131M67095J654010J254600j77819r07104p22456o36571o70666l5938
36062a509980R66818J276814R99590J031779J047827J5270j370761j152564O36205
36053A940998J568483M68336q09240m37078O30045N87903k56214m26395K6267
36044C293105j31855r46234j233535o38867J3444L14545O05586P45524J58233
36035B179946p37337p35405J70005N61376r1600m61980M05410J347760Q76546
36026C514721l80763o37456K39891N72291m97129j740067j671710m98315M43308
36017f55229M43264r8706n06434m73106n4001M56626O64413M33467R2259N4822
$$ y = [-2831770, -2531502, -992935, 622677, 925609, 167757, -385240, -545743, -1078212, -1735131, -1268036, 385974, 1640574, 1462755, 555651, -166805, -803376, -1474042, -1509980, -543162, 733652, 1733242, 2765021, 3812848, 3828118, 2457357, 1304793, 1940998, 3509481, 3977817, 3168577, 2731499, 3361544, 3949447, 3693233, 3266838, 3293105, 3161250, 2215016, 981481, 342614, 356058, 670603, 1276189, 2021713, 2179946, 1442609, 707204, 877209, 1438585, 1346985, 885005, 1290415, 2638175, 3514721, 3133958, 2496502, 2736393, 3308684, 2811555, 1071488, -600222, -1098537, -655229, -211965, -310671, -817105, -1290211, -1344212, -887586, -223173, 210294, 302553, 357375]
36007C57375L14866N39710N45138L81264M5615m87405r23774p88844j29672L01892
35997A56165o6761q12367j012723m18246L45317O93544O70433N41254L60133J82913
35987F39662K04473L50185J87055l77309p74878o17193l46484m26312m08362K97933
35977a271230J110005Q86235k10706p25549o9252N74100J34985o57174m84354
35968g12940M34682O72460k15014j018995o19688M92239R61134L88532k18032
35959A64378J06898Q65293O97229o05617j520407q45550M18972M35600o49196
35950i32400q89273L35838J246616M99720o72653n25522M47994N96869r2009k86906
35940b71726J79003J79334m63530o29960o920L48290J7776K1496Q53162J309436
$$ y = [357375, 672241, 1211951, 1757089, 2138353, 2183968, 1696563, 772789, -16055, -145727, 156165, 89404, -722963, -1735686, -2153932, -1808615, -1115071, -444638, 96616, 456749, 639662, 844135, 1194320, 1381375, 1004066, 229188, -388005, -734489, -1160801, -1569163, -1271230, -161225, 725010, 514304, -211245, -280497, 293603, 428588, -228586, -712940, -278258, 394202, 179188, -839807, -1459495, -967256, -6122, 382410, 164378, 271276, 1136569, 1833798, 1228181, -292226, -1137776, -718804, -283204, -932400, -1821673, -1485835, -239219, 260501, -412152, -937674, -489680, 107189, 15180, -271726, -92723, 86611, -376919, -1006879, -1013799, -665509, -647733, -626237, 226925, 1536361]
35930A536361L41102j130097j403790k40966J073785J378307N77985o03561j211576
35921C17550p74798J68445O38657M33000J67687J01312j46745n70306n92334k14597
35911d72129j51086l98144k3143R93443J188828j22758j430246j152913M2277
35902a525871N30371K51089K27990M10651p4634r63853j065983l18435J53436
35893b375239P0441L35322J097146J222347K52172o44897m18520M32770R27382
35884H98924R52514P54601J54829p86281j223116o73643j3029k68838r72288q22222
35874a998549L41987J345723J342651O34515j90526q92816j126121l89585R95362
35865F2641J680022Q51964n25073q94468j86001K78660j46332o13892l53371O9894
$$ y = [1536361, 1877463, 747366, -656424, -897390, 176395, 1554702, 2132687, 1529126, 317550, -457248, -288803, 349854, 782854, 950541, 1051853, 905108, 334802, -257532, -472129, -623215, -1021359, -1044502, -51059, 1137769, 1015011, -415235, -1568148, -1525871, -995500, -744411, -516421, -105770, -180404, -1144257, -2210240, -2528675, -2375239, -2304798, -1969476, -872330, 350017, 602189, -42708, -461228, -28458, 898924, 1851438, 2606039, 2760868, 1974587, 751471, 77828, 64799, -204039, -1176327, -1998549, -1656562, -310839, 1031812, 1666327, 1475801, 582985, -543136, -932721, 62641, 1742663, 2594627, 2069554, 1175086, 989085, 1267745, 1121413, 507521, 154150, 224044]
35855B24044j65463o65326m98592J64543K87513l16548o75276j99628M97946O35341
35845g11446K48576k04350m85987m84453j40263K37079K03008q3372n3094K21798
35835a252504M2366o60827j054944o67137Q0238Q42703J666216K012089R62764
35826A970964r41207j645347l70261J043997Q14435k56692m68193m496q6873m83504
35816d27177j20471N38301R9389j058203j052024M07438J407262P87472k75775
35807C06212l71079J42908J57099m04395p32936l16591N82566J121849N17047
35798A002680q58711j375506j79369J190142P14802r88654j412931N3170J295726
35789e58651Q50502j39879k52370J0173l19696p13012k47265N35341M57718l74884
$$ y = [224044, 58581, -606745, -1105337, -940794, -653281, -969829, -1645105, -1844733, -1346787, -711446, -462870, -667220, -1153207, -1637660, -1777923, -1540844, -1337836, -1421208, -1474302, -1252504, -1210138, -1870965, -2925909, -3593046, -3512808, -2670105, -1003889, 1008200, 1970964, 1029757, -615590, -985851, 58146, 872581, 615889, 147696, 143200, 56327, -427177, -547648, -9347, 90042, -968161, -2020185, -1612747, -205485, 581987, 306212, -64867, 78041, 235140, -169255, -902191, -1218782, -636216, 485633, 1002680, 143969, -1231537, -1410906, -220764, 494038, -494616, -1907547, -1854377, -558651, 291851, 151972, -100398, -90225, -409921, -1122933, -1370198, -834857, -377139, -752023]
35779g52023q42560m62899L02312R24012J120247P48652O8095l56784m39599n95837
35769b86384p12191j29980R12450J094571J7706q74708l85625N85875M93081n18544
35759A96251j054429n83422J78478N68622N52059K92960K8829Q1122L65363L49592
35749I75425j4573n5123L91342M84536j59646o01568j28235M35144J55101l29377
35739A153026n726N32632l402j272484j627979n69989O89341J095082Q19288M13603
35729A223392J09749O6185K85922K62603l71120r59880n79110M50212Q51972J82158
35719A522083o63929p74033j75051N59186Q91046N49047j63559m69408j22920
35710A152462J15718k81689n69241N8811R14442Q19035Q6338q0907K21156j64382
$$ y = [-752023, -1594583, -2057482, -1755170, -831158, 289089, 1037741, 1105836, 749052, 309453, -286384, -998575, -1128555, -216105, 878466, 896172, 21464, -364161, 221714, 714795, 196251, -858178, -1441600, -1263122, -694500, -142441, 150519, 179348, 260470, 625833, 975425, 960852, 905729, 1297071, 1781607, 1621961, 1020393, 892158, 1327302, 1482403, 1153026, 1147300, 1679932, 1676530, 404046, -1223933, -1793922, -1104581, -9499, 809789, 1223392, 1333141, 1399326, 1685248, 1947851, 1576731, 616851, 37741, 487953, 1339925, 1522083, 858154, 84121, -90930, 468256, 1359302, 1908349, 1744790, 1275382, 1152462, 1268180, 986491, 417250, 476061, 1390503, 2209538, 2295876, 2214969, 2436125, 2271743]
35700B271743j125287j168839K3562Q52464L26643m10787j06820N58247K75013
35691A495939o67295r50804l94452r1876n53855r65393n15145M25540Q89048O09892
35681g18401K69212N17044J099339J183473M32073n88942j111557q78602o5092
35672A38547R53564J510647J011992j54421p86953n20508m45806j250051j748782
35663a291771o20839J203943J654193N99429j50372Q1615q4060j347787k140875
35654b096524j019140R05311J488562N58930j79206K04787P85260M19044o29053
35645D37971j118181l89629Q65633J349016N75535o06490j068472o73442p1354
35636f99413L99637Q22324R57643M50514k15428j37179M27302J88959r92322j465918
$$ y = [2271743, 1146456, -22383, 1179, 853643, 1180286, 769499, 662679, 1220926, 1495939, 828644, -122160, -516612, -608488, -1162343, -2127736, -2642881, -2217341, -1328293, -718401, -449189, 67855, 1167194, 2350667, 2782740, 2193798, 1082241, 203639, 138547, 1092111, 2602758, 3614750, 3460329, 2673376, 2152868, 1707062, 457011, -1291771, -1912610, -708667, 945526, 1544955, 1394583, 1476198, 1392138, 44351, -2096524, -3115664, -2210353, -721791, -162861, -342067, -137280, 647980, 1067024, 437971, -680210, -1069839, -204206, 1144810, 1720345, 1113855, 45383, -628059, -699413, -299776, 522548, 1480191, 1930705, 1715277, 1578098, 2005400, 2194359, 1202037, -263881]
35626b63881k55197J113639O36392j171947j931201p16226Q91533J222332N43178
35617F8622Q3903J46909J01330l11961o21338m97378k47483k13059j65780K79077
35607a377158Q82717R49566L37017k18463r6676L10680K04396m05877p32380l71967
35597e18145K30371N62024O48448O70001N53469K48880q1203m60225j153361j889544
35587a189285j600732K63588K403494K632281M84888j887560k087496l06874J087914
35578a99782P19045k13053o6947O52949K33951j268222j845183o21920P02158
35569a907004M89747l33907J4113J117024J042559l81573j151356k04385J007444
35560c07338Q59532j30155m99372j98014l09842r96298j186340l56328N84962
$$ y = [-263881, -519078, 594561, 1230953, 59006, -1872195, -2588421, -1696888, -474556, 68622, 152525, 299434, 400764, 88803, -532535, -1029913, -1277396, -1490455, -1656235, -1377158, -494441, 455125, 792142, 573679, 477003, 787683, 992079, 586202, -146178, -518145, -287774, 274250, 922698, 1592699, 2146168, 2395048, 2313845, 1853620, 700259, -1189285, -2790017, -2526429, -122935, 2509346, 2994234, 1106674, -980822, -1287696, -199782, 519263, 306210, 239263, 892212, 1126163, -142059, -1987242, -2609162, -1907004, -1417257, -1751164, -1737051, -620027, 422532, 40959, -1110397, -1314782, -307338, 552194, 422039, -77333, -275347, -585189, -1581487, -2767827, -3124155, -2539193]
35551b539193O61630K55941M12730J113528J196803J58961q94446p96796j04283
35542e35125j67060p92341m44071R94978J480129j62561k038057j636776N69730
35533b731154J876890J159995n532k716Q50380J367150J102090L58737l78495
35524C597345o15241k54546J7775m44215j118245r93977k35204N3531l30666m58727
35514g82170J549K91638J18728K23300Q34552R60123N968j067242j075891j72854
35504f62299P16538J178039J233234P14393m14406j521420j774002r82602K79923
35495a232602J159202J133469N41541L07496O43729N30438o55821j660610r06456
35486a39614R00675J463429J41035j289239j325641m31905L31480O36879L77994
$$ y = [-2539193, -1877563, -1621622, -1208892, -95364, 1101439, 1260400, 365954, -430842, -535125, -702185, -1494526, -1938597, -943619, 536510, 373949, -1664108, -3300884, -2731154, -854264, 305731, 300199, 297483, 1147863, 2515013, 3617103, 3975840, 3597345, 2982104, 2727558, 2745333, 2301118, 1182873, 188896, -46308, 7223, -323443, -782170, -780621, -488983, -370255, -146955, 687597, 1647720, 1653688, 586446, -489445, -662299, 54239, 1232278, 2465512, 3179905, 2765499, 1244079, -529923, -1512525, -1232602, -73400, 1060069, 1601610, 1909106, 2552835, 3083273, 2427452, 766842, -139614, 761061, 2224490, 2365525, 1076286, -249355, -681260, -349780, 287099, 665093]
35477F65093m94983j138885m95911P56640P77616m57506q72731L09722J219962
35468B69017M95121n51901m09419J72686k7793m42452k02208r1094q87728j363388
35458c039159k13446J377128J448083M00922M5537M78331L79664k51229j40019
35449D85812P69955J094224K47556q71691j333895r01648K60340J288916Q54921
35440A894490q77686j670091k90162J250792P31797n58998l2592J568882J319328
35431C335760p42391j532691j78469N71408q34159k155282j246278N43195R20309
35422a318598J85073J5591N17196O26555K39345P0918K01948J91380j4081k81811
35412D33516o69314q98597m00938N16569O95148n7271m43651K96975J144362R19166
$$ y = [665093, 170110, -968775, -1464686, -708046, 69570, -387936, -1260667, -950945, 269017, 764138, 212237, -197182, -24496, -52289, -494741, -696949, -788043, -1675771, -3039159, -3252605, -1875477, -427394, -26472, 19065, 497396, 877060, 625831, 485812, 1255767, 2349991, 2597547, 1725856, 391961, -509687, -249347, 1039569, 1894490, 1016804, -653287, -943449, 307343, 1039140, 480142, 447550, 2016432, 3335760, 2593369, 1060678, 882209, 1453617, 619458, -1535824, -2782102, -2238907, -1318598, -1133525, -1117934, -600738, 25817, 265162, 336080, 538028, 729408, 715327, 433516, -235798, -1134395, -1535333, -1018764, -323616, -380887, -824538, -527563, 616799, 1535965]
35402A535965o8426q39124j071986q48545k17925L14995Q4355m14885N2732J213249
35392b59595J283870k2784o44037M46212J257167L5408j589514j153494N79841
35383f6926R58944j62734m41126Q04710J449976J33394j527349j400502J97240
35374e4373J200468M48900j277099k279950j467141O76496K357438K136773M22276
35365B163788j064804j173992k39306O16014N49864l59748j107703p99495K0987
35356a394395n6845r74882q44098J032426K398204J189858r33301q12233J279630
35347H84364K042314M17860r34328k51728N94682k84324j427998q01297M04100
35338F43645j74781j773790j629471L31742J351432M16158l30491M93216J218012
$$ y = [1535965, 1467539, 628415, -443571, -1292116, -1510041, -1195046, -1110691, -1525576, -1472844, -259595, 1024275, 1001491, 357454, 803666, 2060833, 2096241, 506727, -646767, -66926, 892018, 729284, 288158, 1092868, 2542844, 2676238, 1148889, -251613, -54373, 1146095, 1594995, 317896, -1962054, -3429195, -2752699, -395261, 1741512, 2163788, 1098984, -75008, -314314, 301700, 851564, 491816, -615887, -1415382, -1394395, -1451240, -2426122, -3270220, -2237794, 160410, 1350268, 416967, -395266, 884364, 2926678, 3344538, 2410210, 2158482, 2753164, 2468840, 1040842, 239545, 643645, 468864, -1304926, -2934397, -2602655, -1251223, -835065, -1165556, -672340, 545672]
35329E45672K07101j284709j256556j02650M61531K57008K94665N04382m154q64405
35319a242115p18066M85560J286346R72568M05126K95066J89763l40319q28398
35310E05531q09451n32701k92176J836K24206j0734m98322n79474l41918m80070
35300b813273p62346j73396R90511R87208n18808j338231P3498J984293J825470
35291B54926K4200q21849O8986Q13866M581j342631j499951k39002J294113J979281
35281E36520J529761M94221k98687n89813q07981j106944r51883k02360K59304
35272a137862j70815p65624p24434n13854o96267m54762J053316K701675K666707
35263A958080J174273M7832j12646k99881q64270r94361m92100j23796n1586K83769
$$ y = [545672, 752773, -531936, -1788492, -1891142, -1429611, -1172603, -877938, -373556, -377710, -1242115, -1960181, -1474621, -188275, 784293, 1189419, 1484485, 1674248, 1333929, 505531, -303920, -836621, -1128797, -1126961, -902755, -913489, -1411811, -1991285, -2333203, -2813273, -3575619, -3749015, -2758504, -1771296, -2290104, -3628335, -3554837, -1570544, 254926, 279126, -542723, -473737, 340129, 344710, -997921, -2497872, -2736874, -1442761, 536520, 2066281, 2560502, 2261815, 1672002, 864021, -242923, -1194806, -1397166, -1137862, -1308677, -2074301, -2798735, -3312589, -4008856, -4463618, -3410302, -708627, 1958080, 3132353, 3180185, 3067539, 2767658, 1903388, 909027, 416927, 293131, 241545, 525314]
35253E25314O68431L52696k51351j07169K85264m62829j791514j589907K25775
35244b145290J279543N62444j28687M06396Q06314K4499o06894j8037M45066m10018
35234B15336j241281o24000L19950K04901J41835J366905K085944J00622k803519
35225b33307k823511J30910K331710J811685N02271K74720K43694p13647j581839
35216e7314j115385j09665K2974m33540k48579O18313J103175P59535K05976N0637
35206G96127K19115L22635J63019j73799m76800n95333m71144o5892M79259O51653
35196H48840Q8740o00790l26030Q50025J503154Q41516j25395k37043O1053k64344
35186B639726j007656j250852r51706o28747j72155N78061Q01337r3784q96125
$$ y = [525314, 1193745, 1546441, 1295090, 1187921, 1473185, 1010356, -781158, -2371065, -2145290, -865747, -303303, -431990, -25594, 780720, 805219, 198325, 180288, 625354, 215336, -1025945, -1649945, -1329995, -1125094, -983259, 383646, 2469590, 2570212, -233307, -3056818, -2925908, -594198, 1217487, 1719758, 1994478, 2238172, 1524525, -57314, -1172699, -1282364, -1259390, -1692930, -1941509, -1323196, -220021, 539514, 745490, 796127, 1015242, 1337877, 1500896, 1327097, 850297, 254964, -216180, -282072, 197187, 848840, 937580, 336790, 10760, 860785, 2363939, 3205455, 3080060, 2843017, 2904070, 2639726, 1632070, 381218, -570488, -1199235, -1371390, -793329, 8008, -85776, -981901]
35177i81901j39936J266417J124504n27601j330284l12648O87924J04449j013903
35168a122979r66226Q44N07173K46407m9116o9612q4844q9363K03474P43413J159209
35157D78380J160715O04042m02604j212944j071466j43114M96988K15317m42956
35148c17642o36312j98749N32871J176897J299156O27892m02641r28640p10344
35139D42488l15431j75494k12691m27950q78935r62123R0694J665247K004195
35130A230000O06203q68680r30369k78075l46641q94959n58307P77429J737876
35121D74477J501559O99039R0662m47219j150366j519529r67219J40466P53648
35112d24482L78593l92187o89099m14040j86220l10520k85330L02414Q00547J93562
$$ y = [-981901, -1121837, 144580, 1269084, 741483, -588801, -901449, -213525, -109076, -1122979, -2089205, -2088361, -1581188, -1334781, -1383897, -1453509, -1538353, -1627716, -1424242, -680829, 478380, 1639095, 2243137, 1840533, 627589, -443877, -586991, -90003, 125314, -317642, -953954, -1152703, -619832, 557065, 1856221, 2484113, 2081472, 1152832, 442488, 127057, -48437, -261128, -689078, -1568013, -2530136, -2439442, -774195, 1230000, 1836203, 967523, 37154, -240921, -587562, -1482521, -2040828, -1263399, 474477, 1976036, 2675075, 2765737, 2318518, 1168152, -351377, -1318596, -1178130, -424482, -45889, -438076, -1127175, -1541215, -1727435, -2037955, -2323285, -2020871, -1220324, -1026762]
35102a026762j235883j878125q74427N81303Q29102R0409R6600J405540K321097
35093C08854J163131j206264k230958q82529J062141J359849L9810j006481o56027
35084b048474L11926P16036N44203N29344Q61466R98980M84410n40388j497283
35075C60220j767510j107688Q6681J041210J204031N14848o52737j445235q76221
35066b642401R49318K282195J554207l72035j173641l37895K74454m21578j025532
35057i12908j90784J007358R08823o021j75933L30051K29258n27783p72957k49182
35047c60078J40758O5412J00800M47680P55368J001066J205511P41415n92390
35038C505542j432078n56239Q43360O09815j083146k031044j309172m5473Q97754
$$ y = [-1026762, -2262645, -4140770, -5015197, -4433894, -3604792, -3514383, -3417783, -2012243, 308854, 1471985, 265721, -1965237, -2847766, -1785625, -425776, -385966, -1392447, -2048474, -1736548, -1020512, -476309, 53035, 914501, 1913481, 2397891, 1857503, 360220, -1407290, -2514978, -2428297, -1387087, -183056, 331792, -320945, -1766180, -2642401, -1693083, 589112, 2143319, 1771284, 597643, 259748, 534202, 112624, -912908, -1103692, -96334, 812489, 806468, 630535, 960586, 1189844, 662061, -110896, -360078, -219320, -153908, -53108, 394572, 1149940, 2151006, 3356517, 4097932, 3505542, 2073464, 1517225, 2360585, 2970400, 1887254, -143790, -1452962, -1498435, -600681]
35029f00681J593239J491949j32647j970564j684835L45254J106419m34965j696269
35020a983100o39268J273161J884266J486149J230390P32873n47185j470325j002054
35011I64907k41225n20381r58004j15705J200694J117661k65336j203772j000969
35002a022130m16975L2291M17426N58828L59049L42994N74984K5861j546061k313973
34992b987706p91131J591892K308301J176342m5383n42270p10674m06467O42378
34983B35282J286961L06208j142002r58076L58922L67626j174870j778933k95450
34974b794332J329222J304880M37725Q1221q4373p09323j066415l46818O81038
34965a167175Q31276L00615J2317P7270J19548L09561Q50588J076481K63891j031310
$$ y = [-600681, 992558, 2484507, 2351860, 381296, -1303539, -958285, 148134, -286831, -1983100, -2622368, -1349207, 535059, 2021208, 3251598, 3984471, 3437286, 1966961, 964907, 723682, 203301, -754703, -870408, 330286, 1447947, 1182611, -21161, -1022130, -1439105, -1406814, -989388, -430560, -71511, 271483, 846467, 872328, -673733, -2987706, -3778837, -2186945, 121356, 1297698, 1252315, 710045, -629, -407096, 235282, 1522243, 1828451, 686449, -271627, 87295, 454921, -719949, -2498882, -2794332, -1465110, -160230, 277495, 358716, 274343, -434980, -1501395, -1848213, -1167175, -335899, -35284, -22967, 54303, 173851, 483412, 1334000, 2410481, 2674372, 1643062]
34955A643062j493440p35623L24527O79891K17913m65223p79122n91810j46082
34946a345907L55127Q60318J086208N42997n84679j132832l49979Q04040P47842
34937I83135n50344j552039j226834q2106R13998J349286J126538K35102q72247
34928C24489j409328j032406j5544J196007J972056J468493l21767j785568j256740
34919h60308O78924J749458R47827m04087p66787k52483O4144l44633j094839
34910b82784j321451l80958J177312J668757L30699j198862r20043N36922Q91163
34901E00755j56911o84606m4629J32222q11520j071573M16058J750932R76004
34892A006732p92380j296965n94622k69757m18311J18369J184992J351942L67703
$$ y = [1643062, 149622, -586001, -261474, 418417, 636330, 171107, -608015, -1199825, -1345907, -990780, -130462, 955746, 1498743, 914064, -218768, -568747, 235293, 983135, 432791, -1119248, -2346082, -2428188, -1514190, -164904, 961634, 1196736, 324489, -1084839, -2117245, -2132789, -936782, 1035274, 2503767, 2182000, 396432, -860308, -181384, 1568074, 2515901, 2111814, 1345027, 1092544, 1156688, 812055, -282784, -1604235, -1985193, -807881, 860876, 1191575, -7287, -927330, -390408, 500755, 343844, -340762, -385391, -253169, -1064689, -2136262, -1720204, 30728, 1006732, 214352, -1082613, -1677235, -1946992, -2365303, -2246934, -1061942, 290000, 657703]
34883F57703m32456k65746J74783J05201l48595o96418o32872l4907P86299J045854
34873C58846M41336k71461m10227m11004q11856j001870k34893P98189Q38657
34864g04283J0994n09511l45408L419M78933J260603J582874N38672j013090j160960
34854A42243K46606J241162N79187o91557j085813o01471m6933K61015L01499
34845C45938r9643p32142q67568l17317J73969J21103L005K28249L52203J3517
34835g78686k57465L0582M04013L02717J39374M78425P75673J20146j080204j376765
34825a242190k97692R69366J206419O10623J25524N19k52653p56822r36371m62159
34815a035436R3897K8511m08163l13470N38446J273249R77875k68663j548197
$$ y = [657703, 225247, -40499, 134284, 239485, -109110, -805528, -1438400, -1473307, -687008, 358846, 800182, 528721, 118494, -292510, -1104366, -2106236, -2341129, -1542940, -704283, -693289, -1202800, -1548208, -1544789, -1065856, 194747, 1777621, 2316293, 1303203, 142243, 388849, 1630011, 2209198, 1517641, 431828, -169643, -216576, 44439, 345938, 246295, -485847, -1353415, -1670732, -1496763, -1375660, -1372655, -1144406, -792203, -778686, -1036151, -1005569, -601556, -298839, -159465, 318960, 1094633, 1214779, 134575, -1242190, -1539882, -570516, 635903, 1246526, 1372050, 1372569, 1119916, 363094, -573277, -1035436, -941539, -913028, -1321191, -1634661, -1096215, 177034, 1154909, 886246, -661951]
34806f61951j855670p23528J222841K295724J276690q16674j578921l02149J048934
34797i4704P31415l34642l37212N34033P98186L41512K48413N19603J99610m24160
34787B182054p1816R59026Q24093q15114k053088j733918r37936o22905j14338
34778b383942Q58893R61324l08933j134125k19510Q91911N10016j48843P41168
34769b32041J925616Q97699j567568k180928k59502J279293N23834r01433r23387
34760a438417J2126M67628M12515N21230N85569J03589n74373q29447o84071l59153
34750a782804J98128P77717Q83559O74409P96406R90371L31868p83735p37927
34741A347992N44149R76805m15787j719001j196478q0708k00443o83806K88659
$$ y = [-661951, -2517621, -3241149, -2018308, 277416, 1554106, 737432, -841489, -1143638, -94704, 636711, 302069, -35143, 498890, 1297076, 1638588, 1887001, 2406604, 2606214, 2182054, 2110238, 3069264, 3893357, 3078243, 1025155, -708763, -1646699, -2269604, -2383942, -1525049, -563725, -872658, -2006783, -2226293, -1334382, -824366, -973209, -232041, 1693575, 2591274, 1023706, -1157222, -1416724, -137431, 386403, -515030, -1438417, -1426291, -958663, -546148, -24918, 560651, 664240, 89867, -739580, -1423651, -1782804, -1584676, -806959, 76600, 751009, 1547415, 2537786, 2869654, 2085919, 1347992, 1892141, 2868946, 2453159, 734158, -462320, -543028, -743471, -1427277, -1138618]
34732a138618J816509J489446l94193j074073J49245Q19511m98410j867506j215659
34723a913748M54747R29100J36232l48210q0692p6608p95034j440225j284118
34714d418556n30417K57817Q06929J111548J273583J380893J283160P00628k10435
34705A655150p88416o92400l72643l18817k93146J55346P82353Q96912L60445
34696A384784k49663m67272m30976m29278l49300R9132P20894P89414o6313j151347
34686a49925j398630p66401k53035l08014j35893Q00373J534734R54194l06618
34677b9215p00141p4398L50425R9251j00035p034k82251q82673p65817K23720
34667b168168Q14112L84293l0510L07029N10850j61232p61010k56536O54540Q31540
$$ y = [-1138618, 677891, 2167337, 1773144, 699071, 848316, 1667827, 1169417, -698089, -1913748, -1459001, -529901, -393669, -741879, -822571, -899179, -1694213, -3134438, -4418556, -4948973, -4691156, -3884227, -2772679, -1499096, -118203, 1164957, 1865585, 1655150, 866734, 174334, -198309, -517126, -810272, -654926, 127427, 1024339, 1384784, 1135121, 667849, 236873, -192405, -541705, -442573, 278321, 1067735, 1001422, -149925, -1548555, -2314956, -2567991, -2876005, -3011898, -2211525, -676791, 277403, -29215, -729356, -803754, -453329, -354078, -454113, -461147, -743398, -1626071, -2391888, -2168168, -1354056, -969763, -1000273, -693244, -182394, -343626, -1104636, -1361172, -706632, 124908]
34657A24908O05855Q38331J127034O37825j47409k02850K33181K17685k30996
34648C203564n57089r20195j396456r41629Q77727K121582Q39306j556724j973846
34639c03760k50940Q61209K48424k71008K96492L98879p84870j420091j97945
34630a423610J163513P58775l35854j32072P75747M17667j019556j530182n85690
34621a911262L47086M14753L25738N56471N15566q3893n19886k43129L30316O11681
$$ y = [124908, 730763, 1569094, 2696128, 3333953, 3186544, 2983694, 3216875, 3434560, 3203564, 2646475, 1726280, 329824, -611805, 265922, 2387504, 3226810, 1670086, -303760, -554700, 306509, 554933, 283925, 580417, 979296, 194426, -1225665, -1423610, -260097, 498678, 162824, 30752, 806499, 1224166, 204610, -1325572, -1911262, -1564176, -1149423, -823685, -267214, 248352, 164459, -355427, -598556, -268240, 343441]
$$ [...]
##END NTUPLES=NMR SPECTRUM
##END=
