##TITLE=31Pdec_SR37_rep_2_4
 , 124 sc
 11.2.2021
##JCAMPDX= 6.0         $$ Bruker NMR JCAMP-DX V2.0
##DATA TYPE= NMR SPECTRUM
##DATA CLASS= NTUPLES
##ORIGIN= UXNMR, Bruker Analytische Messtechnik GmbH
##OWNER= root
$$ XWIN-NMR		Version 3.5
$$ Thu Feb 11 14:30:38 2021 Russian Standard Time (UT+4h)  she@DPX200
##.OBSERVE FREQUENCY= 81.013821
##.OBSERVE NUCLEUS= ^31P
##.ACQUISITION MODE= SIMULTANEOUS
##.ACQUISITION SCHEME= undefined
##.AVERAGES= 124
##.DIGITISER RES= 16
##SPECTROMETER/DATA SYSTEM= spect
##.PULSE SEQUENCE= zgpg30
##.SOLVENT NAME= CD3CN
##.SHIFT REFERENCE= (INTERNAL, CD3CN, 0, 248.564)
##AUDIT TRAIL= $$ (NUMBER, WHEN, WHO, WHERE, WHAT)
$$ ##TITLE= Audit trail, XWIN-NMR		Version 3.5
$$ ##JCAMPDX= 5.01
$$ ##ORIGIN= Bruker BioSpin GmbH
$$ ##OWNER= she
$$ F:/spectra/data/she/nmr/P31/1/pdata/1/auditp.txt
$$ ##AUDIT TRAIL=  $$ (NUMBER, WHEN, WHO, WHERE, WHAT)
(   1,<2021-02-11 14:29:14.50 +0400>,<she>,<DPX200>,
      <continue with go, POWCHK disabled, PULCHK disabled
       configuration hash MD5:
       00 E9 B6 7A A2 85 ED C7 34 08 36 98 17 FE 4E 26
       data hash MD5: 32K
       54 74 EF F5 59 DC 62 56 CE 36 24 9E B6 A7 97 E6>)
(   2,<2021-02-11 14:29:22.25 +0400>,<she>,<DPX200>,
      <Start of raw data processing
       efp BC_mod = 2 LB = 1 FT_mod = 6 PKNL = 1 PHC0 = -2987.652 PHC1 = 46.80249 SI = 64K 
       data hash MD5: 64K
       C5 13 0A 68 4C B4 07 44 51 95 69 BE E7 F7 AA AF>)
(   3,<2021-02-11 14:29:58.62 +0400>,<she>,<DPX200>,
      <pk PHC0 = 64.49648 PHC1 = -152.2 
       data hash MD5: 64K
       1D 4E 60 A6 67 D0 F4 78 D2 1D A8 86 37 06 8B 95>)
$$ ##END=
$$ 
$$ hash MD5
$$ 6A 28 23 06 ED 2C E8 72 31 D4 B0 80 E9 88 15 89
##$RELAX= 
##$RELAX= 
##$RELAX= 
##$RELAX= 
##$RELAX= 
##$RELAX= 
##$RELAX= 
##$RELAX= 
$$ Bruker specific parameters
$$ --------------------------
##$DU= <F:/spectra>
##$EXPNO= 1
##$NAME= <P31>
##$PROCNO= 1
##$TYPE= <nmr>
##$USER= <she>
##$AMP= (0..31)
100 100 100 100 100 100 100 100 100 100 100 100 100 100 100 100 100 100 
100 100 100 100 100 100 100 100 100 100 100 100 100 100 
##$AQSEQ= 0
##$AQ_mod= 1
##$AUNM= <au_zg>
##$AUTOPOS= <>
##$BF1= 81.014009
##$BF2= 200.13
##$BF3= 200.13
##$BF4= 200.13
##$BF5= 200.13
##$BF6= 200.13
##$BF7= 200.13
##$BF8= 200.13
##$BYTORDA= 1
##$CFDGTYP= 0
##$CFRGTYP= 5
##$CHEMSTR= <none>
##$CNST= (0..31)
1 1 145 1 1 1 1 1 1 1 1 1 1 1 1 1 1 1 1 1 1 1 1 1 1 1 1 1 1 1 1 1 
##$CPDPRG= <waltz16>
##$CPDPRG1= <>
##$CPDPRG2= <waltz16>
##$CPDPRG3= <>
##$CPDPRG4= <mlev>
##$CPDPRG5= <mlev>
##$CPDPRG6= <mlev>
##$CPDPRG7= <mlev>
##$CPDPRG8= <mlev>
##$CPDPRGB= <>
##$CPDPRGT= <>
##$D= (0..31)
0 1 0 0 0 0 0 0 0 0 0 0.03 2e-05 3e-06 0 0 0 0 0 0 0 0 0 0 0 0 0 0 0 0 
0 0 
##$DATE= 1613039157
##$DBL= (0..7)
120 120 120 11 120 120 24 19 
##$DBP= (0..7)
150 150 150 150 150 150 150 150 
##$DBP07= 0
##$DBPNAM0= <>
##$DBPNAM1= <>
##$DBPNAM2= <>
##$DBPNAM3= <>
##$DBPNAM4= <>
##$DBPNAM5= <>
##$DBPNAM6= <>
##$DBPNAM7= <>
##$DBPOAL= (0..7)
0.5 0.5 0.5 0.5 0.5 0.5 0.5 0.5 
##$DBPOFFS= (0..7)
$$ [...]
##$SUBNAM2= <"">
##$SUBNAM3= <"">
##$SUBNAM4= <"">
##$SUBNAM5= <"">
##$SUBNAM6= <"">
##$SUBNAM7= <"">
##$SUBNAM8= <"">
##$SUBNAM9= <"">
##$SW= 501.771253377433
##$SWIBOX= (0..15)
0 1 3 0 0 0 0 0 0 0 0 0 0 0 0 0 
##$SW_h= 40650.406504065
##$TD= 32768
##$TD0= 1
##$TE= 0
##$TE2= 300
##$TE3= 300
##$TEG= 300
##$TL= (0..7)
0 120 53 12 22 120 120 120 
##$TP= (0..7)
150 150 150 150 150 150 150 150 
##$TP07= 0
##$TPNAME0= <>
##$TPNAME1= <>
##$TPNAME2= <>
##$TPNAME3= <>
##$TPNAME4= <>
##$TPNAME5= <>
##$TPNAME6= <>
##$TPNAME7= <>
##$TPOAL= (0..7)
0.5 0.5 0.5 0.5 0.5 0.5 0.5 0.5 
##$TPOFFS= (0..7)
0 0 0 0 0 0 0 0 
##$TUNHIN= 0
##$TUNHOUT= 0
##$TUNXOUT= 0
##$USERA1= <user>
##$USERA2= <user>
##$USERA3= <user>
##$USERA4= <user>
##$USERA5= <user>
##$V9= 5
##$VALIST= <valist>
##$VCLIST= <CCCCCCCCCCCCCCC>
##$VD= 0
##$VDLIST= <DDDDDDDDDDDDDDD>
##$VPLIST= <PPPPPPPPPPPPPPP>
##$VTLIST= <TTTTTTTTTTTTTTT>
##$WBST= 1024
##$WBSW= 4
##$XGAIN= (0..3)
0 0 0 0 
##$XL= 0
##$YL= 0
##$YMAX_a= 17512
##$YMIN_a= -24115
##$ZGOPTNS= <>
##$ZL1= 120
##$ZL2= 120
##$ZL3= 120
##$ZL4= 120
##$ABSF1= 0
##$ABSF2= 0
##$ABSG= 0
##$ABSL= 0
##$ALPHA= 0
##$AQORDER= 0
##$ASSFAC= 0
##$ASSFACI= 0
##$ASSFACX= 0
##$ASSWID= 0
##$AUNMP= <proc_1d>
##$AZFE= 0.1
##$AZFW= 0.5
##$BCFW= 0
##$BC_mod= 2
##$BYTORDP= 0
##$COROFFS= 0
##$CY= -3
##$DATMOD= 1
##$DC= 0
##$DFILT= <>
##$DTYPP= 0
##$F1P= 0
##$F2P= 0
##$FCOR= 1
##$FTSIZE= 65536
##$FT_mod= 6
##$GAMMA= 0
##$GB= 0
##$INTBC= 1
##$INTSCL= 5.30512e-09
##$ISEN= 30
##$LB= 1
##$LEV0= 0
##$LPBIN= 0
##$MAXI= 10000
##$MC2= 0
##$MEAN= 0
##$ME_mod= 0
##$MI= 50
##$NCOEF= 0
##$NC_proc= -7
##$NLEV= 6
##$NOISF1= 182.463
##$NOISF2= 159.3651
##$NSP= 0
##$NTH_PI= 0
##$NZP= 0
##$OFFSET= 248.5645
##$PC= 4
##$PHC0= -2923.156
##$PHC1= -105.3975
##$PH_mod= 1
##$PKNL= yes
##$PPARMOD= 0
##$PSCAL= 0
##$PSIGN= 0
##$REVERSE= no
##$SF= 81.014009
##$SI= 65536
##$SIGF1= 159.3651
##$SIGF2= -187.1042
##$SINO= 113.3802
##$SIOLD= 16384
##$SREGLST= <1H.CDCl3>
##$SSB= 0
##$STSI= 65536
##$STSR= 0
##$SW_p= 40650.406504065
##$SYMM= 0
##$S_DEV= 0
##$TDeff= 32768
##$TDoff= 0
##$TI= <>
##$TILT= no
##$TM1= 0
##$TM2= 0
##$TOPLEV= 0
##$USERP1= <user>
##$USERP2= <user>
##$USERP3= <user>
##$USERP4= <user>
##$USERP5= <user>
##$WDW= 1
##$XDIM= 65536
##$YMAX_p= 411522467
##$YMIN_p= -50041873
$$ End of Bruker specific parameters
$$ ---------------------------------
##NTUPLES= NMR SPECTRUM
##VAR_NAME=  FREQUENCY,     SPECTRUM/REAL,   SPECTRUM/IMAG
##SYMBOL=    X,             R,               I
##VAR_TYPE=  INDEPENDENT,   DEPENDENT,       DEPENDENT
##VAR_FORM=  AFFN,          ASDF,            ASDF
##VAR_DIM=   65536,         65536,           65536
##UNITS=     HZ,            ARBITRARY UNITS, ARBITRARY UNITS
##FACTOR=    0.620285442955139, 1,           1
##FIRST=     20137.2065510759, 0,            0
##LAST=      -20513.1999529892, 0,           0
##MIN=       -20513.1999529892, -50041873,   0
##MAX=       20137.2065510759, 411522467,    0
$$ Real data points
##PAGE= N=1
##DATA TABLE= (X++(R..R)), XYDATA
$$ [...]
##PAGE= N=2
##DATA TABLE= (X++(I..I)), XYDATA
12892A2427518J522779r731041j3138526J748558J5093051K339334k3353939k5365570
$$ 12427518 13950297 4219256 -8919270 -7170712 7922339 10261673 -13092266 -38457836
12884c8457836J339308K2080522J4656042k734135p644777o410748j1835434j4756702
$$ -38457836 -37118528 -15038006 -381964 -3116099 -10760876 -17171624 -29007058 -43763760
12876d3763760l257554R613736N076981p865943n936185J0030581J7729264J0175035
$$ -43763760 -47021314 -37407578 -32330597 -40196540 -46132725 -36102144 -18372880 -8197845
12868h197845L008976M952958O290878J123841j376227M484677R468236N254277
$$ -8197845 -5188869 -235911 6054967 7178808 5802581 10287258 19755494 25009771
12860B5009771k483367m746477j399666L473650P687375P394742j785999j4944891
$$ 25009771 22526404 17779927 16380261 19853911 27541286 34936028 33150029 18205138
12852A8205138j9330286j0669876J092560O173514N442535L240789M31531j124051
$$ 18205138 -1125148 -11795024 -10702464 -4528950 913585 4154374 4585905 3461854
12844C461854K217406P391348N645018l234168q406270m723238m50800j975328
$$ 3461854 5679260 13070608 18715626 15481458 7075188 2351950 1901150 -74178
12836g4178k920913K766353Q003061L775791n234146p468059j153501N673757
$$ -74178 -2995091 -228738 7774323 11550114 6315968 -1152091 -2305592 3368165
12828C368165P025145K480140n925271j2225860p707443P420143J8713143J3522342
$$ 3368165 10393310 12873450 6948179 -5277681 -12985124 -5564981 13148162 26670504
12820B6670504j796595j0413114p159300j584927j040663k206417o73822J130771
$$ 26670504 24873909 14460795 7301495 5716568 4675905 2469488 1795666 2926437
12812B926437l23953k736939j666172K076177K979731j479056o496741n628859
$$ 2926437 2602484 -134455 -1800627 275550 3255281 1776225 -4720516 -10349375
12804a0349375l42447P05665m959000o779064M212300J8265002J7102473R43824
$$ -10349375 -10691822 -9986157 -14945157 -21724221 -17511921 753081 17855554 18799378
12796A8799378r643725l286950O206710K491071q859765j2109354o681332m129999
$$ 18799378 9155653 5868703 12075413 14566484 5706719 -6402635 -13083967 -17213966
12788a7213966o215310l657923M905491R393165N759253K483190N032426O231006
$$ -17213966 -23429276 -27087199 -22181708 -12788543 -7029290 -4546100 486326 6717332
12780F717332q25777r430988p610782M630968J4181736J0403364l010547j2905434
$$ 6717332 5891555 -3539433 -11150215 -6519247 7662489 18065853 15055306 2149872
12772B149872j1059362j601492N948743P942059P335579N486221L36204o266260
$$ 2149872 -8909490 -10510982 -4562239 3379820 10715399 16201620 16537824 10271564
12764A0271564p566722k151758K240376M82983j697835J805754N881676K297539
$$ 10271564 2704842 553084 2793460 3276443 1578608 3384362 9266038 11563577
12756A1563577n991448r076103n317610j819572j535525m47307K677177L832197
$$ 11563577 5572129 -3503974 -8821584 -10641156 -12176681 -12623988 -9946811 -6114614
12748f114614K243756K229156M650695M602103J23540l847283l074876K63623
$$ -6114614 -3870858 -1641702 3008993 7611096 7734636 3887353 812477 1076100
12740A076100K064172J596655K45175p71852K3429L127764N645527M071529l79258
$$ 1076100 3140272 4736927 4982102 4210250 4233679 7361443 13006970 17078499 16699241
12731A6699241l434764m298633n460531o371244l435328K750358O041208K692610
$$ 16699241 13264477 8965844 3505313 -2865931 -6301259 -3550901 2490307 5182917
12723E182917l857449p877818p148963k863889K154261M143378J538961j467224
$$ 5182917 1325468 -6552350 -13701313 -16565202 -14410941 -10267563 -8728602 -10195826
12715a0195826J172582Q491011J1988752O257753l734109q869705o468798j426224
$$ -10195826 -9023244 -532233 11456519 17714272 13980163 5110458 -1358340 -2784564
12707b784564J290332J533522J450526J491169R94693Q41088K102608K337753
$$ -2784564 -1494232 39290 1489816 2980985 3975678 4816766 6919374 9257127
12699I257127k176824q891377r494335k423451J633643n065915j2561701o156781
$$ 9257127 7080303 -1811074 -11305409 -13728860 -12095217 -17161132 -29722833 -35879614
12691c5879614R113931J3029235L47968j1034877p611169J695686M592562N338154
$$ -35879614 -26765683 -13736448 -13388480 -24423357 -32034526 -30338840 -25746278 -20408124
12683b0408124J1428989J5166784O410130o872668r564003l362719j185356l599694
$$ -20408124 -8979135 6187649 12597779 5725111 -3838892 -7201611 -8386967 -11986661
12675a1986661k79261Q644649J2151326P918959M155590K671241k005405p316427
$$ -11986661 -12265922 -3621273 8530053 16449012 20604602 23275843 21270438 13954011
12667A3954011n070736Q75107j339599r164379p820488L208827P943328J997817
$$ 13954011 8883275 9758382 8418783 -745596 -8566084 -5357257 2586071 4583888
12659D583888o44922M502626K777755j0643070j6933599m318105R875513O615406
$$ 4583888 3938966 8441592 11219347 576277 -16357322 -20675427 -10799914 -4184508
12651d184508n050660o519138o40566r57524m212753J145464R313734N784504
$$ -4184508 -9235168 -15754306 -16394872 -17352396 -21565149 -20419685 -11105951 -5321447
12643e321447n042877o128397K555682N527351O22050R23135P577891O509969
$$ -5321447 -10364324 -16492721 -13937039 -8409688 -7787638 -6864503 713388 7223357
12635G223357l957578p477815J271969O115698j892554q247742j203241O741053
$$ 7223357 3265779 -4212036 -2940067 3175631 1283077 -6964665 -8167906 -1426853
12627a426853J056406q486464m234310R063886J2199802K508316m313953p34283
$$ -1426853 -370447 -8856911 -13091221 -4027335 8172467 10680783 6366830 5632547
12619E632547L706883J046393m099674n474422l908540j471367K325152N449648
$$ 5632547 9339430 10385823 6286149 811727 -3096813 -4568180 -2243028 3206620
12611C206620M003595R8203k83341J362182k400769r836240q706014M731292J6698386
$$ 3206620 7210215 7308418 7025077 8387259 5986490 -3849750 -12555764 -7824472 8873914
12602H873914J3441161j079014j2721099j4719355j0029242l275741J452432P80679
$$ 8873914 22315075 21236061 8514962 -6204393 -16233635 -19509376 -18056944 -17276265
12594a7276265k465038j36337Q064944J0669086K303219m625195J421563J0539946
$$ -17276265 -19741303 -19877640 -11812696 -1143610 1159609 -3465586 -2044023 8495923
12586H495923O229044o555434q609681J570466N695910k876188q808716k481369
$$ 8495923 14724967 8169533 -440148 1130318 6826228 3950040 -4858676 -7340045
12578g340045M155656N20576l746591K272084R618493M757360o467529q489431
$$ -7340045 -3184389 -2663813 -6410404 -4138320 5480173 10237533 3770004 -4719427
12570d719427r47634L671673J287305j399331j546267k003065j668044K312404
$$ -4719427 -5667061 -1995388 -708083 -2107414 -3653681 -5656746 -7324790 -5012386
12562e012386N850339L896484Q19356K270382K574724n148913j2379522o125934
$$ -5012386 837953 4734437 5553793 7824175 10398899 5249986 -7129536 -13255470
12554a3255470P773423J1171833J326973p189524p314351n737753l799202N381960
$$ -13255470 -5482047 5689786 7016759 -172765 -7487116 -13224869 -17024071 -11642111
12546a1642111J6799563J3847895l351528j2311455k155755Q110017L49104j3133695
$$ -11642111 5157452 19005347 15653819 3342364 1186609 9296626 9645730 -3487965
12538c487965j0357991M789744J0197695L69244q325773m658438M216608P741389
$$ -3487965 -13845956 -9056212 1141483 1510727 -6815046 -11473484 -7256876 484513
12530D84513N172721R94582j855216j770274L32003r06869q258272j3642584o052831
$$ 484513 5657234 6651816 4796600 3026326 3358329 2451460 -5806812 -19449396 -25502227
12521b5502227J1318653K0958001J1587282p643489j7877314j1685274O96121
$$ -25502227 -14183574 6774427 18361709 10718220 -7159094 -18844368 -18148247
12514a8148247N063330l36964m295073J752629J1414978J1100039j481057j3351230
$$ -18148247 -13084917 -13421881 -17716954 -15964325 -4549347 6550692 5069635 -8281595
12506h281595j2686949k958419L482188J496443k350165K03402Q539046J3300120
$$ -8281595 -20968544 -23926963 -20444775 -18948332 -21298497 -21095095 -12556049 744071
12498G44071O885679o103797j1811311l578631Q468563J0496319L898482J547037
$$ 744071 7629750 1525953 -10285358 -13863989 -5395426 5100893 8999375 10546412
12490A0546412O860262R069768J768048o456308o331444k348830l991940r918065
$$ 10546412 17406674 26476442 28244490 21788182 15456738 13107908 9115968 -802097
12482h02097j0820665m298139K222042K720724m3835K69082M612865O940931K052320
$$ -802097 -11622762 -15920901 -13698859 -10978135 -11021970 -10752888 -6140023 800908 2853228
12473B853228n731561n797356M119097J1998428O871047m818951p941671o41347
$$ 2853228 -2878333 -8675689 -4556592 7441836 14312883 9493932 1552261 910914
12465I10914M263518o99005q429302r750187m127806M216537J0796557J0028381
$$ 910914 5174432 4475427 -3953875 -13704062 -17831868 -13615331 -2818774 7209607
12457G209607J55491j0205105j0934867n087914k710051k763045K541537P827059
$$ 7209607 7365098 -2840007 -13774874 -18862788 -21572839 -24335884 -21794347 -13967288
12449a3967288M55346j2525473q459479J3285634K4099041Q903295r404747o100644
$$ -13967288 -13511942 -26037415 -34496894 -21211260 2887781 11791076 2386329 -3714315
12441c714315P912857P693547n118468r498831j128643M543861l40922p561227
$$ -3714315 4198542 11892089 6773621 -2725210 -3853853 690008 349086 -7212141
12433g212141q847527l485791O304140J3961379R488581n047006j0896504J615553
$$ -7212141 -16059668 -19545459 -13241319 720060 10208641 5161635 -5734869 -4119316
12425d119316J4619746P705886j0852105j8382776j1595484l099167M637329J5494670
$$ -4119316 10500430 18206316 7354211 -11028565 -22624049 -25723216 -21085887 -5591217
12417e591217J9184014M279260j3750001q982868J2197131J7132153k337048j8248878
$$ -5591217 13592797 17872057 4122056 -4860812 7336319 24468472 22131424 3882546
12409C882546j2233497j3529J444009K58053O416743R396147n38781j0366095
$$ 3882546 -8350951 -8364480 -6920471 -6662418 -245675 9150472 8611691 -1754404
12401a754404n109639O405743P478315J214182J556641P626403P526163K92992
$$ -1754404 -6864043 -458300 7020015 8234197 9790838 17417241 24943404 25236396
12393B5236396m845995o004317q239554r437833l106347O328558O398739m088802
$$ 25236396 20390401 14386084 6146530 -3291303 -6397650 -69092 6329647 2240845
12385B240845j1421568n678160O481363J1405547M579626o239289j0832731p062863
$$ 2240845 -9180723 -14858883 -8377520 3028027 7607653 1368364 -9464367 -16527230
12377a6527230j675757o06586q89148L565162J0232125R999072J543140n555924
$$ -16527230 -18202987 -18809573 -19698721 -16133559 -5901434 4097638 5640778 84854
12369H4854n172018k674777l432479k722441M554438J1412172O786092p003019
$$ 84854 -5087164 -7761941 -11194420 -13916861 -9362423 2049749 8835841 1832822
12361A832822j4992387q563592L967233Q587768K526921m270472l045557L140773
$$ 1832822 -13159565 -21723157 -17755924 -9168156 -6641235 -10911707 -13957264 -10816491
12353a0816491N283467J745128m37851K340710M577617J727131j624464J3394
$$ -10816491 -5533024 -3787896 -4225747 -1885037 2692580 4419711 2795247 2808641
12345B808641L191557J893277j646037j307051K105602L245703J330153j525202
$$ 2808641 6000198 7893475 6247438 4940387 7045989 10291692 11621845 10096643
12337A0096643n915526j0254834p144619M567431J1959153N573170l571418q37923
$$ 10096643 4181117 -6073717 -13218336 -8650905 3308248 8881418 5310000 4472077
12329D472077O687673K465227q627304p139219N428026O291359r445807j7762048
$$ 4472077 11159750 13624977 4997673 -2141546 3286480 9577839 132032 -17630016
12321a7630016m038849J3286016J2077960j669975p976273k245807N751569R339211
$$ -17630016 -21668865 -8382849 3695111 2025136 -5951137 -8196944 -2445375 6893836
12313F893836P112252j334578j0275647r482583j77284L568252k475261m755128
$$ 6893836 14006088 12671510 2395863 -7086720 -7264004 -3695752 -6171013 -10926141
12305a0926141L623468R170199J904471n914103j373370O581304M908632N2487
$$ -10926141 -7302673 1867526 3771997 -2142106 -3515476 3065828 7974460 8026947
12297H026947L048218O580903k31771q203588m164171J893495o578718j9069898
$$ 8026947 11075165 17656068 17424297 9220709 5056538 6950033 371315 -18698583
12289a8698583j1894289R835307J6650657J217597j1606546o194214K944883J413022
$$ -18698583 -30592872 -20757565 -4106908 -2889311 -14495857 -20690071 -17745188 -16332166
12281a6332166k039262K843365O887707k09510q885975n356640N071170P876568
$$ -16332166 -18371428 -15528063 -8640356 -8849866 -17735841 -23092481 -18021311 -10144743
12273a0144743K832006J108930N421863Q250250O266081L422123J275535k706706
$$ -10144743 -7312737 -6203807 -781944 7468306 13734387 17156510 18432045 15725339
12265A5725339p249676o606405Q10063Q927326J0506185M280064m118316o864615
$$ 15725339 8475663 1869258 2679321 11606647 22112832 26392896 22274580 15409965
12257A5409965j511818N015330L312101o232287j2559982p912549K014322N820767
$$ 15409965 13898147 18913477 22225578 15993291 3433309 -4479240 -2464918 3355849
12249C355849N56421o561546q312838m683585m61927P64840n35805j431656l35555
$$ 3355849 3912270 -2649276 -10962114 -15645699 -16107626 -15342786 -15878591 -17310247 -17645802
12240a7645802J131653R64300N22801K737752O428243O012620r41360q480242
$$ -17645802 -16514149 -15549849 -15027048 -12289296 -5861053 151567 -789793 -9270035
12232i270035q046892J015513R986727J0865777N262559O67988j69432j504139
$$ -9270035 -17316927 -16301414 -6314687 4551090 9813649 10481637 10312205 8808066
12224H808066n934107r081053o211126L38222M903182N937051M806676J473924
$$ 8808066 2873959 -6207094 -12418220 -12079998 -7176816 -1239765 3566911 5040835
12216E040835k332864n85521P727834J1611571K093807j0337341p269775R203991
$$ 5040835 2707971 2122450 9850284 21461855 23555662 13218321 5948546 15152537
12208A5152537J6628788M367577j1458612j2514573j927135O432978Q125906N889603
$$ 15152537 31781325 36148902 24690290 12175717 10248582 16681560 24807466 30697069
12200C0697069m38609q973089j1000369l390715L760908K989121J452982M794498
$$ 30697069 30258460 21285371 10285002 6894287 10655195 13644316 15097298 19891796
12192A9891796K977675j0929422k1363101j1412528O957264Q901770l378186m395586
$$ 19891796 22869471 11940049 -9423052 -20835580 -13878316 -4976546 -8354732 -12750318
12184a2750318J1774025K1172441Q646271r329404j2143379l969732o88961m193843
$$ -12750318 -976293 20196148 28842419 19513015 7369636 3399904 2710943 -1482900
12176a482900n396916k000821J086038K470039M201971N583432M874015K765014
$$ -1482900 -6879816 -8880637 -7794599 -5324560 -1122589 4460843 9334858 12099872
12168A2099872o96433o504032j0517426n692800M832431P069210m370388j5781688
$$ 12099872 11403439 4899407 -5618019 -11310819 -6478388 590822 -3779566 -19561254
12160a9561254j2233176K095168J1233372Q765571J593541l175817m556757k652591
$$ -19561254 -31794430 -29699262 -18465890 -9700319 -8106778 -11282595 -15839352 -18491943
12152a8491943L267616J0690505J3997053J0006206O47066q860978j2438942o866463
$$ -18491943 -15224327 -4533822 9463231 19469437 20116503 11255525 -1183417 -8049880
12144h049880L644284R636498O703586N86169j463841n95436k669572p644118
$$ -8049880 -4405596 5230902 11934488 12520657 11056816 10461380 7791808 147690
12136A47690q986199l420647L982760N945888J170529n034307o615875k183481
$$ 147690 -8838509 -12259156 -8276396 -2330508 -1159979 -6194286 -12810161 -14993642
12128a4993642M444371P902976N478014j300930q068624j0719718q303309l076667
$$ -14993642 -10549271 -2646295 2831719 1530789 -6537835 -17257553 -25560862 -28637529
12120b8637529K750541Q745402J3008642J0569856M29385q106874m317784Q615602
$$ -28637529 -25886988 -17141586 -4132944 6436912 6866297 -1240577 -5558361 3057241
12112C057241J6139327J1333650J221295p505768j5657032k0170548j1992255
$$ 3057241 19196568 30530218 31751513 24245745 8588713 -11581835 -23574090
12105b3574090N303487J1626789q13195j1096570n31876J5597199J1655853n569366
$$ -23574090 -18270603 -6643814 -7457009 -18553579 -19085455 -3488256 8167597 2598231
12097B598231q060063O127568J0911739j594485q271140K760170J0754907q74373
$$ 2598231 -5461832 665736 11577475 9982990 1711850 4472020 15226927 14352554
12089A4352554j5913529j4000567k972374O32008J989111J2669928K1867042J1752523
$$ 14352554 -1560975 -15561542 -18533916 -17901908 -15912797 -3242869 18624173 30376696
12081C0376696r116784j6020393n820067J842698k145908p302347p247102p839249
$$ 30376696 21259912 5239519 -580548 1262150 -883758 -8186105 -15433207 -23272456
12073b3272456r057747j742728J2313948J7499221Q080920l459249p817080r844049
$$ -23272456 -32330203 -34072931 -21758983 -4259762 3821158 361909 -7455171 -17299220
12065a7299220j0925548r78158J9486747K8137464R650214j7289450k1678868
$$ -17299220 -28224768 -29202926 -9716179 18421285 28071499 10782049 -10896819
12058a0896819j548126J5869579J2339505k002110r282788o687766j984819O61607
$$ -10896819 -12444945 3424634 15764139 13762029 4479241 -2208525 -4193344 -3531737
12050c531737J124031k043103p867779q970470n89848R133707P334058n158917
$$ -3531737 -2407706 -4450809 -12318588 -21289058 -21878906 -12745199 -5411141 -10570058
12042a0570058j2777796n571272P424149J0914458L573695k324271J286658R363783
$$ -10570058 -23347854 -28919126 -21494977 -10580519 -7006824 -9331095 -8044437 1319346
12034A319346J3035320J0057039L365185m463045j1003232j2510912p501290K4213
$$ 1319346 14354666 24411705 27776890 23313845 12310613 -200299 -7701589 -7677376
12026g677376M342389L839088J012518j611045l490945n354368p772138r169011
$$ -7677376 -3334987 504101 1516619 -94426 -3585371 -8939739 -16711877 -25880888
12018b5880888n635975L916893J2641379J1283457N85176p765925n918910M40644
$$ -25880888 -31516863 -27599970 -14958591 -3675134 -3089958 -10855883 -16774793 -16334149
12010a6334149K158230L31740K248051P703937R029725M059940l73703o986J72799
$$ -16334149 -14175919 -13844179 -11596128 -3892191 5137534 9197474 8823771 8816785 8989584
12001H989584m665067r630738o697035K356776O884841J764966n068672k863191
$$ 8989584 4324517 -5306221 -12003256 -9646480 -2761639 -996673 -6065345 -8928536
11993h928536P407364J3630499P891085l379523p994263m115887k010862q598882
$$ -8928536 -1521172 12109327 20000412 16620889 8626626 4510739 2499877 -6099005
11985f099005j6047599j1251443N524020J8487905J5215696K386237k934179M467847
$$ -6099005 -22146604 -33398047 -27874027 -9386122 5829574 8215811 5281632 9749479
11977I749479J1829705O681278n757151j0179443k598022M885281J577785q014966
$$ 9749479 21579184 28260462 22503311 12323868 9725846 14611127 16188912 8173946
11969H173946j2134759p148964P95522N373345N353483K569414k55614r73012
$$ 8173946 -3960813 -11109777 -10314255 -4940910 412573 2981987 2726373 1753361
11961A753361o33752k225238m262072o07563Q952571J4182808P738274k451602
$$ 1753361 1119609 -1105629 -5367701 -5975264 2977307 17160115 24898389 22446787
11953B2446787l692581K578926L780061l671764r661225p179627j972528j493455
$$ 22446787 18754206 21333132 25113193 21441429 11780204 4600577 2628049 1134594
11945A134594m283287n548583n217743n047674m248312k799048l188694m565393
$$ 1134594 -3148693 -8697276 -13915019 -18962693 -23211005 -26010053 -29198747 -33764140
11937c3764140j402893P068796J2212536P138825j942411k694794O780159J4829298
$$ -33764140 -35167033 -28098237 -15885701 -8746876 -10689287 -13384081 -6603922 8225376
11929H225376J0683700k263033j0606273p437450q26396k429120j0569932j2649423
$$ 8225376 18909076 16646043 6039770 -1397680 -2224076 -4653196 -15223128 -27872551
11921b7872551m836084J842970L08936k51326Q399084J5879187Q828964m696586
$$ -27872551 -32708635 -30865665 -30556729 -30808055 -22408971 -6529784 2299180 -2397406
11913b397406o238993L059821N753712o14071m84973Q586566Q266502p891215
$$ -2397406 -8636399 -5576578 177134 -436937 -921910 7664656 15931158 8039943
11905H039943j9048111q805918R019127J3464923O819188K832563P41386o860987
$$ 8039943 -11008168 -19814086 -10794959 2669964 9489152 12321715 13063101 6202114
11897F202114j2404148l634887J1155503J1422824m083061j4666174p676891O297792
$$ 6202114 -6202034 -9836921 1318582 12741406 8658345 -6007829 -13684720 -7386928
11889g386928J1252451M942401l414334m850270K163580R789238P305098m953635
$$ -7386928 3865523 8807924 5393590 543320 2706900 12496138 19801236 14847601
11881A4847601j3028110p530789L039660O382919M788755O676779Q303058M31686
$$ 14847601 1819491 -5711298 -2671638 3711281 8500036 15176815 23479873 23911559
11873B3911559j1955385j4191444m470372M132113L842818n004j070749J504856
$$ 23911559 11956174 -2235270 -6705642 -2573529 1269289 1264285 193536 1698392
11865A698392P762353J4846902J2479516m593265k1689924j8736998N45916J1998761
$$ 1698392 9460745 24307647 36787163 32193898 10503974 -8233024 -7687108 4311653
11857D311653N149933m990064m644706l56401k497211o478859k635800O738566
$$ 4311653 9461586 4471522 -173184 -529585 -3026796 -9505655 -12141455 -5402889
11849e402889J1986907J0001176M276944k421281p611631p104977o42359M849180
$$ -5402889 6584018 16585194 20862138 18440857 10829226 3724249 3081890 7931070
11841G931070L409650k005936m091931r54955J896360j791899j0900120j5517376
$$ 7931070 11340720 9334784 5242853 4287898 6184258 4392359 -6507761 -22025137
11833b2025137p586186N914316Q869075m73279m028512Q352632J9630149J0746220
$$ -22025137 -29611323 -23697007 -14827932 -15301211 -19329723 -10977091 8653058 19399278
11825A9399278p466326j0325449J406170N295663l581077p070995Q35685M045877
$$ 19399278 11932952 1607503 3013673 8309336 4728259 -2342736 -1507051 2538826
11817B538826l408501n496609L977223O974396n605195j4059632l082225J0317341
$$ 2538826 -869675 -6366284 -2389061 4585335 -1019860 -15079492 -18161717 -7844376
11809g844376N553250o649258m358617Q213477J1103355K875218k827583m269749
$$ -7844376 -2291126 -8940384 -13299001 -5085524 6017831 8893049 6065466 1795717
11801A795717q206713q661199L155366J4720664O578630j3348038j8384960m123101
$$ 1795717 -6410996 -15072195 -11916829 2803835 9382465 -3965573 -22350533 -26473634
11793b6473634P870917P329169O368761R997851O239867o111566r184741K389649
$$ -26473634 -18602717 -11273548 -4904787 5093064 11332931 5221365 -3963376 -1573727
11785a573727Q708536j575116j0334790j711538Q856808J231542j2739337p246874
$$ -1573727 7134809 5559693 -4775097 -6486635 2370173 3601715 -9137622 -16384496
11777a6384496J4320700K3415159R705775o583842p864023j120279K02822k782940
$$ -16384496 -2063796 21351363 31057138 24473296 16609273 15488994 15691816 12908876
11769A2908876j797096L064958N453659K718772l694343j1547717j5890201j0495698
$$ 12908876 11111780 14176738 19630397 22349169 18654826 7107109 -8783092 -19278790
11761a9278790K508867J0365074M336502p453819r481933J040439J1134555R303969
$$ -19278790 -16769923 -6404849 -2068347 -9522166 -19004099 -17963660 -6829105 2474864
11753B474864r44027p163129k940444O382176J0697213N305156n059118j1067284
$$ 2474864 1530837 -5632292 -8572736 -2190560 8506653 13811809 8752691 -2314593
11745b314593q017336r6927N355678O278519N897490O038828N388898M098470
$$ -2314593 -10331929 -10428856 -5073178 1205341 7102831 13141659 18530557 22629027
11737B2629027L860502K308409n081124j4550276j4625369l237160N379201Q90438
$$ 22629027 26489529 28797938 23716814 9166538 -5458831 -8695991 -3316790 -2426352
11729b426352n281327K833863J7386788J5332882n442043k0269489j3442864Q38244
$$ -2426352 -7707679 -4873816 12512972 27845854 22403811 2134322 -11308542 -10470298
11721a0470298L514651k393815m414946l436773n429759l795820Q418958J8143716
$$ -10470298 -6955647 -9349462 -13764408 -17201181 -22630940 -26426760 -18007802 135914
11713A35914Q023722j2331390j5872399J342030J4422138Q810165j41263L217451
$$ 135914 8159636 -4171754 -20044153 -18702123 -4279985 4530180 4388917 7606368
11705G606368R131849K508992r732379j1112853l214666o81318n847006p743898
$$ 7606368 16738217 19247209 9514830 -1598023 -4812689 -5494007 -11341013 -19084911
11697a9084911k922698R69583J725302N542095J1741285J0822168K119446j768268
$$ -19084911 -22007609 -21038026 -19312724 -13770629 -2029344 8792824 10912270 9144002
11689I144002M863575J0094915L608493n467007l291901M891981K402003j0723085
$$ 9144002 14007577 24102492 27710985 22243978 18952077 23844058 26246061 15522976
11681A5522976j5374191k885522R479424K695403j5647296k0873000m421424J5967414
$$ 15522976 148785 -2736737 6742687 9438090 -6209206 -27082206 -31503630 -15536216
11673a5536216J9755319O352692q836988j2873048n227935N396985R903634O917606
$$ -15536216 4219103 10571795 1734807 -11138241 -16366176 -10969191 -1065557 5852049
11665E852049L476430N170722P502526K968408n505067p991665m348548n073537
$$ 5852049 9328479 14499201 22001727 24970135 19465068 11473403 7124855 2051318
11657B051318j1990311j2068434J399732J4538384J1888198o93065o202910j501279
$$ 2051318 -9938993 -22007427 -20607695 -6069311 5818887 5125822 -1077088 -2578367
11649b578367L374113M862896P682579J0036859M684309n273486q386251l961093
$$ -2578367 795746 5658642 13341221 23378080 28062389 22788903 14402652 10441559
11641A0441559k879168p263915o534481K203716P481758L704536Q14238N038004
$$ 10441559 7562391 298476 -6236005 -4032289 3449469 7154005 7968243 13006247
11633A3006247O851010n56921o682626j599838N445069J530383p180612n941704
$$ 13006247 19857257 19300336 12617710 11017872 16462941 17993324 10812712 4871008
11625D871008L591204P208469J752821k924367k589989k173117k236591J404420
$$ 4871008 8462212 15670681 17423502 14499135 11909146 9736029 7499438 8903858
11617H903858M655979j598841j3370814j4947143k532708Q508538O026378k818741
$$ 8903858 13559837 11960996 -1409818 -16356961 -18889669 -10381131 -4354753 -7173494
11609g173494n434557j986917l04026j469024p45605K200945K962081J9271l502096
$$ -7173494 -12608051 -14594968 -14898994 -16368018 -17113623 -14912678 -11950597 -11931326 -15433422
11600a5433422m282115j177644M817433J0091785J0208748M604420k387230o334677
$$ -15433422 -19715537 -20893181 -16075748 -5983963 4224785 8829205 6441975 107298
11592A07298o291551l541126l1429J825342J081696k27260k84161l96941j372654
$$ 107298 -6184253 -9725379 -9756808 -7931466 -6849770 -7077030 -7361191 -7758132 -9130786
11583i130786o48314J903637M37273o747988r239939J669417J5415439J3439412
$$ -9130786 -9779100 -7875463 -7438190 -14186178 -23426117 -21756700 -6341261 7098151
11575G098151k983428j2949820o368029L321002K873609j744242j95147L896435
$$ 7098151 4114723 -8835097 -15203126 -11882124 -9008515 -10752757 -10947904 -7051469
11567g051469K813783P24259N033300J0788663Q509668J074012j291569K023198
$$ -7051469 -4237686 -3513427 1519873 12308536 20818204 21892216 20600647 22623845
11559B2623845L212239J19510l308593o801253j1876109j3867481p886497Q32214
$$ 22623845 25836084 25955594 22647001 15845748 3969639 -9897842 -17784339 -16952125
11551a6952125M267280M670742P581305P732018j942332j1981722o565252R267933
$$ -16952125 -12684845 -8014103 -432798 7299220 5356888 -6624834 -13190086 -3922153
11543c922153J3495701Q20507q621325r41819J0983766R234409l553693j2570008
$$ -3922153 9573548 10394055 1772730 830911 11814677 21049086 17495393 4925385
11535D925385j1563232l397106Q256998J6180751J0043624p994436j8781684j0399893
$$ 4925385 -6637847 -10034953 -1777955 14402796 24446420 16451984 -2329700 -12729593
11527a2729593L350818L100431p399055r943017j538594M346586K752091L254926
$$ -12729593 -9378775 -6278344 -13677399 -23620416 -25159010 -20812424 -18060333 -14805407
11519a4805407R870690J3155320O738880l153913r460591j2490987j2013851m289681
$$ -14805407 -4934717 8220603 14959483 11805570 2344979 -10146008 -22159859 -26449540
11511b6449540P385568J1705234N745121P63846M164374P322140R81152p953724
$$ -26449540 -19063972 -7358738 -1613617 -849771 3314603 10636743 11617895 3664171
11503C664171p154747J656175P090329O255041M880264L072125m141907j2539156
$$ 3664171 -3490576 -1834401 5255928 11510969 16391233 19463358 15321451 2782295
11495B782295j0147727L488745J2757318O897079n336201r377905m038975J828957
$$ 2782295 -7365432 -3876687 8880631 15777710 10441509 1063604 -2975371 -1146414
11487a146414M192139M761569K313965n076543j1403330q274329P44499L206074
$$ -1146414 3045725 7807294 10121259 5044716 -6358614 -14632943 -13888444 -10682370
11479a0682370k576599l482059P114768J6056292Q628640q759114j6925262r969781
$$ -10682370 -13258969 -16741028 -9626260 6430032 15058672 6299558 -10625704 -20595485
11471b0595485P14588O572405J1059232J6055745J3745821L03656j2720586j1481582
$$ -20595485 -19880897 -13308492 -2249260 13806485 27552306 27855962 15135376 3653794
11463C653794R73806Q474071K465640r286866j4250055q644638J295005O854155
$$ 3653794 4627600 13101671 15567311 6280445 -7969610 -16614248 -15319243 -8465088
11455h465088M672229m77932j134848L526402O840055M925596K455259L792413
$$ -8465088 -3792859 -4270791 -5405639 -1879237 4960818 9886414 12341673 16134086
11447A6134086M465280r46926p367632n833943R80507J424870o667695j2063490
$$ 16134086 20599366 19652440 12284808 6450865 7431372 8856242 2188547 -9874943
11439i874943p626463k53216K068496K520191O969681J2001869J0792391M458815
$$ -9874943 -17501406 -17754622 -15686126 -13165935 -6196254 5805615 16598006 21056821
11431B1056821j841192q408011j6416641j9118066r917732L775519Q001078K660657
$$ 21056821 19215629 10807618 -5609023 -24727089 -34644821 -30869302 -22868224 -20207567
11423b0207567P13787O125788P897192M54448n499690r77206O185456N529285
$$ -20207567 -19493780 -13367992 -5470800 -5016352 -10516042 -11493248 -5307792 221493
11415B21493J591246L666002P433433K708028o855178q811890l271079j929500
$$ 221493 1812739 5478741 12912174 15620202 8765024 -46866 -3317945 -5247445
11407e247445o858272p812012j915044J691056K16992K351581R473841R857642
$$ -5247445 -12105717 -19917729 -21832773 -20141717 -19924725 -17573144 -8099303 1758339
11399A758339j61094p123553l286661p05353q451182j2960669L11410J9522260
$$ 1758339 1597245 -5526308 -8812969 -9518322 -17969504 -30930173 -30618763 -11096503
11391a1096503K2041568P806946m300132o152645m795825k891394K501269N109954
$$ -11096503 10945065 18752011 14451879 8299234 3503409 612015 3113284 8223238
11383H223238l296478j2642926n631431J1278724J3896973o49531q991175j518535
$$ 8223238 4926760 -7716166 -13347597 -2068873 11828100 11178569 2187394 668859
11375F68859K653016p621944j3767342r80575J3062790O978179q022727p577628
$$ 668859 3321875 -4300069 -18067411 -19047986 -5985196 992983 -7029744 -14607372
11367a4607372N575144R011958j518209r224173o356293j787408k03010L321758
$$ -14607372 -9032228 -20270 -1538479 -10762652 -17118945 -18906353 -19109363 -15787605
11359a5787605P556637M620806l054763l758159L501498P166494L433729J651734
$$ -15787605 -8230968 -3610162 -6664925 -10423084 -6921586 244908 3678637 5330371
11351E330371O228036R007159M357013j928487l692320k622841j418429M32534
$$ 5330371 11558407 20565566 24922579 22994092 19301772 16678931 15260502 15693036
11343A5693036Q61187m246201j1746824j2477645m576503L500629N147053K219911
$$ 15693036 16554223 12308022 561198 -11916447 -16492950 -12992321 -7845268 -5625357
11335e625357j081236k178113J439997Q391830R898665P30629r249167p231339
$$ -5625357 -6706593 -8884706 -7444709 947121 10845786 11576415 2327248 -4904091
11327d904091K065145L584847k744875k579362O344977Q919758j007383q887163
$$ -4904091 -2838946 745901 -1998974 -4578336 1766641 10686399 9679016 791853
11319G91853l012521P258253P574366r99748q210698r575221n740744K272420
$$ 791853 -2220668 5037585 12611951 11612203 3401505 -6173716 -11914460 -9642040
11311i642040Q893145N826334m597560r313240m255010o30423m079821l730433
$$ -9642040 -748895 5077439 479879 -8833361 -13088371 -13718794 -17798615 -21529048
11303b1529048O828754J4075049N703789o436627l199694J1491236J6573059N122880
$$ -21529048 -14700294 -625245 5078544 -1358083 -4557777 6933459 23506518 28629398
11295B8629398q570755j1747317p078416k769443j385177r93404P37012M570414
$$ 28629398 20058643 8311326 1232910 -1536533 -2921710 -3915114 -3178102 1392312
11287A392312P004550K348595p718399j2331615n624617L888575N811518K512318
$$ 1392312 8396862 10745457 3027058 -9304557 -14929174 -11040599 -5229081 -2716763
11279b716763K145015M457644M565425M462278Q498310J2075279P282366l219694
$$ -2716763 -571748 3885896 8451321 12913599 21411909 33487188 40769554 37549860
11271C7549860r383749q387254n662976m111513k486897j786314l405041l805108
$$ 37549860 28166111 19778857 14115881 10004368 7517471 5731157 2326116 -1478992
11263a478992j84009K519010m74540m256730k829430n52578k927211l624758M077985
$$ -1478992 -1663001 856009 381469 -3875261 -6704691 -7257269 -10184480 -13809238 -9731253
11254i731253J0348237K356121j0443834p198620R306597J3487254k552107j4649094
$$ -9731253 616984 2973105 -7470729 -14669349 -5362752 8124502 5572395 -9076699
11246i076699m067496J3055416J1100844o613124j5347781n843880O523291P234011
$$ -9076699 -13144195 -88779 11012065 4398941 -10948840 -16792720 -10269429 -3035418
11238c035418J89183k954861R55936N992854O477429K544939j689196l587897
$$ -3035418 -2846235 -5801096 -4845160 1147694 7625123 10170062 8480866 4892969
11230D892969m761604o882284o490720N96511R685963R859296m43882q226516
$$ 4892969 131365 -6750919 -13241639 -12645128 -2959165 6900131 6456249 -1770267
11222a770267k450874J0319260J4553447O078208m791862q773593p319669n494579
$$ -1770267 -4221141 6098119 20651566 26729774 21937912 13164319 5844650 350071
11214C50071l313270J097432M810627K941887l068374n605161n49550P288045
$$ 350071 -2963199 -1865767 2944860 5886747 2818373 -2786788 -3336338 3951707
11206C951707J0535068P578334J685016m440889q613324p142428K51435N518495
$$ 3951707 14486775 22065109 23750125 19309236 10695912 3553484 3804919 9323414
11198I323414P87739q527158q949165J185294Q218684L781358k897516r55758
$$ 9323414 10111153 1583995 -7365170 -6179876 2038808 5820166 2922650 1966892
11190A966892M808515L543525l245248n585572j874035Q43909J65601Q4294J468110
$$ 1966892 6775407 10318932 7073684 1488112 -385923 457986 623587 707881 2175991
11181B175991J505240J000032K482792L241698k32266l845850j999254J501103
$$ 2175991 3681231 4681263 7164055 10405753 10173487 6327637 4328383 5829486
11173E829486m23707n045747n027445k422529l561819m069796M626549J6356532
$$ 5829486 5405779 360032 -4667413 -7089942 -10651761 -14721557 -10095008 6261524
11165F261524J5893045L314547n771591n190331l893792m809718K43461R504737
$$ 6261524 22154569 25469116 19697525 14507194 10613402 5803684 6047145 15551882
11157A5551882P982953n913116j2647488k303057Q227712L255109o953180o817794
$$ 15551882 23534835 17621719 4974231 2671174 10898886 14153995 7200815 383021
11149C83021j734287l249802n016883K950572J0098447J487873j2087536p773173
$$ 383021 -1351266 -4601068 -9617951 -6667379 3431068 4918941 -7168595 -14941768
11141a4941768J1370288J9764742Q631155n202826j0468457j3884210j6859531
$$ -14941768 -3571480 16193262 24824417 19621591 9153134 -4731076 -21590607
11134b1590607p354921J4527823K6764789J5430787m134057j0367388l824778
$$ -21590607 -28945528 -14417705 12347084 27777871 23643814 13276426 9451648
11127I451648J732128K265317J995566N45135k887476j684803O965131J1268924
$$ 9451648 11183776 13449093 15444659 15989794 13102318 11417515 18382646 29651570
11119B9651570O35328j4716408j6337916m882158K126044k503179p927328n614644
$$ 29651570 30286898 15570490 -767426 -5649584 -3523540 -6026719 -13954047 -19568691
11111a9568691q23105N09455K058795P513686J1532076P840460q84055p311733
$$ -19568691 -20391796 -19882341 -17823546 -10309860 1222216 9062676 8178621 866888
11103H66888q158521m458668J257821M665216K281566k666071l023133J468499
$$ 866888 -7291633 -11750301 -10492480 -5827264 -3545698 -6211769 -9234902 -7766403
11095g766403L504169P44102k91715K985715L056024m111732r538928m910217
$$ -7766403 -4262234 -3518132 -3809847 -824132 2231892 -1879840 -11418768 -16328985
11087a6328985L369013N242444L726601O635395Q866532M92999j1366432r037644
$$ -16328985 -12959972 -7717528 -3990927 2644468 11511000 12003999 637567 -8400077
11079h400077O179011J1795891k136405j6640734j2182372L508028J0642048O854117
$$ -8400077 -2221066 9574825 7438420 -9202314 -21384686 -17876658 -7234610 -380493
11071c80493M021878M888566J794379n472247q357831n263563l077231k985166
$$ -380493 3641385 8529951 10324330 4852083 -3505748 -8769311 -11846542 -14831708
11063a4831708L23053M653695J405765o560164m756714R043177J6839641O400516
$$ -14831708 -14508655 -9854960 -8449195 -15009359 -19766073 -10722896 6116745 12517261
11055A2517261q693745q453250M474974J0882391M047101m015854m258054k641650
$$ 12517261 3823516 -4629734 -154760 10727631 14774732 10758878 6500824 3859174
11047C859174o530391j1571210r315987l39773P214191Q037715L439536k126100
$$ 3859174 -2671217 -14242427 -23558414 -23898187 -16683996 -8646281 -5206745 -7332845
11039g332845m004149M48190Q249753J1249971M487707o650644j1487441o426382
$$ -7332845 -11336994 -10888804 -2639051 8610920 13098627 6447983 -5039458 -11465840
11031a1465840J078329K040148l142360n623891N13092J0097418J2183975L521518
$$ -11465840 -10387511 -8347363 -11489723 -17113614 -16600522 -6503104 5680871 9202389
11023I202389o404267o833546J26254K848428k263058n054669J882487R555442
$$ 9202389 2798122 -4035424 -3909170 -1060742 -3323800 -8378469 -6495982 3059460
11015C059460N437824n433370o114378N792715J2601412K842106j0915931j0810793
$$ 3059460 8497284 3063914 -3050464 2742251 15343663 18185769 7269838 -3540955
11007c540955N06553O251619J260970l218489J215910R147438J1267504N743724
$$ -3540955 -3034402 3217217 4478187 1259698 2475608 11623046 22890550 28634274
10999B8634274k292989o201718k874922K626829Q45365p889382j0123679M41239
$$ 28634274 26341285 20139567 17264645 19891474 20736839 12847457 2723778 3165017
10991C165017Q698549m13045j4638042j0260096Q893632J4439376k180728j5873886
$$ 3165017 11863566 11450521 -3187521 -13447617 -4553985 9885391 7704663 -8169223
10983h169223p574020Q508165J1746878N508312K386775k5461p158423r157364
$$ -8169223 -15743243 -7235078 4511800 10020112 12406887 12381426 5223003 -3934361
10975c934361J584804R468118j838963j7858813j2425354R559231J8332799N327767
$$ -3934361 -2349557 7118561 5279598 -12579215 -25004569 -15445338 2887461 8215228
10967H215228o990074l584216L593895J808870k376566n50212J056760m266173
$$ 8215228 1225154 -2359062 1234833 3043703 667137 116925 1173685 -3092488
10959c092488r211572n120867L040483N864985L955573L206430L579259J435705
$$ -3092488 -12304060 -17424927 -14384444 -8519459 -4563886 -1357456 2221803 3657508
10951C657508k710019n491490n559172l516215r83006l68026r04166K510967R726964
$$ 3657508 947489 -4544001 -10103173 -13619388 -14602394 -14970420 -15874586 -13363619 -3636655
10942c636655J0214329j260397j0315277r66929J6334343J5837184m115984j6378468
$$ -3636655 6577674 5317277 -4998000 -5964929 10369414 26206598 22090614 5712146
10934E712146n635430R682926P947093l897994n896443K886436P124429J526195
$$ 5712146 76716 9759642 17706735 13808741 7912298 10798734 17923163 19449358
10926A9449358l687239j167141L478325J204361q554246j6880818j4358215k509726
$$ 19449358 15762119 14594978 18073303 19277664 10723418 -6157400 -20515615 -23025341
10918b3025341N551724J599416m245641K458140J5730434J4737410m015917j8239178
$$ -23025341 -17473617 -15874201 -20119842 -17661702 -1931268 12806142 8790225 -9448953
10910i448953j1010557N870292J0605226Q77894p497514l254636R176168J6379614
$$ -9448953 -20459510 -14589218 -3983992 -3106098 -10603612 -13858248 -4682080 11697534
10902A1697534Q548717r266843j7903907n440616J3569548J4646092j693139j1159040
$$ 11697534 20246251 10979408 -6924499 -12365115 1204433 15850525 14157386 2998346
10894B998346m035933J699822o251826j3260153m749734Q075566Q544024J875446
$$ 2998346 -1037587 662235 -5589591 -18849744 -23599478 -15523912 -6979888 -5104442
10886e104442J504477L834136j335172p959516l943563N486850O454985Q77581
$$ -5104442 -3599965 234171 -1101001 -9060517 -13004080 -7517230 -1062245 -184664
10878a84664J261991P162778P104558l48139n992440o650749n813563k481269
$$ -184664 1077327 8240105 15344663 14996524 9004084 2353335 -3460228 -5941497
10870e941497M539566P266685R8569o274267l98495Q187934L076312r961551j0914175
$$ -5941497 -1401931 5864754 5963323 -310944 -709439 7478495 10554807 593256 -10320919
10861a0320919J658026R567447N290697l63763j448768m070487p495481j430183
$$ -10320919 -8662893 904554 6195251 5831488 4382720 312233 -7183248 -8613431
10853h613431J1946573J4836761Q72495j3437054j3010563l359095L161089M850700
$$ -8613431 3333142 18169903 19042398 5605344 -7405219 -10764314 -7603225 -2752525
10845b752525N106430K815915k036511l780943j59013K949133J606745m71278
$$ -2752525 2353905 5169820 3133309 -647634 -806647 2142486 3749231 3277953
10837C277953m73122q77510j797734M38055L917433J816242m488024n454586P828
$$ 3277953 2804831 1927321 129587 567642 4485075 6301317 1813293 -3641293 -3633465
10828c633465J580334m248208p405847j854886M571192N568591O652672J0224870
$$ -3633465 -2053131 -6301339 -13707186 -15562072 -10990880 -5422289 1230383 11455253
10820A1455253N614669j1889788k4690903j3379938J3117139K5508524J0943103
$$ 11455253 17069922 5180134 -19510769 -32890707 -19773568 5734956 16678059
10813A6678059j2644153k0434959p707996R947443J5321087N151642q461794j0505664
$$ 16678059 4033906 -16401053 -24109049 -14161606 1159481 6311123 -2150671 -12656335
10805a2656335P51551J1393482Q824895k278326p122451j527026L388297j178904
$$ -12656335 -11904784 -511302 8313593 6035267 -1087184 -2614210 774087 -404817
10797d04817q411109o546915K965820P398790J781074m015868r13092N426929
$$ -404817 -8815926 -15362841 -12397021 -4998231 -3217157 -7233025 -8146117 -2719188
10789b719188L962606m348788q455481l724944L725063Q242325R619734O850650
$$ -2719188 1243418 -3105370 -11560851 -15285795 -11560732 -3318407 6301327 13151977
10781A3151977j439622q752978n349938N687685R915608L373367j148433L926587
$$ 13151977 11712355 2959377 -2390561 3297124 13212732 16586099 15437666 19364253
10773A9364253P868580J86841j1874575j6113313j2920819p834205M87485J1015893
$$ 19364253 27232833 27419674 15545099 -568214 -13489033 -21323238 -20835753 -9819860
10765i819860J2210208m77086j0837245l854720R173695P399331o718120j3081391
$$ -9819860 2390348 1913262 -8923983 -12778703 -3605008 3794323 -2923797 -16005188
10757a6005188o139123J109700J980046L235975Q195963J2025022J3300344J3255056
$$ -16005188 -22144311 -21034611 -19054565 -15818590 -7622627 4402395 17702739 30957795
10749C0957795O595709r007931j9239644r865625P319615Q806030l406261n131701
$$ 30957795 37553504 28545573 9305929 -559696 6759919 15565949 12159688 7027987
10741G027987R400013J8246538P923824p601526j2264125q841295n597012k963233
$$ 7027987 16428000 34674538 42598362 34996836 22732711 13891416 8294404 5331171
10733E331171j941473o364927j0203773k547658R912251Q176379o123163r482595
$$ 5331171 3389698 -2975229 -13179002 -15726660 -5814409 2361970 -3761193 -13243788
10725a3243788L636031Q873575o739174k0882087j2436433M778112P931090J758628
$$ -13243788 -9607757 -734182 -7473356 -28355443 -40791876 -36013764 -28082674 -26324046
10717b6324046L189756Q594695M702567k085010L564530J5046007J2042416m720683
$$ -26324046 -23134290 -14539595 -9837028 -11922038 -8357508 6688499 18730915 14010232
10709A4010232j2987403k832699J1430150J4973501R194630J793864m382048q815601
$$ 14010232 1022829 -1809870 9620280 24593781 33788411 35582275 31200227 22384626
10701B2384626j0648849j0773503r417795l574305O207742J1418457O456617j891300
$$ 22384626 11735777 962274 -8455521 -12029826 -5822084 5596373 12052990 10161690
10693A0161690m912365m975595p844143r809687m951926J722931K102073N2126
$$ 10161690 5249325 273730 -7570413 -17380100 -22332026 -20609095 -18507022 -18454896
10685a8454896M248389J0832766Q742145o52534m978036r18374K406639P51489
$$ -18454896 -14206507 -3373741 5368404 4715870 -262166 -1180540 1226099 1977588
10677A977588O56617N321417P991971M096585j124987k465151k984045o393654
$$ 1977588 2634205 7955622 15947593 20044178 18919191 16454040 13469995 7076341
10669G076341q530339l500534N678937R300805L371469m778159n237645J941455
$$ 7076341 -1453998 -4954532 724405 10025210 13396679 8618520 3380875 5322330
10661E322330O370477R35810p910866q451365k18914N144025L79809p579559p763161
$$ 5322330 11692807 12628617 4717751 -3733614 -3952528 1191497 1571306 -6008253 -13771414
10652a3771414M98101P544912M751089o288033j4116433q101681P956464J6485827
$$ -13771414 -13273313 -5728401 -977312 -7265345 -21381778 -29483459 -21526995 -5041168
10644e041168O698862r773186j3093129j256919J0050433J1076558P078989L850562
$$ -5041168 1657694 -8115492 -21208621 -22465540 -12415107 -1338549 5740440 9591002
10636I591002l45734n362348n844920j533015J216656Q75533J599447K075962
$$ 9591002 9245268 3882920 -1962000 -3495015 -2278359 -1402826 196621 2272583
10628B272583k069744m961796K738482J3210987Q713326p785403j3021863n14971
$$ 2272583 202839 -4758957 -2020475 11190512 19903838 12118435 -903428 -1418399
10620a418399Q495830J146785o721886q62951O906020L256629k166840J168178
$$ -1418399 7077431 8224216 1502330 639379 7545399 10802028 8635188 9803366
10612I803366J258823j1976112j9807483k493220K2488421K2896250J224040j1907220
$$ 9803366 11062189 -913923 -20721406 -23214626 -726205 22170045 23394085 11486865
10604A1486865o919860k929332p612175m969570J0097454J6938288K630434j4281551
$$ 11486865 4567005 1637673 -5974502 -10944072 -846618 16091670 18722104 4440553
10596D440553j0424542Q684291J8315105Q159037q373123j4460710q255614j86411
$$ 4440553 -5983989 2700302 21015407 29174444 20801321 6340611 -1915003 -2101414
10588b101414J858534N30785J778278L959048J133614m132872k171591P041281
$$ -2101414 -242880 287905 2066183 6025231 7158845 3025973 854382 7895663
10580G895663J0896364L453991n143207o180817n686447j0186720j2799329o038195
$$ 7895663 18792027 22246018 17102811 10921994 5235547 -4951173 -17750502 -23788697
10572b3788697L850488Q378722J0363809J2695109P501484p489259j5944087n499976
$$ -23788697 -19938209 -11559487 -1195678 11499431 19000915 11511656 -4432431 -9932407
10564i932407R274950P768675m019993n205609M736359Q273308J885866q33127
$$ -9932407 -657457 7111218 3091225 -2114384 2621975 10895283 12781149 11948022
10556A1948022L198873J639334q164296j2483483m437362O069893J0506454J1646516
$$ 11948022 15146895 16786229 8621933 -3861550 -8298912 -2229019 8277435 19923951
10548A9923951J0696368K330799j1097631j6383836q062661K828691N388610K539651
$$ 19923951 30620319 32951118 21853487 5469651 -2593010 235681 5624291 8163942
10540H163942J306236L71548l977439p298904k232281Q457029J2513604L921103
$$ 8163942 9470178 9841726 5864287 -1434617 -3666898 4790131 17303735 21224838
10532B1224838p344430p235494K190620M323655o185125j1988626N99121J6611819
$$ 21224838 13880408 6644914 8835534 13159189 6974064 -5014562 -4415441 12196378
10524A2196378J3755879j310097m523330L992233K326333j0192014r648560O934305
$$ 12196378 25952257 24642160 20118830 24111063 26437396 16245382 6596822 13531127
10516A3531127J2407542j932302r286543L395448J0877540k049314j0057711M649590
$$ 13531127 25938669 24006367 14719824 18115272 28992812 26943498 16885787 21535377
10508B1535377J5144523k356549k1742699j0473833J3982496J6202327J514595
$$ 21535377 36679900 34323351 12580652 2106819 16089315 32291642 33806237
10501C3806237k917958J834859M76124K35967R727019J1533952r40529J687137
$$ 33806237 30888279 32723138 33199262 33435229 43162248 54696200 53755671 55442808
10493E5442808K6005141K4448176j5524845j6554659O1958830J06860422o710452
$$ 55442808 81447949 105896125 90371280 73816621 135775451 242635873 235925421
10486B35925421j92672840k31526991p6302475P9718601Q2463307P706109n127924
$$ 235925421 43252581 -188274410 -264576885 -184858284 -102394977 -94688868 -99816792
10479i9816792L3028187K9741639j1136208j5566449J6828400K1695269p633153
$$ -99816792 -66788605 -37046966 -48183174 -63749623 -46921223 -25225954 -32859107
10472c2859107j6968916M395864J2482038l999772r578521M840825R218074k466944
$$ -32859107 -49828023 -45432159 -32950121 -36949893 -46528414 -41687589 -32469515 -34936459
10464c4936459k596427J2325536J4059708k327378j0013552j469360K298799k858629
$$ -34936459 -37532886 -25207350 -11147642 -13475020 -23488572 -24957932 -22659133 -25517762
10456b5517762J987615J5440316J2910324o620018j4624055j420494R397383K893098
$$ -25517762 -23530147 -8089831 4820493 -1799525 -16423580 -17844074 -8446691 -5553593
10448e553593p183159q086308n296189l519270P97852M401920Q33527j859969
$$ -5553593 -12736752 -20823060 -26119249 -29638519 -28840667 -24438747 -23605220 -25465189
10440b5465189O723853J4706408M587228j2527494j1813816L176162Q400019K732924
$$ -25465189 -18741336 -4034928 552300 -11975194 -23789010 -20612848 -12212829 -9479905
10432i479905N261967J3780343P112780j1578937j5397560q93579N738294m730471
$$ -9479905 -4217938 9562405 16675185 5096248 -10301312 -11194891 -5456597 -10187068
10424a0187068j1193374l251792K796478r38966J37090R878461R333429p587702
$$ -10187068 -21380442 -24632234 -21835756 -22774722 -22637632 -12759171 -3425742 -11013444
10416a1013444j8628166r090271N452807P481074K335369N68477R0426p63996
$$ -11013444 -29641610 -38731881 -33279074 -25798000 -23462631 -22894154 -22803728 -23567724
10408b3567724M585537J3761000J2679583M83535n279430J928562O342684j833275
$$ -23567724 -18982187 -5221187 7458396 7941931 2662501 4591063 10933747 9100472
10400I100472j0329577q267006l367335l973660m584934n71274K037004J421609
$$ 9100472 -1229105 -9496111 -12863446 -16837106 -21422040 -21993314 -19956310 -18534701
10392a8534701N726661J5121211J6959842O936924l272548n912915n970212n709197
$$ -18534701 -12808040 2313171 19273013 26209937 22937389 17024474 11054262 5345065
10384E345065r72414L521010k220124j1335405o462316Q494125J0844244j913210
$$ 5345065 4372651 7893661 5673537 -5661868 -12124184 -3630059 7214185 5300975
10376E300975o636946M045912Q144686n150522j4509646l801904R977862O902840
$$ 5300975 -1335971 2709941 10854627 5704105 -8805541 -12607445 -2629583 4273257
10368D273257m413250p007944l390389k109528J105968Q060772N886873q634476
$$ 4273257 -139993 -7147937 -10538326 -12647854 -11541886 -3481114 2405759 -6228717
10360f228717j4121686L276636K2930736J9008481j048667j1676350p218294o62233
$$ -6228717 -20350403 -17073767 5856969 24865450 23816783 12140433 4922139 4259906
10352D259906K124468L417111L44922p735268r233554K417927J2664233O247327
$$ 4259906 6384374 9801485 10146407 2411139 -6822415 -4404488 8259745 14507072
10344A4507072p916905j1629224n431890k034736l096117k531097k391946n912409
$$ 14507072 6590167 -5039057 -10470947 -12505683 -15601800 -18132897 -20524843 -26437252
10336b6437252n135535N472863J4059389R195799P45272K621583P245257j2208
$$ -26437252 -31572787 -26099924 -12040535 -2844736 -2099464 522119 7767376 7755168
10328G755168j2250391j1694730j47671O037320M282917M529984O099219J021463
$$ 7755168 -4495223 -16189953 -16337624 -10300304 -6017387 -1487403 4611816 5633279
10320E633279m705014R24213J0350091N360943j0200790j3805683j089273P917524
$$ 5633279 928265 1852478 12202569 17563512 7362722 -6442961 -7532234 385290
10312C85290L071884k160071J800845M815953j002847o020119k323969R51311
$$ 385290 3457174 1297103 3097948 7913901 6911054 890935 -1433034 -481723
10304d81723m790676j0888112o667796J789123K856155r20546Q27408P295704
$$ -481723 -5272399 -16160511 -22828307 -21039184 -18183029 -19103575 -18276167 -10980463
10296a0980463Q430323K338688k464076j849347j562646n127680n609985L888982
$$ -10980463 -2550140 -211452 -2675528 -4524875 -6087521 -11215201 -16825186 -12936204
10288a2936204J6276850J6024236K48504j3904384j0004199M899174R446743j582448
$$ -12936204 3340646 19364882 19613386 5709002 -4295197 603977 10050720 8468272
10280H468272j0408520l999857O546893N048836l798620l158651Q073444J3263654
$$ 8468272 -1940248 -5940105 606788 5655624 1857004 -1301647 6771797 20035451
10272B0035451L230479j1305687j5621589q512283M23943L643390J420152j261355
$$ 20035451 23265930 11960243 -3661346 -12173629 -11749686 -8106296 -6686144 -7947499
10264g947499n50121K366314L010562m18702m993096p268614n909798l43250P514072
$$ -7947499 -8497620 -6131306 -3120744 -3539446 -8532542 -15801156 -21710954 -22054204 -14540132
10255a4540132J0627752M174846m334533k850849O301077Q739496J926349j92475
$$ -14540132 -3912380 262466 -4072067 -6922916 -621839 8117657 10044006 9851531
10247I851531O925823P229286q461427k2152206j4235874N163058J1751041L485071
$$ 9851531 16777354 24006640 15545213 -6606993 -20842867 -15679809 -3928768 -443697
10239d43697j351945M079346Q518182N293887J21087l868526r412788j2489690
$$ -443697 -1795642 2283704 10801886 16095773 16216860 12348334 2935546 -9554144
10231i554144m833388Q865413J3292475M630069n009153o902313m203666j86089
$$ -9554144 -14387532 -5522119 7770356 12400425 7391272 488959 -3714707 -3900796
10223c900796N719939Q738349K556365n749759k402545Q988769R671278l512306
$$ -3900796 1819143 10557492 13113857 7364098 4961553 13950322 23621600 20109294
10215B0109294j1172714l368504L650845l796075j1661452r46573J9036512K2127139
$$ 20109294 8936580 5568076 9218921 5422846 -6238606 -7185179 11851333 33978472
10207C3978472K806045j7846963k1427522j0723842J269555O757756M946892j132723
$$ 33978472 36784517 18937554 -2489968 -13213810 -11944255 -5186499 -239607 -1372330
10199a372330n985030n788606k701877j144644j049667N74886L335048M001099
$$ -1372330 -7357360 -13145966 -15847843 -16992487 -18042154 -17467268 -14132220 -10131121
10191a0131121J939341o52866k269135j840941K210781Q028742Q927126K015455
$$ -10131121 -8191780 -8844646 -11113781 -12954722 -10743941 -2715199 6211927 8227382
10183H227382m894888k461907O001726Q077628J31946p340929n237522J296439
$$ 8227382 3332494 870587 6872313 14949941 15081887 7740958 2503436 3799875
10175C799875J239646o402767j2063598q899863k33779O417581P531063M328218
$$ 3799875 5039521 -1363246 -13426844 -22326707 -22560486 -16142905 -8611842 -4283624
10167d283624n26268m289898m547681j073697L215200M606258J807003l005678
$$ -4283624 -4809892 -9099790 -13647471 -14721168 -11505968 -6899710 -5092707 -8098385
10159h098385n273219j262808P030090J1240856N561518m016911o018066p3372
$$ -8098385 -13371604 -14634412 -7604322 3636534 9198052 5181141 -836925 -910297
10151i10297J824857n314634r743111j678673Q295568L798659j0630242j4625432
$$ -910297 914560 -4400074 -14143185 -15821858 -7526290 -3727631 -14357873 -28983305
10143b8983305k449577R420995Q234906J716731J951467O669845O151979j049665
$$ -28983305 -31432882 -22011887 -13776981 -12060250 -10108783 -3438938 2713041 1663376
10135A663376q144040r218295k700976P612859J2052248M309155p032726p572136
$$ 1663376 -6480664 -15698959 -18399935 -10787076 1265172 5574327 -1458399 -9030535
10127i030535Q26078K097838o684080q905300L036911J3093352Q236285M16596
$$ -9030535 -8204457 -6106619 -12790699 -21695999 -18659088 -5565736 2670549 3087145
10119C087145M827782J3340753J0009755p69296l837740n30677l595498j2257312
$$ 3087145 7914927 21255680 31265435 30496139 26658399 26127722 22532224 10274912
10111A0274912j4381800q153628j218285N961343J5342188J6763718J278030j6563558
$$ 10274912 -4106888 -12260516 -13478801 -7517458 7824730 24588448 25866478 9302920
10103I302920j4766509J461828P469809o59292k632304P986189J2799564K378594
$$ 9302920 -5463589 -4001761 3468048 2808756 176452 8162641 20962205 23340799
10095B3340799p950138o455050k682601m845069m647555J681352J443874r643258
$$ 23340799 15390661 8935611 6253010 1407941 -3239614 -1558262 -114388 -9757646
10087i757646j3641096L77970J4589052J0293499j757270j592679O248280M454482
$$ -9757646 -23398742 -23020772 -8431720 1861779 104509 -1488170 4760110 9214592
10079I214592m538071m602374L586766M685466k483085l713665K882059K076348
$$ 9214592 4676521 74147 3660913 8346379 5863294 2149629 5031688 7108036
10071G108036j0994744j9469227r438470R368719J7262632R166525k871088o155693
$$ 7108036 -3886708 -23355935 -32794405 -23425686 -6163054 3003471 132383 -6023310
10063f023310q9008N689028L298173l787426n777221j184185R68657l386474n768863
$$ -6023310 -6112318 -423290 2874883 -912543 -6689764 -7873949 -6905292 -10291766 -16060629
10054a6060629q0612N555206K654404j962956J648682P448754L729074l765849
$$ -16060629 -16141241 -10586035 -7931631 -9894587 -8245905 -797151 2931923 -833926
10046h33926N36406J3287606J3260216n069649k0029675j3837205K554392Q110019
$$ -833926 -297520 12990086 26250302 21180653 1150978 -12686227 -10131835 -2021816
10038b021816J429557k969696Q34070M921972L472271M66977O24957K191300J181068
$$ -2021816 -592259 -3561955 -2727885 2194087 5666358 6133335 6758292 8949592 10130660
10029A0130660k864214p006470p405291j726939P727580J3885939J1272995K304653
$$ 10130660 7266446 259976 -7145315 -8872254 -1144674 12741265 24014260 26318913
10021B6318913n565033q413825q470973q462122p231000k837910K577946M375573
$$ 26318913 20753880 12340055 3869082 -4593040 -11824040 -14661950 -12084004 -7708431
10013g708431J937083O88562N309119J2399973J3580850O300696k625189o524247
$$ -7708431 -5771348 -5082786 226333 12626306 26207156 32507852 29882663 23358416
10005B3358416p483784j0724665j3923940r811721P96052O918266J877879o809380
$$ 23358416 15874632 5149967 -8773973 -18585694 -17789642 -10871376 -8993497 -15802877
9997a5802877p628530m31839N353185N191193L992924O011746Q169501O468382
$$ -15802877 -23431407 -23863246 -18510061 -13318868 -9325944 -3314198 4855303 11323685
9989A1323685K608598j68279k579265n423132n003149P76649N580344K500466
$$ 11323685 13932283 13764004 11184739 5761607 758458 1535107 7115451 9615917
9981I615917l436862r21992R171279J2459562J980383j0700604j2318624o049818
$$ 9615917 6179055 5257063 14428342 26887904 28868287 18167683 5849059 -200759
9973b00759l097363l922917j96426Q574961J3236627R592863L778265J363974
$$ -200759 -3298122 -7221039 -7417465 1157496 14394123 23986986 27765251 29129225
9965B9129225K39931l058279p167743q808643o877261k368581J827799J894616
$$ 29129225 29369156 26310877 19143134 10334491 3457230 1088649 2916448 4811064
9957D811064j853053l456281L2259K972805J245587J364429Q647212J3163314
$$ 4811064 2958011 -498270 -466011 2506794 3752381 5116810 13764022 26927336
9949B6927336L098473j2541957j4010690k340427J554688p661417j0086194M215426
$$ 26927336 30025809 17483852 3473162 1132735 2687423 -4973994 -15060188 -10844762
9941a0844762J5483346O415524q021938n437315O560993M589291r880691j3424768
$$ -10844762 4638584 11054108 3032170 -2405145 4155848 8745139 -1135552 -14560320
9933a4560320n37410Q412004K348711l915666K575898J0944362O159533n424557
$$ -14560320 -15097730 -6685726 -4337015 -8252681 -5676783 5267579 11427112 6002555
9925F002555o308412N438428J4579744J0552039n70486o423952l588897p5894
$$ 6002555 -305857 5132571 19712315 30264354 29693868 23269916 19681019 19605125
9917A9605125m448805j4163740j7569826r126986K426866O342064M564040N209455
$$ 19605125 15156320 992580 -16577246 -25704232 -23277366 -16935302 -12371262 -7161807
9909g161807O445899N4399j0565269j1144124J794685J3979361J3477800N417253
$$ -7161807 -715908 -661509 -11226778 -22370902 -20576217 -6596856 6880944 12298197
9901A2298197K25268j182521k552103k994943j477203j996074n629255n410926
$$ 12298197 12523465 11340944 8788841 5793898 4316695 2320621 -3308634 -8719560
9893h719560K387305R905929R349725M687210K575496R26327k714490j623211
$$ -8719560 -6332255 3573674 12923399 17610609 20186105 21112432 18397942 16774731
9885A6774731P582576J3061612N639106p98515J0805213K6211004J3082036k8943088
$$ 16774731 24357307 37418919 43058025 42259510 53064723 79275727 92357763 63414675
9877F3414675n9619166m9898811j7441361M514552J0701012J5363075J9209188
$$ 63414675 3795509 -46103302 -63544663 -59030111 -48329099 -32966024 -13756836
9870a3756836J2001002j703959o576803l028503m985872j1792773p392862R026282
$$ -13756836 -1755834 -3459793 -10036596 -13065099 -18050971 -29843744 -37236606 -28210324
9862b8210324J6884257P504680j95837Q572102J8098052P377970j3912664j8793994
$$ -28210324 -11326067 -3821387 -4017224 4554878 22652930 30030900 16118236 -2675758
9854b675758m551854M196205n527724j5952703o697631J4734121K3579496J0836308
$$ -2675758 -7227612 -3031407 -8559131 -24511834 -31209465 -16475344 7104152 17940460
9846A7940460o892950r845794J380269R042079K114459r529919r237811K601067
$$ 17940460 11047510 1201716 2581985 11624064 13738523 4208604 -5029207 -2428140
9838b428140R434236M082816o33815N210963R359952l039561k0505124j7877633
$$ -2428140 7006096 11088912 10455097 15666060 25026012 21986451 1481327 -16396306
9830a6396306M394453J7313816M951903j3296209j3640427j606541K557243k386253
$$ -16396306 -12001853 5311963 10263866 -3032343 -16672770 -18279311 -15722068 -18108321
9822a8108321j572212O439257O576315n105842j1694306j102787J4271414J4757141
$$ -18108321 -19680533 -13241276 -6664961 -11770803 -23465109 -24567896 -10296482 4460659
9814D460659J75289j2456893j2320254m336601K673263O416182P747056N602106
$$ 4460659 4635948 -7820945 -20141199 -24477800 -21804537 -15388355 -7641299 -2039193
9806b039193L57424k807629K55168N440222M533984l076892p849292k042466R082658
$$ -2039193 -1681769 -4489398 -4234230 1205992 5739976 2663084 -5186208 -7228674 1853984
9797A853984J2635131M157493o457966p397293K55439M655807q31155r374450
$$ 1853984 14489115 18646608 12188642 4791349 5046788 9702595 8871440 -503010
9789e03010j0765519n018523n41767j104765j716070J797045O293686P582347
$$ -503010 -11268529 -16287052 -16828819 -17933584 -19649654 -17852609 -11558923 -3976576
9781c976576O660033N087146O64150n847012o383475K838943J1207522P049376
$$ -3976576 2683457 7770603 8434753 2587741 -3795734 -956791 10250731 17300107
9773A7300107l231269l961063M006699L995194q066109j5333860p408844K576180
$$ 17300107 14068838 10107775 14114474 18109668 10043559 -5290301 -12699145 -10122965
9765a0122965q5219q738034q827414j020519M645049O582641Q104174O532918
$$ -10122965 -10208184 -18946218 -27773632 -28794151 -24149102 -17566461 -9462287 -2929369
9757b929369J457725K538679J2121476J3087999n153263k2062734j3598517P232697
$$ -2929369 -1471644 1067035 13188511 26276510 21123247 -939487 -14538004 -7305307
9749g305307R338500m867178m546394J4019924J8959643j374785j5988637l027173
$$ -7305307 2033193 -2833985 -7380379 6639545 25599188 24224403 8235766 5208593
9741E208593J4082522P938423q245611q418752J020686j136855q759934j864541
$$ 5208593 19291115 27229538 18983927 10565175 11585861 10449006 1689072 -175469
9733a75469J1659180P228653j0316733j1144233Q608669J7979858R05102j8853986
$$ -175469 11483711 18712364 8395631 -2748602 5860067 23839925 24745027 5891041
9725E891041j5953399J124591R725919O443366K482776J116008j998554n412981
$$ 5891041 -10062358 -8937767 788152 7231518 9714294 10830302 8831748 3418767
9717C418767m295237p42674j48886j727040j528424k69595l65477J41875L090805
$$ 3418767 -876470 -1619144 -1768030 -3495070 -5023494 -5293089 -5658566 -5516691 -2425886
9708b425886L964783j686709q316859n399671P314431J6677721J1485378l096070
$$ -2425886 1538897 -147812 -8464671 -13864342 -6549911 10127810 21613188 18517118
9700A8517118j1154755n498888L866532M078732k708816l871045L175114O582376
$$ 18517118 7362363 1863475 5730007 9808739 7099923 3228878 6403992 12986368
9692A2986368n22809q204369n395196K442493K469328n450817r945568n607862
$$ 12986368 12463559 4259190 -1136006 1306487 3775815 -1675002 -11620570 -17228432
9684a7228432K117578P316836Q579889N265200j605141n950498k696392M230839
$$ -17228432 -15110854 -7794018 785871 6051071 4445930 -1504568 -4200960 29879
9676B9879P321502N806414L160298o37298n212451m157851N269775J2433781O591528
$$ 29879 7351381 13157795 16318093 15680795 10468344 6310493 11580268 24014049 30605577
9667C0605577n003702p225329j228630j272335r313258j1823439l773219K964879
$$ 30605577 25601875 18376546 17147916 15875581 6562323 -5261116 -9034335 -6069456
9659f069456K76342m113238k391727L86130k272747o151545m647134P7020K192338
$$ -6069456 -5793114 -9906352 -12298079 -11911949 -14184696 -20336241 -24983375 -24906355 -22714017
9650b2714017J247374J75511M62974K880646O670284O709852o08972q597793p233857
$$ -22714017 -21466643 -21291132 -20828158 -17947512 -11277228 -4567376 -5176348 -13774141 -21007998
9641b1007998J106727M365932k88320k986533K029997R086565J2156289J0342203
$$ -21007998 -19901271 -15535339 -15823659 -18810192 -16780195 -7693630 4462659 14804862
9633A4804862K011374j1791089j8592463p188070J0488908J1286851l291472p798293
$$ 14804862 16816236 5025147 -13567316 -20755386 -10266478 1020373 -2271099 -10069392
9625a0069392N253584J2576187P03419j0168282j882434R423062K071489j2729968
$$ -10069392 -4815808 7760379 8463798 -1704484 -3586918 5836144 7907633 -4822335
9617d822335j0785978L494934O826053k609446n865873J790869O541512M120378
$$ -4822335 -15608313 -12113379 -5287326 -7896772 -13762645 -11971776 -5430264 -1309886
9609a309886M180294O795731J319589r490263r574794K582361R775761M103284
$$ -1309886 2870408 9666139 10985728 1495465 -8079329 -5496968 4278793 8382077
9601H382077l168444m194708m573091n609702M05378J0405433R318698k912302
$$ 8382077 5213633 1018925 -3554166 -9163868 -8758490 1646943 10965641 8053339
9593H053339o989333K518965N196156q780998j6306726J998131K4999766J9791025
$$ 8053339 1064006 3582971 8779127 -1871 -16308597 -14310466 10689300 30480325
9585C0480325p485001k0946469q119361P568811P479865J061628J303506K827862
$$ 30480325 22995324 2048855 -6070506 1498305 8978170 10039798 11343304 14171166
9577A4171166k500447p615933l346597L913082K848652l551756l883705K558207
$$ 14171166 11670719 4054786 708189 4621271 7469923 3918167 34462 2592669
9569B592669O334669M240553K233142L003944K438567p60172k513274k063274
$$ 2592669 8927338 13167891 15401033 18404977 20843544 20083372 17570098 15506824
9561A5506824l209779m782192o90227O948630O783076l090619q008429R16532
$$ 15506824 12297045 7514853 6824626 13773256 20556332 17465713 9457284 10373816
9553A0373816R187397k97516j7494292j7195899J770102J2724467J365448j3005345
$$ 10373816 19561213 19263697 1769405 -15426494 -13656392 -931925 433523 -12571822
9545a2571822q480993O707601J0236913O54125m652591Q52117O256699M576120
$$ -12571822 -21052815 -14345214 -4108301 -3454176 -8106767 -7254650 -997951 3578169
9537C578169J559155J106178j428592o999939q190623k490417J760378j067682
$$ 3578169 5137324 6243502 4814910 -2185029 -10375652 -12866069 -11105691 -12173373
9529a2173373m946798l560389j053131l389931o634036k839929P049091J4295407
$$ -12173373 -17120171 -20680560 -21733691 -25123622 -31757658 -34597587 -27548496 -13253089
9521a3253089J3735289P736161R28006l564623m137944j510963J300156K560439
$$ -13253089 482200 8218361 9146367 5581744 1443800 -67163 1232993 3793432
9513C793432L545110M481545K080641n165436j2058068j1858212n098664J345534
$$ 3793432 7338542 11820087 13900728 8735292 -3322776 -15180988 -20279652 -18934118
9505a8934118L621184M547706O682040O540648J19204q042181p730621K877165
$$ -18934118 -15312934 -10765228 -4083188 2457460 2576664 -5465517 -13196138 -10318973
9497a0318973J1795905P655414m176966q264072p23704O196520L308283l190519
$$ -10318973 1476932 9132346 4955380 -3308692 -4032396 2164124 5472407 2281888
9489B281888m521274l247580m732988m564111K368124P566626m43411j4747436
$$ 2281888 -2239386 -5486966 -10219954 -14784065 -12415941 -4849315 -5292726 -20040162
9481b0040162j6110527p66231J3700220J3110496K864083m861248o481944l996788
$$ -20040162 -36150689 -36916920 -23216700 -10106204 -7242121 -12103369 -18585313 -22582101
9473b2582101J130962M904978K467427j953061J793346J1880000J3449653K197792
$$ -22582101 -21451139 -16546161 -14078734 -16031795 -14238449 -2358449 11091204 13288996
9465A3288996o149875p2206R039298O101359l213933m227439J165886p5622p994296
$$ 13288996 7139121 7066915 16106213 22207572 18993639 14766200 15932086 15856464 7862168
9456G862168j0825910o835116n310837o690833j351350R691080J1942618P59323
$$ 7862168 -2963742 -9798858 -15109695 -21800528 -23151878 -13460798 -1518180 -758857
9448g58857r320134o140646L430103O888990L861754J332602J300890K394476
$$ -758857 -10078991 -16219637 -12789534 -5900544 -2038790 -706188 594702 2989178
9440B989178N394930Q583677N293203n404714j2741588p770236L452945Q875552
$$ 2989178 8384108 16967785 22260988 16856274 4114686 -3655550 -202605 8672947
9432H672947O577307K698178r33313o366971j0736488r114580m131344k127417
$$ 8672947 15250254 17948432 17015119 10648148 -88340 -9202920 -13334264 -15461681
9424a5461681j133234N883032J5578581J4693707M5270j3205676j0897773M92041
$$ -15461681 -16594915 -10711883 4866698 19560405 19605675 6399999 -4497774 -4005733
9416d005733L150026p101233j5482952q979818O120559J2855427N622177l742905
$$ -4005733 -855707 -7956940 -23439892 -32419710 -26299151 -13443724 -7821547 -11564452
9408a1564452k802180N420510Q779893M126232q6558O24588n81179q136881j2637549
$$ -11564452 -14366632 -8946122 -166229 3960003 3873445 4498033 3916854 -4220027 -16857576
9399a6857576l611182J1874161J5998715M400424q778443j1694804q313781o387414
$$ -16857576 -20468758 -8594597 7404118 11804542 3026099 -8668705 -16982486 -23369900
9391b3369900l930178L208556R174888N450129l903724o312165O73777N977854
$$ -23369900 -27300078 -24091522 -14916634 -9466505 -13370229 -19682394 -19008617 -13030763
9383a3030763K512943k095690J830448R955607R214348l089891j3909698j0657817
$$ -13030763 -10517820 -12613510 -10783062 -827455 8386893 5297002 -8612696 -19270513
9375a9270513K709645J0770523N768753m080932o669926q81446N082083O387113
$$ -19270513 -16560868 -5790345 -21592 -4102524 -10772450 -11653896 -6571813 -184700
9367a84700N645763N491788M904250M102013N155255N008314l327064j7458032
$$ -184700 5461063 10952851 15857101 19959114 25114369 30122683 26795619 9337587
9359I337587k2664160j0822442N588102R544467L129132J219913N968228N222678
$$ 9337587 -13326573 -24149015 -18560913 -9016446 -5887314 -4667401 1300827 6523505
9351F523505l151501m912724N668164J2483885J570389j5555013j8039096n522935
$$ 6523505 3372004 -1540720 4127444 16611329 18181718 2626705 -15412391 -20935326
9343b0935326M882556N302026L237496L582649K240269r83358M67740N870919
$$ -20935326 -16052770 -10750744 -7513248 -3930599 -1690330 -2673688 -2205948 3664971
9335C664971N220679l055835o391893K083338J0802189O906861m709287j1002364
$$ 3664971 8885650 5829815 -562078 1521260 12323449 19230310 14521023 3518659
9327C518659j0144848q176610m070283O023868J4000817P104860r284426j3640299
$$ 3518659 -6626189 -14802799 -18873082 -12849214 1151603 8256463 -1027963 -14668262
9319a4668262J378914J6060385J0797237o300172j2380855k745807N192873j38837
$$ -14668262 -13289348 2771037 13568274 7268102 -5112753 -7858560 -2665687 -2804524
9311b804524p975086k929759J1133101J5405480J514774j6744427j9723363m455891
$$ -2804524 -10779610 -13709369 -2576268 12829212 14343986 -2400441 -22123804 -26579695
9303b6579695J3689006J9367103J1719554J80947q014086j1762816j1358833o539173
$$ -26579695 -12890689 6476414 18195968 18376915 10362829 -1399987 -12758820 -19297993
9295a9297993N42376N618742O994735O198570L525990k114814p693441o615331
$$ -19297993 -18755617 -13136875 -6142140 56430 3582420 1467606 -6225835 -12841166
9287a2841166J500778P147867K688572o131023p048711K491728J2816054J5013500
$$ -12841166 -11340388 -4192521 -1503949 -7634972 -14683683 -12191955 624099 15637599
9279A5637599R649556J852847n471435j0789616j1782471q209747l930220k531488
$$ 15637599 25287155 27140002 21668567 10878951 -903520 -9113267 -13043487 -15574975
9271a5574975k783480j233461K155030L774486J423847k508767l564414l04760
$$ -15574975 -18358455 -19591916 -17436886 -13662400 -12238553 -14747320 -18311734 -18616494
9263a8616494L935418N220630M281599M960851O965285M662073l748775j0454762
$$ -18616494 -14681076 -9460446 -5178847 -217996 6747289 11409362 7660587 -2794175
9255b794175p292231K226378P215232M085615p59617k018423n57241K838123Q817592
$$ -2794175 -10086406 -7860028 -644796 3440819 2681202 662779 105538 2943661 11761253
9246A1761253J2428142N422698r610959j7454099r347090M714508J0051225N384196
$$ 11761253 24189395 29612093 20001134 2547035 -6800055 -2085547 7965678 13349874
9238A3349874j245151o002697q375171m453973O335249J3212528O190925p063668
$$ 13349874 12104723 6102026 -2273145 -6727118 -391869 12820659 19011584 11947916
9230A1947916j0037374j089580N581736K295176l343281m051779l163511m771044
$$ 11947916 1910542 820962 6402698 8697874 5354593 1302814 -1860697 -6631741
9222f631741n690082k890671P82093L044276N412245O545840K144160n035153
$$ -6631741 -12321823 -15212494 -14430401 -11386125 -5973880 571960 2716120 -2319033
9214b319033n749354R91709M996125J415975j999911n5102Q06766l413103m853586
$$ -2319033 -8068387 -7076678 -2080553 -664578 -2664489 -2719591 -1912825 -5325928 -10179514
9205a0179514Q71209L339884n087022j2446157m463783J0689762J3268270J552187
$$ -10179514 -9308305 -5968421 -11055443 -23501600 -27965383 -17275621 -4007351 -2455164
9197b455164q042386p060142k577234L15534M989174J0257123Q110766j247617
$$ -2455164 -10497550 -17557692 -20134926 -19819392 -14830218 -4573095 3537671 2290054
9189B290054o826783l761075N43196J065678K231635N685039N037545r85534l507363
$$ 2290054 -4536729 -8297804 -7754608 -6688930 -4457295 1227744 6265289 5279755 1772392
9180A772392J271667M582573N73781l488996j355857Q02374k241912k771740N344909
$$ 1772392 3044059 7626632 8200413 4711417 3355560 4157934 1916022 -855718 4489191
9171D489191J1677579M505163q067780r491547n39504M567394L104937M892062
$$ 4489191 16166770 20671933 12604153 3112606 2573102 7140496 10245433 15137495
9163A5137495R865916O027737o919930j2576488l976672M074845m80896p143398
$$ 15137495 25003411 31031148 24111218 11534730 7558058 11632903 11152007 4008609
9155D008609k007401P368211M483254p618031j0288405J187797J0783619O421563
$$ 4008609 2001208 9369419 13852673 6234642 -4053763 -2865966 7917653 14339216
9147A4339216m493322r176391o269545k077113J94339O86774m01920p50840L138749
$$ 14339216 9845894 669503 -5600042 -7677155 -7482816 -6796042 -7197962 -7948802 -4810053
9138d810053Q494079O903902k621900q918571l541521O631722R207917K547735
$$ -4810053 3684026 10587928 7966028 -952543 -4494064 2137658 11345575 13893310
9130A3893310n645781j0010521r217330k190157P306799Q422925k450635j0920968
$$ 13893310 8247529 -1762992 -10980322 -13170479 -5863680 2559245 108610 -10812358
9122a0812358k861145J1437691J0012051n629962j0639044L610763J4244400L270940
$$ -10812358 -13673503 -2235812 7776239 2146277 -8492767 -4882004 9362396 12633336
9114A2633336j2829805r258757P983167J3256791K170980m651842K918632R888227
$$ 12633336 -196469 -9455226 -1472059 11784732 13955712 9303870 12222502 22110729
9106B2110729K531070j0569291j3660611o114124R20588J350550j551188k641120
$$ 22110729 24641799 14072508 411897 -5702227 -4781639 -3431089 -4982277 -7623397
9098g623397k08593L446240M077407J160484N68046N681721Q314640j247909j5820030
$$ -7623397 -7831990 -4385750 -308343 852141 1420187 7101908 15416548 14168639 -1651391
9089a651391j6306174J435904J8194144J6749877L422350n055642n272966n385724
$$ -1651391 -17957565 -16521661 1672483 18422360 21844710 16789068 11516102 6130378
9081F130378p435268n789887l36011J914064j096407l212623n44779L240799M135786
$$ 6130378 -1304890 -7094777 -7430788 -5516724 -6613131 -9825754 -10370533 -7129734 -2993948
9072b993948L119133J916179k54361k714023j564596M011943P520987K341872
$$ -2993948 125185 2041364 1787003 -927020 -2491616 1520327 9041314 11383186
9064A1383186p913700j1208841j476918J1790917J3094202L58183j1017114p780585
$$ 11383186 3469486 -7739355 -9216273 2574644 15668846 16027029 5009915 -2770670
9056b770670K895825L452195q058575j3859904j620016J7358371K2896181J1170210
$$ -2770670 125155 3577350 -4481225 -18341129 -19961145 -2602774 20293407 31463617
9048C1463617m034174j0284418p064398j92239M613659L013619m621725j0384995
$$ 31463617 27429443 17145025 10080627 9888388 14502047 17515666 12893941 2508946
9040B508946o523185L111178O174444k038381j2080757j2450258k665557Q538506
$$ 2508946 -4014239 -903061 5271383 3233002 -8847755 -21298013 -23963570 -15425064
9032a5425064J3265559R648963J215765n376181m971894N44473L732172J077353
$$ -15425064 -2159505 7489458 8705223 3329042 -1642852 -1098379 2633793 3711146
9024C711146k052277O54009O378549O148009k708957j2251387j3801463q154659
$$ 3711146 1658869 2312878 8691427 14839436 12130479 -120908 -13922371 -22077030
9016b2077030k691081q66445P57798N226525R907947J0804184Q339579N266527
$$ -22077030 -24768111 -25634556 -24876758 -19650233 -9742286 1061898 9401477 14668004
9008A4668004J609116l784538q473531q443046m274316k78737J897545L191526
$$ 14668004 16277120 12492582 4019051 -4423995 -8698311 -8977048 -7079503 -3887977
9000c887977J700680m738578j0220483n120761P826501J2614040J963653r997494
$$ -3887977 -2187297 -6925875 -17146358 -22267119 -14440618 -1826578 137075 -9860419
8992i860419p173264N180011R846473M035230J50227K639264K285146l604486
$$ -9860419 -17033683 -11853672 -2007199 2028031 2178258 4817522 7102668 3498182
8984C498182l562761P073156J3483941K794002j3616162j5308422l114664L516929
$$ 3498182 -64579 7008577 20492518 23286520 9670358 -5638064 -8752728 -5235799
8976e235799k791257p968134j439239O928330M394422l603844l645154K774988
$$ -5235799 -8027056 -15995190 -17434429 -10506099 -6111677 -9715521 -13360675 -10585687
8968a0585687K445795o159543r016863P79033J0926800Q359690j281495l533992
$$ -10585687 -8139892 -14299435 -23316298 -22537265 -11610465 -3250775 -4532270 -8066262
8960h066262K718750N713507N84769m326122k322384J962334K087576k53985r88023
$$ -8066262 -5347512 365995 950764 -3375358 -5697742 -3735408 -1647832 -1901817 -2889840
8951b889840k298071p950948j4008706j1742002Q80701J5483102K1095138J3575200
$$ -2889840 -5187911 -13138859 -27147565 -38889567 -38008866 -22525764 -1430626 12144574
8943A2144574j023014j0659547p657203L050191R042832N197847j429766l499616
$$ 12144574 11121560 462013 -7195190 -4144999 4897833 10095680 8665914 5166298
8935E166298l175058n104218o589046k699454L522988M796643Q29638k479929
$$ 5166298 1991240 -3112978 -9702024 -12401478 -8878490 -4081847 -3252209 -5732138
8927e732138k910268k692149j459738K594405O077368M623282K516363O846323
$$ -5732138 -8642406 -11334555 -12794293 -10199888 -4122520 500762 3017125 9863448
8919I863448J2370640N975785j0797909j8635530p379022P605165P451012k969180
$$ 9863448 22234088 28209873 17411964 -1223566 -8602588 -997423 6453589 3484409
8911C484409m664951N856413J3666868J0037356K863002l77201m427603j3607091
$$ 3484409 -1180542 4675871 18342739 28380095 31243097 30865896 26438293 12831202
8903A2831202j9814373j3951385j545012M506978K574103K252449P171482R626758
$$ 12831202 -6983171 -20934556 -22479568 -17972590 -15398487 -13146038 -5974556 3652202
8895C652202M625731j374181j286391J377010m41220n071440n607055j911570
$$ 3652202 8277933 6903752 5617361 6994371 6553151 1481711 -4125344 -6036914
8887f036914K18100M3851K192449O066652N282286n27891l826024k283543k555225
$$ -6036914 -5818814 -5774963 -3582514 2484138 7766424 7238533 3412509 1128966 -1426259
8878a426259n956562l211693P604262J1060925l421024j9923099j5246192O259465
$$ -1426259 -7382821 -10594514 -2990252 8070673 4649649 -15273450 -30519642 -24260177
8870b4260177J8115198J0599595J596844M449419Q013244o0457j0024870o678253
$$ -24260177 -6144979 4454616 6051460 10500879 18514123 18453666 8428796 1750543
8862A750543M706496P586906N07956m056339k230703k254765o859174q595290
$$ 1750543 6457039 14043945 14551901 10495562 8264859 6010094 -849080 -9444370
8854i444370m402953p64345j191837n80694M075479P689498O183516K923683J831872
$$ -9444370 -13847323 -14611668 -15803505 -16384199 -12308720 -4619222 1564294 4487977 6319849
8845F319849J588238N87609P14673K251986J267299m027215r529786j0860788
$$ 6319849 7908087 8495696 9210369 11462355 12729654 8702439 -827347 -11688135
8837a1688135p798434j405714P088386J2693920R365616m33167o111115k913050
$$ -11688135 -19486569 -20892283 -13803897 -1109977 8255639 7822472 1711357 -1201693
8829a201693J625214j42683m787732n164868k247045j462184j887054J863181
$$ -1201693 423521 280838 -4506894 -9671762 -11918807 -13380991 -15268045 -13404864
8821a3404864Q700573J0228931J957255r738287j3625541n123924P995154J2017373
$$ -13404864 -4704291 5524640 7481895 -2256392 -15881933 -21005857 -13010703 -993330
8813i93330K535168p977808m488853R098061J3398514J594609r305910m128772
$$ -993330 1541838 -6435970 -10924823 -1826762 11571752 13166361 3860451 -268321
8805b68321O521552L085512j1183860j4756707j632431R714694N382086l875790
$$ -268321 6253231 9338743 -1845117 -16601824 -18234255 -8519561 -3137475 -7013265
8797g013265j014317J1934092J8768175J1995454l68602p762771p977305n425364
$$ -7013265 -8027582 3906510 22674685 34670139 34301537 26538766 18561461 13136097
8789A3136097m243303m223337k128065K509505M144196k435895j3274500j8126185
$$ 13136097 8892794 4669457 2541392 5050897 9195093 6759198 -6515302 -24641487
8781b4641487j2360701p11959J0005404J4962736R597201n670483j8053992j2189542
$$ -24641487 -37002188 -37714147 -27708743 -12746007 -3148806 -8819289 -26873281 -39062823
8773c9062823Q113467J9980149J0451525o015396q456478K674209J0819791Q618298
$$ -39062823 -30949356 -10969207 -517682 -6533078 -14989556 -12315347 -1495556 7122742
8765G122742L448441J509365M75419j891869l129654j733751L85740J524061L65065
$$ 7122742 10571183 12080548 12555967 10664098 7534444 5800693 6186433 7710494 8075559
8756H075559n162830j2549007j2320183m2598J3165532J3088219K539520l358312
$$ 8075559 2912729 -9636278 -21956461 -21999059 -8833527 4254692 6794212 3435900
8748C435900k95962J286750l508445n358653K184509J0524425R293072J423485
$$ 3435900 3139938 4426688 918243 -4440410 -2255901 8268524 17561596 18985081
8740A8985081l956002n459115o918896p125595j983792O052503R172639M330080
$$ 18985081 15029079 9569964 2651068 -4474527 -6458319 -405816 8766823 13096903
8732A3096903l264062o358028k213691N586420R675056N488001l132540p846591
$$ 13096903 9832841 3474813 1261122 6847542 16522598 22010599 18878059 11031468
8724A1031468o026596k670990j527802o28897J280593J055401k067257k636134
$$ 11031468 5004872 2333882 806080 177183 1457776 2513177 445920 -2190214
8716b190214K683021Q390254P523265J240279m589737q042211j0194470r269938
$$ -2190214 492807 8883061 16406326 17646605 13056868 5014657 -5179813 -14449751
8708a4449751k783797O289601J1697719J1377811P897969K942802l397402q832939
$$ -14449751 -17233548 -10943947 753772 12131583 20029552 22972354 19574952 10742013
8700A0742013r930894p347838n296177m716130j223682P628364J5922308J4497976
$$ 10742013 811119 -6536719 -11832896 -16549026 -17772708 -10144344 5777964 20275940
8692B0275940L207027n806195j497723J0667932J3520008O70504j3696945j3905403
$$ 20275940 23482967 17676772 16179049 26846981 40366989 41037493 27340548 13435145
8684A3435145m126562J11758l479031k573897O848627J2051238L310131j0910220
$$ 13435145 9308583 9420341 5941310 3367413 10216040 22267278 25577409 14667189
8676A4667189j6408092j1059417k385872M278588P149107M534950j970982o044863
$$ 14667189 -1740903 -12800320 -15186192 -10907604 -3758497 776453 -1194529 -7239392
8668g239392m566248j730542p99089Q74239L690747J860188n507411q680097j333018
$$ -7239392 -11805640 -13536182 -14335271 -13461032 -9770285 -7910097 -13417508 -22097605 -23430623
8659b3430623Q190592R122898L838045J049315J129150m56328j761785J373186
$$ -23430623 -15240031 -6117133 -2279088 -1229773 -100623 -556951 -2318736 -945550
8651i45550M819553J995814l767494m116398N43553K903271J023283j306805k728896
$$ -945550 3874003 5869817 2102323 -2014075 -1470522 1432749 2456032 1149227 -1579669
8642a579669l391291p15510M494809M167276m417825j0095313m215920L526884
$$ -1579669 -4970960 -5686470 -1191661 2975615 -1442210 -11537523 -15753443 -12226559
8634a2226559Q23338n172625n17450Q760337N396904p951162j1033306O23220
$$ -12226559 -11403221 -16575846 -17093296 -8332959 -2936055 -10887217 -21920523 -21297303
8626b1297303R314253N310981l90749R31176K798973J046262K380550O683774
$$ -21297303 -11983050 -6672069 -7062818 -6131642 -3332669 -2286407 94143 6777917
8618F777917K195093j1417518j6457717n675243L830716n33584n223103M274008
$$ 6777917 8973010 -2444508 -18902225 -24577468 -20746752 -21280336 -26503439 -22229431
8610b2229431J6130269J2011515j278660m145082K696652K294450p520556j1299563
$$ -22229431 -6099162 5912353 4633693 488611 3185263 5479713 -2040843 -13340406
8602a3340406k828008O272427O478767J852537p33384j49967K767088O205012
$$ -13340406 -16168414 -9895987 -3417220 -1564683 -2298067 -2448034 319054 6524066
8594F524066M796933l387610r355245m083558N970431P100907m80251m136449
$$ 6524066 11320999 7933389 -1421856 -5505414 465017 7565924 7085673 2949224
8586B949224l29602J089256m136289o857200p45759O663507O064590j21890l192016
$$ 2949224 2619622 3708878 -427411 -7284611 -8030370 -1366863 4697727 4575837 1383821
8577A383821k92561M573020O755280M038997k636062q814712r896653n897383
$$ 1383821 1091260 5664280 12419560 16458557 13822495 5007783 -4888870 -10786253
8569a0786253k79584M700296P830009O775813J522141k416251l58586M098343
$$ -10786253 -11065837 -6365541 1464468 8240281 9762422 7346171 6987585 11085928
8561A1085928M161278k19076m046358n761720o672022n461199j670709p77809
$$ 11085928 15247206 15028130 10981772 5220052 -1451970 -6913169 -8583878 -9361687
8553i361687n893961q309379J373292J5056067J4506567k060738j4959659q912805
$$ -9361687 -15255648 -23565027 -22191735 -7135668 7370899 5310161 -9649498 -18562303
8545a8562303P853713J6112910Q295893o593016j4060632o776756Q162490J3941604
$$ -18562303 -10708590 5404320 13700213 7107197 -6953435 -13730191 -5567701 8373903
8537H373903K595216j2831565j4016931k472349M493917J402318N07473P284115
$$ 8373903 10969119 -1862446 -15879377 -18351726 -13857809 -12455491 -11948018 -4663903
8529d663903R767413J077179n840961N56685R570075M929580q935962j4690028
$$ -4663903 5103510 6180689 339728 896413 10466488 15396068 6460106 -8229922
8521h229922q363959m57654L904130Q205244J0510095M004623p512401j0863238
$$ -8229922 -16593881 -17051535 -13147405 -4942161 5567934 9572557 2060156 -8803082
8513h803082l420053K544696j78769l118005J754541P437894L304136p106073
$$ -8803082 -12223135 -9678439 -9857208 -12975213 -11220672 -3782778 -478642 -7584715
8505g584715j0558368k764090O877942Q752384M117373R20378K604591M067032
$$ -7584715 -18143083 -20907173 -14029231 -5276847 -1159474 -239096 2365495 6432527
8497F432527j101898j0615983j3740295m114343J0263983J5199723P789324p32367
$$ 6432527 5330629 -5285354 -19025649 -23139992 -12876009 2323714 10113038 9380671
8489I380671r17788L360192L430056o61492k352662o42767j376782o348173q921544
$$ 9380671 8462883 11823075 15253131 14591639 12238977 11596210 10219428 3871255 -5050289
8480e050289l738945M663664P512526K987266k870702m753506k760208J038380
$$ -5050289 -8789234 -4125570 3386956 6374222 3503520 -1249986 -4010194 -2971814
8472b971814N303209P216483K855573o468294j2168179p768802K010000P082826
$$ -2971814 2331395 9547878 12403451 5935157 -6233022 -14001824 -11991824 -4908998
8464d908998N296082L230757M152554L544340p78149k644657K375813P495636
$$ -4908998 387084 3617841 7770395 11314735 10536586 7891929 10267742 17763378
8456A7763378L432943p331921j3524047j0249357k822216L473762Q289877J0226883
$$ 17763378 21196321 13864400 340353 -9909004 -12731220 -9257458 -967581 9259302
8448I259302N612756l411835p980233m320705O46594M22863j676530m53148J295944
$$ 9259302 14872058 11460223 3479990 -840715 -194121 228742 -1447788 -1900936 -604992
8439f04992m84931p80400O800662J5617817J2260218k706323j3142598r779375
$$ -604992 -1089923 -1870323 4930339 20548156 32808374 30102051 16959453 7180078
8431G180078k214188k313537o509767m324805L219266N856928J742892P04449
$$ 7180078 4965890 2652353 -3857414 -8182219 -4962953 893975 2636867 3341316
8423C341316P918801J3918582O536596j1737435k4326139j8739427p93952J2059938
$$ 3341316 11260117 25178699 31715295 19977860 -4348279 -23087706 -23881658 -11821720
8415a1821720J0965596M473543L847972N507810j860649j4909817j5445375J919598
$$ -11821720 -856124 3617419 7465391 12973201 11112552 -3797265 -19242640 -17323042
8407a7323042J6802058R915721q574377j3986102k978848N112804N91600m061514
$$ -17323042 -520984 9394737 820360 -13165742 -16144590 -11031786 -10440186 -14501700
8399a4501700J903539J0392537J0254481M641628J671694K28818l313128m646323
$$ -14501700 -12598161 -2205624 8048857 12690485 14362179 14590997 11277869 6631546
8391F631546M4593L950963K40704m956358k903019J715035o83047o274625m218469
$$ 6631546 6676139 10627102 10867806 5911448 3008429 4723464 4040417 -2234208 -6452677
8382f452677K787939K138024n629744o165759L820717R698677L121073m506893
$$ -6452677 -3664738 -1526714 -7156458 -13322217 -9501500 197177 3318250 -1188643
8374a188643k347446K152991j035780m809175K280081J3025954J0621041l542808
$$ -1188643 -3536089 -1383098 -2418878 -7228053 -4947972 8077982 18699023 15156215
8366A5156215j0811052m479217J388497k489332n285107K346349P605124n480850
$$ 15156215 4345163 -134054 1254443 -1234889 -6519996 -4173647 3431477 -2049373
8358b049373k5780209k5311046P80460K4795519K3203259N582366l995025m56202
$$ -2049373 -27829582 -53140628 -52360168 -27564649 -4361390 1220976 -2774049 -3230251
8350c230251K970869J68411j612701R18216R13082m063190n721340N73612O593736
$$ -3230251 -259382 -90971 -1703672 -785456 127626 -3935564 -9656904 -9083292 -2489556
8341b489556L823925l704318o841698m532663k087687j773341j931531j073768
$$ -2489556 1334369 -2369949 -9211647 -13744310 -15831997 -17605338 -19536869 -20610637
8333b0610637K248763Q550636J2526647O633389n566909r302957P30729J0209947
$$ -20610637 -18361874 -9811238 2715409 9348798 3781889 -5521068 -4790339 5419608
8325E419608O324899j702684J693303J0966024P281764r640153j8714918r167615
$$ 5419608 11744507 10041823 11735126 22701150 29982914 20342761 1627843 -7539772
8317g539772M567615O744717K190604L528166R373650Q398765j825826j1654918
$$ -7539772 -2972157 3772560 5963164 9491330 18864980 27263745 25437919 13783001
8309A3783001j2256820l980888N998303R395199L029342p014538j0899932o975287
$$ 13783001 1526181 -2454707 3543596 12938795 15968137 8953599 -1946333 -8921620
8301h921620k994231l286341k199392N238062J3635658J4775860R055502K669116
$$ -8921620 -11915851 -15202192 -17401584 -12163522 1472136 16247996 25303498 27972614
8293B7972614j732750m723703m869470j320091J475020j066931n958714o903635
$$ 27972614 26239864 21516161 16646691 15326600 16801620 15734689 9775975 2872340
8285B872340m352665m256846p790263r435316n688509O29387N857768R643125
$$ 2872340 -1480325 -5737171 -13527434 -22962750 -28651259 -28021872 -22164104 -12520979
8277a2520979J1808559J0175375M556036o14968j196164R52822O60744k580449
$$ -12520979 -712420 9462955 14018991 13404023 12207859 13160681 13821425 11240976
8269A1240976k987386L206301J0351825Q576944l307067j4644155j5250800o861542
$$ 11240976 8253590 11459891 21811716 30388660 27081593 12437438 -2813362 -9674904
8261i674904J574647N691726O609661L889943l043053p482412n34061J3546355
$$ -9674904 -8100257 -2408531 4201130 8091073 5048020 -2434392 -2968453 10577902
8253A0577902J7771140M297208j2976158j5922579n451686K645250O74594l564774
$$ 10577902 28349042 32646250 19670092 3747513 -1704173 941077 1615671 -1949103
8245a949103j871849K802740L516385L37263j178278J443746N114975N489272
$$ -1949103 -3820952 -1018212 2498173 2835436 1657158 3100904 8215879 13705151
8237A3705151P68314p210794j3052782j0585642Q54255J3140467J6125201Q996496
$$ 13705151 14473465 7262671 -5790111 -16375753 -15521498 -2381031 13744170 22740666
8229B2740666J454364J208047M132582J527212o192566j0635341q946473o365911
$$ 22740666 24195030 25403077 29535659 31062871 24870305 14234964 5288491 -1077420
8221a077420l891502M627852J7358466J9256200L418879j2803934q871690Q287630
$$ -1077420 -4968922 -341070 17017396 36273596 39692475 26888541 18016851 26304481
8213B6304481J3029465j789677j6011244j3253039j712953L150250Q6355l468615
$$ 26304481 39333946 37544269 21533025 8279986 6567033 9717283 9803638 6335023
8205F335023m753105l402183K397421Q027614K971050j0743377j4452744l13084
$$ 6335023 1581918 -1820265 577156 8604770 11575820 832443 -13620301 -13933385
8197a3933385J1469696R20287j8153373j5908015Q483381K4746897J5148231l832300
$$ -13933385 -2463689 -1543402 -19696775 -35604790 -27121409 -2374512 12773719 8941419
8189H941419r912844l999519L02769l75758n73511M99362K78166R69642M880640
$$ 8941419 -971425 -4970944 -4668175 -5043933 -5617444 -5118082 -4839916 -3870274 1010366
8180A010366O609886M77801p936646q042027o1480N268489K595459j787704j298970
$$ 1010366 7620252 8098053 161407 -7880620 -7942100 -2673611 -78152 -1865856 -3164826
8171c164826J723253K119195Q24401K171063N830458P021805L686116q95183k617814
$$ -3164826 -1441573 677622 1502023 3673086 9503544 16525349 20211465 19316282 16698468
8162A6698468o55044K550465K622863l999270j4440450j8154291q127272O756409
$$ 16698468 16043424 18593889 21216752 17217482 2777032 -15377259 -23504531 -16748122
8154a6748122R688513j024255p868628K36830J0258737N461665p051956p680581
$$ -16748122 -7059609 -8083864 -15952492 -15715662 -5456925 4740 -7047216 -14727797
8146a4727797K862658M905703n682580r232368L765732J4521354O503064o564693
$$ -14727797 -11865139 -6959436 -12642016 -21874384 -18108652 -3587298 2915766 -3648927
8138c648927l447145R657331J0796295j087516o840461o54379K417541n432032
$$ -3648927 -7096072 2561259 13357554 12270038 5429577 4775198 7192739 1760707
8130A760707j2161251p998842q75361n29930k620651R40462P612194J0448163
$$ 1760707 -10400544 -18399386 -19274747 -19804677 -22425328 -21484866 -13872672 -3424509
8122c424509R776215R268365P385092J524546m465932m815158o31893J788519
$$ -3424509 6351706 15620071 23005163 24529709 20063777 15248619 14616726 16405245
8114A6405245q21889o008039q744347n278973L016238Q891072O543482m43078
$$ 16405245 15583356 9575317 830970 -4448003 -1431765 7459307 14002789 13559711
8106A3559711m025422l558143m739672p129224l454355O074154J0067645K313795
$$ 13559711 9534289 5976146 1236474 -5892750 -9347105 -3272951 6794694 9108489
8098I108489p897492r072190l014568J081587J278500K444427N537170O452432
$$ 9108489 1210997 -7861193 -10875761 -9794174 -8515674 -6071247 -534077 5918355
8090E918355L881443J055013J06002j64400j278979l256602m972946m572880j546005
$$ 5918355 9799798 10854811 10960813 10796413 9517434 6260832 1287886 -3284994 -4830999
8081d830999R49837k92227k152928J525374Q767239R343797l23403r963961r088611
$$ -4830999 -3881162 -4173389 -6326317 -4800943 3966296 13310093 12986690 3022729 -6065882
8072f065882r84093M027152L437267K340901K617649J355085j677624k949590
$$ -6065882 -7049975 -3022823 414444 2755345 5372994 6728079 5050455 2100865
8064B100865j327613Q02774K270125L722083L888616J99068o406752j0793963
$$ 2100865 773252 1576026 3846151 7568234 11456850 11655918 5249166 -5544797
8056e544797q481918k103Q731726J0476054M007009k916170k610670J371548k13515
$$ -5544797 -14026715 -14028818 -5297092 5178962 9185971 6269801 3659131 5030679 4817164
8047D817164n792705l536529Q223191J4706062O771962m175527n440299m364956
$$ 4817164 -975541 -4512070 3711121 18417183 25189145 21013618 15573319 11208363
$$ [...]
##END NTUPLES=NMR SPECTRUM
##END=
