##TITLE=31Pdec_SR37_rep_2_3
 , 72 sc
 11.2.2021
##JCAMPDX= 6.0         $$ Bruker NMR JCAMP-DX V2.0
##DATA TYPE= NMR SPECTRUM
##DATA CLASS= NTUPLES
##ORIGIN= UXNMR, Bruker Analytische Messtechnik GmbH
##OWNER= root
$$ XWIN-NMR		Version 3.5
$$ Thu Feb 11 14:19:31 2021 Russian Standard Time (UT+4h)  she@DPX200
##.OBSERVE FREQUENCY= 81.013821
##.OBSERVE NUCLEUS= ^31P
##.ACQUISITION MODE= SIMULTANEOUS
##.ACQUISITION SCHEME= undefined
##.AVERAGES= 72
##.DIGITISER RES= 16
##SPECTROMETER/DATA SYSTEM= spect
##.PULSE SEQUENCE= zgpg30
##.SOLVENT NAME= CD3CN
##.SHIFT REFERENCE= (INTERNAL, CD3CN, 0, 248.564)
##AUDIT TRAIL= $$ (NUMBER, WHEN, WHO, WHERE, WHAT)
$$ ##TITLE= Audit trail, XWIN-NMR		Version 3.5
$$ ##JCAMPDX= 5.01
$$ ##ORIGIN= Bruker BioSpin GmbH
$$ ##OWNER= she
$$ F:/spectra/data/she/nmr/P31/1/pdata/1/auditp.txt
$$ ##AUDIT TRAIL=  $$ (NUMBER, WHEN, WHO, WHERE, WHAT)
(   1,<2021-02-11 14:17:51.28 +0400>,<she>,<DPX200>,
      <continue with go, POWCHK disabled, PULCHK disabled
       configuration hash MD5:
       00 E9 B6 7A A2 85 ED C7 34 08 36 98 17 FE 4E 26
       data hash MD5: 32K
       93 4A D2 4A AD 93 83 D9 FA A7 20 79 B1 11 27 0B>)
(   2,<2021-02-11 14:17:53.71 +0400>,<she>,<DPX200>,
      <Start of raw data processing
       efp BC_mod = 2 LB = 1 FT_mod = 6 PKNL = 1 PHC0 = -3199.363 PHC1 = 1402.202 SI = 64K 
       data hash MD5: 64K
       0B 56 C0 ED B3 B3 04 C5 90 7A F8 E4 31 F5 D8 A9>)
(   3,<2021-02-11 14:18:57.10 +0400>,<she>,<DPX200>,
      <pk PHC0 = 225.9371 PHC1 = -1355.4 
       data hash MD5: 64K
       D5 0A 87 0F D9 DA 90 17 81 B4 B6 E1 53 76 B8 EA>)
$$ ##END=
$$ 
$$ hash MD5
$$ 77 E7 3D 23 24 A2 B4 DF 8C 74 2F 3E 83 D8 A6 63
##$RELAX= 
##$RELAX= 
##$RELAX= 
##$RELAX= 
##$RELAX= 
##$RELAX= 
##$RELAX= 
##$RELAX= 
$$ Bruker specific parameters
$$ --------------------------
##$DU= <F:/spectra>
##$EXPNO= 1
##$NAME= <P31>
##$PROCNO= 1
##$TYPE= <nmr>
##$USER= <she>
##$AMP= (0..31)
100 100 100 100 100 100 100 100 100 100 100 100 100 100 100 100 100 100 
100 100 100 100 100 100 100 100 100 100 100 100 100 100 
##$AQSEQ= 0
##$AQ_mod= 1
##$AUNM= <au_zg>
##$AUTOPOS= <>
##$BF1= 81.014009
##$BF2= 200.13
##$BF3= 200.13
##$BF4= 200.13
##$BF5= 200.13
##$BF6= 200.13
##$BF7= 200.13
##$BF8= 200.13
##$BYTORDA= 1
##$CFDGTYP= 0
##$CFRGTYP= 5
##$CHEMSTR= <none>
##$CNST= (0..31)
1 1 145 1 1 1 1 1 1 1 1 1 1 1 1 1 1 1 1 1 1 1 1 1 1 1 1 1 1 1 1 1 
##$CPDPRG= <waltz16>
##$CPDPRG1= <>
##$CPDPRG2= <waltz16>
##$CPDPRG3= <>
##$CPDPRG4= <mlev>
##$CPDPRG5= <mlev>
##$CPDPRG6= <mlev>
##$CPDPRG7= <mlev>
##$CPDPRG8= <mlev>
##$CPDPRGB= <>
##$CPDPRGT= <>
##$D= (0..31)
0 1 0 0 0 0 0 0 0 0 0 0.03 2e-05 3e-06 0 0 0 0 0 0 0 0 0 0 0 0 0 0 0 0 
0 0 
##$DATE= 1613038500
##$DBL= (0..7)
120 120 120 11 120 120 24 19 
##$DBP= (0..7)
150 150 150 150 150 150 150 150 
##$DBP07= 0
##$DBPNAM0= <>
##$DBPNAM1= <>
##$DBPNAM2= <>
##$DBPNAM3= <>
##$DBPNAM4= <>
##$DBPNAM5= <>
##$DBPNAM6= <>
##$DBPNAM7= <>
##$DBPOAL= (0..7)
0.5 0.5 0.5 0.5 0.5 0.5 0.5 0.5 
##$DBPOFFS= (0..7)
$$ [...]
##$SUBNAM2= <"">
##$SUBNAM3= <"">
##$SUBNAM4= <"">
##$SUBNAM5= <"">
##$SUBNAM6= <"">
##$SUBNAM7= <"">
##$SUBNAM8= <"">
##$SUBNAM9= <"">
##$SW= 501.771253377433
##$SWIBOX= (0..15)
0 1 3 0 0 0 0 0 0 0 0 0 0 0 0 0 
##$SW_h= 40650.406504065
##$TD= 32768
##$TD0= 1
##$TE= 0
##$TE2= 300
##$TE3= 300
##$TEG= 300
##$TL= (0..7)
0 120 53 12 22 120 120 120 
##$TP= (0..7)
150 150 150 150 150 150 150 150 
##$TP07= 0
##$TPNAME0= <>
##$TPNAME1= <>
##$TPNAME2= <>
##$TPNAME3= <>
##$TPNAME4= <>
##$TPNAME5= <>
##$TPNAME6= <>
##$TPNAME7= <>
##$TPOAL= (0..7)
0.5 0.5 0.5 0.5 0.5 0.5 0.5 0.5 
##$TPOFFS= (0..7)
0 0 0 0 0 0 0 0 
##$TUNHIN= 0
##$TUNHOUT= 0
##$TUNXOUT= 0
##$USERA1= <user>
##$USERA2= <user>
##$USERA3= <user>
##$USERA4= <user>
##$USERA5= <user>
##$V9= 5
##$VALIST= <valist>
##$VCLIST= <CCCCCCCCCCCCCCC>
##$VD= 0
##$VDLIST= <DDDDDDDDDDDDDDD>
##$VPLIST= <PPPPPPPPPPPPPPP>
##$VTLIST= <TTTTTTTTTTTTTTT>
##$WBST= 1024
##$WBSW= 4
##$XGAIN= (0..3)
0 0 0 0 
##$XL= 0
##$YL= 0
##$YMAX_a= 10966
##$YMIN_a= -12707
##$ZGOPTNS= <>
##$ZL1= 120
##$ZL2= 120
##$ZL3= 120
##$ZL4= 120
##$ABSF1= 0
##$ABSF2= 0
##$ABSG= 0
##$ABSL= 0
##$ALPHA= 0
##$AQORDER= 0
##$ASSFAC= 0
##$ASSFACI= 0
##$ASSFACX= 0
##$ASSWID= 0
##$AUNMP= <proc_1d>
##$AZFE= 0.1
##$AZFW= 0.5
##$BCFW= 0
##$BC_mod= 2
##$BYTORDP= 0
##$COROFFS= 0
##$CY= -3
##$DATMOD= 1
##$DC= 0
##$DFILT= <>
##$DTYPP= 0
##$F1P= 0
##$F2P= 0
##$FCOR= 1
##$FTSIZE= 65536
##$FT_mod= 6
##$GAMMA= 0
##$GB= 0
##$INTBC= 1
##$INTSCL= 5.30512e-09
##$ISEN= 30
##$LB= 1
##$LEV0= 0
##$LPBIN= 0
##$MAXI= 10000
##$MC2= 0
##$MEAN= 0
##$ME_mod= 0
##$MI= 50
##$NCOEF= 0
##$NC_proc= -8
##$NLEV= 6
##$NOISF1= 182.463
##$NOISF2= 159.3651
##$NSP= 0
##$NTH_PI= 0
##$NZP= 0
##$OFFSET= 248.5645
##$PC= 4
##$PHC0= -2973.426
##$PHC1= 46.802
##$PH_mod= 1
##$PKNL= yes
##$PPARMOD= 0
##$PSCAL= 0
##$PSIGN= 0
##$REVERSE= no
##$SF= 81.014009
##$SI= 65536
##$SIGF1= 159.3651
##$SIGF2= -187.1042
##$SINO= 113.3802
##$SIOLD= 16384
##$SREGLST= <1H.CDCl3>
##$SSB= 0
##$STSI= 65536
##$STSR= 0
##$SW_p= 40650.406504065
##$SYMM= 0
##$S_DEV= 0
##$TDeff= 32768
##$TDoff= 0
##$TI= <>
##$TILT= no
##$TM1= 0
##$TM2= 0
##$TOPLEV= 0
##$USERP1= <user>
##$USERP2= <user>
##$USERP3= <user>
##$USERP4= <user>
##$USERP5= <user>
##$WDW= 1
##$XDIM= 65536
##$YMAX_p= 534336601
##$YMIN_p= -130674191
$$ End of Bruker specific parameters
$$ ---------------------------------
##NTUPLES= NMR SPECTRUM
##VAR_NAME=  FREQUENCY,     SPECTRUM/REAL,   SPECTRUM/IMAG
##SYMBOL=    X,             R,               I
##VAR_TYPE=  INDEPENDENT,   DEPENDENT,       DEPENDENT
##VAR_FORM=  AFFN,          ASDF,            ASDF
##VAR_DIM=   65536,         65536,           65536
##UNITS=     HZ,            ARBITRARY UNITS, ARBITRARY UNITS
##FACTOR=    0.620285442955139, 1,           1
##FIRST=     20137.2065510759, 0,            0
##LAST=      -20513.1999529892, 0,           0
##MIN=       -20513.1999529892, -130674191,  0
##MAX=       20137.2065510759, 534336601,    0
$$ Real data points
##PAGE= N=1
##DATA TABLE= (X++(R..R)), XYDATA
$$ [...]
##PAGE= N=2
##DATA TABLE= (X++(I..I)), XYDATA
55043d3329602O678129J6709817O262739m600319k690098N477092J0208773R823782
55035D540313M365134p399069k0287629k1991268o680484J4811925K3924685J3484169
55027D767776m772781j3021964o402193L413649L957976k939563n260744L174779
55019a7083065J6072047K2840077J8265033M526120j0978792j9061405j5036822
55012d56807l805941M091710K631658n118471j1471902j0411834j607232P325551
55004a8823268N107394r567348k0175514q437440J9256302L2982493J5083693
54997A5426312j4297917k0491828J221975K0381937J2755973r515558j8863769
54990a3382875r900650Q6006R34267J67624L535423M579301J49279q87760N190066
$$ plain form
55043 -43329602 -36651473 -19941656 -13678917 -18279236 -20969334 -15492242 -5283469 4540313
55035 4540313 8905447 1506378 -18781251 -40772519 -47453003 -32641078 -8716393 4767776
55027 4767776 -5005 -13026969 -19429162 -16015513 -12057537 -14997100 -20257844 -17083065
55019 -17083065 -1011018 21829059 40094092 44620212 33641420 14580015 -456807
55012 -456807 -4262748 -171038 2460620 -2657851 -14129753 -24541587 -26148819 -18823268
55004 -18823268 -13715874 -23283222 -43458736 -51896176 -32639874 342619 15426312
54997 15426312 1128395 -19363433 -18141458 2240479 14996452 5480894 -13382875
54990 -13382875 -23283525 -23197519 -22263252 -22095628 -18560205 -13980904 -13831625 -14719385 -9529319
54981i529319O358308n081237j5641351j1118995k080976p046933j8215940j0469055
54973g2825498J6284119L1595905J8275403l636876r066933j787630R55284p97462
54965b1003688L808810J0951949O782837o501603j0939578r06179P229766l84157
54957a0961843j4392037j5065585J316068J7745845J6880909M14128j4110411
54950a8172926j3765305l600709K207311j497056o825749m707155N715067J8436310
54942b2210212K4749108J7650086n5511j3802418j2525902l624107j789091o326835
54934a7934882m798784K872367L642819l591957m463210L223814K181342j2838090
54926c1706581k0549920p234314P480235J671896j1542783n709596J3873279J8311533
$$ plain form
54981 -9529319 -3171011 -8252248 -23893599 -35012594 -37093570 -44140503 -62356443 -72825498
54973 -72825498 -56541379 -24945474 -6670071 -10306947 -19373880 -21161510 -20206226 -21003688
54965 -21003688 -17194878 -6242929 539908 -5961695 -16901273 -17807452 -10577686 -10961843
54957 -10961843 -25353880 -40419465 -39103397 -21357552 -4476643 -4062515 -18172926
54950 -18172926 -31938231 -35538940 -33331629 -34828685 -41654434 -46361589 -40646522 -22210212
54942 -22210212 2538896 20188982 20133471 6331053 -6194849 -9818956 -11608047 -17934882
54934 -17934882 -22733666 -19861299 -16218480 -19810437 -24273647 -21049833 -18868491 -31706581
54926 -31706581 -52256501 -59490815 -52010580 -50338684 -61881467 -67591063 -53717784 -35406251
54918c5406251K044959r932669k705552R270875R759743L665190K820678P115244
54910a3367783R891261R397309P088238L881375K193431L186557J508630p177745
54902A6601273j5010711j0903360R66738O211064K475651N5813P23418m637863
54894c517977j4504754j3627503J295513J2261769O735391l356776k024634O132226
54886a0606745O376778k128736p919582n684970M26889O857576J2023589J1654461
54878A0999260L740651m604826m846126O49976K629950q32424k909719n3437K845060
54869G618365O56524m811901q152307p148331m036098j729972p41605j59665k72627
54860a8777617j489595p19020N816809J3386916R687557p732925k1910620j6022960
$$ plain form
54918 -35406251 -33361292 -43293961 -45999513 -36728638 -26968895 -23303705 -20483027 -13367783
54910 -13367783 -3476522 5920787 13009025 16890400 19083831 22270388 23779018 16601273
54902 16601273 1590562 -9312798 -8346060 -2134996 340655 396468 1119886 -3517977
54894 -3517977 -18022731 -31650234 -30354721 -18092952 -11357561 -14714337 -16738971 -10606745
54886 -10606745 -4229967 -6358703 -14278285 -19963255 -19536366 -12678790 -655201 10999260
54878 10999260 14739911 10135085 5288959 5938935 8568885 7736461 4826742 4773305 7618365
54869 7618365 8274889 3462988 -4689319 -11837650 -15873748 -17603720 -18345325 -18504990 -18777617
54860 -18777617 -20267212 -20986232 -15169423 -1782507 7905050 172125 -21738495 -37761455
54852c7761455K097822R955957L169817p0562R331604J5495217M132011j2722286
54844f371875j5185387n984267k633101o950238m658376O063677Q595842l635533
54836c0759258j2910096l424438J3520372J6085175L672174n174352j604852M840730
54828a5754545N833347M300932J250433q792589k0458131j4126326J4633762L7304811
54820D191694K5297582q687508k5804265j2913779O337935J1744610R097024O515101
54812A5778394j733052j3865732j1140886R904912K0613467R71938k4194266j9935248
54804b3600473N257610J5360145M097841k877905K000430j634276j7689210k1218436
54796d0304274l566236Q450177j818112j0711147M350346K3489598J6859432m259249
$$ plain form
54852 -37761455 -35663633 -25707676 -22537859 -22608421 -13276817 2218400 6350411 -6371875
54844 -6371875 -21557262 -27541529 -30174630 -37124868 -41783244 -35719567 -27123725 -30759258
54836 -30759258 -43669354 -47093792 -33573420 -17488245 -13816071 -18990423 -20595275 -15754545
54828 -15754545 -9921198 -5620266 -4369833 -13162422 -33620553 -47746879 -33113117 4191694
54820 4191694 29489276 20801768 -5002497 -17916276 -11578341 166269 9263293 15778394
54812 15778394 14045342 179610 -10961276 -1056364 19557103 20529041 -3665225 -23600473
54804 -23600473 -18342863 -2982718 1115123 -1762782 237648 -1396628 -19085838 -40304274
54796 -40304274 -43870510 -35420333 -37238445 -47949592 -43599246 -20109648 -3250216 -7509465
54788g509465n984433J1865526J6830378j734220j6156893n665507J2566495J2169432
54780A6381313m252967j3340065n286469O625300P080511k627885q904312l839312
54772h163886M544679K311455j0752971j8389218r146593P325547J3864631Q699402
54764i706954K783170j91511n345926j0256901n445809N582507N340831j0176725
54756b7417318j9873775o589449J5559934J9549782K677551j2490996j0323660
54749c8907931K583851J3611237J7789975J2632018l087657j8857000j6927900
54742c1163407K970102J7496193R982556o063094p945551L597218J0793974Q860369
54734H528360P972444R218914J777492j3975319k1941152j4321200j624121O733796
$$ plain form
54788 -7509465 -13493898 -1628372 15202006 13467786 -2689107 -8354614 4211881 16381313
54780 16381313 12128346 -1211719 -6498188 127112 7207623 4579738 -4324574 -8163886
54772 -8163886 -3619207 -1307752 -12060723 -30449941 -39596534 -32270987 -18406356 -9706954
54764 -9706954 -6923784 -7115295 -12461221 -22718122 -28163931 -22581424 -17240593 -27417318
54756 -27417318 -47291093 -53880542 -38320608 -18770826 -16093275 -28584271 -38907931
54749 -38907931 -36324080 -22712843 -4922868 7709150 4621493 -14235507 -31163407
54742 -31163407 -28193305 -10697112 -714556 -6777650 -14723201 -11125983 -332009 8528360
54734 8528360 16500804 25719718 27497210 13521891 -8419261 -22740461 -24364582 -17630786
54726a7630786J2853042J5220701M749973j3533964j6841062J681519J5732225
54719B231648K379253k1359337k2384630N56420J8808941J6354593M486645l140817
54711b067284n464734l328316M061617R673483N109380k118322K454796J3080265
54703B1400885Q423465j2230648k1916568n833087J3864477R352954j3298075
54696b36597k4942484j4094101K256074O030670J31604p33031Q390380J7240800
54688e956685J4794297L752384l812458l520797l294468q423290j2068747p747882
54680b6277646j572690j804787m830883l175949J125200L923937R688306J9368108
54672c556404J8794635o69620j9994466j5185516N561766J4361244P276003M462387
$$ plain form
54726 -17630786 -4777744 10442957 15192930 1658966 -15182096 -13500577 2231648
54719 2231648 4610901 -16748436 -39133066 -38576646 -19767705 -3413112 1073533 -2067284
54711 -2067284 -7532018 -10860334 -6798717 2874766 7984146 5865824 8320620 21400885
54703 21400885 29824350 17593702 -4322866 -10155953 3708524 13061478 -236597
54696 -236597 -25179081 -39273182 -37017108 -30986438 -30854834 -31587865 -23197485 -5956685
54688 -5956685 8837612 12589996 8777538 5256741 1962273 -6461017 -18529764 -26277646
54680 -26277646 -27850336 -29655123 -34486006 -37661955 -36536755 -32612818 -22924512 -3556404
54672 -3556404 15238231 14568611 -5425855 -20611371 -15049605 -688361 6587642 11050029
54664A1050029R387865L405412j4746856k0374973m761857Q234023K469526n478256
54656a0815087K73326O887812K61287o935435K06381R761661M925823n012431
54648d46663k768141M805302M0550j3478711j7962498r445347L736786J7806032
54640a7712690K7091448J6576503j3682662l2578322j5861307J3644367J6188058
54633f334605n790382j5092349q8291J1904750L847913o285192l90680J1528204
54625f700632J2131134K052034q427695j4165517j1853263O65582J3957809J2825141
54617D84593r90804r038494m243064K09935l984612o974893j504673L380195R27505
54608b1734312J89579P420995J1099234J314114j0213947p001609N686345Q867619
$$ plain form
54664 11050029 20437894 23843306 9096450 -11278523 -16040380 -7806357 -5336831 -10815087
54656 -10815087 -10541761 -3653949 -3392662 -10328097 -10121716 -360055 4565768 -446663
54648 -446663 -3214804 1590498 1631048 -11847663 -29810161 -39255508 -35518722 -17712690
54640 -17712690 9378758 25955261 12272599 -20305723 -36167030 -22522663 -6334605
54633 -6334605 -12124987 -27217336 -27305627 -15400877 -11552964 -17838156 -18228836 -6700632
54625 -6700632 5430502 7482536 -945159 -15110676 -26963939 -26298357 -12340548 484593
54617 484593 -506211 -9544705 -13787769 -13577834 -17562446 -24537339 -26042012 -22661817 -21734312
54608 -21734312 -21544733 -14123738 -3024504 -1710390 -11924337 -18925946 -13239601 -4371982
54600d371982j811550j1982874j0183642j40302Q238569J0035273O631457K041920
54592a543131j662407p152535j6574647k2761564j4107740P468697K2768650J7528406
54584a6036271J185385n854830J746473J1289345J1818306N596538o05054n303026
54576C836866q941382p742482J877918J4153594J5782971P72410j9008281k3876474
54568b3144860q520315J1181672J7322654J0304366K896183r32278q792164k1046526
54560b0731268k3473157p013525J5054776K1711210J1320808J248652J018659
54553h63845L93215r920043j9109127j1254700P831335J6062375P144260r68643
54545a0685173M236855R867039R38069j1416810n605515J4539710K2696078Q140741
$$ plain form
54600 -4371982 -6183532 -18166406 -28350048 -28490350 -20251781 -10216508 -3585051 -1543131
54592 -1543131 -3205538 -10358073 -26932720 -49694284 -63802024 -56333327 -33564677 -16036271
54584 -16036271 -14850886 -20705716 -18959243 -7669898 4148408 9744946 9139892 3836866
54576 3836866 -5104516 -12846998 -10969080 3184514 18967485 19739895 731614 -23144860
54568 -23144860 -31665175 -20483503 -3160849 7143517 10039700 9107422 315258 -20731268
54560 -20731268 -44204425 -51217950 -36163174 -14451964 -3131156 -1882504 -863845
54553 -863845 -470630 -10390673 -29499800 -40754500 -32923165 -16860790 -9716530 -10685173
54545 -10685173 -6448318 3418721 4356790 -7060020 -12665535 1874175 24570253 32710994
54537C2710994j1128477j7401789j5008875j5025754j5873774j0437234Q92R097089
54529d3066928J3296544R821601k318779j3641241r234681J0456012K6092805
54522h594667K3424131Q716847m816483j1545552r359571J778223J0830392L981239
54514A4414559j1151480j1118449N573504J2278091k238710j3776250m590449
54507a0609184N731908l023403j3777904l458368J3644634J1087644k682855k727006
54499e814534N163518r75671j2416696m566068J1867845N155128j7163070j5964166
54491c4713714J0108719J9076148j277256j1865049P226371K0298373m16354k4581624
54483a6144386j5632420P759787O104621j4968427j9246183j539318R575967J857311
$$ plain form
54537 32710994 21582517 4180728 -10828147 -25853901 -41727675 -52164909 -52164017 -43066928
54529 -43066928 -29770384 -19948783 -22267562 -35908803 -45143484 -34687472 -8594667
54522 -8594667 14829464 23546311 18729828 7184276 -2175295 -397072 10433320 14414559
54514 14414559 3263079 -7855370 -2281866 9996225 7757515 -6018735 -10609184
54507 -10609184 -4877276 -7900679 -21678583 -25136951 -11492317 -404673 -3087528 -5814534
54499 -5814534 -651016 -1626687 -14043383 -18609451 -6741606 -1586478 -18749548 -34713714
54491 -34713714 -24604995 -5528847 -6806103 -18671152 -11444781 8853592 8437238 -16144386
54483 -16144386 -31776806 -24017019 -17912398 -32880825 -52127008 -53666326 -44090359 -42233048
54475d2233048o694851k438457O955352J2127448J4382053J5615213J3629861
54468A1343571R126846N095319Q53103m034594n005703o7763M947592N713988
54460B7972359M664227J564645p693960j6968405j2094643M045598Q723711o069836
54452D143696j7297328n461064J4594492J7174070K488129j0971410j5254631
54445a0584046j2991208l114869J1755119J6837612N267142o480942l744768J348482
54437a707478o674346j5152869m048723J5734496J7223077J481022o516615j092901
54429g54337j251821j3384816k0936563j4661049m106671N098468J7434106K6425799
54421f136884J6242721p840935j8308177n499978O969802J39199j1245998n041072
$$ plain form
54475 -42233048 -48927899 -51366356 -44411004 -32283556 -17901503 -2286290 11343571
54468 11343571 20470417 25565736 26418839 22384245 17378542 17310779 22258371 27972359
54460 27972359 32636586 34201231 26507271 9538866 -2555777 1489821 10213532 4143696
54452 4143696 -13153632 -18614696 -4020204 13153866 15641995 4670585 -10584046
54445 -10584046 -23575254 -26690123 -14935004 1902608 7169750 688808 -3055960 -1707478
54437 -1707478 -8381824 -23534693 -27583416 -11848920 5374157 6855179 338564 -754337
54429 -754337 -2006158 -15390974 -36327537 -50988586 -55095257 -49996789 -32562683 -6136884
54421 -6136884 10105837 2264902 -16043275 -21543253 -14573451 -14434252 -25680250 -30721322
54413c0721322J2687957J8779369P184097p092245j1649706q578285n221719m455599
54405b9067453m518034k988437n34064n26446k419276P99493J1915571K0835040
54397f503606J6608631L957888m186087o224012r186434j0642120k111822J0551119
54389g736443J1374605J614610P17063J3058313J6300018m178806k8699382k8825380
54381b6375402o136262J3301215J5207869R124299O514935M123657n764815j8746799
54373h751303k0453535m771146J4971857J8594390M118525p186902K246318K1260837
54365B0029041K4016623N151551j4346061j6816534p611966o15530J340806L437763
54357A4585693O748527P773594M184447l716920j2006301j2981093m248231K839615
$$ plain form
54413 -30721322 -18033365 746004 7930101 837856 -10811850 -19390135 -24611854 -29067453
54405 -29067453 -33585487 -36573924 -37107988 -37634434 -40053710 -39254217 -27338646 -6503606
54397 -6503606 10105025 14062913 9876826 3652814 -5533620 -16175740 -18287562 -7736443
54389 -7736443 3638162 5252772 5969835 19028148 35328166 31149360 2449978 -26375402
54381 -26375402 -32511664 -19210449 -4002580 5121719 11636654 15760311 9995496 -8751303
54373 -8751303 -29204838 -33975984 -19004127 -409737 3708788 -3478114 -1231796 20029041
54365 20029041 44045664 49197215 34851154 18034620 10422654 9807124 11147930 14585693
54357 14585693 21334220 29107814 33292261 29575341 17569040 4587947 339716 3179331
54349C179331m197392j7942861j8080821k006763R402025L332680o110358j991574
54341c4415733R397811J1910460N292511n0421l582720j0650924j4873157n116503
54333d2088676J2041268J6695390M550935o325419k552968P053021R026649N807047
54325D207247O560220Q061506O47987j1018908j0279078N555227J6913605Q652262
54317B9300068o863455p345474N997741J0840410j095743j1514199n509619M654517
54309A8464246J42391j4063558j7911605p260218L311721N232852M782554O909453
54301c92164O777120K57619r661677j8236485k0590632j1162093O165748J3610780
54293c3231784K143772q423926N157465K9455814K9125224J912512j5319955l711057
$$ plain form
54349 3179331 -1018061 -18960922 -37041743 -39048506 -29646481 -26313801 -32424159 -34415733
54341 -34415733 -25017922 -13107462 -7814951 -7865372 -11448092 -22099016 -36972173 -42088676
54333 -42088676 -30047408 -13352018 -8801083 -15126502 -17679470 -10626449 -1599800 4207247
54325 4207247 10767467 18828973 19476960 8458052 -1821026 3734201 20647806 29300068
54317 29300068 22436613 15091139 21088880 31929290 30833547 19319348 13809729 18464246
54309 18464246 18606637 4543079 -13368526 -20628744 -17317023 -12084171 -7301617 -392164
54301 -392164 6384956 6642575 -3019102 -21255587 -41846219 -53008312 -46842564 -33231784
54293 -33231784 -31088012 -39511938 -34354473 -4898659 24226565 26139077 10819122 7108065
54285G108065J0307217J850591j2675870q590768L537866l6998j2420317j0283429
54277b1203643K324731J468597j2197163j2595730P955503K6564773K6067001
54270A8384069J5506936P716609J162547p287097j2074551j0183296o615046l302245
54262C307926K205674M908047k978772j3612901j0017880N544027J1523779J221645
54254B101545o027444K774654J3278290Q579867m607475j0117106o632249k425515
54246c075433O65457L634524K723033k022357k764781J185933m37866p417606
54238g509096l531296J3399757J9083172J063024j4595743l658187J1664954l126517
54230A2790068l2133102k7906936J1070288L2780572J1165460j5940844j0348621
$$ plain form
54285 7108065 17415282 19265873 6590003 -2000765 1537101 1500103 -10920214 -21203643
54277 -21203643 -18878912 -17410315 -29607478 -42203208 -34247705 -7682932 18384069
54270 18384069 33891005 41607614 42770161 35483064 23408513 13225217 6610171 3307926
54262 3307926 5513600 10421647 7442875 -6170026 -16187906 -10643879 879900 2101545
54254 2101545 -3925899 -1151245 12127045 20706912 16099437 5982331 -649918 -3075433
54246 -3075433 -2409976 1224548 3947581 1925224 -839557 346376 -91490 -7509096
54238 -7509096 -11040392 2359365 21442537 22505561 7909818 4251631 15916585 12790068
54230 12790068 -19343034 -47249970 -36179682 -3399110 7766350 -8174494 -18523115
54223a8523115Q906808M727338j5708915j8750368k389739O512770K153460M878235
54215b8193526J8095540J9490707J757370j2322424p261029K140107R5937m037508
54207a0234826K017352P221257l072867j6512123r085948J5992657K9807663J8115685
54199C4248850j287432o382209J231520N010690j602677r427436q392868l20033
54191A3078405M073012j098492q187233m875249P745722J3742346M263324q053363
54183B0688472p100791K014152J943564p267536p312051P012326J6147123N430054
54175C1555313j0952603j0737738L962212J2403439O192501l467090p008007p904410
54167A4043617j1148847j4592468j5523126j4643886j0198403J162482J3918283
$$ plain form
54223 -18523115 -9616307 -4888969 -20597884 -39348252 -41737991 -35225221 -33071761 -28193526
54215 -28193526 -10097986 9392721 11150091 -1172333 -8433362 -6293255 -6197318 -10234826
54207 -10234826 -8217474 -996217 -4069084 -20581207 -29667155 -13674498 16133165 34248850
54199 34248850 32961418 26579209 27810729 32821419 31218742 21791306 13398438 13078405
54191 13078405 17151417 16052925 7865692 2990443 10736165 24478511 28741835 20688472
54183 20688472 13587681 15601833 17545397 10277861 2965810 9978136 26125259 31555313
54175 31555313 20602710 9864972 13827184 26230623 32423124 28956034 21948027 14043617
54167 14043617 2894770 -11697698 -27220824 -41864710 -52063113 -50900631 -36982348
54160c6982348J4964924J205863j3192756j3669842k077678R424015J4026952
54153b6300870J2737470P385898m85083o861760p853345l184655N919858J7452325
54145a190162K4004753J5420149o836701k4745653k2301280m640995R787293J1606761
54137A104165N753956j268678p874655j2397876j2086215p712012j903293N391384
54129c0993224J2613101J2437869K193397o487584j741527Q660369P354328n099349
54121a062620j1300465n740033j409525l776954p45736J2508727K0568969J2682304
54113B1724667Q43969k071274k971849r628473j0577606L413885J5148777N540894
54105B1422990j1376623r003213N993660L712340j6445958k1727660k63153J8395903
$$ plain form
54160 -36982348 -22017424 -20811561 -34004317 -47674159 -49751837 -40327822 -26300870
54153 -26300870 -13563400 -6177502 -6662585 -13524345 -21377690 -24562345 -18642487 -1190162
54145 -1190162 22814591 38234740 31398039 6652386 -15648894 -20289889 -10502596 1104165
54137 1104165 6858121 5589443 -2285212 -14683088 -26769303 -34481315 -36384608 -30993224
54129 -30993224 -18380123 -5942254 -3748857 -10236441 -11977968 -3317599 4036729 -1062620
54121 -1062620 -12363085 -18103118 -19512643 -23289597 -24035333 -11526606 9042363 21724667
54113 21724667 22568636 20497362 17525513 7897040 -2680566 733319 15882096 21422990
54105 21422990 10046367 1043154 7036814 10749154 -5696804 -27424464 -27687617 -9291714
54097i291714J1598255j500760M441179J8228719J3250827p441110j7406399q751702
54089C127295M19458j663149n092251J000951J0792361J1684333R29844j2939210
54081H259632j9082313j2686942J034443J0944544J1085146N666289J145117j222885
54073E143031j972922l44985M92525n739092j5282169j2436665Q030111K5843547
54065C733381J7968947q579795k3531024j2710178N736676Q685741k979029j1707506
54057b3382787r211387k340147L114649J0508643K0068118K0157886K758483j7562196
54049D111262j6710735M334835J6225532K622365j3998436o950956J1107657Q273902
54041I015426j2876690j8123208J598913J5598813N956287m664928K657890Q464823
$$ plain form
54097 -9291714 2306541 805781 5246960 23475679 36726506 29285396 11878997 3127295
54089 3127295 3546753 1883604 -3208647 -2207696 8584665 20268998 21198842 8259632
54081 8259632 -10822681 -23509623 -22475180 -11530636 -445490 5220799 6365916 5143031
54073 5143031 3170109 2825124 3317649 -2421443 -17703612 -30140277 -22110166 3733381
54065 3733381 21702328 13122533 -10408491 -23118669 -17381993 -8696252 -11675281 -23382787
54057 -23382787 -32594174 -34934321 -31819672 -21311029 -1242911 18914975 21673458 4111262
54049 4111262 -12599473 -8264638 7960894 10583259 -3415177 -10366133 741524 9015426
54041 9015426 -3861264 -21984472 -20385559 -4786746 1169541 -3495387 -837497 7627326
54033G627326o524348k1141100q827777J3131998J1407795n554949l652715J4539645
54025A005875J3176784j2788518k6433528r742004J0218806J0755469P023213
54018f783903J5214180K0117513O486396q118080k438030R991708L133388j7448340
54010B0154832k4163801j0921758K181045K672183j984670m448618o610624p115113
54002c0236524R8977J0953856J1862343P26985o685231J259274J4321619J4124821
53994A6426120r0757j0003401l227318R386080Q845627m542448j1566212l411623
53986A816068N215835J311541m457675J984267J0104777J429207j5084022j4107027
53978a1787029K750866P847878m902504q902680P463908J7981469L617554j2372299
$$ plain form
54033 7627326 1102978 -20038122 -28865899 -15733901 -4326106 -9881055 -13533770 1005875
54025 1005875 14182659 1394141 -25039387 -34781391 -24562585 -13807116 -6783903
54018 -6783903 8430277 28547790 35034186 26916106 24478076 34469784 37603172 20154832
54010 20154832 -4008969 -14930727 -12749682 -10077499 -12062169 -16510787 -23121411 -30236524
54002 -30236524 -30137547 -19183691 -7321348 -6594363 -13279594 -12020320 2301299 16426120
53994 16426120 16335363 6331962 3104644 12490724 21336351 16793903 5227691 1816068
53986 1816068 7031903 8343444 3885769 5870036 15974813 17404020 2319998 -11787029
53978 -11787029 -9036163 -1188285 -6090789 -14993469 -7529561 10451908 14069462 1697163
53970A697163k722729J6592233J1263387j6241177l1333509j8685128K860347
53963c6569413J3868452J4884154J2577955Q594580N211295M981087L789857k497624
53955B4840343p820874n387280p97313j473814k000587L371617M291824r180523
53947E843393k3709787j9820323l391328N475091P211827J7022994K9273785K0975285
53939C8880937p294200k6338832k0753425o719168M58805O620638J5123839J2433681
53931A2412275n671006j8177273q400471R783673J3470214K438531p202590o877028
53923h223675J533578J2933409J6647945K099869k0825827k4501144q27938K2612719
53915A448936K0160997K526967o352981p137153j3558993j9326117q315737J0659117
$$ plain form
53970 1697163 -1025566 15566667 26830054 10588877 -20744632 -39429760 -36569413
53963 -36569413 -22700961 -7816807 4761148 13355728 18567023 23548110 27337967 24840343
53955 24840343 17019469 11632189 10834876 9361062 7360475 10732092 15023916 5843393
53947 5843393 -17866394 -37686717 -41078045 -35602954 -28391127 -11368133 17905652 38880937
53939 38880937 31586737 5247905 -15505520 -22224688 -21765883 -15145245 -21406 12412275
53931 12412275 6741269 -11436004 -19836475 -10052802 3417412 5855943 -1346647 -8223675
53923 -8223675 -6690097 6243312 22891257 24991126 4165299 -20335845 -21163783 1448936
53915 1448936 21609933 24136900 17783919 10646766 -2912227 -22238344 -30554081 -19894964
53907a9894964J1949396n340532j4326226k569492J0686333P552753l089514n290355
53899b0322601r83540p88943m578669n665473m155956l189429L45827R186060
53891c0152724J5539728R598356m534340j2181644p096184J807981L918471o46664
53883b3747020m933619m693074J068947J3453442K8921760L3638893J4976220
53876E8685549j7046479l2205937j4942545J2350190J6111989m246700j8474717
53869B31350j0522981J923352l15473r244901p866384J395960N025481K017421
53861a7356175K740k067633p869172q710235M679551K1307497K2270726J0188188
53853B2445487M188714P304070K886898j3749223k4024917j4594094K627868R282007
$$ plain form
53907 -19894964 -7945568 -13286100 -27612326 -30181818 -19495485 -11942732 -15032246 -20322601
53899 -20322601 -21306141 -22095084 -26673753 -32339226 -36495182 -39684611 -39338784 -30152724
53891 -30152724 -14612996 -5014640 -9548980 -21730624 -28826808 -27018827 -23100356 -23747020
53883 -23747020 -28680639 -33373713 -32304766 -18851324 10070436 43709329 58685549
53876 58685549 41639070 9433133 -5509412 6840778 22952767 18706067 231350
53869 231350 -10291631 -8368279 -8683752 -17928653 -25795037 -24399077 -19373596 -17356175
53861 -17356175 -17353435 -19421068 -27290240 -36000475 -31320924 -10013427 12257299 22445487
53853 22445487 26634201 33938271 36825169 23075946 -948971 -15543065 -12915197 -3633190
53845c633190M137084j833561j545041N115578J3709625J5355195N212805o483510
53837C0034985n306262L878195J780054j3715249k1790374j1529308K114462O057650
53829h475847Q882408J6932045J4820533p030111k5758953j5477393J0899717
53822e207601J9584891O205388l918866j127871k621189j5121696j9659038n043768
53814b6909750J1108927J0316766M27197j857819J975132P95868l593411j040886
53806h777976P305470J0183221L276030p127342j4112145j4118168n536758P195255
53798b1712413J2901524O773279n33145K753427J0630888P305112p844276j6898613
53790f624217p664395J0012058J7690649J0196670k306722q912189p639701k462696
$$ plain form
53845 -3633190 503894 -1329667 -2874708 2240870 15950495 31305690 36518495 30034985
53837 30034985 24728723 28606918 30386972 16671723 -5118651 -16647959 -14533497 -8475847
53829 -8475847 406561 17338606 32159139 25129028 -629925 -16107318 -5207601
53822 -5207601 14377290 20582678 16663812 15535941 12914752 -2206944 -21865982 -26909750
53814 -26909750 -15800823 -5484057 -5056860 -6914679 -4939547 -4143679 -7737090 -8777976
53806 -8777976 -1472506 8710715 11986745 4859403 -9252742 -23370910 -28907668 -21712413
53798 -21712413 -8810889 -2037610 -2570755 182672 10813560 18118672 10274396 -6624217
53790 -6624217 -14288612 -4276554 13414095 23610765 21304043 12391854 4752153 2289457
53782B289457K756431N757080N250195J843863j524841k415135j822888k324010
53774I810152l876331m426442m306299n417599n292711J600420J3251747J7758499
53766A9101436Q054902o599215j1928185o951330j664980j37881K659827Q318319
53758A0852893J1150036Q339294L684802m50861n262820q460537n723308q77526
53750A3251973l187295j1772177j4616830o874664K066239M478428M387400N630082
53742f636844L295647m157926o742435K143874J2732377J2066460J913677o954249
53734G660581j0413728j0257975n188098O128147J7988780K2882890J9421042
53727D8221639R304298n974257j9842053k2657165j6094000j3547847j8464568
$$ plain form
53782 2289457 5045888 10802968 16053163 17897026 16372185 13957050 12134162 9810152
53774 9810152 5933821 1507379 -2798920 -8216519 -13509230 -11908810 1342937 19101436
53766 19101436 27156338 20557123 8628938 1677608 12628 -125253 2534574 10852893
53758 10852893 22002929 30342223 34027025 33576164 28313344 19852807 14129499 13251973
53750 13251973 10064678 -1707499 -16324329 -23198993 -21132754 -16654326 -12266926 -6636844
53742 -6636844 -3341197 -7499123 -14241558 -12097684 634693 12701153 14614830 7660581
53734 7660581 -2753147 -13011122 -18199220 -12071073 5917707 28800597 48221639
53727 48221639 57525937 51551680 31709627 9052462 -7041538 -20589385 -39053953
53720c9053953j7004965k397572J0579633R518080M929851R142144J2965951N733759
53712e587072P66350J3003279K6371642J6109126p304508j2585151M70777K659309
53704C3903752j1907502j6077958P78620J3903533O835442l438334j855023m55231
53696B1687299p771981o939799J0497817K0154496M015406j3254396j437026K3888210
53688E0840026K5039168K106104j0865840k727316J289780j4581876l2015952
53681A9084094k9672940j2925116n23852O52474l078528m751256l182778k580027
53673c6977929o665057r633932l88721J7017425K0198456j18724j9469019j1452055
53665d7489556J1594495J6140476j870348j4334969p341804K114015R49551j97661
$$ plain form
53720 -39053953 -56058918 -58456490 -47876857 -38358777 -33428926 -24286782 -11320831 -5587072
53712 -5587072 -4820722 8182557 34554199 50663325 43358817 30773666 31244443 33903752
53704 33903752 21996250 5918292 6696912 20600445 27435887 23997553 22142530 21687299
53696 21687299 13915318 6975519 17473336 37627832 41643238 28388842 26951816 50840026
53688 50840026 75879194 77985298 67119458 64392142 65681922 51100046 19084094
53681 19084094 -10588846 -23513962 -24037814 -23385340 -26463868 -31215124 -34397902 -36977929
53673 -36977929 -43642986 -53276918 -53665639 -36648214 -16449758 -16568482 -36037501 -47489556
53665 -47489556 -35895061 -19754585 -21624933 -35959902 -43301706 -41187691 -40238140 -40435801
53657d0435801O099526O014734q927985k0509598j0158767J0429297J6713521
53650d0775073P295038Q40279M396840O188464j276245r262836p744942K53446
53642d0085029M705253K071114k012584j062002M129614O706567L179451j361073
53634b3728689q20355K746020L810052L504390N818117O552167j538767j3002316
53626a6659381j3310759r24856Q651327N981659O23553L432753R478319Q758616
53618F031231K663232j600978m113467q421483j1450290p715740J279258R424177
53610a3904060J2090072N299038j0834463k2267820j0025782J9888369L2599494
53603A2844848Q349824k4747694k6094752L82813J4642335J773999r771119J714693
$$ plain form
53657 -40435801 -34336275 -28321541 -37249526 -57759124 -67917891 -57488594 -40775073
53650 -40775073 -33480035 -32639756 -28242916 -22054452 -23330697 -32593533 -40338475 -40085029
53642 -40085029 -35379776 -33308662 -35321246 -36383248 -32253634 -25547067 -22367616 -23728689
53634 -23728689 -24549044 -21803024 -17992972 -14488582 -8670465 -2118298 -3657065 -16659381
53626 -16659381 -29970140 -30894996 -22243669 -16262010 -15638457 -12205704 -2727385 6031231
53618 6031231 8694463 7093485 2980018 -5441465 -16891755 -24607495 -23328237 -13904060
53610 -13904060 -1813988 3485050 -7349413 -29617233 -39643015 -19754646 12844848
53603 12844848 21194672 -3553022 -29647774 -29264961 -14622626 -12848627 -22619746 -20905053
53595b0905053J6474827P805156j4012096j8159257O10574J8208041J7578766
53588G600958N780896m335308r080137p593417J848006J2934753J2488110j835260
53580A7808601j5255866j4503899l937590M078912O010492N230539J293176o590050
53572e865685j0248399j118449J2571969J2253542l696126j4076312m763909R364752
53564e578617O736733o976207p392143R045374J7126393J218434j9243788j7600080
53556b2663901J574987J1672154L560147o525824p642462r260946j7946420j9473831
53548f6706096m90222K4436447K7228297M702574j5332088j0103176R951547J7543000
53540h769717M473231j0479672q744445L810864O845476n214424j5288897q447294
$$ plain form
53595 -20905053 -4430226 3374930 -10637166 -28796423 -28185849 -9977808 7600958
53588 7600958 13381854 9046546 -33591 -7627008 -5779002 7155751 19643861 17808601
53580 17808601 2552735 -11951164 -15888754 -11809842 -5799350 -568811 724365 -5865685
53572 -5865685 -16114084 -17232533 -4660564 7592978 3896852 -10179460 -14943369 -5578617
53564 -5578617 1158116 -5818091 -13210234 -4164860 12961533 14179967 -5063821 -22663901
53556 -22663901 -21088914 -9416760 -5856613 -12382437 -20024899 -29285845 -47232265 -66706096
53548 -66706096 -67196318 -42759871 -15531574 -10829000 -26161088 -36264264 -26312717 -8769717
53540 -8769717 -4296486 -14776158 -23520603 -19709739 -12864263 -18078687 -33367584 -41814878
53532d1814878O222969R651077K058679J503925J2947458J7877886L240087j6183925
53524d496722j8547438n496201M745833N379277L611670K080785k044030l270564
53516a8037390N785289J5796934J0497749n027680r578875j111571J6839j1542921
53508a3201626j5153802j723227Q341411J573420m567694L362683O258083j1170741
53500b6281493k3765216m119301K5011613K1482009p797421j8296733q22637R459398
53492b5129781q61000k901406J5385499K2375754N2387j8528092k727480K2763489
53484A0429370J7568779j0299959k1131837n314831J1077493J0973699R95636
53477A4298350j1118581k2005909k1181600k996209J4995471J2767804Q91698
$$ plain form
53532 -41814878 -35591909 -25940832 -23882153 -22378228 -9430770 8447116 11687203 -4496722
53524 -4496722 -23044160 -28540361 -23794528 -18415251 -14803581 -12722796 -14766826 -18037390
53516 -18037390 -12252101 3544833 14042582 9014902 -563973 -1675544 -1658705 -13201626
53508 -13201626 -28355428 -30078655 -21737244 -20163824 -24731518 -21368835 -15110752 -26281493
53500 -26281493 -50046709 -54166010 -29154397 -7672388 -15469809 -33766542 -34589179 -25129781
53492 -25129781 -25990781 -28892187 -13506688 8869066 8921453 -9606639 -12334119 10429370
53484 10429370 27998149 17698190 -3433647 -8748478 2329015 13302714 14298350
53477 14298350 3179769 -18826140 -40007740 -43003949 -28008478 -15240674 -14348976
53470a4348976M648814K0742889K1133486j150023k1353184k1515144j1004161
53463b2846299k985015L137971Q338393O890752P91814K74233L723280j429448
53455d104319j2381563r896812Q143782J7636930N384248r004822m984197P118651
53447b088102O518339l927240p045223j603742N32530j061560K945308J0116316
53439D386626Q930648J393753Q93272O151239L61743j6938695k0169661N031854
53431i959221L3030910K8893732j867092k0098171q851222N366575k757800j8176382
53423E581329j3467976L787050M072094j2050326j2408551J1987344K7901563
53416A5402527J1516169j3941317j6392758k752141J989494M98163J0444439K1402514
$$ plain form
53470 -14348976 -9700162 11042727 32176213 31026190 9673006 -11842138 -22846299
53463 -22846299 -25831314 -22693343 -14354950 -7464198 -6672384 -6398151 -2674871 -4104319
53455 -4104319 -16485882 -26382694 -18238912 -601982 4782266 -4222556 -9206753 -2088102
53447 -2088102 4430237 502997 -6542226 -8145968 -7613438 -8674998 -5729690 4386626
53439 4386626 13317274 14711027 15604299 21755538 22117281 5178586 -14991075 -9959221
53431 -9959221 23071689 51965421 50098329 30000158 21148936 26515511 23757711 5581329
53423 5581329 -7886647 -4099597 -27503 -12077829 -24486380 -12499036 15402527
53416 15402527 26918696 12977379 -3415379 -6167520 -4178026 -3679863 6764576 28167090
53408B8167090P127090k3523438l0979491n802483J4709669L782614j6587661
53401b3106610j4208285N883857J6594185R911260j745832j0470378j5921127
53394c3062930j3316946M87290J4675742J5857331P686260M130169P111461N979132
53386I547509k009017n218269M563117J7420873J5183597n742758k6224441k3677962
53378a6157351K71231J9091618J3702345l684122r069933q69571K920572l646373
53370B558416p507448j838199L733015L066863L308288P866533Q873867M543074
53362B4604409M859346J0736926P278996j0154829k2239151j3195761M305094
53355F195030Q403454r99546p344411l260226M381130P736660L681795o622078
$$ plain form
53408 28167090 35294180 11770742 -19208749 -25011232 -10301563 -6518949 -23106610
53401 -23106610 -37314895 -31431038 -14836853 -4925593 -6671425 -17141803 -33062930
53394 -33062930 -46379876 -45892586 -31216844 -15359513 -7673253 -3543084 3568377 9547509
53386 9547509 7538492 2320223 6883340 24304213 39487810 33745052 7520611 -16157351
53378 -16157351 -15886120 3205498 16907843 13223721 4153788 3284217 6204789 2558416
53370 2558416 -4949032 -6787231 -3054216 12647 3320935 11187468 20061335 24604409
53362 24604409 29463755 40200681 47479677 37324848 15085697 1889936 6195030
53355 6195030 14598484 13598938 6254527 2994301 7375431 15112091 18793886 12171808
53347A2171808j4442119r172429M457227P372475o195047j6687457p060316J2087504
53339a7468354J9808677J3528467M455522k903098q916141p572102L913985J2296818
53331A7143774L518566j4861243k2755802j4186061m57609P910521Q874289L945946
53323a0867619j844238n44577P645631J1280010N006434p47791J734104K485730
53315A4147684q332550k0282960j7034951r83653J2107655J4007658O538904n469269
53307e301482j1893539k870641J1517681P239617j3839585j7111949J0035880
53300b2224018K8263203N003675k6988796j6586729K2422352L1271556p43631
53293B0417612k3925311j1732403M374812n13031l017997J6949464L1689259J1066869
$$ plain form
53347 12171808 -2270311 -11442740 -6985513 386962 -5808085 -22495542 -29555858 -17468354
53339 -17468354 2340323 15868790 20324312 17421214 8505073 932971 4846956 17143774
53331 17143774 20662340 5801097 -16954705 -31140766 -31598375 -23687854 -14813565 -10867619
53323 -10867619 -12711857 -13256434 -5610803 5669207 10675641 9927850 11661954 14147684
53315 14147684 5815134 -14467826 -31502777 -32486430 -20378775 -6371117 167787 -5301482
53307 -5301482 -17195021 -20065662 -8547981 -1308364 -15147949 -32259898 -22224018
53300 -22224018 6039185 11042860 -15945936 -32532665 -10110313 21161243 20417612
53293 20417612 -3507699 -15240102 -10865290 -11378321 -14396318 2553146 34242405 45309274
53285D5309274k3172228k9037898o643959R207994L445101p069659p234543K04912
53277a4991006Q517854J3603207R591891l656907j2510396n235455Q541277Q975039
53269A2835504o864741k1794508j9716154o86151K1189205K8239278J3997937
53262B7200370p118685j3350262k567456O458154L247571j552291J31257j613348
53254A0835310j2402399j6150549N8674J9543431J7222524l443030j7024255j2260940
53246a3621234m26500P064265Q894059M847712m445302j0335372n094428M271123
53238h845677O149605L607208O641155J0431159J847815j4613558j9483929q561668
53230b2827890Q01966j916196o146720j509505N639714O866761O203448Q194819
$$ plain form
53285 45309274 22137046 -6900852 -13544811 -4336817 -891716 -7961375 -15195918 -14991006
53277 -14991006 -6473152 7130055 16721946 13065039 554643 -4680812 3860465 12835504
53269 12835504 5970763 -15823745 -35539899 -36226050 -15036845 13202433 27200370
53262 27200370 20081685 6731423 4163967 10622121 13869692 12317401 12448658 10835310
53254 10835310 -1567089 -17717638 -17658964 1884467 19106991 15663961 -1360294 -13621234
53246 -13621234 -14047734 -6983469 1910590 6758302 2313000 -8022372 -13116800 -8845677
53238 -8845677 -2696072 911136 7552291 17983450 19831265 5217707 -14266222 -22827890
53230 -22827890 -22025924 -23942120 -30088840 -31598345 -25958631 -19091870 -12888422 -4693603
53222d693603N862040n373315j3276899m667000J1086284J1547545o737961k1062081
53214b7314990j2014917J0932845K1684054J0217961o825016r892015k000130
53207a5212208j286324j1414645j3976842L036998K2621086J9949996j009106
53200B708955j2003247j870253Q101493j252694j6646476j3266509P109960J9826405
53192g292366J3748297K658095o52437j321373o403170r235196j950625Q210779
53184b237996Q740488P70291m794220m828253m436115l416554L134689J1177165
53176D109495R479955k176097j0031149o139220J461734M075058M998208Q668650
53168A4446634R356683J843232o296573n358059J019226L212274J714198L090764
$$ plain form
53222 -4693603 1168437 -4204878 -17481777 -22148777 -11062493 485052 -6252909 -27314990
53214 -27314990 -39329907 -28397062 -6713008 3504953 -3320063 -13212078 -15212208
53207 -15212208 -16498532 -27913177 -41890019 -38853021 -16231935 3718061 2708955
53200 2708955 -9294292 -11164545 -3063052 -4315746 -20962222 -34228731 -27118771 -7292366
53192 -7292366 6455931 9114026 8461589 7140216 737046 -8498150 -10448775 -2237996
53184 -2237996 6502492 7272783 2478563 -2349690 -6785805 -10202359 -7067670 4109495
53176 4109495 13589450 11413353 1382204 -4757016 -3295282 779776 5777984 14446634
53168 14446634 23803317 25646549 19349976 13991917 15011143 18223417 19937615 23028379
53160B3028379N921840M503331J306495J264871r79607j1347187j8701320p604975
53152b608173J2913580J6828344K83173j1823014o296706j749173j2651665j9688075
53144b4791709j849555K1845841J6569482j1919036k2481285j933785J4761828
53137i798219J595053j6163155l906333K3939658K5043713l218238j9089282k378467
53129c975270J5826713O411836j0750992k863247J9018682J8174293o332557j8837322
53121A6672136o469255K692649r634867k1976726j2255788O480644J3066892J2421175
53113I96860J5946866J3295664n308499k0397634j1596644L445853l385284j8916406
53105b5919224q015068K3626706L3738089J1245201q265196l550297L006752o504033
$$ plain form
53160 23028379 28950219 33453550 34760045 36024916 35045309 23698122 4996802 -2608173
53152 -2608173 10305407 27133751 27416924 15593910 9297204 7548031 -5103634 -24791709
53144 -24791709 -26641264 -4795423 11774059 -144977 -22626262 -24560047 -9798219
53137 -9798219 -8203166 -24366321 -28272654 -4332996 20710717 17492479 -1596803 -3975270
53129 -3975270 11851443 18263279 7512287 4649040 23667722 41842015 35509458 16672136
53121 16672136 10202881 12895530 3260663 -18716063 -30971851 -24491207 -11424315 996860
53113 996860 16943726 30239390 24930891 4533257 -7063387 -3617534 -7002818 -25919224
53105 -25919224 -33934292 -10307586 23430503 34675704 26410508 22860211 25866963 19362930
53097A9362930j3280926k172732N901697p474490k1018208r297694J2223003J3766935
53089a989485L90635k784703L499499M15805q045343j867810J4040092J4555876
53081A8214566j707937r967237k462042J372175p062545j1611867m118543J406632
53073a5936798j125778K945936J6791202J7788249m059721k1428625r584524J2161100
53065b448959J0087135r490407j1025454J2081678K6866661J2336453j1035226
53058B7371881j5653719m594421K053179q36834m807536p885168j2742716j2849680
53050b9945014n58842J5124555J7893827Q860758K642055N93766r018161k2335333
53042a6742389j8578507L379778J5036442J621566j1347746J020612K0210895
$$ plain form
53097 19362930 6082004 3909272 9810969 2336479 -18681729 -27979423 -15756420 -1989485
53089 -1989485 -1598850 -4383553 -884054 -468249 -8513592 -10381402 3658690 18214566
53081 18214566 16506629 6539392 4077350 5449525 -1613020 -13224887 -17343430 -15936798
53073 -15936798 -17062576 -14116640 2674562 20462811 16403090 -5025535 -14610059 -2448959
53065 -2448959 7638176 -1852231 -12877685 -796007 26070654 38407107 27371881
53058 27371881 11718162 7123741 9176920 8340086 3532550 -4352618 -17095334 -29945014
53050 -29945014 -30503856 -15379301 2514526 11375284 14017339 14611105 5592944 -16742389
53042 -16742389 -35320896 -31941118 -16904676 -15283110 -26630856 -25610244 -5399349
53035e399349J4998125m585815m354076J4069895J5859157n423318j6068062j238051
53027G858506J0355762r52067j1755050o06409J1655035K81251j7041982j1050567
53019a1255521P047800O204251r790192j1427984L806263J0668359K919488m89123
53011b316659M748159K319117p751414n256810R907567J1325642q762695k3444810
53003a9231903j5129707k090503k622134m036092R174646K2783560J5630165m115555
52995C62477j2150689m506241K827006J179373m177950o926549l009730R890420
52987a6511883K2634203J7433253m782153j6417610k046662J3014409k91935k5022357
52979a1990735k0714156J1617412K6796170K982858k5614621j9678525J1302844
$$ plain form
53035 -5399349 9598776 5012961 658885 14728780 30587937 25164619 9096557 7858506
53027 7858506 18214268 17262201 5507151 4900742 16555777 16837028 -204954 -11255521
53019 -11255521 -4207721 1996530 -7793662 -19221646 -15415383 -4747024 -1827536 -2316659
53011 -2316659 2431500 4750617 -3000797 -8257607 1649960 12975602 4212907 -19231903
53003 -19231903 -34361610 -36452113 -39074247 -43110339 -33935693 -11152133 4478032 362477
52995 362477 -11788212 -16294453 -13467447 -12288074 -16466024 -23392573 -26402303 -16511883
52987 -16511883 6122320 23555573 18773420 2355810 309148 13323557 13031622 -11990735
52979 -11990735 -32704891 -21087479 5708691 8691549 -16923072 -36601597 -25298753
52972b5298753K8518935J7077049m143215j4255813j0004013J179696R971763
52965C045649Q921120J25855l910683K295040N283200p813123k3843254j7177315
52957c3073511J1262004K9441872J6488550q478606j3568310K744830J3964677
52950A8781506N486770p770758p118762L111831N110704n385357j4444272j0465805
52942a2694143J420840Q363273N931730K31859k088188o0948M174190Q253773
52934A3532386Q672464K511002o485810q480597p7323P397871R10960j3781400
52926D199553j5707439L022507K3034932K1051900L12873j4509600j0129103Q59483
52918A2135106Q69955q942750j3305912m648826Q320261J2664348N595033m729775
$$ plain form
52972 -25298753 3220182 20297231 16154016 1898203 -8105810 -6926114 3045649
52965 3045649 11966769 12092624 8181941 10476981 15760181 7947058 -15896196 -33073511
52957 -33073511 -21811507 7630365 24118915 15640309 2071999 4816829 18781506
52950 18781506 24268276 16497518 9378756 12490587 17601291 12215934 -2228338 -12694143
52942 -12694143 -11273303 -2910030 3021700 3253559 1165371 1104423 5278613 13532386
52934 13532386 22204850 24715852 18230042 9749445 9672122 17069993 17980953 4199553
52926 4199553 -11507886 -8485379 14549553 35601453 35914326 21404726 11275623 12135106
52918 12135106 13005061 4062311 -9243601 -13892427 -5572166 7092182 12687215 7957440
52910G957440r204856n554882K872799J1676063J5871444R919484n504175j8058245
52902I975072j4716550q9402P021381l13165p255268j593141O070063R72145q787604
52893h716469l623492J5484780K7241162K0509452M936021q471624j7650389j9577274
52885A0132167j0660532J77631p98294q236313l479173J1875600J3912501l930228
52877H993359j6795590p994339M516078P75535p299123N2259J3305849J0070194
52869E624222n567409j0397354n00082O369453K459813k392211l017395m488084
52861a1909047n798330j87877Q049710P737972J586280K369874Q683649N906653
52853A6438884p295636j4662825p621673M769125J3921019J9810000J8037575
$$ plain form
52910 7957440 -1247416 -6802298 -3929499 7746564 23618008 33537492 28033317 9975072
52902 9975072 -4741478 -4830880 2190501 1877336 -5377932 -6971073 -901010 71135 -8716469
52893 -8716469 -12339961 3144819 30385981 50895433 55831454 47359830 29709441 10132167
52885 10132167 -528365 -350734 -1149028 -9385341 -12864514 -988914 12923587 8993359
52877 8993359 -7802231 -15796570 -11280492 -10504957 -17804080 -17751821 -4445972 5624222
52869 5624222 56813 -10340541 -10840623 -4471170 -2011357 -4403568 -7420963 -11909047
52861 -11909047 -17707377 -17895254 -9845544 -2107572 -521292 1848582 10532231 16438884
52853 16438884 9143248 -5519577 -13141250 -8372125 5548894 25358894 43396469
52846D3396469Q15204k2563154k7467749o450344J7320905J9693485L872677j0547937
52838A8069556j2829245m964518P243672J5925813J3410895K191311n210953l206604
52830C0629927r63864o481042j2731337q801743K507227P887104J167847q914558
52822D299561q045393P997906K5513347K3911604n3232k3948463k4698653o997193
52814b020516N798553M647690J740942N344547P419422J830770k425997M053675
52806B6389086J5071134J7105508O321478q882650j6715303j1048769J953565
52799C0194049O687282m243717j7546588j5016360J430088J3787692J3872789
52792B9165235R331297N900052J540180k064003l73785J501041m341351j0299686
$$ plain form
52846 43396469 44211673 21648519 -5819230 -12269574 5051331 24744816 28617493 18069556
52838 18069556 5240311 275793 7519465 23445278 36856173 39047484 33836531 30629927
52830 30629927 29666063 23185021 10453684 1651941 4159168 12046272 13214119 4299561
52822 4299561 -3745832 4252074 29765421 53677025 53623793 29675330 4976677 -2020516
52814 -2020516 3778037 8425727 10166669 15511216 22930638 24761408 22335411 26389086
52806 26389086 41460220 58565728 64887206 56004556 39289253 28240484 30194049
52799 30194049 36881331 32637614 15091026 74666 1504754 15292446 29165235
52792 29165235 38496532 44396584 45936764 43872761 43498976 45000017 40658666 30358980
52784C0358980k883151J0627312R853723m047619r446221k340491j661278j0563971
52776A9897284p924642R846780J6027555O90321p530996Q345124J9570722R76375
52768E9898523k0750513r951298J5689360J4394962q779455j3856937K212882
52761C8857524K313942k1323249l0275814n905686J7931367J1011085o259473
52754F349696j455412J6442498J5926099n121279j9171051j1172795O006969J5001601
52746B2806326J2631941N616147J297269K475491L936389k207229j2816802j3701163
52738B0038369l6623J3275116J1349744K54558l502690K720682P039989K995119
52730E4134264k628158k199705K309896L796903l28504m650816k56778J5520196
$$ plain form
52784 30358980 27475829 38103141 47956864 43909245 34463024 32122533 30461255 19897284
52776 19897284 11972642 21819422 37846977 38537298 31006302 39351426 58922148 59898523
52768 59898523 39148010 29196712 44886072 59281034 50501579 36644642 38857524
52761 38857524 41171466 19848217 -10427597 -16333283 1598084 12609169 6349696
52754 6349696 4894284 21336782 37262881 32141602 12970551 1797756 7804725 22806326
52746 22806326 35438267 41054414 42351683 44827174 48763563 46556334 33739532 20038369
52738 20038369 20001746 33276862 44626606 44881164 41378474 44099156 51139145 54134264
52730 54134264 51506106 49306401 51616297 55413200 55084696 50433880 50177102 65697298
52722F5697298L2255898L3377695J3705095j2555951k4396008j3013893J1824879
52715A06895013L0628511L0456576J8712104J8287807L7197055M4051478n270422
52708B80958122j04793786j81760769j67393938p7342571M355782K2220057K711937
52701b21045166J061755K4069275L3868856J3694072o831545J546916K4955278
52694a28680559K9558241J0707944m594803O72664J2207684R758135l615929r376834
52686h3363457j071846R411054J0972377O862965N695822P169389M248543l109262
52678d3184415n050761L935023J4079501J1156458l738030j3945535q480809M727605
52670d0500963J0930856O508638r25922m153636j783791K543371J007734j1243414
$$ plain form
52722 65697298 97953196 131330891 145035986 132480035 108084027 95070134 106895013
52715 106895013 137523524 167980100 186692204 204980011 242177066 286228544 280958122
52708 280958122 176164336 -5596433 -172990371 -250332942 -245977160 -223757103 -221045166
52701 -221045166 -219983411 -195914136 -162045280 -148351208 -155182753 -153635837 -128680559
52694 -128680559 -99122318 -88414374 -93009177 -92336513 -80128829 -70370694 -73986623 -83363457
52686 -83363457 -84435303 -75024249 -64051872 -57188907 -51493085 -44323696 -40075153 -43184415
52678 -43184415 -48235176 -44300153 -30220652 -19064194 -22802224 -36747759 -45228568 -40500963
52670 -40500963 -29570107 -23061469 -23987391 -28141027 -29924818 -27381447 -26373713 -37617127
52662c7617127k4139375j8599321N960474K2728883J1860535q117007n713190
52655e3636128J4688676J8335902n249307k4562805j3539575J1463277J9985623
52648c2514337J0524213L149069M552340M230089k394270q178361q514175n280519
52640c4425951N37700O997620O605167l005008q924908J492345J8409332J8743899
52632F430196k338011k3232436k1739623J017088K4283735K7628628P330003j9933442
52624e53862l0448225j6622753N082667J4158826Q907106K658152L414222O721324
52616f682543M879810n097616j9028942k4993408j2321619J1608804K3339376
52609b8296138J2196404l897439m837705J842317l076246j4912631j1157948R665577
$$ plain form
52662 -37617127 -61756502 -80355823 -74395349 -51666466 -39805931 -47922938 -53636128
52655 -53636128 -38947452 -20611550 -25860857 -50423662 -63963237 -52499960 -32514337
52648 -32514337 -21990124 -18841055 -14288715 -10058626 -12452896 -20631257 -29145432 -34425951
52640 -34425951 -33888251 -26890631 -20285464 -23290472 -32215380 -30723035 -12313703 6430196
52632 6430196 4092185 -19140251 -40879874 -39862786 -15579051 12049577 19379580 -553862
52624 -553862 -31002087 -47624840 -42542173 -28383347 -19476241 -16818089 -13403867 -6682543
52616 -6682543 -1802733 -6900349 -25929291 -50922699 -63244318 -51635514 -28296138
52609 -28296138 -16099734 -19997173 -24834878 -22992561 -26068807 -40981438 -52139386 -42473809
52601d2473809K2389491J3480431N53393L083183J3610503J2579105j918404j4345618
52593F958275j3960239m347689N080066P823349L068725m014645o752887m796080
52585a0941125l801320n469248l849025M896002J4514882J5224846N221715p792249
52577H004478j4790162j3427622r123933q092923q716242l292282R295300J8723613
52569b1419773J7005408J0730688R998602J0462026Q032j7882743k3036633o120240
52561b0254633J5139125J6530198k857797k1150936k1527104j0313469m483522
52554d8918138p614649o726541O336386K0361363K0292149J0318493P034973J1847633
52546A2931669Q557303p772187j9340199j3159096j867023k235565q401264m456143
$$ plain form
52601 -42473809 -20084318 -6603887 -6050494 -2967311 10643192 23222297 21303893 6958275
52593 6958275 -7001964 -11349653 -6269587 1553762 4622487 607842 -6145045 -10941125
52585 -10941125 -14742445 -20211693 -24060718 -19164716 -4649834 10575012 15796727 8004478
52577 8004478 -6785684 -20213306 -29337239 -37430162 -46146404 -49438686 -40143386 -21419773
52569 -21419773 -4414365 6316323 16314925 26776951 26784983 8902240 -14134393 -20254633
52561 -20254633 -5115508 11414690 8556893 -12594043 -34121147 -44434616 -48918138
52554 -48918138 -56532787 -63259328 -56922942 -36561579 -16269430 -5950937 1084036 12931669
52546 12931669 21488972 13716785 -5623414 -18782510 -20649533 -22885098 -31286362 -35742505
52538c5742505Q222988J4982245J0264094r74310j4626064k3614132j4796553
52531e6284237J0868545K7918441J8426720O04980p03183L737769j0523499l0432550
52523c6387014k0314930J5164234L0555219R423868j1792334m703286J0761488
52516g292755R206145J508989M477927M773717j2269861k6695218j3687199J2677328
52508b7300927K1433634J2368236O269646L912670p582619j9722554j3181708
52501b3803622L464454L795315j0736266j2761446K917063J0824669k55760r832808
52493c6388401l293067N814375M676633L266052J1045326J6237087O390110r393390
52485a645275j5105154r257300R72208J1206839J4672328L363692j4135001j5506113
$$ plain form
52538 -35742505 -27519517 -12537272 -2273178 -3247488 -17873552 -41487684 -56284237
52531 -56284237 -45415692 -17497251 929469 1534449 831266 4569035 -5954464 -36387014
52523 -36387014 -56701944 -41537710 -10982491 -1558623 -13350957 -18054243 -7292755
52516 -7292755 1913390 3422379 7900306 12674023 404162 -26291056 -39978255 -27300927
52508 -27300927 -5867293 6500943 12770589 16683259 9100640 -10621914 -23803622
52501 -23803622 -20339168 -16543853 -27280119 -40041565 -37124502 -26299833 -26555593 -36388401
52493 -36388401 -39681468 -33867093 -29190460 -25924408 -14879082 1358005 7748115 -1645275
52485 -1645275 -16750429 -26007729 -25035521 -13828682 843646 4207338 -9927663 -25433776
52477b5433776J416340R190902p384571k2478579o942803K3797034L0332838P065998
52469I563383j2961533q200401P223667J2988201Q748693K421656m960337j1561950
52461C261379r336145K657662J2644028J2291654O469672Q95840n864169j1478028
52453A1541893o910223O260085J1502425J993796o131103M03910Q528435N3706
52445B7242924j6471316j8018945l549992N811268M98455o657550m565887K058717
52437a3652326O088685O844130K300785r413187j7711886q284386J1431901J6273732
52429f122552l36011j5299928j0271583M264537J1073728J0722258R208463K211194
52421E450106j0003084j1512705M399773J7017632P657274r396397j0660821j766968
$$ plain form
52477 -25433776 -24017436 -14826534 -22211105 -44689684 -51632487 -27835453 2497385 9563383
52469 9563383 -3398150 -11598551 -4374884 8613317 17362010 19783666 14823329 3261379
52461 3261379 -6074766 -3417104 9226924 21518578 27988250 28884090 23019921 11541893
52453 11541893 4631670 10891755 22394180 24387976 18256873 18660783 27189218 27242924
52445 27242924 10771608 -7247337 -10797329 -4986061 -4487606 -11145156 -15711043 -13652326
52437 -13652326 -7563641 -719511 1581274 -7831913 -25543799 -33828185 -22396284 -6122552
52429 -6122552 -6458563 -21758491 -32030074 -27765537 -16691809 -5969551 3238912 5450106
52421 5450106 -4552978 -16065683 -11665910 5351722 13008996 3612599 -7048222 -8815190
52413h815190k428975p648367Q83750J4118700N937898j7936285k2319293M24677
52405c7783085J5852239K792843j4558227r721502M584119M400180l052671M100863
52397c3385241K1497554K5730197J2804295O42958k724702p364498j6819114j8071261
52389a7689812k972271J5886271J9698043O271947q408409r234539J063357O086307
52381A0700894k342299j1781832o322638Q302088J0643951m950877j8868826j4032400
52373b8651939J557096R036288L439457n732893r625012o691757r07067R49870
52365c6625957l240558m837542L972553J3646828Q771150l900168j502905J6225203
52357g491396K1284161J989704j5289551q141334N443992n37392j4457923p442994
$$ plain form
52413 -8815190 -11244165 -18892532 -18008782 -3890082 2047816 -15888469 -38207762 -37783085
52405 -37783085 -21930846 -19138003 -33696230 -43417732 -38833613 -34433433 -37486104 -33385241
52397 -33385241 -11887687 13842510 26646805 27289763 24565061 17200563 381449 -17689812
52389 -17689812 -20662083 -4775812 14922231 21194178 12785769 3551230 4614587 10700894
52381 10700894 8358595 -3423237 -9745875 -1443787 9200164 4249287 -14619539 -28651939
52373 -28651939 -27094843 -18058555 -14619098 -20351991 -29977003 -36668760 -37575827 -36625957
52365 -36625957 -39866515 -44704057 -40731504 -27084676 -18313526 -22213694 -23716599 -7491396
52357 -7491396 13792765 15782469 492918 -7648416 -2204424 -2741816 -17199739 -24642733
52349b4642733J5986574K4047341P606043j0515529j4370501j0874549n958844
52342a8722198L771412J1018075J31220k1814802k5061733r21116K0686916J3853461
52334a7058765o092100q585865O569037J3684992J948057j1820253j0063646M544540
52326b6874003J8489719K4093566K0737789Q543111j0515412k7467371k9841382
52319b2833983j3924496R001660K2552282K0613989R522041k537019j1239927
52312A1154547j2869136o309658j47225n267440j5817248j1808234J1047169K9255276
52304g61949K2136158P25209j0045021n908009q64154k08761J799440L200509
52296A0073422l693960j3584071j3128267m233522j443958n748561k846427R759733
$$ plain form
52349 -24642733 -8656159 15391182 22997225 12481696 -1888805 -12763354 -18722198
52342 -18722198 -14950786 -3932711 -3801491 -25616293 -50678026 -51599142 -30912226 -17058765
52334 -17058765 -23150865 -31736730 -25167693 -11482701 -9534644 -21354897 -31418543 -26874003
52326 -26874003 -8384284 15709282 36447071 44990182 34474770 7007399 -22833983
52319 -22833983 -36758479 -27756819 -5204537 15409452 24931493 22394474 11154547
52312 11154547 -1714589 -8024247 -8171472 -13438912 -29256160 -41064394 -30017225 -761949
52304 -761949 21374209 22099418 12054397 6146388 5282234 5073473 6872913 10073422
52296 10073422 6379462 -7204609 -20332876 -24566398 -26010356 -31758917 -34605344 -24845611
52288b4845611J5706926N646172q776870j3184334o449728N861127J7602139J8803909
52280A0363730M325897j1779833j0237773L150734M275201r163951j2265743M245905
52272a7085833J6355649O982103n813720k025767O135172L7911q838251k30505
52264d483241J4381632Q207078j3402461j8202901J735703J8073467J0778905
52257A7088182m920041o577930L958075J0065171M879400n638415j3088198j1567138
52249e800894r69411R398655Q804475n91876o423896m085534j098787k460173
52241c227441m018133k943139k461919k810434P72707P710486J1308130J0890037
52233A5220294J2027182J2313204K289741j4799674k1134527j0432223M43589
$$ plain form
52288 -24845611 -9138685 -3492513 -12269383 -25453717 -31903445 -26042318 -8440179 10363730
52280 10363730 14689627 2909794 -7327979 -4177245 97956 -9065995 -21331738 -17085833
52272 -17085833 -730184 6251919 438199 -1587568 4547604 4585515 -4252736 -4483241
52264 -4483241 9898391 18105469 4703008 -13499893 -11764190 6309277 17088182
52257 17088182 12168141 5590211 9548286 19613457 24492857 18854442 5766244 -5800894
52249 -5800894 -6770305 2628350 11432825 10840949 4417053 331519 -767268 -3227441
52241 -3227441 -7245574 -10188713 -12650632 -15461066 -14688359 -6977873 4330257 15220294
52233 15220294 27247476 39560680 41850421 27050747 5916220 -4516003 -4072414
52226d072414l066927j1777041j0484325k715399p69602k817062N97808N549535
52218b9555427J242718p102237l720058R663645J2821211j373348j3355116l724859
52210c5103471J9860740L2148781J8997227q873602k5570127j3693126J4512320
52203B278742K4869825K770096k1518853j1537739J7884459J6733535k1828386
52196I651679m1842788o472151M0105485L3325998j6485142m0607225j2703309
52189c5027453K1133355J8429276m490879j2579725m845594J161200N665414J5400894
52181D846488J8304894J720015j8792020j8961324l665219L316121j088905J14538
52173a4205412Q416357O879919n206561o226411R938324J8425600J975394j8041342
$$ plain form
52226 -4072414 -7139341 -18916382 -29400707 -32116106 -32885708 -35702770 -35104962 -29555427
52218 -29555427 -28312709 -35414946 -39135004 -29471359 -16650148 -18023496 -31378612 -35103471
52210 -35103471 -15242731 16906050 35903277 27029675 1459548 -12233578 2278742
52203 2278742 27148567 29918663 8399810 -3137929 14746530 31480065 9651679
52196 9651679 -32191109 -38663260 1442225 34768223 18283081 -22324144 -35027453
52189 -35027453 -13894098 4535178 44299 -12535426 -17381020 -16219820 -10554406 4846488
52181 4846488 23151382 24871397 6079377 -12881947 -16547166 -13231045 -14319950 -14205412
52173 -14205412 -5789055 1090864 -4115697 -10342108 -403784 18021816 19997210 1955868
52165A955868j1601720J3440440K0705247k372310k6316914k1041253L526035
52158b1704607J4112400J459274j0134794k257547J0345581N781292q300273p272506
52150a7971180Q800037J3884231j636333j5494442j0314320P48236J193686l94184
52142b1184269R042766J8594316J1679710k935638o088829j449334m480679q989645
52134e811602K404508K1005693K0570937J518464r278548m893690o817532k0165336
52126a467106k0234357J407358J5773994L453961j1969208n170741P338699r63336
52118a1830736j6456294p517654J8724546K4902876M134698r357048M098924K0306081
52110B7005393J1835009j0999988j9522318p956643N170496O476209L95739l668474
$$ plain form
52165 1955868 -9645852 3794588 24499835 22127525 -4189389 -25230642 -21704607
52158 -21704607 -7592207 -6132933 -16267727 -18525274 -8179693 -2398401 -10698674 -17971180
52150 -17971180 -9171143 4713088 3076755 -12417687 -22732007 -21983771 -20790085 -21184269
52142 -21184269 -12141503 6452813 18132523 15196885 9108056 7658722 3178043 -5811602
52134 -5811602 -3407094 17598599 38169536 39688000 30409452 25515762 18698230 -1467106
52126 -1467106 -21701463 -20294105 -4520111 -1066150 -13035358 -18206099 -10867400 -11830736
52118 -11830736 -28287030 -35804684 -17080138 7822738 11957436 2600388 6699312 27005393
52110 27005393 38840402 27840414 8318096 361453 5531949 12008158 12403897 8735423
52102H735423k697451J544957N812060N627956j209244r490110r996424j201594
52094b874427O087901J160785j0711280j2574192Q33754J2678493N840109j1551493
52086a1110350j5991054j517895J3408833J4116171P606373N131432L537854l580734
52078A1600630r539112n331360K072260p07494j0196740r570492M760363J5846471
52070a065474R654955o235626j4000382q162796K42393o28010r089708j2819783
52062d2104431m448027R120631J5666634J2830941Q047180N122201O13799n027952
52054a79024m383359K993533M410459q320094k2665123j8636835M645399K6149408
52046a5985636K7106640J0558442n074603p480991k361367l148250j0559265r528700
$$ plain form
52102 8735423 6037972 7582929 13394989 19022945 17813701 8323591 -1672833 -2874427
52094 -2874427 3213474 4374259 -6337021 -18911213 -18077459 -5398966 441143 -11110350
52086 -11110350 -27101404 -28619299 -15210466 -1094295 6512078 11643510 15181364 11600630
52078 11600630 2061518 -3269842 -1197582 -1905076 -12101816 -21672308 -16911945 -1065474
52070 -1065474 8589481 2353855 -11646527 -19809323 -19566930 -20194940 -29284648 -42104431
52062 -42104431 -46552458 -37431827 -21765193 -8934252 -887072 4235129 4848928 -179024
52054 -179024 -4562383 -1568850 2841609 -5478485 -28143608 -46780443 -42135044 -15985636
52046 -15985636 11121004 21679446 16604843 9123852 6762485 3614235 -6945030 -16473730
52038a6473730P719163K3665993J4724127j4300867l2352176k1596309K168667
52031c6445132J4517879J1162128K856336k835214l254734K904089R648669O002418
52023D556439n982637r258421J653372Q357728l002579j7434672j3492861L869765
52015c0733866J3252229Q741676J248388l212463o150598m932725K000917N326240
52007a4460202j487439p548872k349615L468288k603306p869956N620680K5189899
51999b040523K4020154O045029j397314L924223k462414k2408445k6217168m117126
51991b4653584J3275334M156718j0259568l631358J3827463J7619435Q324345
51984A8658785J752332q63123o655666j0389655m231079M184989M795306L780453
$$ plain form
52038 -16473730 -8754567 14911426 29635553 15334686 -17017490 -38613799 -36445132
52031 -36445132 -21927253 -10765125 -7908789 -10744003 -13998737 -11094648 -1445979 4556439
52023 4556439 -1426198 -10684619 -9031247 -673519 -3676098 -21110770 -34603631 -30733866
52015 -30733866 -17481637 -8739961 -7491573 -10704036 -16854634 -21787359 -19786442 -14460202
52007 -14460202 -15947641 -23496513 -25846128 -22377840 -24981146 -32851102 -27230422 -2040523
51999 -2040523 21979631 28024660 26627346 30551569 28089155 5680710 -20536458 -24653584
51991 -24653584 -11378250 -7221532 -17481100 -21112458 -7284995 10334440 18658785
51984 18658785 20411117 19547994 12892328 2502673 -1728406 2456583 7251889 11032342
51976A1032342R164467J1299937q06302j6170526j7078111o842715o67572M17748
51968i650732L945041M905296m936810j4739416p421442J0128877J4699768J731578
51960a337840j1068224j2856696q974215k744835Q033828J6248217J0727896k181638
51952d153507n023761J708775J077770p834300o102345J0069324J8112524M548258
51944A2402738j2911543j3456354k212107M827640O288648Q556277R063343L996555
51936A6555197j0890J955923J360712p685830j3359436m572902P586553O354341
51928H183668l295340n104929n66175l298978r940849l702065J2680357J5040166
51920I995855m285609k1548924j6393939o9872O622470N340106J0214532J8491347
$$ plain form
51976 11032342 20196809 31496746 30690444 14519918 -2558193 -9400908 -10068480 -9650732
51968 -9650732 -5705691 -800395 -5737205 -20476621 -27898063 -17769186 -3069418 -1337840
51960 -1337840 -12406064 -25262760 -34236975 -36981810 -28947982 -12699765 -1971869 -4153507
51952 -4153507 -9177268 -7468493 -6390723 -14225023 -20327368 -10258044 7854480 12402738
51944 12402738 -508805 -13965159 -16177266 -11349626 -5060978 3495299 12558642 16555197
51936 16555197 16544307 18500230 19860942 12175112 -1184324 -5757226 1829327 8183668
51928 8183668 4888328 -216601 -782776 -4081754 -14022603 -17724668 -5044311 9995855
51920 9995855 5710246 -15838678 -32232617 -32302489 -25680019 -20339913 -10125381 8365966
51912H365966J4248118k986750j5029694j2228137n439673n345992n736778K796836
51904b1356104J4159598J4503423L043601p039426p159332k400654q01003k364662
51896i414559k405185K52716K737828K430357j010994n268283o090917k391091
51888b1160128n42467o654130j3625060o506992J4105592K6354368J5648373k365807
51880E253749l811354P018781N747279j0281719j5542330J282829J5590685M493867
51872I751787j6050673j5768953L233577J2152738J003695r917304m768194P424335
51864a2938992J2749767J0709023M793767n419832j3800664q201999P759912J1851266
51856G502248m530549j8914982r411829J1839690J7343212M398330o327477m877206
$$ plain form
51912 8365966 22614084 19627334 4597640 -7630497 -13070170 -18416162 -24152940 -21356104
51904 -21356104 -7196506 7306917 10350518 3311092 -3848240 -6248894 -7049897 -9414559
51896 -9414559 -11819744 -11567028 -8829200 -6398843 -7409837 -12678120 -18769037 -21160128
51888 -21160128 -21702595 -28356725 -41981785 -48488777 -34383185 -8028817 7619556 5253749
51880 5253749 1442395 8461176 14208455 3926736 -11615594 -10332765 5257920 9751787
51872 9751787 -6298886 -22067839 -18834262 -6681524 -5677829 -15595133 -20363327 -12938992
51864 -12938992 -189225 10519798 15313565 9893733 -3906931 -12108930 -4349018 7502248
51856 7502248 2971699 -15943283 -25355112 -13515422 3827790 8226120 1898643 -2978563
51848b978563p16400k42065R67169K373121k988428j0445060n194335J1749359
51840g475202J9212648O892677p778021o286605L785264M269919l331758k331999
51832F956923R810314J5299519J404581k0722426k8390169j3377609Q616843J4770748
51824e631276O95328j4498006j2433736J396084Q913793P782818J0369351J5835373
51816A2429729P800936j2778674j8879426J606744K0469619R638798j3193560
51809G094166j1780325R465218J2355624j2115895k8774940j4644560P791060
51802c0609652J1175150M017082O243126J0895214R59977j3598681r010689J0768684
51794i159789J7810574M025708q314239l927208M402013J503113o038179n190167
$$ plain form
51848 -2978563 -3694963 -3937028 -2969859 -596738 -3585166 -14030226 -19224561 -7475202
51840 -7475202 11737446 18630123 10852102 4565497 8350761 12620680 9288922 6956923
51832 6956923 16767237 32066756 33471337 12748911 -15641258 -29018867 -20402024 -5631276
51824 -5631276 -4935948 -19433954 -31867690 -30471606 -21557813 -13774995 -3405644 12429729
51816 12429729 20230665 7451991 -11427435 -9820691 10648928 20287726 7094166
51809 7094166 -4686159 4779059 17134683 5018788 -23756152 -38400712 -30609652
51802 -30609652 -19434502 -15417420 -9174294 1720920 2680897 -10917784 -19928473 -9159789
51794 -9159789 8650785 12676493 4362254 435046 4837059 6340172 301993 -4888174
51786d888174Q19666P16479m675704n437488M35019N834307O808533N126297P80484
51777E519419p857181j6251755j4719152j18142J7811438K4186261J2563726q006430
51769A3128184j9390202j1852716L745459P226535n165381j5134345q284620M760968
51761c0966118M988157n537988p749915L876756J3736711J0478690J559330l806386
51753a3420763q244511j2993191q868792N278190J1531777q16274j2197469K25713
51745c9505320K2984373K2634671k390884j8215208p581321O933538L540255n584665
51737a7184561j466514P199827K601000p958621m823842R017904J4121860Q645069
51729A0152122Q201645J4565192J1911845m058477j8066099k0233086j6842994
$$ plain form
51786 -4888174 -4068508 -3352029 -8027733 -13465221 -13030202 -7195895 -387362 4738935 5519419
51777 5519419 -2337762 -18589517 -33308669 -33426811 -15615373 8570888 21134614 13128184
51769 13128184 -6262018 -18114734 -14369275 -7142740 -12308121 -27442466 -35727086 -30966118
51761 -30966118 -25977961 -31515949 -39265864 -35389108 -21652397 -11173707 -9614377 -13420763
51753 -13420763 -21665274 -34658465 -43527257 -38249067 -26717290 -27533564 -39731033 -39505320
51745 -39505320 -16520947 6113724 3722840 -14492368 -22073689 -15140151 -11599896 -17184561
51737 -17184561 -18651075 -11451248 -8850248 -16808869 -21632711 -12614807 1507053 10152122
51729 10152122 18353767 32918959 44830804 40772327 22706228 2473142 -14369852
51722a4369852j2213571k412749P518387L491982j1863359j6014664l73849J4418616
51714c1819059J0891436J109797K783174Q522451J917998j0081566o966482J0318225
51706a3324026J9316864R745485m622528r582364p115281m482648k798952j896959
51698a4760409l712044n449583j33756J1018045J6305885Q874143l586264r483865
51690i27848p076229k846552j614792k909147l488689k13693O494089J0362238
51682b220623M800941o792429j0910136J104355J9909232K5204880P763718j8419134
51674B0440804k9887968j9642046m307264k405114j1355930j3755281k302641
51667f3215440J2958627K1342365K2096317J6097663J920317j3495676j5127074
$$ plain form
51722 -14369852 -26583423 -28996172 -21477785 -17985803 -29849162 -45863826 -46237675 -31819059
51714 -31819059 -20927623 -19817826 -17034652 -8512201 -6594203 -16675769 -23642251 -13324026
51706 -13324026 5992838 15738323 11115795 1533431 -5581850 -10064498 -12863450 -14760409
51698 -14760409 -18472453 -23922036 -24055792 -13037747 3268138 12142281 8556017 -927848
51690 -927848 -8004077 -10850629 -12465421 -15374568 -18863257 -19076950 -12582861 -2220623
51682 -2220623 2580318 -4212111 -15122247 -14017892 5891340 31096220 38859938 20440804
51674 20440804 -9447164 -29089210 -33396474 -35801588 -47157518 -60912799 -63215440
51667 -63215440 -50256813 -28914448 -6818131 9279532 11199849 -2295827 -17422901
51660a7422901j003708J0202991M995324m417578q58733Q529895M253194j1368117
51652g089633j5087560K090594K1103633K0872854K742953j6067127k1637012
51645a3071298j2390601J538854O628858J327938k47444J0499014J9515674R794574
51637B3595569r406344j4316620l158616L752945q12022l262431O45870k159866
51629e121515j1984836r132036R887040J9007431L617172j3785701j1053964j633544
51621b0199953n317648j0325891J858302J6253641Q157889r500089n806748J1622338
51613a3258159P038089j8787245k4308558L699482K5366888J1553492j0740952
51606a9436963n139401J6861667J9660010Q3571j5285693j4445291q829208o005406
$$ plain form
51660 -17422901 -18426609 -8223618 -3228294 -7645872 -8504605 25290 4278484 -7089633
51652 -7089633 -22177193 -20086599 1017034 21889888 24632841 8565714 -13071298
51645 -13071298 -25461899 -23923045 -17294187 -15966249 -16213693 -5714679 13800995 23595569
51637 23595569 14189225 -127395 -3286011 466934 -345088 -3607519 -2961649 -5121515
51629 -5121515 -17106351 -26238387 -16351347 2656084 6273256 -7512445 -18566409 -20199953
51621 -20199953 -25517601 -35843492 -33985190 -17731549 -9573660 -19073749 -24880497 -13258159
51613 -13258159 -6220070 -25007315 -49315873 -45616391 -20249503 -8696011 -19436963
51606 -19436963 -24576364 -7714697 11945313 12028884 -3256809 -17702100 -26531308 -32536714
51598c2536714k175127K130493K601210L910347J1495454J5779578N396737r345460
51590b743482q896975L440277O021502n561940j2736645o740493j658408o481205
51582c5357369p609293P057912K4679370K4662030Q129382n214709l799079M790563
51574A7338807P192778k98942j0106432j3456075j1216437j1928293j6375361
51567c8849955j1940896P550535K4548331J8100750k665056q147665P180384J5679129
51559A1455557M84852j7771990j4321548K786209J0517976O919395M718090L597877
51551H386418l860054q760333K610875J9220856J6348093m921206j7671430j0570013
51543G83206j096741k224549l987161K256341P265872M080701J510379M445032
$$ plain form
51598 -32536714 -34711841 -32581348 -29980138 -26069791 -14574337 1205241 6601978 -2743482
51590 -2743482 -11640457 -8200180 -2178678 -7740618 -20477263 -27217756 -28876164 -35357369
51582 -35357369 -42966662 -35908750 -11229380 13432650 21562032 16347323 12548244 17338807
51574 17338807 24531585 24232643 14126211 670136 -10546301 -22474594 -38849955
51567 -38849955 -50790851 -43240316 -18691985 -591235 -3256291 -11403956 -4223572 11455557
51559 11455557 11940409 -5831581 -20153129 -17366920 -6848944 70451 4788541 8386418
51551 8386418 4526364 -4233969 -1623094 17597762 33945855 29024649 11353219 783206
51543 783206 -313535 -2538084 -6525245 -4268904 2996968 7077669 8588048 13033080
51535A3033080K994895n228044n431022O013683Q530699p237219j6686602m42603
51527d453133J7947402P471650j6817945j6531451N944407J1967930o839551j4656891
51519a5967582O240821K4667557J2409795j1704648j6820204p891495o877922
51512a5943678r999903J073061J9961782K2427536O481250n154658j448240M700086
51504B2097236J676652o814183j5176904k2411520k2795265j0019666O705764
51497d6737886J0381973K960441L517845J5377041J8280593K592758j1817899
51490e445134o076167P867585P325123n644036j0563371j739044O657473N481769
51482b135802P63034j482245l185611m312792m20551N614462L422696p353806
$$ plain form
51535 13033080 16027975 10799931 5368909 11382592 19913291 12676072 -4010530 -4453133
51527 -4453133 13494269 20965919 4147974 -12383477 -6439070 5528860 -1310691 -15967582
51519 -15967582 -9726761 14940796 27350591 15645943 -1174261 -9065756 -15943678
51512 -15943678 -25943581 -24870520 -4908738 17518798 24000048 18845390 17397150 22097236
51504 22097236 23773888 16959705 1782801 -20628719 -43423984 -53443650 -46737886
51497 -46737886 -36355913 -33395472 -29877627 -14500586 3780007 6372765 -5445134
51490 -5445134 -11521301 -3653716 3671407 -1972629 -12536000 -14275044 -7617571 -2135802
51482 -2135802 -1372768 -2855013 -6040624 -10353416 -10773967 -5159505 -1736809 -9090615
51474i090615j2220732k692614R157625P790749k551832m806810M983680J2885024
51466C454475Q831947j92919l915134m473321q956293j3505317p305809Q772075
51458a7290296J9286227J3538750r86644r976651j0390869j0020700j3012789
51451b8852972j4151765p725821L746606J1446414Q658403k600136j1967727r789954
51443e1236952K216984J2109101J1611316M809823K23768k048J892210N704722
51435a2671076J0364673J0149951K566645m749714m389957j223887l061356n163790
51427h178511J339901J0318695Q307574l92453K301638J6330863J8715864m47341
51419D8296230j9232929j5267082K681177J1348587N768841l053429j0126089
$$ plain form
51474 -9090615 -21311347 -24003961 -14846336 -7055587 -9607419 -14414229 -9430549 3454475
51466 3454475 12286422 12093503 8178369 3705048 -5251245 -18756562 -26062371 -17290296
51458 -17290296 1995931 15534681 14548037 4571386 -5819483 -15840183 -28852972
51451 -28852972 -43004737 -50730558 -46983952 -35537538 -26879135 -29479271 -41446998 -51236952
51443 -51236952 -49019968 -36910867 -25299551 -20489728 -20265960 -20268008 -18375798 -12671076
51435 -12671076 -2306403 7843548 10410193 5660479 1270522 46635 -3014721 -8178511
51427 -8178511 -6838610 3480085 11787659 11395206 13696844 30027707 48743571 48296230
51419 48296230 29063301 13796219 16477396 27825983 33594824 30541395 20415306
51412B0415306j5733426j2949310K236573J4958485P632531j1582219j7943938
51405a2965998o064046N111100M235570K136811Q629812J4671192P991580p136229
51397A6609792j5973030j1252198J026460Q050816J251997j2615367j4572322
51390b7473852K629678J9579976J4275939n059896j2230793m285402l254896j4401108
51382c0220354j4108981Q588695K8227311K0592433n77978q641800n032805p143944
51374h317423j1565180k078140J4232106J2832479o701153j6686970m395865R642769
51366a3037377O543553l500158l506730K230577J359485j351043O081457J7011220
51358A1830984J2830002o403328j8474280j0373097L475696L012414r407980j4809027
$$ plain form
51412 20415306 4681880 -8267430 -6030857 8927628 16560159 4977940 -12965998
51405 -12965998 -19030044 -13918944 -9683374 -7546563 1083249 15754441 23746021 16609792
51397 16609792 636762 -10615436 -9588976 -1538160 -286163 -12901530 -27473852
51390 -27473852 -24844174 -5264198 9011741 3951845 -8278948 -12564350 -15819246 -30220354
51382 -30220354 -44329335 -35740640 -7513329 13079104 12501126 3859326 -1173479 -8317423
51374 -8317423 -19882603 -21960743 -7728637 5103842 -1597311 -18284281 -22680146 -13037377
51366 -13037377 -6493824 -9993982 -13500712 -11270135 -9910650 -11261693 -5180236 11830984
51358 11830984 24660986 18257658 -216622 -10589719 -7114023 -4101609 -13509589 -28318616
51350b8318616n479504O125325O991067P13468q85961L904139N624832j038102
51342a2363352r419879j0447220m001026K842841N014397K956264p74843m201313
51334c0394131n201315j276415P571997J5811055J5073080L514927q514278q231729
51326a1646809K622201Q316354J033514p120687l078043N401166J779215j0744244
51318a3437333j1641701M822736J8487295J1197360r070032k0964173j5360524
51311c5966372L69210J4223543J7618245R436712j185661k887539L287898N785808
51303A0681844R48243k743902j592152k398596o107837l245767O113673O586570
51295H242076o527625j4293669k606265J3988280J5193946N591048J617932K368277
$$ plain form
51350 -28318616 -33798120 -27672795 -20681728 -19968260 -20854221 -16950082 -11325250 -12363352
51342 -12363352 -21783231 -32230451 -36231477 -33388636 -28374239 -25417975 -26192818 -30394131
51334 -30394131 -35595446 -36871861 -29299864 -13488809 1584271 5099198 -3415080 -11646809
51326 -11646809 -9024608 -708254 325260 -6795427 -9873470 -4472304 -2693089 -13437333
51318 -13437333 -25079034 -20256298 -1769003 9428357 358325 -20605848 -35966372
51311 -35966372 -35597162 -21373619 -3755374 5681338 4495677 1608138 4896036 10681844
51303 10681844 11630087 8886185 7294033 4895437 -1212400 -4458167 1655506 8242076
51295 8242076 1714451 -12579218 -15185483 -1197203 13996743 19587791 21205723 23574000
51287B3574000k999108r910708n711448M680899M827757n560905j1054165n538442
51279g692120K684392O689526M101306q080402k3277252k1140267M091355K4426713
51271a8196749J4929250m775059p48673J6748706R868895j7687927k0949603J0126914
51263a0684246K8966592O846483k0874976j3483915J2300363J5821923l638207
51256A5254017j6788606j5050207j1776556q501167K758270J3359456P686944
51249a3057849p228208j0505444k43446P950374Q504300P243560K665644q809224
51241a3480293j5597098m487519J4207165J9682541J2481793P956198N480123
51234B6242910o483740j9790238j3841056O379542J2100413m525605j8208628
$$ plain form
51287 23574000 20574892 10664184 4952736 9633635 14461392 8900487 -2153678 -7692120
51279 -7692120 -5007728 1681798 5783104 -2297298 -25574550 -46714817 -42623462 -18196749
51271 -18196749 -3267499 -8042558 -8791231 7957475 17826370 138443 -20811160 -10684246
51263 -10684246 18282346 25128829 4253853 -9230062 3070301 18892224 15254017
51256 15254017 -1534589 -16584796 -28361352 -36862519 -34104249 -20744793 -13057849
51249 -13057849 -20286057 -30791501 -31034947 -23084573 -14580273 -7336713 -4671069 -13480293
51241 -13480293 -29077391 -33564910 -19357745 324796 12806589 20762787 26242910
51234 26242910 19759170 -31068 -13872124 -7492582 4607831 82226 -18126402
51227a8126402j1034343L558088Q047161N716774N293228L934751n38128o18466
51219c767337M587160L018187q122752j3410015n428590Q05411m726299o643498
51211c3687733Q304631K2871002J4436186n778921q007060Q971418J6446872J496585
51203B5052980j4951161j2948166j323499K113726j496574m49133M541344L785780
51195D325297k036701l394338l16013k716972j0701452j0485492L430551J5713419
51187f181701J0923542l001367o039418M591792J2193322O900227j828135k871550
51179A4686712R46418J988706K13613k219992p998876j6470711j8016065p585622
51171c4455817M487652O728888L537889N167059Q529366L596280o467490q734931
$$ plain form
51227 -18126402 -29160745 -25602657 -17555496 -11838722 -6545494 -2610743 -3148871 -3767337
51219 -3767337 819823 3838010 -4284742 -17694757 -23123347 -22317936 -27044235 -33687733
51211 -33687733 -25383102 -2512100 11924086 6145165 -1861895 7109523 23556395 25052980
51203 25052980 10101819 -2846347 -4169846 -2056120 -3552694 -4001827 539517 4325297
51195 4325297 2288596 -1105742 -1421755 -4138727 -14840179 -25325671 -21895120 -6181701
51187 -6181701 4741841 1740474 -4298944 292848 12486170 19386397 17558262 14686712
51179 14686712 15633130 17621836 17835449 15615457 7616581 -8854130 -26870195 -34455817
51171 -34455817 -29968165 -23239277 -19701388 -14534329 -6004963 -2408683 -8876173 -17611104
51163a7611104j951652K213222o19084k193276J807366N229318M610200M537658
51155c977352O044135L416829k957713m192076J190113K455124n142570j0318243
51147a3481753l258625P816526Q696923L2930n224252r63148N654450N761953
51139E035004p08380o982730p819004m179478R3209M468971J0315983J3205124
51131A3428699N753102p126579q102946O554367J4438654j213918j9923441j1248647
51123g440709J4120668J5862541j1674947k6771122o150438J6326811M305413
51116a421783k1400906j6444726J5851011L0856313J1188729j3700128j7198565
51109a2270055o095311N342215J6433755K3099246J1482641j4723800k7342025
$$ plain form
51163 -17611104 -19562756 -17349534 -17968618 -20161894 -18354528 -13125210 -8515010 -3977352
51155 -3977352 2066783 5483612 2525899 -1666177 -476064 1979060 -3163510 -13481753
51147 -13481753 -16740378 -8923852 -226929 -193999 -5418251 -6381399 -726949 5035004
51139 5035004 4326624 -2656106 -10475110 -14654588 -14561379 -10092408 223575 13428699
51131 13428699 19181801 12055222 3952276 10506643 24945297 23731379 3807938 -7440709
51123 -7440709 6679959 22542500 10867553 -15903569 -22054007 -5727196 -1421783
51116 -1421783 -22822689 -39267415 -23416404 7439909 18628638 4928510 -12270055
51109 -12270055 -18365366 -13023151 3410604 26509850 37992491 23268691 -4073334
51102d073334j2792589N414103L487997o019426M33254J4827150J1719334o617531
51094F378958j2964375r4160R931400N361227K336883J1935205J7803157M551773
51086D5240068j3683009j5009549m374822k521100j0258007q949647O357912J8056482
51078A4858328J2961692j525084j2902885j7804293j5111645k089587J3893498
51071g719976J5361982j828258j7330565j1367733Q594705J9293746J2206476
51064A7210377q95849p511721n750124J164442Q983005J1504773N750734k374537
51056B8081100n627385o026678r252457j2485049q952051j591818M12060k678078
51048a8120356k163486K539105K723160k067272m56789J0858997J7439487O995691
$$ plain form
51102 -4073334 -16865923 -11451820 -7963823 -13983249 -13549995 1277155 12996489 6378958
51094 6378958 -6585417 -6679577 3251823 8613050 10949933 22885138 40688295 45240068
51086 45240068 31557059 16547510 12172688 9651588 -606419 -9556066 -3198154 14858328
51078 14858328 27820020 26294936 13392051 -4412242 -19523887 -21613474 -7719976
51071 -7719976 7642006 5813748 -11516817 -22884550 -14289845 5003901 17210377
51064 17210377 16314528 8802807 3052683 4217125 13200130 24704903 30455637 28081100
51056 28081100 22453715 16427037 7174580 -5310469 -14262520 -15854338 -15442278 -18120356
51048 -18120356 -20283842 -17744737 -15021577 -17088849 -17545638 -6686641 10752846 17748537
51040A7748537j1090109j7409095p977955K808497K755030l973318n047206L657868
51032a8527751J3926323J6071139J0053977K993487k150366q949098j7196490
51025c778779j8251093o620708R665496J7358345J2401065O3797j3350092k1495437
51017b4007406j7652397l445934P864945P243723K843614N857834J1350587Q145326
51009a799708M33364P34524O155540L052277o213990m319813J0512048J7871720
51001B6425962N804697j2116706j8601019j3437970m323830N474810J1413389
50994F39333O559601m562002p220018L2745R35136j0008511j4613653j37440J7484311
50985a0890498J6654416J363007q211620m515244M387028J0520754R936943M04788
$$ plain form
51040 17748537 6658428 -10750667 -18728622 -15920125 -13165095 -17138413 -22185619 -18527751
51032 -18527751 -4601428 11469711 21523688 24517175 22366809 13417711 -3778779
51025 -3778779 -22029872 -28650580 -18985084 -1626739 10774326 10838123 -2511969 -24007406
51017 -24007406 -41659803 -45105737 -37240792 -29997069 -27153455 -21295621 -9945034 -1799708
51009 -1799708 -1366344 -631820 5523720 8575997 2362007 -1957806 8554242 26425962
51001 26425962 32230659 20113953 1512934 -11925036 -16248866 -10774056 639333
50994 639333 7198934 2636932 -4583086 -4550341 -3615205 -13623716 -28237369 -28374809 -10890498
50985 -10890498 5763918 7126925 -1084695 -5599939 -1212911 9307843 19244786 19649574
50977A9649574j1911975j3537787k720731M799376k6804m901662J340460Q966295
50969A656746O399520J430192L955186M699300o309000j6026246q696233M106599
50961h783936J712136q996611n575379R717076J3931065L607480j700117L859486
50953G771200M318914n217879p989836L522337J2532481M777721j0629506j7159978
50945h074546j0749887K800265J4432617J2594526n645032k2989903j9933398
50938c7565358l633178K888399j614671K669379J7316430J9588354L182634q232936
50930e400947j678625L449278o658242j1573121P946231L1228213K5515486l927099
50922C8901174k2397831j5338601j332559P49974o305256r638988k891995R603224
$$ plain form
50977 19649574 7737599 -5800188 -8520919 -3721543 -3748347 -8650009 -7309549 1656746
50969 1656746 8056266 9486458 13441644 18140944 11831944 -4194302 -12890535 -8783936
50961 -8783936 -7071800 -16068411 -21643790 -11926714 2004351 5611831 3911714 7771200
50953 7771200 12090114 6872235 -1117601 2404736 14937217 19714938 9085432 -8074546
50945 -8074546 -18824433 -16024168 -1591551 11002975 5357943 -17631960 -37565358
50938 -37565358 -41198536 -38310137 -39924808 -37255429 -19938999 -350645 2831989 -5400947
50930 -5400947 -7079572 -3630294 -10288536 -21861657 -13915426 17312787 42828273 38901174
50922 38901174 16503343 1164742 -167817 582157 -5723099 -15362087 -18254082 -8650858
50914h650858J5251252M174353j4419775j7075145K500933K0425404J5254508
50907A7460672j229113n199994R02597l422259j8282906k1605620o010297Q823109
50899b8563811P142477j166723q4959P732383Q436444j94671n868726L29696J1245009
50890i92881J1854197j178431j2693821p492691P327759J0338028k622508j0998440
50882f458788j231374J1728147Q968105k452742m211028J443469p14372p461605
50874c90188j508263J4086930J4957069n350272k1912409j5313747J082075N419925
50866h928880n83021j723982L541608N983873N700042Q917593J0188046j509114
50858B1586165j9346781k1388080j856369J7619135J7421940O244134M078314
$$ plain form
50914 -8650858 6600394 10774747 -3645028 -20720173 -18219240 2206164 17460672
50907 17460672 16231559 11031565 11934162 8511903 -9771003 -31376623 -37386920 -28563811
50899 -28563811 -21421334 -22588057 -22673016 -14940633 -6504189 -6698860 -12567586 -12237890 -992881
50890 -992881 10861316 9682885 -3010936 -10503627 -3175868 7162160 4539652 -6458788
50882 -6458788 -7690162 4037985 13006090 10553348 6342320 7785789 7071417 -390188
50874 -390188 -1898451 12188479 27145548 21795276 -117133 -15430880 -14348805 -8928880
50866 -8928880 -9511901 -11235883 -7694275 -1710402 3989640 12907233 23095279 21586165
50858 21586165 2239384 -19148696 -21005065 -3385930 14036010 20280144 24358458
50851B4358458R529259L882788j4513920k2448861p024482J0716378M768328j6246216
50843f978268k1701930n607752O437689P8452o440095L147804J3057251K316659
50835a5690190j7366115j8391140q59919J0011972N449850K020663P496721P859861
50827a9468297l186401r191901N47990J0850434O509547j496587L498299J3011095
50819A074179P501310q535697j1628877L391735J5836798J1263109j220091r752757
50811G929709j6642659k3588610j8918004L374078K4740078K2558780L376828
50804B830200n418288L431087P017593r315604k5143602j4238695J3540812K3604708
50796c691789N882220j2273113p798531O467657N972904p198291j0700619J790402
$$ plain form
50851 24358458 33887717 37770505 23256585 807724 -6216758 4499620 9267948 -6978268
50843 -6978268 -28680198 -34287950 -27850261 -27771809 -34211904 -31064100 -18006849 -15690190
50835 -15690190 -33056305 -51447445 -52307364 -42295392 -36845542 -34824879 -27328158 -19468297
50827 -19468297 -22654698 -31846599 -31298609 -20448175 -13938628 -15435215 -11936916 1074179
50819 1074179 8575489 39792 -11589085 -8197350 7639448 18902557 17682466 7929709
50811 7929709 -8712950 -32301560 -51219564 -47845486 -23105408 -546628 2830200
50804 2830200 -2588088 842999 7860592 -1455012 -26598614 -40837309 -27296497 -3691789
50796 -3691789 2190431 -10082682 -17881213 -11413556 -5440652 -12638943 -23339562 -21549160
50788b1549160J2323996O799709o570129j1634186m249438P533683J3909425R887388
50780F451288p55579o068159J020417R886967M190480j2071618j6205990l48367
50772a3900561J4075531P567836p632451p177511P427392J3170024K781258o829094
50764I482424n070603k535723p251317p912602N058640J8803529J5760618J18576
50756B6453542j1202646j4301563j5791828j2754692J617126J6085537J1161105
50749A266581o864087q712912J2651234K6807892J1325276j3211294j6597408
50742F665282n748980p700784k0520174j7190556N728397J9870290J0765874j504990
50734i635641J046731O924842J364755n820558k68827R047289N917717l439889
$$ plain form
50788 -21549160 -9225164 -2425455 -8995584 -20629770 -24879208 -17345525 -3436100 6451288
50780 6451288 5695709 -372450 647967 10534934 14725414 2653796 -13552194 -13900561
50772 -13900561 174970 7742806 110355 -7067156 360236 13530260 16311518 9482424
50764 9482424 4411821 1876098 -5375219 -13287821 -8229181 10574348 26334966 26453542
50756 26453542 15250896 949333 -14842495 -27597187 -25980061 -9894524 1266581
50749 1266581 -5597506 -14310418 -1659184 25148708 36473984 23262690 6665282
50742 6665282 916302 -6784482 -27304656 -44495212 -38766815 -18896525 -8130651 -9635641
50734 -9635641 -8588910 -1664068 -299313 -6119871 -6388698 2658591 8576308 5136419
50726E136419j339526R923709J1516247j272605j3194656j2986976n455221M87392
50718g185217J432224k229637n534425N13128J5632894K2981628R539037j1997177
50710B3152455j8444855q276045L60810J2733N75876N781574N984178j098333
50702H048393l701482K683695O404819N53078n093085l030975k039181r781388
50694e956126j6023778p991518P931612J4698248Q443802P05996K32722L617759
50686E658717L584868p68044l306697J394002R290949Q533082n453598k0347641
50678a414362k0475367o510992P827339J3950666J1386991m69989j6647764j9533361
50670c1886839j93813J8261878P224476j9029098j7002936J7838426L7111764
$$ plain form
50726 5136419 3796893 13720602 25236849 23964244 10769588 -2217388 -7672609 -7185217
50718 -7185217 -5752993 -7982630 -13517055 -13003927 2628967 25610595 35149632 23152455
50710 23152455 4707600 -3568445 -3207635 -3194902 -2619026 3162548 9146726 8048393
50702 8048393 4346911 7030606 13435425 13988503 8895418 5864443 3825262 -5956126
50694 -5956126 -21979904 -29971422 -22039810 -7341562 1102240 1808236 2040958 5658717
50686 5658717 9243585 8475541 5168844 6562846 15853795 24386877 18933279 -1414362
50678 -1414362 -21889729 -28400721 -20573382 -6622716 4764275 4294286 -12353478 -31886839
50670 -31886839 -32080652 -13818774 -6594298 -25623396 -42626332 -24787906 12323858
50663A2323858J1538899k3157736k1799498L665630J1762540j006939n210740
50656a1883986N200351Q333490l20702k640444K040120n693142k2606452j8983900
50648d6554665J0629172L0757166J6348126j1548634k0913434j1233871K60078
50641c2256062R466414J8515102J8462029M125959q573075l556791Q859623P997035
50633B3040234m996152j2193745p514877J48944N022492O126406j372391j5903872
50625g642961j8470497M265649L1324667K8867038n52642j9056699q400861O341585
50617A6675279M74684j2099961o795486P909249M777449j5196166k2116313l755010
50609c0126275J6204881J5224727L035539M97218N604828J295259j2410038j6437983
$$ plain form
50663 12323858 23862757 705021 -21094477 -17428847 -5666307 -6673246 -11883986
50656 -11883986 -6683635 1649855 1329153 -1311291 728829 -4964313 -27570765 -46554665
50648 -46554665 -35925493 -5168327 11179799 -368835 -21282269 -32516140 -32256062
50641 -32256062 -22789648 -4274546 14187483 18313442 9740367 6183576 15043199 23040234
50633 23040234 18044082 5850337 -1664540 -1515596 3506896 9633302 8260911 -7642961
50625 -7642961 -26113458 -21847809 9476858 38343896 37791254 18734555 10333694 16675279
50617 16675279 17149963 5050002 -1745484 6163765 10941214 -4254952 -26371265 -30126275
50609 -30126275 -13921394 1303333 4338872 4836090 10440918 11736177 -673861 -17111844
50601a7111844k674917J2768078J2084293j322159r832035l556389J0794984J7929192
50593A9079203P785690j3327249k4753369j2761035R623681J5462560q42713j5553668
50585a5286900r587386N446622Q047702m33978k453592M935772P038550k428479
50577d721689j1120402o683179Q230280K1579714K1582912K347103k6899130m0597783
50569c6282174k1557334J3108351K8438501J5518503o69416j079242K595783o122443
50561f049471j8894579j6925109j166806J0920182J1564464Q977405J0810632
50554g63282J4668748J4174395N932042p535485j6756601j2809215n88920M017476
50546C39158l844555r959935l605871M832545J942215n310266k177996O746514
$$ plain form
50601 -17111844 -19786761 -7018683 5065610 3743451 -6088584 -9644973 1150011 19079203
50593 19079203 26864893 13537644 -11215725 -23976760 -14353079 1109481 266768 -15286900
50585 -15286900 -24874286 -19427664 -11379962 -11813940 -14267532 -9331760 -2293210 -4721689
50577 -4721689 -15842091 -22525270 -14294990 7284724 28867636 31214739 4315609 -36282174
50569 -36282174 -57839508 -44731157 -16292656 -774153 -1443569 -2522811 72972 -6049471
50561 -6049471 -24944050 -41869159 -43035965 -32115783 -20551319 -11573914 -763282
50554 -763282 13905466 28079861 34011903 26476418 9719817 -3089398 -3678318 339158
50546 339158 -3505397 -13465332 -17071203 -12238658 -10296443 -15606709 -17784705 -11038191
50538a1038191M374724q468067j1843064J742243J5169437J3049400K669306j650180
50530D005608r60448n086343j2767664j3172237m231420L644886L617535J675582
50522b3274501N191451J0108254P591503k58617j628426O307313J0110698j105031
50514A3042644j7058741j7937019j712447J2757055J1049256k31972o031560j787291
50506g910075N617227Q049344K466350o927111j0823820n881345k260483q890008
50498b6559921j3792610K268225L0628164L7085632R594525k0244087k0533616
50491a553688k216314M267600k981568k206159J0105809J4359018K673685j0338685
50483A2109698j3614707j1113610m665183R552931K2828108J7383737m033536
$$ plain form
50538 -11038191 -6663467 -15131534 -26974598 -25232355 -10062918 2986482 5655788 4005608
50530 4005608 3045160 -2041183 -14808847 -27981084 -32212504 -28567618 -24950083 -23274501
50522 -23274501 -18083050 -7974796 -383293 -641910 -2270336 4036977 14147675 13042644
50514 13042644 -4016097 -21953116 -23665563 -10908508 140748 -91224 -6122784 -7910075
50506 -7910075 -2292848 5756496 8222846 1295735 -9528085 -15409430 -17669913 -26559921
50498 -26559921 -40352531 -38084306 -7456142 29629490 39224015 18979928 -1553688
50491 -1553688 -3770002 497598 -2483970 -4690129 5415680 19774698 22448383 12109698
50483 12109698 -1505009 -12618619 -17283802 -7730871 15097237 32480974 28447438
50476B8447438j5488149m783384Q981514O483012m698233q857505q374703j2730567
50468a1020577j6840343j0248686K767577J0537359J2498681J3373615Q447775
50461I515401n981786j5655239m665267J5051783J5103456o886188k1281167j0651347
50453b5450354M654843Q78379j0485050l188849J7195344J8322906o978795k5040082
50445c0091658j0699069J3872376J2967214q129179j3303557O786836K1623844
50438f973193J0513493p178161o999438K730804J015957q326715o868115L341716
50430a8743652L787001o796092j0085527P07979J1936666J4117906J3118004J2774589
50422B0816874P273170l235626q048756l449794J459596J551677J907383K907272
$$ plain form
50476 28447438 12959289 8175905 17157419 23640431 18942198 10084693 1709990 -11020577
50468 -11020577 -27860920 -38109606 -35342029 -24804670 -12305989 1067626 9515401
50461 9515401 3533615 -12121624 -16786891 -1735108 13368348 6482160 -14799007 -25450354
50453 -25450354 -20795511 -19917132 -30402182 -33591031 -16395687 1927219 -5051576 -30091658
50445 -30091658 -40790727 -26918351 -13951137 -22080316 -35383873 -28597037 -6973193
50438 -6973193 3540300 -3637861 -10637299 -7906495 -6890538 -15217253 -22085368 -18743652
50430 -18743652 -14956651 -21752743 -31838270 -31130291 -19193625 -5075719 8042285 20816874
50422 20816874 28090044 24854418 16805662 13355868 14815464 16367141 18274524 21181796
50414B1181796k965466j3620463j4896537k997642P966848Q353304N206704M399827
50406A2628371j76397r629815j1831486k466561M408540K69376k527445N281971
50398d043446J0387908P90234r514849l413524P288473M4335j8627354k0581599
50390c7669822Q31648K2471695K6251029J7247207M790567j0031210k1647171
50383B243943j7077442L303656J8558494J2420526n765640j5421034j0799986
$$ plain form
50414 21181796 18216330 4595867 -10300670 -13298312 -5331464 3021840 8228544 12628371
50406 12628371 12451974 2822159 -9009327 -11475888 -7067348 -6797972 -9325417 -4043446
50398 -4043446 6344462 7134696 -2380153 -5793677 1494796 1539131 -17088223 -37669822
50390 -37669822 -36838174 -14366479 11884550 29131757 33922324 23891114 2243943
50383 2243943 -14833499 -11529843 7028651 19449177 13683537 -1737497 -12537483
$$ [...]
##END NTUPLES=NMR SPECTRUM
##END=
