##TITLE=31Pdec_SR37_rep_2_2
 , 124 sc
 11.2.2021
##JCAMPDX= 6.0         $$ Bruker NMR JCAMP-DX V2.0
##DATA TYPE= NMR SPECTRUM
##DATA CLASS= NTUPLES
##ORIGIN= UXNMR, Bruker Analytische Messtechnik GmbH
##OWNER= root
$$ XWIN-NMR		Version 3.5
$$ Thu Feb 11 13:35:35 2021 Russian Standard Time (UT+4h)  she@DPX200
##.OBSERVE FREQUENCY= 81.013821
##.OBSERVE NUCLEUS= ^31P
##.ACQUISITION MODE= SIMULTANEOUS
##.ACQUISITION SCHEME= undefined
##.AVERAGES= 24
##.DIGITISER RES= 16
##SPECTROMETER/DATA SYSTEM= spect
##.PULSE SEQUENCE= zgpg30
##.SOLVENT NAME= DMSO
##.SHIFT REFERENCE= (INTERNAL, DMSO, 0, 248.564)
##AUDIT TRAIL= $$ (NUMBER, WHEN, WHO, WHERE, WHAT)
$$ ##TITLE= Audit trail, XWIN-NMR		Version 3.5
$$ ##JCAMPDX= 5.01
$$ ##ORIGIN= Bruker BioSpin GmbH
$$ ##OWNER= she
$$ F:/spectra/data/she/nmr/P31/1/pdata/1/auditp.txt
$$ ##AUDIT TRAIL=  $$ (NUMBER, WHEN, WHO, WHERE, WHAT)
(   1,<2021-02-11 13:32:06.04 +0400>,<she>,<DPX200>,
      <created by zg, POWCHK disabled, PULCHK disabled
       configuration hash MD5:
       00 E9 B6 7A A2 85 ED C7 34 08 36 98 17 FE 4E 26
       data hash MD5: 32K
       53 02 11 91 EF 9D 2A 84 CC FF 9E 9F 39 34 76 19>)
(   2,<2021-02-11 13:32:09.96 +0400>,<she>,<DPX200>,
      <Start of raw data processing
       efp BC_mod = 2 LB = 1 FT_mod = 6 PKNL = 1 PHC0 = -2619.839 PHC1 = 1013.002 SI = 64K 
       data hash MD5: 64K
       9B 5F DA 33 91 44 45 36 D0 EC 24 5C FE E9 D4 19>)
(   3,<2021-02-11 13:33:08.07 +0400>,<she>,<DPX200>,
      <pk PHC0 = -529.3682 PHC1 = 483.0004 
       data hash MD5: 64K
       65 30 9B 8A 5A B9 36 28 FB C0 58 13 FA A4 2B C9>)
$$ ##END=
$$ 
$$ hash MD5
$$ 20 13 54 C4 B8 D0 E5 1D C9 B1 38 6B 22 F0 18 DA
##$RELAX= 
##$RELAX= 
##$RELAX= 
##$RELAX= 
##$RELAX= 
##$RELAX= 
##$RELAX= 
##$RELAX= 
$$ Bruker specific parameters
$$ --------------------------
##$DU= <F:/spectra>
##$EXPNO= 1
##$NAME= <P31>
##$PROCNO= 1
##$TYPE= <nmr>
##$USER= <she>
##$AMP= (0..31)
100 100 100 100 100 100 100 100 100 100 100 100 100 100 100 100 100 100 
100 100 100 100 100 100 100 100 100 100 100 100 100 100 
##$AQSEQ= 0
##$AQ_mod= 1
##$AUNM= <au_zg>
##$AUTOPOS= <>
##$BF1= 81.014009
##$BF2= 200.13
##$BF3= 200.13
##$BF4= 200.13
##$BF5= 200.13
##$BF6= 200.13
##$BF7= 200.13
##$BF8= 200.13
##$BYTORDA= 1
##$CFDGTYP= 0
##$CFRGTYP= 5
##$CHEMSTR= <none>
##$CNST= (0..31)
1 1 145 1 1 1 1 1 1 1 1 1 1 1 1 1 1 1 1 1 1 1 1 1 1 1 1 1 1 1 1 1 
##$CPDPRG= <waltz16>
##$CPDPRG1= <>
##$CPDPRG2= <waltz16>
##$CPDPRG3= <>
##$CPDPRG4= <mlev>
##$CPDPRG5= <mlev>
##$CPDPRG6= <mlev>
##$CPDPRG7= <mlev>
##$CPDPRG8= <mlev>
##$CPDPRGB= <>
##$CPDPRGT= <>
##$D= (0..31)
0 1 0 0 0 0 0 0 0 0 0 0.03 2e-05 3e-06 0 0 0 0 0 0 0 0 0 0 0 0 0 0 0 0 
0 0 
##$DATE= 1613035925
##$DBL= (0..7)
120 120 120 11 120 120 24 19 
##$DBP= (0..7)
150 150 150 150 150 150 150 150 
##$DBP07= 0
##$DBPNAM0= <>
##$DBPNAM1= <>
##$DBPNAM2= <>
##$DBPNAM3= <>
##$DBPNAM4= <>
##$DBPNAM5= <>
##$DBPNAM6= <>
##$DBPNAM7= <>
##$DBPOAL= (0..7)
0.5 0.5 0.5 0.5 0.5 0.5 0.5 0.5 
##$DBPOFFS= (0..7)
$$ [...]
##$SUBNAM2= <"">
##$SUBNAM3= <"">
##$SUBNAM4= <"">
##$SUBNAM5= <"">
##$SUBNAM6= <"">
##$SUBNAM7= <"">
##$SUBNAM8= <"">
##$SUBNAM9= <"">
##$SW= 501.771253377433
##$SWIBOX= (0..15)
0 1 3 0 0 0 0 0 0 0 0 0 0 0 0 0 
##$SW_h= 40650.406504065
##$TD= 32768
##$TD0= 1
##$TE= 0
##$TE2= 300
##$TE3= 300
##$TEG= 300
##$TL= (0..7)
0 120 53 12 22 120 120 120 
##$TP= (0..7)
150 150 150 150 150 150 150 150 
##$TP07= 0
##$TPNAME0= <>
##$TPNAME1= <>
##$TPNAME2= <>
##$TPNAME3= <>
##$TPNAME4= <>
##$TPNAME5= <>
##$TPNAME6= <>
##$TPNAME7= <>
##$TPOAL= (0..7)
0.5 0.5 0.5 0.5 0.5 0.5 0.5 0.5 
##$TPOFFS= (0..7)
0 0 0 0 0 0 0 0 
##$TUNHIN= 0
##$TUNHOUT= 0
##$TUNXOUT= 0
##$USERA1= <user>
##$USERA2= <user>
##$USERA3= <user>
##$USERA4= <user>
##$USERA5= <user>
##$V9= 5
##$VALIST= <valist>
##$VCLIST= <CCCCCCCCCCCCCCC>
##$VD= 0
##$VDLIST= <DDDDDDDDDDDDDDD>
##$VPLIST= <PPPPPPPPPPPPPPP>
##$VTLIST= <TTTTTTTTTTTTTTT>
##$WBST= 1024
##$WBSW= 4
##$XGAIN= (0..3)
0 0 0 0 
##$XL= 0
##$YL= 0
##$YMAX_a= 2759
##$YMIN_a= -6043
##$ZGOPTNS= <>
##$ZL1= 120
##$ZL2= 120
##$ZL3= 120
##$ZL4= 120
##$ABSF1= 0
##$ABSF2= 0
##$ABSG= 0
##$ABSL= 0
##$ALPHA= 0
##$AQORDER= 0
##$ASSFAC= 0
##$ASSFACI= 0
##$ASSFACX= 0
##$ASSWID= 0
##$AUNMP= <proc_1d>
##$AZFE= 0.1
##$AZFW= 0.5
##$BCFW= 0
##$BC_mod= 2
##$BYTORDP= 0
##$COROFFS= 0
##$CY= -3
##$DATMOD= 1
##$DC= 0
##$DFILT= <>
##$DTYPP= 0
##$F1P= 0
##$F2P= 0
##$FCOR= 1
##$FTSIZE= 65536
##$FT_mod= 6
##$GAMMA= 0
##$GB= 0
##$INTBC= 1
##$INTSCL= 5.30512e-09
##$ISEN= 30
##$LB= 1
##$LEV0= 0
##$LPBIN= 0
##$MAXI= 10000
##$MC2= 0
##$MEAN= 0
##$ME_mod= 0
##$MI= 50
##$NCOEF= 0
##$NC_proc= -7
##$NLEV= 6
##$NOISF1= 182.463
##$NOISF2= 159.3651
##$NSP= 0
##$NTH_PI= 0
##$NZP= 0
##$OFFSET= 248.5645
##$PC= 4
##$PHC0= -3149.207
##$PHC1= 1496.002
##$PH_mod= 1
##$PKNL= yes
##$PPARMOD= 0
##$PSCAL= 0
##$PSIGN= 0
##$REVERSE= no
##$SF= 81.014009
##$SI= 65536
##$SIGF1= 159.3651
##$SIGF2= -187.1042
##$SINO= 113.3802
##$SIOLD= 16384
##$SREGLST= <1H.CDCl3>
##$SSB= 0
##$STSI= 65536
##$STSR= 0
##$SW_p= 40650.406504065
##$SYMM= 0
##$S_DEV= 0
##$TDeff= 32768
##$TDoff= 0
##$TI= <>
##$TILT= no
##$TM1= 0
##$TM2= 0
##$TOPLEV= 0
##$USERP1= <user>
##$USERP2= <user>
##$USERP3= <user>
##$USERP4= <user>
##$USERP5= <user>
##$WDW= 1
##$XDIM= 65536
##$YMAX_p= 394672334
##$YMIN_p= -27444389
$$ End of Bruker specific parameters
$$ ---------------------------------
##NTUPLES= NMR SPECTRUM
##VAR_NAME=  FREQUENCY,     SPECTRUM/REAL,   SPECTRUM/IMAG
##SYMBOL=    X,             R,               I
##VAR_TYPE=  INDEPENDENT,   DEPENDENT,       DEPENDENT
##VAR_FORM=  AFFN,          ASDF,            ASDF
##VAR_DIM=   65536,         65536,           65536
##UNITS=     HZ,            ARBITRARY UNITS, ARBITRARY UNITS
##FACTOR=    0.620285442955139, 1,           1
##FIRST=     20137.2065510759, 0,            0
##LAST=      -20513.1999529892, 0,           0
##MIN=       -20513.1999529892, -27444389,   0
##MAX=       20137.2065510759, 394672334,    0
$$ Real data points
##PAGE= N=1
##DATA TABLE= (X++(R..R)), XYDATA
$$ [...]
13018E570981k180444l163714j450278l89555n21471k91293J35637o6729K92117
13009b064749K397405M504987M008969R58187k450091m100691k618087J457758
13001B093688M249675J936183l251210m674039m55930L844735L749276J489966
12993H982344J43958j782929n301042o131432j079220N074456N626640J741015
12985G273790l58402O43498R52164l19693k91083R02951m40598m443995o227029
12976b308397l375152M65768J532180Q95753J050914J426934K77125j511514j420325
12967b966714R56643L169833K804674M15099p08138J515572M282697K529595l598935
12958H400326p168486l320613L314105M533437k62926m277909l703109j740104
$$ plain form
13018 5570981 3390537 226823 -1223455 -1613010 -2134481 -2425774 -2290137 -2356866 -2064749
13009 -2064749 332656 4837643 8846612 9804799 7354708 3254017 635930 2093688
13001 2093688 6343363 8279546 5028336 354297 -101633 3743102 7492378 8982344
12993 8982344 9126302 7343373 2042331 -4089101 -5168321 -93865 5532775 7273790
12985 7273790 6915388 7558886 8511050 8191357 7900274 8803225 8362627 3918632 -2308397
12976 -2308397 -5683549 -5217781 -3685601 -2789848 -1738934 -312000 -34875 -1546389 -2966714
12967 -2966714 -2010071 1159762 3964436 4379535 3671397 5186969 9469666 11999261 8400326
12958 8400326 1231840 -2088773 1225332 5758769 5495843 1217934 -2485175 -4225279
12950d225279j517559j035256K119461N506255M924573M99745l245038k604305
12942D22597J422716M059232J668230l597142n627339k422888O00983j142592
12934d616203l439290J77175O475187N966244j646206n394268M64406P447309
12926E434354O020552o11946l518787j993134j378969j968083k31307J770561
12918C523241j216782o681455o209609P54914N025383J961768k013206j161874
12910f017620N99755j453266l158483J185442P447843O838640l72905n057710
12902A1696k439122K606818M100589K139249j25060j255553j092909L58201J603381
12893E907290M32395k489352l696566j633340J636508M069558N512819N173540
$$ plain form
12950 -4225279 -5742838 -6778094 -4658633 847622 5772195 6271940 3026902 422597
12942 422597 1845313 5904545 7572775 3975633 -1651706 -4074594 -3473611 -4616203
12934 -4616203 -8055493 -7878318 -1403131 4563113 2916907 -2477361 -2012955 5434354
12926 5434354 11454906 10842960 7324173 5331039 3952070 1983987 1752680 3523241
12918 3523241 2306459 -4374996 -10584605 -9829691 -4804308 -2842540 -4855746 -6017620
12910 -6017620 -5417865 -6871131 -10029614 -8844172 -1396329 5442311 5069406 11696
12902 11696 -2427426 179392 4279981 6419230 6294170 5038617 3945708 4303909 5907290
12893 5907290 6339685 3850333 153767 -1479573 156935 4226493 9739312 14912852
12885A4912852J465720l859046n705904k512508O91626n21778l261126k131609
12877i21773K007623L451305N84773k159735j665910k50929n88398r75773J020921
12868E02104L161801J059505m682237p963615m972494O23046K654105O00460p26685
12859i744010R41820K203308L71460j315222J119431M892593L702754k334021
12851a61887n867222k570372L047005M457509J405468j591631j623631P61868
12843b142893L453503L982415J240172k251382k799153j458386k894193o510588
12835i380505n050802L862619J1333906Q743767K70430l779734j694792K93772
12827D598661j17298J3001K31968k760910o197800l406606M076618O999680K985104
$$ plain form
12885 14912852 16378572 12519526 6813622 4301114 4992740 4470962 1209836 -921773
12877 -921773 1085850 4537155 5121928 2962193 1296283 1045354 456956 -518817 502104
12868 502104 3663905 4723410 41173 -7922442 -12894936 -12271890 -9617785 -9017325 -9744010
12859 -9744010 -8802190 -6598882 -6227422 -7542644 -6423213 -1530620 2172134 -161887
12851 -161887 -6029109 -8599481 -5552476 -1094967 310501 -1281130 -2904761 -2142893
12843 -2142893 1310610 5293025 6533197 4281815 1482662 24276 -2869917 -9380505
12835 -9380505 -14431307 -10568688 765218 9508985 9779415 5999681 4304889 4598661
12827 4598661 4481363 4494364 4726332 1965422 -4232378 -7638984 -3562366 3437314 6422418
12818F422418o3151J725209J760402l818020p535210k958463L677135L508704
12810B719024p97991j064003K030556J489262k652350l389347J064823M794130
12802D194104M030245J358609m65980j819201k587212j438809N24285N90341r49860
12793C436522j732399k009392l246780l471225j57900L526795K432814j320039
12785b541604o46235M627618O593753J824790l141770k317720J039058Q02149
12777F240039k819347n379232n045939k778877P82681M485975N638806L307671
12769D431777P7423k028925m175945o771235o783640k404963K974132N052106
12761i629270M062606K690132J558381L28155L96069K525487M018691K064134
$$ plain form
12818 6422418 6359267 8084476 9844878 6026858 -1508352 -4466815 -789680 2719024
12810 2719024 1921033 857030 2887586 4376848 1724498 -1664849 -600026 4194104
12802 4194104 8224349 9582958 9116978 7297777 4710565 3271756 3796041 4386382 3436522
12793 3436522 1704123 -305269 -3552049 -7023274 -7181174 -3654379 -1221565 -2541604
12785 -2541604 -3187839 1439779 8033532 9858322 6716552 4398832 5437890 6240039
12777 6240039 3420692 -1958540 -7004479 -9783356 -9000675 -4514700 1124106 4431777
12769 4431777 4509200 2480275 -1695670 -8466905 -15250545 -17655508 -14681376 -9629270
12761 -9629270 -5566664 -2876532 -1318151 -989996 -593927 1931560 5950251 8014385
12753H014385j851413m127147l725776j715664J376156M358900M183943N2687
12745F566071l506956k062707K055369L074049J93964k273330k170304j551540
12737C24616j472076M9365L623220O241851N203649J507031j856246k958341j992079
12728H670990j157053k875474n985291n438882P83481O536973M482353k995667
12720B021430o245982j907877L125993L135860J413707K529654L622046p2160
12712G622671n629735n892651m00691M124132L672666J040965l62280r05895j372341
12703A896841l22329K527031M009987J551127k870145n309347m701189k959493
12695f177517j623267n65946O52801J960346L165547M016900L842633J885484
$$ plain form
12753 8014385 6162972 2035825 -1689951 -3405615 -2029459 2329441 6513384 6566071
12745 6566071 3059115 996408 3051777 6125826 6319790 4046460 1876156 324616
12737 324616 -1147460 -1098095 2525125 8766976 13970625 15477656 13621410 10663069 8670990
12728 8670990 7513937 4638463 -1346828 -6785710 -6002229 534744 5017097 2021430
12720 2021430 -4224552 -6132429 -3006436 129424 1543131 4072785 7694831 7622671
12712 7622671 1992936 -3899715 -4300406 -176274 3496392 4537357 4175077 3269182 1896841
12703 1896841 1574512 4101543 8111530 9662657 6792512 1483165 -3218024 -6177517
12695 -6177517 -7800784 -8366730 -7713929 -5753583 -2588036 1428864 5271497 7156981
12687G156981j629119m752213m683088o37108L951803M106929n56750m624582
12679a667147l908562r99215l39791o39216K146292N997176M527609j922084n002714
12670a807652r93798L253932J757517j002285J008378L760870R4544o348059n401086
12661e677639K943962P546959K953795l418413m026532j450312j137037k250312
12653d515529j748837r41469j646218j192981K431840N073250K485741j979441
12645b033644k325648O97148J802722P1935j213284j549085k869918l502638J29961
12636a0792451N841408O899936K031472k189694q02729L185985M169979J114806
12628I458712k970189n122854m021492m63646K359266J743359p06787j013959
$$ plain form
12687 7156981 5527862 775649 -3907439 -4544547 -592744 3514185 2957435 -1667147
12679 -1667147 -5575709 -6574924 -6914715 -7553931 -5407639 589537 5117146 3195062 -1807652
12670 -1807652 -2801450 452482 2209999 1207714 2216092 5976962 6071506 -276553 -5677639
12661 -5677639 -2733677 4813282 7767077 4348664 322132 -1128180 -2265217 -4515529
12653 -4515529 -6264366 -7205835 -8852053 -10045034 -7613194 -2539944 -54203 -2033644
12645 -2033644 -4359292 -3662144 -1859422 -1787487 -3000771 -4549856 -7419774 -10922412 -10792451
12636 -10792451 -4951043 1948893 3980365 1790671 987942 4173927 8343906 9458712
12628 9458712 6488523 1365669 -2655823 -3119469 -760203 983156 276369 -737590
12620g37590J310890K870804J953036L96523n56788j814134k898333j487069J982608
12611A019947L679386K156848M22823K78712p10565l842667n522210k718073J568782
12602c667017K560816N61682p79838p66400j488886k630867j319254K521172M731136
12593b77456K355014k091758l729341j473732R04716J13836j966439q27315L871771
12584c120704O988678M673412m93080l633514l982670l567488k231651J038961
12576d328056L743412K634534j71777K545K206592J452514j666662j174975L174207
12567E872334L904703j876359o938813n467649j870393j930777k840735L36398
12559a0811291M713915M648194J730447R18002Q22389k819464p062116n094469
$$ plain form
12620 -737590 573300 3444104 5397140 5793663 5236875 3422741 524408 -962661 1019947
12611 1019947 4699333 6856181 7279004 7557716 6847151 3004484 -2517726 -5235799 -3667017
12602 -3667017 -1106201 -544519 -1324357 -2090757 -3579643 -6210510 -7529764 -5008592 -277456
12593 -277456 2077558 -14200 -3743541 -5217273 -4312557 -4198721 -6165160 -6992475 -3120704
12584 -3120704 3867974 8541386 8048306 4414792 432122 -3135366 -5367017 -4328056
12576 -4328056 -584644 2049890 1878113 1880658 4087250 5539764 3873102 2698127 5872334
12567 5872334 9777037 7900678 961865 -4505784 -6376177 -8306954 -11147689 -10811291
12559 -10811291 -6097376 -1449182 281265 1199267 2021656 -797808 -7859924 -12954393
12551a2954393J685758M634324J009139k774667k028744L70867Q79319N99629
12543h578768J235496J893995K177853L096121L350609L14040l857631l232658
12535c600943K597725O308403L019734k746541m017304p51542J842906J067953
12527C720391j225141k440949j951994r73946j351062l428913m759468k707536
12519a5118618J725176M906135M893937K199046k364693o782827o489503N19479
12511a6511868P884491O687092k220788q240656n068328J814250M376232K457658
12503h821917R64028J759095K937182K849627J234509j122228j785814J027525
12495i57993M275860K729078k737415n072794j581791J712749k72644l984309
$$ plain form
12551 -12954393 -11268635 -6634311 -5625172 -8399839 -10428583 -10057716 -9178397 -8578768
12543 -8578768 -7343272 -5449277 -3271424 -175303 3175306 3489346 -368285 -3600943
12535 -3600943 -1003218 5305185 8324919 5578378 1561074 809532 2652438 3720391
12527 3720391 2495250 54301 -1897693 -2871639 -4222701 -7651614 -12411082 -15118618
12519 -15118618 -13393442 -8487307 -3593370 -1394324 -3759017 -10541844 -17031347 -16511868
12511 -16511868 -8627377 -1940285 -4161073 -12401729 -17470057 -15655807 -11279575 -8821917
12503 -8821917 -7857889 -6098794 -3161612 -311985 922524 -199704 -1985518 -957993
12495 -957993 3317867 6046945 3309530 -1763264 -3345055 -1632306 -1904950 -5889259
12487e889259l906019j127926K94472M57506J163831R43687j239462j528774K852698
12478g979246O868432M151477k636221n331449k097300J588193K260754J459868
12470a715492K58579j959598l391157j236630K585813L427692J571436J405048
12462I45691K961780J604262k790951l938443Q37348N351401L205110l339670
12454D836528p126608n174867n01549K617193K496678P06773J35852J124751L82715
12445e02534l540788n721504r52941O913777Q573390K447242l303120l521850
12437C91672k539699m358625m756286N44984O545407N741684Q595k353265Q28011
12428E2478L611751J779515k110724l866356k340509J541846N631422O011134
$$ plain form
12487 -5889259 -9795278 -10923204 -10628732 -10171226 -9007395 -8063708 -9303170 -10831944 -7979246
12478 -7979246 -1110814 3040663 404442 -4927007 -7024307 -5436114 -3175360 -1715492
12470 -1715492 -1456913 -3416511 -6807668 -8044298 -5458485 -2030793 -459357 945691
12462 945691 3907471 5511733 2720782 -1217661 -380313 4971088 8176198 4836528
12454 4836528 -2290080 -7464947 -7966496 -5349303 -2852625 -2145852 -2010000 -885249 -502534
12445 -502534 -4043322 -9764826 -10717767 -3803990 4769400 7216642 3913522 391672
12437 391672 -2148027 -6506652 -11262938 -10717954 -4172547 1569137 1577732 -775533 52478
12428 52478 3664229 5443744 3333020 -533336 -2873845 -1331999 4299423 10310557
12420A0310557L26920p486326j0111288n606909M93229K748516J599479M21281
12412g304541P54656K261799L900932L262566j644411p654042p459794R91577
12404a2891258R455632Q557017m4526o034377m168104L47500J134382p52231p39094
12395e135059J496278K880734K694054K476908J756373j074760m088832l123208
12387b117512J552353M511405K580227j154682k592003j941636j407792j117362
12379a687002l01374K93653J7343r6003L02830k36632j437398l52866K999790
12370d97659L327396k156078p592753n851834R88109M901991L514680J585025
12362a781123K059859K756188K066115J363345R27176o47521k170267n67800L354141
$$ plain form
12420 10310557 10637477 3151151 -6960137 -12567046 -12073817 -9325301 -7725822 -7304541
12412 -7304541 -6549885 -4288086 -387154 2875412 1231001 -6423041 -13882835 -12891258
12404 -12891258 -3435626 5121391 5076865 -957512 -5125616 -4778116 -3643734 -4395965 -5135059
12395 -5135059 -3638781 -758047 1936007 4412915 6169288 5094528 1005696 -2117512
12387 -2117512 -565159 3946246 6526473 5371791 2779788 838152 -569640 -1687002
12379 -1687002 -1988376 -1694723 -1677380 -1773383 -1470553 -1707185 -3144583 -3497449 -497659
12370 -497659 2829737 673659 -6919094 -12770928 -11782819 -6880828 -3366148 -1781123
12362 -1781123 278736 3034924 5101039 6464384 7391560 6744039 4573772 4005972 7360113
12353G360113N150061L174033l51673m150999p655673p059371L94797Q475198
12345E336486P633605m54783m222744j06366K433612k067648n471202q44159M668005
12336F904806J945750m562958n046111p37792K59030j920544q13321K969578L070197
12327B068635R6734M80612L453725J650889m695524o432119o08276M395110K319062
12318B728848k449846l817406k424807q46873J544264M484355M751758K172362
12310F142655Q82174J328459j369221p435110r299673l556658K214997J040944
12302a0051433k610461j157601L572508M835768K783863K441861L442525J377665
12294D634695k461056k189667J919416K716936k225860o222989l741901J430722
$$ plain form
12353 7360113 12510174 15684207 15332534 11181535 3525862 -3533509 -3138712 5336486
12345 5336486 12970091 12515308 8292564 8186198 10619810 8552162 3080960 2236801 6904806
12336 6904806 8850556 4287598 -758513 -1496305 -1237275 -3157819 -3971140 -1001562 2068635
12327 2068635 2165369 2645981 6099706 7750595 3055071 -3377048 -3985324 409786 2728848
12318 2728848 279002 -3538404 -5963211 -6810084 -5265820 -781465 3970293 6142655
12310 6142655 7024829 8353288 6984067 -451043 -9750716 -13307374 -11092377 -10051433
12302 -10051433 -12661894 -13819495 -10246987 -5411219 -2627356 -185495 3257030 4634695
12294 4634695 2173639 -16028 1903388 4620324 2394464 -3828525 -7570426 -6139704
12286f139704K568096j03070r96177J644526L356900P31255k926607j996811K985758
12277h75834N153191P71114m790496m179777J327690L775127M31210k682421p48796
12268a818992K745888K568601Q4129p4874J972342K246798j76451k344722k685881
12259B516838k622802l030115k702208p79309J722857L085837K293779j63681
12251C21196k043618j323383P72442Q46456j610568l005536r23454K368809L461611
12242a136045J888504r12191l360567l068249J284907N675806L687858l621759
12234D38264o957434j834211M243837L247373j390559j794546J205131J279779
12226a562366j287651j089652J210630m6060l918216l182498K656161N123914
$$ plain form
12286 -6139704 -3571608 -3674678 -4670855 -3026329 330571 1061826 -1864781 -3861592 -875834
12277 -875834 4277357 5048471 257975 -3921802 -2594112 1181015 1612225 -1070196 -1818992
12268 -1818992 926896 3495497 3579626 3504752 5477094 7723892 7547441 5202719 2516838
12259 2516838 -105964 -3136079 -5838287 -6617596 -4894739 -1808902 484877 321196
12251 321196 -1722422 -3045805 -2273363 -1426907 -3037475 -6043011 -6966465 -4597656 -1136045
12242 -1136045 752459 -159732 -3520299 -6588548 -5303641 372165 4060023 438264
12234 438264 -6519170 -8353381 -4109544 -862171 -2252730 -4047276 -2842145 -1562366
12226 -1562366 -2850017 -3939669 -2729039 -2775099 -6693315 -9875813 -7219652 -2095738
12218b095738L71630m433506k437575L221898N854774M640465K561877L93075
12210H076900k096436l001690j038832J345974J103425j487724m133500n050328
12202f282211k910023K192730O560252N765479R35344k176879j358334o2020k94108
12193B370230M25427K845775L235700J45370k205441j163415l46193k669715m425971
12184a788233j654544K558598K940780J92851j263247k35429J656634L853369
12176F260779N309580K821654l734552q146637n529611J86351K207249P21233
12168I6046M33412J706314J328725m42280p54098K9577J11897J177210M281174
12159G967977M200087l126639j0449305p409186K525565N604896j117031n562959
$$ plain form
12218 -2095738 -1724108 -6157614 -8595189 -5373291 481483 5121948 7683825 8076900
12210 8076900 5980464 2978774 1939942 3285916 4389341 2901617 -1231883 -6282211
12202 -6282211 -9192234 -6999504 -439252 5326227 6261571 4084692 2726358 2664338 2370230
12193 2370230 2795657 5641432 8877132 9022502 6817061 5653646 5307453 2637738 -1788233
12184 -1788233 -3442777 -884179 2056601 2249452 986205 750776 2407410 6260779
12176 6260779 11570359 14392013 10657461 2510824 -3018787 -2832436 -625187 96046
12168 96046 529458 2235772 3564497 3122217 2368119 2397696 2509593 3686803 7967977
12159 7967977 12168064 9041425 -1407880 -8817066 -6291501 -686605 -1803636 -7366595
12151g366595q15598M172653Q68941m287879j629375N097319N563351j11181l146428
12142a654792j079306O08927m3824O22314K714745J617183k904970n362582l841590
12133i323895k351865k250054J43911M932278O397270L048781J326164M343388
12125F265978N398960o25948p156448n703332M92578K280490o24373j342084P16281
12116b97898l50113m516205m909133m51945J880139o3381J99838M739565N914240
12107B145107K37427l660895O53433N422289J624168m985635l549584K972135
12099H58445L154186k650741l158207L475209N949295p51607o781009l857672
12091c762101K059844J864169k611401l579011M62979M553700M565897j65737
$$ plain form
12151 -7366595 -8182193 -4009540 -3140599 -7428478 -9057853 -3960534 1602817 1491636 -1654792
12142 -1654792 -2734098 -2125171 -2168995 -1546681 1168064 2785247 -119723 -5482305 -9323895
12133 -9323895 -11675760 -13925814 -13781903 -8849625 -2452355 596426 1922590 6265978
12125 6265978 11664938 11038990 3882542 -1820790 -1328212 952278 327905 -1014179 -297898
12116 -297898 -648011 -5164216 -10073349 -10525294 -8645155 -8708536 -8508698 -3769133 2145107
12107 2145107 2382534 -1278361 -624928 4797361 6421529 1435894 -2113690 858445
12099 858445 4012631 1361890 -1796317 1678892 7628187 6876580 95571 -3762101
12091 -3762101 -1702257 161912 -2449489 -6028500 -5565521 -1011821 3554076 3388339
12083C388339o835067q892580j939403P811374Q856685P81925m377487q35659
12075b041873K555672j110978m458150J20006N766098L293840j742270J044853
12067C427198P358873M988808m586533q321214l349993J42612k008508k505285
12059d854042J361199K056124l056990n250439M77697O232194M305157j206458
12051F4442l165948k359295k302389j494445J597199L022287N2866k843000j202366
12042h630649K274155L619978M207837N452102L744464k431572o725535l765637
12034b254857J773687K427715q48452k186511o49408J007594K768352M847352
12026F885472L382491l210603q063076m831681J311223J279291l008158k214357
$$ plain form
12083 3388339 -3446728 -12339308 -14278711 -6467337 2389348 3171273 -1206214 -2041873
12075 -2041873 513799 -597179 -5055329 -4935323 830775 4124615 2382345 3427198
12067 3427198 10786071 15774879 11188346 2867132 -482861 -340249 -2348757 -4854042
12059 -4854042 -3492843 -1436719 -4493709 -9744148 -9266451 -3034257 1270900 64442
12051 64442 -3101506 -5460801 -7763190 -9257635 -7660436 -4638149 -4585283 -7428283 -8630649
12042 -8630649 -6356494 -2736516 1471321 6923423 10667887 8236315 1510780 -2254857
12034 -2254857 -481170 1946545 1098093 -1088418 -1737826 -730232 2038120 6885472
12026 6885472 10267963 7057360 -1005716 -5837397 -4526174 -3246883 -6255041 -8469398
12018h469398M079799O407393J021079m710131m586333j364049P31115K354513
12010d536012M059397K829640j738596m169072r29188L425223K639240k471281
12002h90649n950601m635275l86641L640193N683602N311991L061947J69223j994148
11993D009642k299685p33946M68728j191138l896886k406918L592729O528164
11985D070690J470647m852151l160964L624248M461116k202458n953740j278559
11977c821171M099310K355527k523784k592023J668824M178335L182181J201401
11969G748600j026151l823144m728318j640723K350512K861179R81493Q82542
11961C605990K539393K308453m51813k610306k593911j887586j505475r66942
$$ plain form
12018 -8469398 -4389599 2017794 3038873 -1671258 -6257591 -7621640 -6890525 -4536012
12010 -4536012 -476615 2353025 614429 -3554643 -4483831 -1058608 1580632 -890649
12002 -890649 -6841250 -11476525 -11863166 -8222973 -2539371 2772620 5834567 6003790 4009642
11993 4009642 1709957 976011 1444739 253601 -3643285 -6050203 -2457474 4070690
11985 4070690 5541337 689186 -2471778 1152470 5613586 3411128 -2542612 -3821171
11977 -3821171 278139 2633666 109882 -2482141 -813317 3365018 6547199 7748600
11969 7748600 6722449 2899305 -1829013 -3469736 -1119224 1741955 2723448 3605990
11961 3605990 6145383 8453836 8002023 5391717 2797806 910220 -595255 -1562197
11953a562197m39917l56881M37698K731357M197052K364273p61901j273196K49339
11944E585627l89176l743477n168166j714798L324137M558630O76520m703058
11936a573761o488157k179925N387159R428974N738309k191364o853836n148349
11928c880950n58790K358884K325459M01318j715345k061332k10762J107370p06444
11919b940592l512086k905149R55840L616811L546597L559588M085945J520358
11911G927312m118741o605669k976172P19834q73996k752781K249100R781861
11903C350748Q710841j517185q756665n476294J302027J747879l068703n396793
11895i104145k874208P12922L106872M934929N203791K025894k498404l697985
$$ plain form
11953 -1562197 -2002114 -2358995 -1921297 810060 5007112 7371385 6609484 5336288 5585627
11944 5585627 5196451 1452974 -3715192 -5429990 -2105853 2452777 3129297 -1573761
11936 -1573761 -8061918 -10241843 -4854684 4574290 10312599 8121235 1267399 -3880950
11928 -3880950 -4439740 -2080856 244603 645921 -1069424 -3130756 -3341518 -2234148 -2940592
11919 -2940592 -6452678 -9357827 -8401987 -4785176 -1238579 2321009 6406954 7927312
11911 7927312 3808571 -2797098 -5773270 -5053436 -5927432 -8680213 -6431113 3350748
11903 3350748 12061589 10544404 1787739 -3688555 -2386528 -638649 -3707352 -9104145
11895 -9104145 -11978353 -11265431 -8158559 -3223630 1980161 4006055 1507651 -2190334
11887b190334r46770J751990K024628J516843J600704J145403m14887j694775
11879B792802k083982k380508k190526n86217M13692k026291n223018k891140
11871a4175188M425853P558597J615919n531597l887546M310064Q279090L869283
11863F464475k637206m748823k535136R04181L304268K895007k87872k341886
11855A017008M6976L409440J813184l054081l676134Q00352K623125j481228m435498
11846b936856q52984L600555J804542k928663k844331J609506L889620K416396
11838C757785P24262p50564l930456n769307j221167O490511P969902J470651
11830H741617m162939k804576J111899J591836l8519k02773k15905k361577m000078
$$ plain form
11887 -2190334 -3137104 -1385114 639514 2156357 3757061 4902464 4487577 2792802
11879 2792802 708820 -1671688 -3862214 -4448431 -4034739 -6061030 -11284048 -14175188
11871 -14175188 -9749335 -2190738 -574819 -6106416 -9993962 -5683898 2595192 6464475
11863 6464475 3827269 -921554 -3456690 -2552509 751759 3646766 3358894 1017008
11855 1017008 1063984 4473424 6286608 3232527 -443607 356745 2979870 1498642 -2936856
11846 -2936856 -3789840 -189285 1615257 -1313406 -4157737 -2548231 1341389 3757785
11838 3757785 4482047 3731483 -198973 -5968280 -7189447 -698936 7270966 8741617
11830 8741617 4578678 1774102 2886001 4477837 4439318 4236545 4020640 1659063 -2341015
11821b341015j767939K101124L343376K342774J785462P79601k600052n311090
11813a667759k644789L372087N427095J231759l401283l094968M90230K611798
11805B324170J936083M64647l65180r59740k043872l226823k762630Q29479N838902
11796B035036P515770L605769j651996k545269J27635O19400k434291l799162
11788C472892l46322L524717K615301j235800k523461m29620J011343l15916k245704
11779C527430k526666j525815k80267J060595K055812J623104k17093j882998
11771A834102k125750j140018M06095K114997L367052L231532J296701j827114
11763G157597m624488n147793k516411J389393L177760J885987j185n47974q99832
$$ plain form
11821 -2341015 -4108954 -2007830 1335546 3678320 5463782 6243383 3643331 -1667759
11813 -1667759 -4312548 -940461 4486634 5718393 2317110 -777858 -287628 2324170
11805 2324170 4260253 4724900 4359720 3399980 1356108 -1870715 -4633345 -3803866 2035036
11796 2035036 9550806 13156575 11504579 8959310 9086945 9706345 7272054 3472892
11788 3472892 3126570 6651287 9266588 8030788 5507327 5077707 6089050 5773134 3527430
11779 3527430 1000764 -525051 -805318 255277 2311089 3934193 3717100 1834102
11771 1834102 -291648 -1431666 -1025571 1089426 4456478 7688010 8984711 7157597
11763 7157597 2533109 -2614684 -5131095 -3741702 -563942 1322045 1320860 772886 -126946
11754a26946j966973j725626Q50764K217882n95960l718154j492148L566628L434481
11745D43948k370450m890747J63011M876468J512086m726317l626970L865878
11737d753093P023976J541095m900381m628273L26084L599498L387062J954573
11729C550541O55420l64929l03408P45426L28349k998220o318375n493776p80007
11720a0978979L506852M516505L459892K604395K116254R04759r06584j788246
11712C434848q22453J008121J869165J079307l31324j003443p56721n95193j491852
11703B390455l141187l753253j772092J509723K327553p63974l885028k778116
11695i865919L86928M3350l021248j644418N705830J0382595O150350o72733j270256
$$ plain form
11754 -126946 -2093919 -3819545 -2968781 -750899 -1346859 -5065013 -6557161 -2990533 443948
11745 443948 -1926502 -6817249 -6654238 -1777770 -265684 -4992001 -8618971 -4753093
11737 -4753093 2270883 3811978 -1088403 -5716676 -5390592 -1791094 1595968 3550541
11729 3550541 4205961 3841032 3537624 4283050 4611399 1613179 -4705196 -10198972 -10978979
11720 -10978979 -7472127 -2955622 504270 3108665 5224919 6129678 5223094 3434848
11712 3434848 2612395 3620516 5489681 6568988 6237664 5234221 4477500 3882307 2390455
11703 2390455 -750732 -4503985 -6276077 -4766354 -2438801 -3202775 -7087803 -9865919
11695 -9865919 -9478991 -9435641 -12456889 -14101307 -8395477 1987118 8137468 7464735 6194479
11686F194479J495086r04446o602454n707746K186942O040610J260356l137889
11678H24938k76391L470666O27498m230198k938432K334669L788488J014755p73783
11669C842210j315658l922816o404094l548078K606371M441513M54677l146155
11661f992030k479496K63266K989892N740002O408350K285996l622502n310337
11653g16859l009460k013232k532386J96805N199144N407657J34581k530401P28839
11644H64688K903195n85690l960434k261263m73183l460849n844285j502404M489478
11635i830747M112788L95553J550708N722362M124301k883127n568136q54095
11627c230393L324248J783616n54551J194710L608250J865622k035171l151823
$$ plain form
11686 6194479 7689565 6785119 182665 -5525081 -3338139 2702471 3962827 824938
11678 824938 548547 4019213 4646711 416513 -2521919 -187250 3601238 4615993 3842210
11669 3842210 2526552 -1396264 -7800358 -11348436 -8742065 -4300552 -3845875 -6992030
11661 -6992030 -9471526 -9208260 -6218368 -478366 5929984 8215980 4593478 -716859
11653 -716859 -3726319 -5739551 -8271937 -8075132 -2875988 2531669 2666250 135849 864688
11644 864688 3767883 3182193 -778241 -3039504 -3512687 -6973536 -12817821 -14320225 -9830747
11635 -9830747 -5717959 -5322406 -3771698 1950664 6074965 3191838 -2376298 -3230393
11627 -3230393 93855 1877471 1322920 2517630 6125880 7991502 5956331 2804508
11619B804508q46977J971383L073924J536444k104084m399850k032262K157037
11611B160123J526365l933409n864153J10595O612780M720919k913481n972125
11603c552386p72673O082407P533245L658712j077601l613812l987376l923467
11595C47049m556833m379419n50140N976878Q910893L847613m505530p072805
11587a982294k244710K136309R6465m138493k751793M118074Q519366N644946
11579I397870k35576k378231m20616N86678j796424m287838l193490M92409L084120
11570A248902L073960J744244L39306r08319j626490j457419j047328j035371
11562C31485o95170M50020P39935j176875l035551j660344J558057K136124m17693
$$ plain form
11619 2804508 1957531 3928914 7002838 8539282 6435198 2035348 3086 2160123
11611 2160123 3686488 -246921 -6111074 -6000479 612301 5333220 2419739 -3552386
11603 -3552386 -4325059 1757348 9290593 12949305 11871704 8257892 4270516 347049
11595 347049 -4209784 -8589203 -9139343 -3162465 5748428 9596041 5090511 -1982294
11587 -1982294 -4227004 -2090695 -1994230 -6132723 -8884516 -4766442 3752924 9397870
11579 9397870 9162294 6784063 6363447 6950125 5153701 865863 -2327627 -1835218 1248902
11570 1248902 4322862 6067106 6406412 5498093 3871603 2414184 1366856 331485
11562 331485 -363685 86335 826270 -350605 -3386156 -5046500 -3488443 -1352319 -1770012
11553a770012j851053n12336L2172j899817k158920J848636N075823K221036k706591
11544a721062j735222M085232N398503j146941p351912n298330J844843N451783
11536d73106L170405k48376r64105L98843J951129K636664J411061j746710l892031
11527B243774j827092K711876M171561P28314k793673j907389O87316q34228n917337
11518b736878p159824p50412O840264O457361j444122p019129m033323K320102
11510g525961L596069n512j441746J259169K074386k189109m965776P13695J0143135
11501A658350J1608174K430383o869082o530498L76090L955884J115136k577093
11493E167344k674656j203208j359038k089964q43422J544807K258063J270844
$$ plain form
11553 -1770012 -3621065 -4133401 -4101229 -6001046 -8159966 -6311330 -1235507 985529 -1721062
11544 -1721062 -3456284 628948 6027451 4880510 -2471402 -7769732 -5924889 -473106
11536 -473106 2697299 2448923 1484818 1883661 3834790 6471454 7882515 6135805 2243774
11527 2243774 416682 3128558 7300119 8028433 5234760 3327371 4014687 3180459 -2736878
11518 -2736878 -9896702 -10647114 -3806850 2650511 1206389 -5812740 -9846063 -7525961
11510 -7525961 -3929892 -3935404 -5377150 -4117981 -2043595 -4232704 -9198480 -8484785 1658350
11501 1658350 13266524 15696907 8827825 2297327 2673417 6629301 7744437 5167344
11493 5167344 2492688 1289480 -69558 -2159522 -3002944 -1458137 799926 2070770
11485B070770J189768K475509K142920j459128n089738m335690K17867L414776
11477F27054K274207o32461j814654j812297k638380k817988L28360M396018L707335
11468A617194j430730l377808J605539O514099L537295l688035n197440M51049
11460C1163M930604L489063P74031J315183K513423J197141j9045J546457K334485
11451A8112505j640912o928631p299828l345674q47167j590125k248943j139814
11443f928589J58607J193349K708552K972173J16175k395614N56373O374733O492021
11434A1247780q27369o802471m460903J945931M199253J307902j653048j839260
11426C117815n23204P27533J173256r0272k688713m113000k922101o72860J399805
$$ plain form
11485 2070770 3260538 5736047 7878967 6419839 1330101 -3005589 -2787722 627054
11477 627054 2901261 2268800 454146 -1358151 -3996531 -6814519 -6486159 -2090141 1617194
11468 1617194 186464 -3191344 -1585805 4928294 8465589 4777554 -419886 31163
11460 31163 4961767 8450830 9224861 10540044 13053467 14250608 14231563 15778020 18112505
11451 18112505 16471593 9542962 2243134 -1102540 -1949707 -3539832 -5788775 -6928589
11443 -6928589 -6769982 -5576633 -2868081 104092 220267 -2175347 -1618974 4755759 11247780
11434 11247780 10420411 3617940 -842963 1102968 5302221 6610123 4957075 3117815
11426 3117815 2594611 3322144 4495400 4405128 1716415 -2396585 -5318686 -5991546 -4591741
11417d591741M232406O812328M668014l081928r257268p098876k79783K193320
11409f403528q56176k192267J588238N123811L494704o31224k473050k091118
11401d440610j678569n12372K394617L903106O29010m384742m482301J079030
11393g492831N495179L698436j046146k419489L31912K653207J808675l02795
11385B726148j406881k126096l506794m073183j661143L263530Q015088J0228200
11377A1458869Q454976K123400o499913j1847810j0081518m159666n03053p45066
11369a1799781n89094K668019N839494N026495J409759r87689p85813L50957R47178
11360B079525O59931o68042k477352k993158j267779J136247K069742J361984
$$ plain form
11417 -4591741 -359335 6452993 11121007 8039079 -1218189 -8317065 -8596848 -6403528
11409 -6403528 -7259704 -9451971 -7863733 -2739922 754782 123558 -2349492 -4440610
11401 -4440610 -6119179 -6631551 -4236934 -333828 295182 -4089560 -8571861 -7492831
11393 -7492831 -1997652 1700784 654638 -1764851 -1432939 1220268 3028943 2726148
11385 2726148 1319267 -806829 -4313623 -8386806 -10047949 -6784419 1230669 11458869
11377 11458869 19913845 22037245 15537332 3689522 -6391996 -10551662 -11054715 -11799781
11369 -11799781 -12388875 -9720856 -3881362 1145133 2554892 1567203 781390 1132347 2079525
11360 2079525 2739456 2071414 -405938 -3399096 -4666875 -3530628 -1460886 -98902
11352i8902J72529q01916j110480j90406J216122R85312j368011l295741k572448
11343g063941l03984J146971J315347Q76219o3931p19099R68781M875804O815110
11334G847277L488736k214747m380332j582536K094244K956792J350498n64125
11326H995807j777477k551258l362512m172417m040665k029897J037437L123818
11318d777164L749693M079505L764028R88303l125224m282080j557297J23395
11310a036841k575823n736596m342876j77731J689375R89560R96258J862610J434474
11301f897590O96397K028648L561578J789216j359108r12874K299450K387273
11293C592990j741195m357710j999060J876927L059136J803625K38500n06094
$$ plain form
11352 -98902 73627 -728289 -1838769 -2029175 -813053 172259 -1195752 -4491493 -7063941
11343 -7063941 -7367925 -6220954 -4905607 -4029388 -4093319 -4812418 -3843637 1032167 7847277
11334 7847277 11336013 9121266 4740934 3158398 5252642 8209434 9559932 8995807
11326 8995807 7218330 4667072 1304560 -2867857 -6908522 -8938419 -7900982 -4777164
11318 -4777164 -1027471 3052034 6816062 7804365 4679141 397061 -1160236 -1036841
11310 -1036841 -3612664 -9349260 -13692136 -13869867 -12180492 -11190932 -10194674 -8332064 -6897590
11301 -6897590 -6201193 -4172545 -610967 1178249 -180859 -1093733 1205717 3592990
11293 3592990 1851795 -2505915 -4504975 -2628048 431088 2234713 2473213 1967119
11285A967119N39079L192448M021012L76854l900905l125327M47030n97553n835263
11276b915506o153918J513160P999132N223044k403353n707323l160902N92130
11268e013536K942161L759524K202901j035683k158695l844P97450k673189n673973
11259f856884l078258J967920L247228J473640J872713M542168M766865J657978
11251I593370n51606K88674J694879J511208M56390o78447k187908l466422l292394
11242C367744k138739j396221q50770L99707J475477Q70507r42489k440447l173151
11233d828382k810064k32813L799966N498221K722931j310263k229543l87177
11225B22876O70008l44529j756747k015746p03327J805538L553025K246647q82541
$$ plain form
11285 1967119 2506198 5698646 9719658 10096512 6195607 3070280 3517310 2919757 -2915506
11276 -2915506 -9069424 -7556264 442868 5665912 3262559 -2444764 -5605666 -5013536
11268 -5013536 -2071375 1688149 3891050 2855367 696672 692828 1490278 -1182911 -6856884
11259 -6856884 -9935142 -7967222 -4719994 -3246354 -1373641 3168527 7935392 9593370
11251 9593370 9041764 9330438 11025317 12536525 12992915 12314468 10126560 6660138 3367744
11242 3367744 1229005 -167216 -1017986 -618279 857198 1727705 785216 -1655231 -4828382
11233 -4828382 -7638446 -7871259 -4071293 1426928 4149859 2839596 610053 222876
11225 222876 892884 548355 -1208392 -3224138 -3927465 -2121927 1431098 3677745 2795204
11216B795204j766559J00647M29476k141843k647980J728761N391738K258363
11208F147807m664228p869947n687699j789313J970854N543757O618876L424146
11200C694253o95537j555475l87115k36853J30695K357912K904111j037743m345546
11191H28702j422700L217188J725380l310892l133725J701493K569772j464162
11183G11056k309155J823600L050702j420388l965626m09696K688585K28934k851792
11174b453780j648175M3692j657312k443095J822213O107257L990106j605981
11166B154925l480527j044449J253566K062153K667512K103230o99486k907606
11158B109318j658302R41138J569113J146777J874887K386424O24261j795298
$$ plain form
11216 2795204 1028645 1129292 1558768 -583075 -3231055 -1502294 3889444 6147807
11208 6147807 1483579 -6386368 -12074067 -13863380 -11892526 -6348769 270107 3694253
11200 3694253 2998716 1443241 1056126 819273 949968 3307880 6211991 5174248 828702
11191 828702 -593998 2623190 4348570 1037678 -2096047 -394554 2175218 711056
11183 711056 -1598099 225501 3276203 1855815 -2109811 -2519507 169078 398012 -2453780
11174 -2453780 -4101955 -4058263 -5715575 -8158670 -6336457 -229200 3760906 2154925
11166 2154925 -1325602 -2370051 -1116485 945668 3613180 5716410 5016924 2109318
11158 2109318 451016 1392154 2961267 4108044 5982931 8369355 8993616 7198318
11150G198318k535291k545642l250319l439631k442571k027630j904626J196110
11142i751282O335092O862858Q58030m058228k286702Q21964j006099l558978
11134e783345k30145M939117L468336k766236m642073j060772N87891j797380
11126g284607k226139J696360M625726K915666m58556k260855k790384k077190
11118g859979O99194L330718K882535J527780K782589L356901j967275q505475
11110c753012o275472K884124N750954j428988n975725Q72358R360568O815763
11102H250570k364479m517209J966086N896669J314179n236206o033488k017017
11094b740895Q51219m01409l235160k616659L116762Q368811N720715k812433
$$ plain form
11150 7198318 4663027 2117385 -1132934 -4572565 -7015136 -9042766 -10947392 -9751282
11142 -9751282 -3416190 3446668 4304698 246470 -2040232 -1218268 -2224367 -5783345
11134 -5783345 -6013490 -1074373 2393963 -372273 -5014346 -6075118 -5487227 -7284607
11126 -7284607 -9510746 -7814386 -3188660 -272994 -731550 -2992405 -5782789 -7859979
11118 -7859979 -7160785 -3830067 -947532 580248 3362837 6719738 4752463 -3753012
11110 -3753012 -10028484 -7144360 -1393406 -2822394 -8798119 -7925761 1434807 8250570
11102 8250570 5886091 1368882 3334968 9231637 10545816 5309610 -723878 -2740895
11094 -2740895 -1889676 -2291085 -5526245 -8142904 -5026142 3342669 9063384 6250951
11086F250951n844778J635149R324834N865705l975879o678251o82196K547331
11078H442866k337857p092606m584097M85033J272536j11213J472686M116820
11070A664168K754880j356715k718812n10607J265578P90906l35088j446503k850299
11061b742492k663360R55528N188187N452123K320504J95065l73723k838061o720969
11052a227198o412280l18100M872105K996232k922277n062404q42892N275243
11044c641571P833076M935529j344590o238377n705138j025348K006997N57109
11036b622313j513225j73245K056595M15377l694783m205710N57717N560679O136440
11027B517532L022666l77656k050157j800309o76730o74161k509509l625480j131889
$$ plain form
11086 6250951 406173 2041322 11366156 17231861 13255982 6577731 5895535 8442866
11078 8442866 6105009 -987597 -5571694 -5086661 -3814125 -3925338 -2452652 1664168
11070 1664168 4419048 3062333 343521 -167086 1098492 1889398 1554310 107807 -2742492
11061 -2742492 -5405852 -4450324 737863 6189986 8510490 8705555 8331832 5493771 -1227198
11052 -1227198 -7639478 -7957578 -3085473 -89241 -3011518 -8073922 -8916814 -3641571
11044 -3641571 4191505 9127034 7782444 1544067 -4161071 -5186419 -3179422 -2622313
11036 -2622313 -4135538 -4308783 -2252188 -1836811 -5531594 -9737304 -9179587 -3618908 2517532
11027 2517532 5540198 5162542 3112385 1312076 635346 -38815 -2548324 -6173804 -7305693
11018g305693L402247N164471K252414k249076m395225k886862J170409M977316
11010A30001M990404M75864m339836m975379k591767j380389j590280k94659K100591
11001g475450K434038J472994K917188N311925L001018l107577m508147J499231
10993A545220O081117K186611m365877m492464J38535J475269j376701k525076
10985a333366m73279M66940r58426j255471M05209P62676p42597q08016Q98465
10976c037865N03109k647846l732312k77072L465549L305493J458517K174381
10968A211954M664323M670613J088218k713955l479955j430918P46988Q55036
10960E612304p21129j495125p0231J533759L28539l117516m891206k958841Q4137
$$ plain form
11018 -7305693 -3903446 1261025 3513439 1264363 -3130862 -6017724 -4847315 130001
11010 130001 5120405 5596269 1256433 -3718946 -6310713 -7691102 -9281382 -9576041 -7475450
11001 -7475450 -5041412 -3568418 -651230 4660695 7661713 4554136 45989 1545220
10993 1545220 7626337 9812948 5447071 954607 1093142 2568411 1191710 -1333366
10985 -1333366 -1806645 -1339705 -2298131 -3553602 -3148393 -2385717 -3128314 -3936330 -3037865
10976 -3037865 -2534756 -5182602 -8914914 -9191986 -5726437 -2420944 -962427 1211954
10968 1211954 5876277 10546890 11635108 8921153 5441198 4010280 4757268 5612304
10960 5612304 4891175 3396050 3325819 4859578 5188117 2070601 -2820605 -5779446 -5695309
10951e695309O90115q63443j005148K262788O183937N631455r18721q368078r658956
10942a1741360l788530K996235M922629K886316J112829P55406J74021p11902
10934c394356m86678M68486N71961J91483O54911J019821k99417j495740O08400
10925b161129M710884N825306K427637j566344k766000j961985p97150P84546
10917D495765K151457J272313j523698k826658j238265M93364L74571J5872K04304
10908C419025j468827m853737m266335K947476R043052M856488n790327r481837
10900e595022j783348O466435N058959j531899k670966J928307L463161p19351
10892D616276l367953k35430K669757n30250n342348l989350K096964M823126
$$ plain form
10951 -5695309 -5005194 -5868637 -6873785 -4610997 1572940 7204395 6285674 -2082404 -11741360
10942 -11741360 -15529890 -12533655 -7611026 -4724710 -3611881 -2856475 -2682454 -3394356
10934 -3394356 -3881034 -3412548 -2840587 -2649104 -1994193 -974372 -1273789 -2769529 -2161129
10925 -2161129 2549755 8375061 10802698 9236354 6470354 4508369 3711219 4495765
10917 4495765 6647222 7919535 6395837 3569179 2330914 2824278 3198849 3214721 3419025
10908 3419025 1950198 -2903539 -7169874 -4222398 4820654 9677142 3886815 -5595022
10900 -5595022 -7378370 -911935 4147024 2615125 -55841 1872466 5335627 4616276
10892 4616276 1248323 1012893 3682650 3152400 -2189948 -6179298 -4082334 740792
10884G40792K064982m34954N00530J186330r88928k468870R5912L795117L875422
10875H366333M31187k916493l949980k453349J012627M020999L112575j312647
10867F311252m119286k457811j61335j596297m677699m381613l70861L390379
10859h063271M365485K680595q82137l907891k172826M639000R610481O471171
10851A2740607j291805n017461k789012l21798r47900j757818l09740J325223
10843A630296J027044Q184j68964K1876m9824l74022j803670m620708n704204
10834a0033992j668720M913741P302945L408231j846211l802555k882505j121128
10826e730194R05812K020092M13479k151412j059323L694058N797800J773897
$$ plain form
10884 740792 2805774 2370820 2871350 4057680 3068752 599882 695794 4490911 8366333
10875 8366333 8797520 5881027 1931047 -522302 490325 4511324 7623899 6311252
10867 6311252 2191966 -265845 -427180 -2023477 -6701176 -11082789 -11453650 -8063271
10859 -8063271 -3697786 -1017191 -1899328 -5807219 -7980045 -3341045 6269436 12740607
10851 12740607 11448802 6431341 3642329 3320531 2372631 614813 305073 1630296
10843 1630296 2657340 2665524 2496560 2518436 2468612 2094590 290920 -4329788 -10033992
10834 -10033992 -11702712 -6788971 513974 3922205 2075994 -1726561 -4609066 -5730194
10826 -5730194 -4824382 -2804290 -2390811 -4542223 -5601546 -1907488 3890312 5664209
10818E664209k998523j974547K752851L941916J91310k639735p90500K261400
10810F408381J883380p68311j346680M15460M05915k707782m357165p98402M259319
10801C394115M252350o13991l821338k437377l42701l71487j61571J289808K92417
10792A480225l581135l629779L080996P911619K658652o466363p637668j844936
10784h028389L6009l567596k775730N418543J0667600N866531j861289l488651
10776B267028j289576j762388l502752j171549L848259N491822K681226k64081
10768F297989r09331n18313j59682J31322l41237j613950j693673K54429J492833
10759B940387l15281l060418l422042j843264q35961m46614Q95195K526585K226975
$$ plain form
10818 5664209 2665686 691139 3443990 7385906 7577216 4937481 4146981 6408381
10810 6408381 8291761 7523450 6176770 6592230 6998145 4290363 -66802 -865204 3394115
10801 3394115 7646465 7032474 3211136 773759 431058 59571 -102000 1187808 1480225
10792 1480225 -2100910 -5730689 -2649693 5261926 7920578 1454215 -6183453 -8028389
10784 -8028389 -7992380 -11559976 -14335706 -8917163 1750437 7616968 5755679 2267028
10776 2267028 977452 -784936 -4287688 -5459237 -1610978 3880844 6562070 6297989
10768 6297989 5388658 4870345 4710663 4841985 4500748 2886798 1193125 1447554 2940387
10759 2940387 2625106 -435312 -3857354 -5700618 -6536579 -6983193 -6087998 -3561413 -1334438
10750a334438J35877j057745L2724J517740P42040j944517k727006J217149O796714
10741C378538P348705J581825l501458k198950J379871J11473m393312m722111
10733a015419l42355J774193r05736l232037k296188j337056j622070J10373L050361
10724e815934J013562n789445p563046K67531Q244252O631025m2105j219969L304806
10715i69323N215492J735647j937326k383419j645116j629638j507238o96634
10707c817555K96026J355488J674926o67443m705926n423874o87261M116843L068177
10698d790599j803580l849389q23475L980549O864319N803913N16749n384772
10690E13715n788912N0923M822003K805605k049307k844723n1731J051794n78297
$$ plain form
10750 -1334438 -1198561 -2256306 -2223582 -705842 36198 -1908319 -4635325 -3418176 3378538
10741 3378538 10727243 12309068 8807610 6608660 7988531 8100004 3706692 -1015419
10733 -1015419 -1357774 416419 -489317 -3721354 -6017542 -7354598 -8976668 -8866295 -5815934
10724 -5815934 -4802372 -10591817 -18154863 -17887332 -9643080 -3012055 -3054160 -4274129 -969323
10715 -969323 4246169 5981816 4044490 1661071 15955 -1613683 -3120921 -3817555
10707 -3817555 -3521529 -2166041 -491115 -1158558 -5864484 -11288358 -11975619 -7858776 -4790599
10698 -4790599 -6594179 -10443568 -11267043 -7286494 -422175 5381738 5898487 513715
10690 513715 -5275197 -5224274 -402271 2403334 354027 -2490696 -2542427 -1490633 -2068930
10681b068930j924102k175102k431263j646014J195638L430208K871968K464990
10673b82607M862222O116935J831708l954211m213089n40238l04986l752231l646931
10664c883428J877893N588440K544260k852979m464645k443746o4220J912766
10656a785659L664329L368731Q5268l169085l018252p02143p2277j558982j653578
10647d841648J041136K576532p57184n520180m512338K354754O291538K193677
10639a173713k821065N3465P036384P300802N2150n060847m232546l835925o173927
10630h855222l907346N562069J1970005O735263l690498p716284m136714O31556
10622c407171L571460M611530J787823m189386o417432j495896L158566M38253
$$ plain form
10681 -2068930 -3993032 -6168134 -8599397 -10245411 -9049773 -5619565 -2747597 -282607
10673 -282607 4579615 10696550 12528258 8574047 4360958 3820720 3515734 -236497 -3883428
10664 -3883428 -2005535 3582905 6127165 3274186 -1190459 -3634205 -3698425 -1785659
10656 -1785659 1878670 5247401 5332669 2163584 -854668 -1556811 -1629088 -3188070 -4841648
10647 -4841648 -3800512 -1223980 -1981164 -7501344 -12013682 -9658928 -3367390 -1173713
10639 -1173713 -3994778 -3941313 3095071 10395873 10448023 5387176 1154630 -2681295 -8855222
10630 -8855222 -12762568 -7200499 4769506 11504769 7814271 97987 -4038727 -3407171
10622 -3407171 164289 4775819 6563642 2374256 -4043176 -5539072 -2380506 -1942253
10614a942253m319570k216746M002243M804462k61055k987108m43981K136173
10606a227835J339410p02752j847970j667134R39011N177695N903030L51562n811573
10597B453444n906693j957465J2456R6574K071809M778213M082647M32768k592503
10588C471250l975017l697992l38360M181383L850001j534133l737082K20079
10580a559871J930802k761422m262671L417261Q812273J406664q190654m517161
10572e724779O444158P547625o89372l407325J506912K326089k673927k799555
10564B529826L075562L547904l715150p191360j969626L090538K488789J431700
10556C288183K344169K48025m756586n817109l060165l675437o243016j482115
$$ plain form
10614 -1942253 -6261823 -8478569 -4476326 328136 67081 -2920027 -3364008 -1227835
10606 -1227835 111575 -591177 -2439147 -4106281 -3167270 2010425 7913455 8265017 2453444
10597 2453444 -3453249 -5410714 -5398258 -5301684 -3229875 1548338 5630985 6063753 3471250
10588 3471250 -503767 -4201759 -4540119 -358736 3491265 1957132 -1779950 -1559871
10580 -1559871 370931 -2390491 -6653162 -3235901 5576372 6983036 -1207618 -5724779
10572 -5724779 719379 8267004 7577632 4170307 5677219 8003308 5329381 2529826
10564 2529826 5605388 9153292 5438142 -1753218 -3722844 -632306 1856483 3288183
10556 3288183 5632352 5880377 1123791 -4693318 -7753483 -11428920 -17671936 -19154051
10548a9154051Q822008J1069892K071054m971341j773558L806020L453313K93776
10540C617113p21980q72227j118222L53108J111847k744303o037623o14888Q236928
10531A209753P420869j973077n800803n99877K436247j199035l149106O3124J892687
10522C00782J021720L330940O786166L158898m273832m446330L59562j552156
10514D685750p432042l969980O129882P392258L54291p31573K587172l425252
10506E590506j3116852p826717O921753Q036780k024268k81710R664591L461504
10498A0425587j1238786l888731J4878139M739565k1762148q577580L4436888
10491A9012934K8991858k5102093j2762002J08469875J90349362Q5712400j16707776
$$ plain form
10548 -19154051 -10332043 737849 2808903 -2162438 -3935996 -129976 3323337 3617113
10540 3617113 2895133 2022906 904684 1257792 2369639 -374664 -6412287 -7027175 1209753
10531 1209753 8630622 6657545 856742 256865 2693112 1494077 -1655029 -1591905 300782
10522 300782 1322502 4653442 11439608 14598506 10324674 5878344 6237906 4685750
10514 4685750 -2746292 -6716272 -586390 6805868 7160159 6428586 9015758 5590506
10506 5590506 -7526346 -15353063 -8431310 -394530 -2418798 -2700508 6964083 10425587
10498 10425587 -813199 -4701930 10176209 14915774 -6846374 -15423954 19012934
10491 19012934 48004792 22902699 10140697 118610572 308959934 394672334 277964558
10484B77964558j95061384r5842193J9224035K5339051j9770114j9803647R462052
10477A512358Q122587j1771602n730474J3965508R162469r022069o004684R074595
10469I308688M292338j3129587j2230764M380044R283280O71716j414104L580147
10461D741758M85134o989715l033075P429605O485064l789532o568136r34466
10453b173363P80020j380815J572609O131187K978372k706950p49153L148802
10445G600709j301623o813699j150371Q066366N589581l591173l651347K990442
10437G738885J707207n845830n387042K352041L371796k695644k328780N747178
10429D659811P705111p08289p820724o533124k484936k4077K878388M653797J099605
$$ plain form
10484 277964558 82903174 -12939019 6285016 31624067 11853953 -7949694 1512358
10477 1512358 9634945 -2136657 -7867131 6098377 15260846 6238777 234093 9308688
10469 9308688 13601026 471439 -11759325 -7379281 1903999 2575715 1161611 4741758
10461 4741758 5226892 -1762823 -4795898 2633707 9118771 5329239 -1238897 -2173363
10453 -2173363 -1393343 -2774158 -1201549 4929638 7908010 5201060 4451907 7600709
10445 7600709 6299086 -514613 -1664984 6401382 11990963 8399790 4748443 7738885
10437 7738885 9446092 3600262 -1786780 565261 3937057 1241413 -1087367 4659811
10429 4659811 12364922 11656633 3835909 -2697215 -5182151 -5206228 -2327840 2325957 3425562
10420C425562l452976j201285L965501K039154m293512l522882L350142L747590
10412D057294l784583o478976L89299N882065K533331k935523l567804k558998
10404f463895l520851k817023J794602N110346L191457j98811q14853k24375p28896
10395d672299n97247J785223M244848M280827K371636L90815k86322O55432J266961
10386I439874j212526n185589n081040j69837K726206j89297l211362j062281
10378c945852K144382J130751q39262J136910M124924L568669J843549J756547
10370A0920618n00579o313403p586654M3730O272821J436294o325572m006955
10362f059700M524394O130299O11849k153338j372989l366075n189876O77745
$$ plain form
10420 3425562 -27414 -1228699 2736802 4775956 482444 -3040438 309704 4057294
10412 4057294 272711 -6206265 -5816966 65099 2598430 -337093 -3904897 -6463895
10404 -6463895 -9984746 -12801769 -11007167 -5896821 -2705364 -2904175 -3719028 -3943403 -4672299
10395 -4672299 -5269546 -3484323 760525 5041352 7412988 7803803 7517481 8172913 9439874
10386 9439874 8227348 3041759 -2039281 -2209118 517088 327791 -2883571 -3945852
10378 -3945852 -1801470 -670719 -1509981 -373071 3751853 7320522 9164071 10920618
10370 10920618 10420039 4106636 -3480018 -3436288 2836533 4272827 -2052745 -6059700
10362 -6059700 -1535306 4594993 5206842 3053504 1680515 -1685560 -6875436 -6197691
10354f197691Q628580O367861l036349n230723N99542J543710m302969m523174
10346f151213L531483O759338k75060n934922k435760K202726Q92518q62013J615219
10337f57684K803723m22987j433007K617805L927713j087167m035248r1339K649185
10328D270994j591754n440601k587814N86423j751089l080192K267840O460480
10320h65713J800564m111031j099534N142342K604384o104175p952355n07395
10312a1092913N714894M148565r69051l977905l680281k96823M718897O502730
10304A068113J992823l845434l909792O27049K640247M4887k470993j634763Q17616
10295d670247K256985J799352n14503l257878l735063j735230o82479j988225
$$ plain form
10354 -6197691 2430889 8798750 5762401 531678 1131220 2674930 -1628039 -6151213
10346 -6151213 -2619730 4139608 3864548 -2070374 -4506134 -2303408 -1410890 -2272903 -657684
10337 -657684 2146039 1723052 290045 2907850 6835563 5748396 1713148 1621809 4270994
10328 4270994 2679240 -2761361 -5349175 -4762752 -6513841 -9594033 -7326193 -865713
10320 -865713 934851 -3176180 -4275714 866628 3471012 -2633163 -10585518 -11092913
10312 -11092913 -5378019 -1229454 -2198505 -6176410 -9856691 -10153514 -5434617 1068113
10304 1068113 3060936 -784498 -4694290 -4067241 -1426994 -1382107 -3853100 -5487863 -4670247
10295 -4670247 -2413262 -613910 -1128413 -4386291 -8121354 -9856584 -10539063 -12527288
10287a2527288j888185K326590O964821P338717M635720K522106P41025k383266
10279G730240m452885k188504K027354K684090q07807l514686j944480K151184
10271A684506M565073K713483k240249n840439m542971k66206J828801L86563
10263a711439j150189q64323n47436p01330O85325K858020K281180j79362O82064
10254A352510M615899M416810j922108o287489l123397J606511J010697j524139
10246A45294j48645K078366l06830l569390r77855L845592J840947n570097p749188
10237a0411806j943294K741751O50516k049877J107382N882973M379817k551858
10229b194396o787766m261755J021944L921800M345991M843797N153697K695925
$$ plain form
10287 -12527288 -14415473 -12088883 -5124062 2214655 6850375 9372481 10113506 7730240
10279 7730240 3277355 1088851 3116205 5800295 4992488 1477802 -466678 1684506
10271 1684506 6249579 8963062 6722813 882374 -3660597 -3926803 -2098002 -1711439
10263 -1711439 -2861628 -3725951 -4273387 -4974717 -4289392 -1431372 849808 670446 1352510
10254 1352510 5968409 10385219 8463111 2175622 -947775 658736 1669433 145294
10246 145294 -3351 2075015 1768185 -1801205 -2779060 1066532 2907479 -2662618 -10411806
10237 -10411806 -12355100 -9613349 -8962833 -11012710 -9905328 -4022355 357462 -2194396
10229 -2194396 -8982162 -13243917 -12221973 -8300173 -3954182 889615 6043312 8739237
10221H739237j955102m119813j534383J724078J387913k73654R20352K802010
10213G690638M94831l695253l027767J495583J911607k603756l680147J172074
10205b42190L508792p07306l091608J943608N908977O95584o300590m172698L020711
10196E63280L799986j278848k567243P36482Q69816k488593j557254M242677O299343
10187H619646J550264l249752l764716l096582k899317o72283K225740P90324
10179d96676l513975l633751N24130J837925k16697J658380P345099O930311j590817
10170H843929o521043j484441L574783k81807n551759j834611O067767O824311
10162I637129J042207k487310k596572m075086n052949k31349O059986M124359
$$ plain form
10221 8739237 6784135 2664322 1129939 2854017 4241930 3968276 4888628 7690638
10213 7690638 8185469 4490216 1462449 2958032 4869639 2265883 -1414264 -242190
10205 -242190 3266602 2559296 -532312 1411296 7320273 8015857 1715267 -2457431 563280
10196 563280 4363266 3084418 517175 1253657 2123473 -365120 -1922374 2320303 8619646
10187 8619646 10169910 6920158 3155442 58860 -2840457 -3512740 -1287000 -496676
10179 -496676 -4010651 -7644402 -7120272 -5282347 -5499044 -3840664 3504435 10434746 8843929
10170 8843929 2322886 838445 4413228 4131421 -1420338 -3254949 2812818 9637129
10162 9637129 10679336 8192026 5595454 1520368 -3532581 -3763930 2296056 6420415
10154F420415m474539p893059k465226K489415O42441k500553p68707L148917
10146e400896M517308M175278L968717K134419j310455j494609L131241N816251
10138A5537254J198713n440280n784564j000402J239073o90473j362904R75338
10130D671755J282574k942553o501770m334106O65888K070730j051817l974001
10122a0113300l506337j058656J290581L803424O666912P403668L534325k903053
10114E117564o199915l277140K489736N150855K880587r62723k907080l023583
10106g31699k820534j925319Q43667M091118M302012N55949l034226j633437L695902
10097C343433N939148N54802p405082q278348o34542N490212J879839n536101
$$ plain form
10154 6420415 1945876 -5947183 -8412409 -5922994 -5280553 -7781106 -8549813 -5400896
10146 -5400896 -883588 3291690 7260407 9394826 8084371 6589762 9721003 15537254
10138 15537254 16735967 11295687 5511123 4510721 5749794 5059321 3696417 4671755
10130 4671755 5954329 3011776 -3489994 -7824100 -7158212 -5087482 -6139299 -10113300
10122 -10113300 -13619637 -14678293 -13387712 -9584288 -2917376 4486292 8020617 5117564
10114 5117564 -1082351 -4359491 -1869755 3281100 6161687 5198964 2291884 -731699
10106 -731699 -3552233 -5477552 -4633885 -542767 3759245 4315194 1280968 -352469 3343433
10097 3343433 9282581 9837383 2432301 -5846047 -6480589 -990377 889462 -4646639
10089d646639m564631M982427J0247090M341819l576033l077039J600024j52671
10081E154347p314002r329192l436374K369554L629137M494340O487087M352196
10073F407093k516257n960323k389743N12353k429001m254422Q45683N371670
10065d412947J484375l554846N34408P463490M126444n328813m875905N427156
10057H63362Q078040k133265q467301m83462Q047997K459792q327185p192096
10049g154118L590081Q361009L808824K19420J085805m57637n300908n253530
10041a101054J123542M233419m00653m218726L1914O362417N295760j948171o537035
10032B841413m637145m76979O56597k179439n776289n830422j241131L936225
$$ plain form
10089 -4646639 -9211270 -4228843 6018247 10360066 6784033 3706994 5307018 5154347
10081 5154347 -2159655 -11488847 -14925221 -12555667 -8926530 -4432190 2054897 6407093
10073 6407093 3890836 -2069487 -4459230 -3946877 -6375878 -10630300 -9784617 -4412947
10065 -4412947 -2928572 -6483418 -5949010 1514480 5640924 312111 -4563794 863362
10057 863362 8941402 6808137 -1659164 -2142626 5905371 8365163 37978 -7154118
10049 -7154118 -3564037 4796972 8605796 8825216 9911021 9453384 4152476 -1101054
10041 -1101054 22488 4255907 3855254 -363472 -331558 6030859 11326619 9378448 2841413
10032 2841413 -1795732 -2272711 -1616114 -3795553 -9571842 -15402264 -16643395 -12707170
10024a2707170N130534L277458K429389K509565K92212k756585j085295M975782
10016B065890P539170K586948m048531o005025m690879l545274j144513L588640
10008c653574N667687J389373l434415j054223N836725P946042L254643j779383
10000A4172875l498915m370284n187291l256157L24412M29435k784847k872325
9992g043097J619880L572874o62429m226915q31986M811060N098964J568461L54556
9983D261368R87865p86710k968100m15606M223181L358890k353909m344672m71145
9974A491162J672997j788666m735496k322269J175667J135865L58756J813070
9966a198914J808747k303054m956478j091433M233764L658934n03531j331911
$$ plain form
10024 -12707170 -7576636 -4299178 -1869789 639776 931988 -1824597 -2909892 2065890
10016 2065890 9605060 12192008 8143477 2138452 -2552427 -6097701 -7242214 -3653574
10008 -3653574 2014113 3403486 -30929 -1085152 4751573 12697615 15952258 14172875
10000 14172875 10673960 6303676 1116385 -2139772 -1815360 -1385925 -4170772 -7043097
9992 -7043097 -5423217 -1850343 -2512772 -6739687 -7571673 -2760613 2338351 3906812 4261368
9983 4261368 5249233 4462523 1494423 1078817 5301998 8660888 6306979 1962307 1491162
9974 1491162 3164159 1375493 -3360003 -5682272 -4506605 -3370740 -3011984 -1198914
9966 -1198914 609833 -1693221 -6649699 -7741132 -3507368 151566 -351965 -1683876
9958a683876M57305o04632l266773j673600L196342M762836K356954J209638J686371
9949F440565p92504n054550m517735N67340K308212j277413l047074n2095J444566
9940c980688j381314j950381K826763M995710q38332o450984k590943N563451
9932c806718O712546J176443j391763J631245L406864M67886k496335j675055
9924D025113M37320N73524n68278j019432n85590N7406L06360m79991j767859
9915I78573j579879M28258J626311L78124j414466k114840l046034m453141l144875
9906a2341969J889943N894367M994302K196166J726935J794004j078816m438956
9898F35976l318185J461356M592816L739822M42499l777893p253335p218149l768432
$$ plain form
9958 -1683876 -1226571 -1831203 -5097976 -6771576 -3575234 1187602 3544556 4754194 6440565
9949 6440565 5648061 593511 -3924224 -3356884 -1048672 -2326085 -5373159 -5425254 -3980688
9940 -3980688 -5362002 -7312383 -4485620 510090 -328242 -6779226 -9370169 -3806718
9932 -3806718 2905828 4082271 2690508 4321753 7728617 8196503 5700168 4025113
9924 4025113 4462433 5035957 4467679 3448247 2862657 2920063 3226423 2746432 978573
9915 978573 -601306 -173048 1453263 1831387 416921 -1697919 -4743953 -9197094 -12341969
9906 -12341969 -10452026 -4557659 436643 2632809 4359744 6153748 5074932 635976
9898 635976 -2682209 -1220853 3371963 7111785 7554284 3776391 -3476944 -10695093 -14463525
9889a4463525j115905p45797J223091N194552M362223l165475p362668j480520
9881a7554024M533964p85992r320786m317551J1704769J8806732R482382j885532
9873A0663962k944806P18141O5051k549403j869189n93113k355160l586184q24775
9864c275476K229777K220293K358384M418982L377855k646674o037358j539658
9856A106125L888229K073393l194364l620322k20102O03884p82020M49426L273058
9847C577307K924833K23646n13568j0796j614912l277974j004909K407623J445378
9838D156628j671504m88141L428260K292091m160718p435378m040598k60323n84062
9829h763745j027619J876529L956096Q69146l757386l714723N60860L662364L291122
$$ plain form
9889 -14463525 -15579430 -16325227 -15102136 -9907584 -5545361 -8710836 -16073504 -17554024
9881 -17554024 -13020060 -13806052 -23126838 -27444389 -15739620 3067112 12549494 10663962
9873 10663962 7719156 8437297 8502348 5952945 4083756 3490643 1135483 -2450701 -3275476
9864 -3275476 -1045699 1174594 3532978 7951960 11329815 8683141 2645783 1106125
9856 1106125 4994354 7067747 3873383 253061 32959 636843 -145177 304249 3577307
9847 3577307 6502140 6725786 6212218 6201422 4586510 1308536 303627 2711250 4156628
9838 4156628 2485124 1996983 5425243 7717334 3556616 -3878762 -7919360 -8179683 -8763745
9829 -8763745 -9791364 -7914835 -3958739 -3089593 -6846979 -10561702 -10000842 -6338478 -3047356
9820c047356J849141J582530K059522J907676N54738j386526k231815o20439K467471
9811C134942M367562L889404K243625N10741j683915m140959m871161k523773
9803I26466J123664K672957R55696j516103j416359J144457K222688q59600m952429
9794C01437m400649R83288M981786L483657n0440m99730J340658J387644m70474
9785G057177j060746k19569p08963k256990j398016J939381L106267l2329l230228
9776C195984k120447J362924K377542N07905k10042K288395N138470M517235L01164
9767A7359130m176556n745031l914553o08296J603986J289740p53344j933623
9759C121453l31044K763379L792122J264720k055958k737739j209187m83417j259218
$$ plain form
9820 -3047356 -1198215 384315 2443837 4351513 4906251 3519725 1287910 667471 3134942
9811 3134942 7502504 11391908 13635533 14146274 12462359 8321400 3450239 926466
9803 926466 2050130 4723087 5678783 4162680 2746321 3890778 6113466 5253866 301437
9794 301437 -4099212 -3115924 1865862 5349519 5299079 4799349 6140007 7527651 7057177
9785 7057177 5996431 5776862 5067899 2810909 1412893 3352274 6458541 6426212 3195984
9776 3195984 1075537 2438461 4816003 5323908 5113866 7402261 12540731 17057966 17359130
9767 17359130 13182574 7437543 3522990 2914694 4518680 5808420 5055076 3121453
9759 3121453 2790409 5553788 9345910 10610630 8554672 5816933 4607746 4124329 2865111
9750B865111j288211L75365J593859M38478k271069m551088n096808l050157J385362
9741i599158N408429N562263K135002j141826k369117l006561l357747r58150
9733g326865M393201Q111211O398457J261911k764543l958209k990349n37190
9725B587624J766914J272389j648467k756369l08609J486089p12836l116532o71576
9716b101373M044333M188969p16813m058782k028582J572645J675100j470634
9708A104863l939873l423343j133511J86342n85763j427354L45784L754365M663571
9699d54919J736881j274030j241540j15239o58445j387361J25224K045477J235513
9690A1561q97880n71220J874476K506142k0679l031768l895055k087403J583081
$$ plain form
9750 2865111 1576900 1952265 3546124 3984602 1713533 -2837555 -7934363 -10984520 -9599158
9741 -9599158 -4190729 1371534 3506536 2364710 -4407 -3010968 -6368715 -7326865
9733 -7326865 -2933664 5177547 11576004 12837915 10073372 6115163 3124814 2587624
9725 2587624 4354538 5626927 3978460 1222091 913482 2399571 1686735 -1429797 -2101373
9716 -2101373 1942960 6131929 5415116 1356334 -672248 900397 2575497 1104863
9708 1104863 -2835010 -6258353 -7391864 -7205522 -7791285 -9218639 -8872855 -5118490 -454919
9699 -454919 1281962 7932 -1233608 -1348847 -2007292 -3394653 -3269429 -1223952 11561
9690 11561 -886319 -1457539 416937 2923079 2902400 -129368 -4024423 -6111826 -4528745
9681d528745M727549M259608O38829j423631J30233P70266l165189p201526n008685
9672a0801291J449225M952672L654891J523387K98859j395955k412707l46188
9664c077107K376288J258143k109808k298654L29622M86002j957307j597265K346568
9655d243518M434873K629380P58084J99596j823950m277025k388943K291338K288230
9646a31935k504818l022401L279669O591068Q42515n733258m394183J47482m31385
9637e357246l205655n81433M964196N014513m9002k189370O37794K660121J051187
9628B945105j017507j655723k155988j970914N35605K880343J362312j644888
9620g21655p52850L008592L736444J048747M38476K874709K741567k116485o309396
$$ plain form
9681 -4528745 198804 4458412 5097241 3673610 3803843 4574109 1408920 -5792606 -10801291
9672 -10801291 -9352066 -4399394 -744503 778884 1077743 -318212 -2730919 -3077107
9664 -3077107 -700819 557324 -1552484 -3851138 -3521516 -3035514 -4992821 -6590086 -4243518
9655 -4243518 191355 2820735 3578819 3778415 1954465 -2322560 -4711503 -2420165 -131935
9646 -131935 -2636753 -5659154 -2379485 4211583 5054098 -679160 -5073343 -4925861 -5357246
9637 -5357246 -8562901 -9144334 -4180138 834375 785373 -1403997 -766203 1893918 2945105
9628 2945105 1927598 271875 -1884113 -3855027 -3319422 -439079 923233 -721655
9620 -721655 -1474505 1534087 5270531 6319278 6757754 9632463 12374030 10257545 3948149
9611C948149n474453j995606N50828K288409L540492K424796q34329k351044l96460
9602A700782J784580J489362K38291m06565j711751l723670l352832K32874K919247
9593h29682J802571l03694m6263J104828N57923m93329j82153j63718k065685
9584f19202l283881j325722Q89583m61179l168482k583996K33674P30062l67376
9575i956519J882211O857856P697990K298196k469601j034575K803621K703381
9567A0782560o50395k381777j860712k123565l268796k662947p18242n55315j896786
9558e335975q85243L029917N173441K581644j423882k172398J22062J764258P94603
9549C648427j735468l947168m444264k797632l71732N33992n70982j834323j700355
$$ plain form
9611 3948149 -1526304 -3521910 -2971082 -682673 2857819 5282615 4448286 2097242 1700782
9602 1700782 3485362 4974724 5213015 4806450 3094699 -628971 -3981803 -3748929 -829682
9593 -829682 972889 669195 622932 1727760 2285683 1792354 1610201 1446483 -619202
9584 -619202 -3903083 -5228805 -4339222 -4800401 -7968883 -10552879 -10319205 -9589143 -9956519
9575 -9956519 -8074308 -1216452 6481538 8779734 6310133 5275558 8079179 10782560
9567 10782560 10132165 7750388 5889676 3766111 497315 -2165632 -2883874 -3439189 -5335975
9558 -5335975 -6221218 -3191301 1982140 4563784 3139902 967504 1089566 2853824 3648427
9549 3648427 1912959 -2034209 -6478473 -9276105 -9647837 -9113845 -9684827 -11519150 -13219505
9540a3219505j59246K588370N738534O231938J843514l399595k427037M185096
9532A382069O975529Q68247o665409o407471n04805K675250J893964K065579L190617
9523E473570P62465l627202k786594L541403O543053J665329m801543o196241
9515E74240m283647l088556j712806J124096K172358m28887j976196J507947N614225
9506d97226M046035j130142k981298p29973J66460k198505l424331n22015L275397
9497c995598L335734j90116k923253j623085J983276K952200p01740m670542l690146
9488i523270R13838L312234K257853K197389M606608N088730J397799k528119
9480G723062l663427m047086m367376j297398M127730M208723k817282o725333
$$ plain form
9540 -13219505 -13378751 -10790381 -5051847 1180091 3023605 -375990 -2803027 1382069
9532 1382069 8357598 9225845 2560436 -3847035 -4351840 -1676590 217374 2282953 5473570
9523 5473570 6236035 2608833 -177761 3363642 9906695 11572024 6770481 574240
9515 574240 -3709407 -6797963 -8510769 -7386673 -5214315 -5643202 -7619398 -6111451 -497226
9506 -497226 3548809 2418667 -562631 -1292604 -1126144 -3324649 -6748980 -7270995 -3995598
9497 -3995598 -659864 -849980 -3773233 -5396318 -3413042 -460842 -1162582 -5833124 -9523270
9488 -9523270 -8609432 -5297198 -3039345 -841956 3764652 8853382 10251181 7723062
9480 7723062 4059635 12549 -4354827 -5652225 -1524495 2684228 -133054 -6858387
9472f858387l65435P716791O331139l15319n50504M528554L649263m404168q492592
9463A239342l742269J669695J167935j258858p39315P04410O08251R60383K264763
9454B874337J092767k425910k689935J842983M875111J984634l015488n035050
9446d96551m087040j613547K356680N491228M091083K75826O5575K241693q26597
9437G498350q317165q967649N39389P712128L079546m856339m138975J620684
9429e830031J615435k947562k409677L598743O236264K864336n96095j579354
9421I52059l133771m661434j879243L471055M574088J109469l08179J760985J508490
9412C393519k316850l280167Q22487L221534m5309l103772q07362K193180N0586
$$ plain form
9472 -6858387 -7223822 492969 6824108 6508789 5958285 10486839 14136102 9731934 1239342
9463 1239342 -2502927 -833232 334703 -924155 -1663470 -959060 -350809 609574 2874337
9454 2874337 3967104 1541194 -1148741 694242 5569353 7553987 4538499 -496551
9446 -496551 -4583591 -6197138 -3840458 1650770 5741853 6017679 6083254 8324947 7498350
9437 7498350 -818815 -9786464 -9247075 -1534947 1544599 -3311740 -7450715 -5830031
9429 -5830031 -4214596 -7162158 -9571835 -5973092 263172 3127508 2531413 952059
9421 952059 -2181712 -6843146 -8722389 -5251334 -677246 432223 124044 1885029 3393519
9412 3393519 1076669 -2203498 -1381011 1840523 1795214 -1308558 -2115920 77260 127846
9403A27846l669942k203743K604165L433801k89384j906542J141293L370842O25453
9394C233789k907423j097985M399387N909204O09847n112945m299822J023297
9386A757349L046547n58597l882264k061469K074240L357934J593479l32431j698677
9377C296111k857847k298015L82913J673066n73115k284297N09339L780380J205373
9368B833908m661823n325246M13825M770684L027106j017947l007577l456490
9360f423560l131815o04800K871528L024132j05570j182186J467323K998797J001140
9351h5011l91198R89194Q16381k845749m251533J02086L904101J145800k920249
9342c536178j05147O547791O998227k68409o717248o627316k697690Q95980K950398
$$ plain form
9403 127846 -3542096 -5745839 -3141674 292127 2743 -1903799 -762506 2608336 3233789
9394 3233789 326366 -771619 3627768 9536972 10146819 5033874 734052 1757349
9386 1757349 4803896 4245299 363035 -1698434 375806 3733740 5327219 4994788 3296111
9377 3296111 438264 -1859751 -1476838 196228 -376887 -2661184 -2151845 1628535 2833908
9368 2833908 -1827915 -7153161 -6739336 -1968652 1058454 40507 -2967070 -6423560
9360 -6423560 -9555375 -10160175 -7288647 -4264515 -4370085 -5552271 -4084948 -1086151 -85011
9351 -85011 -476209 512985 1329366 -1516383 -5767916 -5665830 -1761729 -615929 -3536178
9342 -3536178 -3641325 2906466 9904693 9636284 2919036 -3708280 -6405970 -5509990 -2559592
9333b559592K395539j515026n231125l747413J581488M177122J981591k11536
9325c128952P28070J973257J029774J22161J242182K052345K58890k063339j995196
9316B19192l82065K01423n59819j424068j889067j538045M70674L129321L333836
9307A561382K44205k503688j529826J408091K083386j59253j989322j095007J007239
9298i72793J460110k48237j787474r31179J267164J173001k563364o064905m543287
9289a3210964J000172M526331K753177j132121k634147j427245K34008J426296
9281h464493K130499J324395j312566l295691j971376J623540M094632L988435
9273a882625K298944j98657l039221m137551j356794L518569N593919K817349
$$ plain form
9333 -2559592 -164053 -1679079 -6910204 -10657617 -9076129 -4899007 -2917416 -3128952
9325 -3128952 -2400882 -427625 602149 724310 1966492 4018837 4277727 2214388 219192
9316 219192 -162873 38550 -521269 -1945337 -3834404 -5372449 -4901775 -1772454 1561382
9307 1561382 1805587 -698101 -2227927 -819836 1263550 1104297 -885025 -1980032 -972793
9298 -972793 487317 239080 -1548394 -2479573 -1212409 -39408 -2602772 -8667677 -13210964
9289 -13210964 -12210792 -7684461 -4931284 -6063405 -8697552 -10124797 -9890789 -8464493
9281 -8464493 -6333994 -5009599 -6322165 -9617856 -11589232 -9965692 -5871060 -1882625
9273 -1882625 416319 217662 -2821559 -6959110 -8315904 -4797335 796584 3613933
9265C613933j477085l263618k534062j534558o88145R87721K795352K751835Q08272
9256A459645r11308j183122o54197L13481J970045K852482N31656l776649m978584
9247d376551j269970K064777L13504k489692N73750P116763P405354n87017o958687
9238A792231m519538Q09583P21378j849327P96229O209366M937726l149573p679274
9229a931199m225823l71423j567748k099652L159870P652626L164965n834642
9221b053026q322682l145900J083296L90159p04649M54731O32245j133588n73189
9212a3372603L340276N064268J729483j563012m62841J390307l58902k408216
9204f641240J54454M224327L222802j762623l729692j080856J162375J034355
$$ plain form
9265 3613933 2136848 -1126770 -3660832 -5195390 -5883535 -4895814 -2100462 651373 1459645
9256 1459645 548337 -634785 -1288982 -975501 994544 3847026 4378682 602033 -4376551
9247 -4376551 -5646521 -3581744 -3268240 -5757932 -5184182 1932581 9337935 8750918 1792231
9238 1792231 -2727307 -1917724 -1196346 -3045673 -2249444 3959922 8897648 5748075 -1931199
9229 -1931199 -6157022 -6528445 -8096193 -10195845 -7035975 616651 3781616 -2053026
9221 -2053026 -10375708 -13521608 -12438312 -12048153 -12752802 -12298071 -11665826 -12799414 -13372603
9212 -13372603 -10032327 -4968059 -3238576 -4801588 -5264429 -3874122 -4233024 -6641240
9204 -6641240 -6486786 -2262459 960343 -802280 -4531972 -5612828 -4450453 -3416098
9196c416098J870554L802899J807913m621670p929157l491310K666781L189091
9188f120997O17743J812758N369226L654555l866669q420906m695610J824202
9180i825698L769126K062760K268956M862659N080257J160471k688893k500592
9172D189046J76192J290720J30696o54660M7666P6695j930611l499514j870087
9163b043857J131127J349710j030081j323480K142668M752082K360274k522490
9155D815953m796893l737675j754746Q18900M521459O457862L148883l015361
9147F458382n794834l473593K7361K076335L464991L602938M07512l779006l214890
9138b24804J892002L969900n45473n102567k949466K725488M170062P6462m403589
$$ plain form
9196 -3416098 -1545544 2257355 4065268 -556402 -8485559 -11976869 -9310088 -6120997
9188 -6120997 -5503254 -3690496 1678730 5333285 1466616 -6954290 -11649900 -9825698
9180 -9825698 -6056572 -3993812 -1724856 3137803 8218060 9378531 6689638 4189046
9172 4189046 4365238 5655958 5786654 5131994 5179660 5256355 3325744 -173770 -2043857
9163 -2043857 -912730 436980 -593101 -1916581 226087 4978169 7338443 4815953
9155 4815953 19060 -3718615 -5473361 -4654461 -133002 6324860 9473743 6458382
9147 6458382 663548 -2810045 -2782684 -706349 2758642 6361580 6769092 2990086 -224804
9138 -224804 1667198 5637098 5091625 -10942 -2960408 -234920 3935142 4011604 -391985
9129c91985n283312k490400J965319M488466K034017k663070k555618L163371
9121a733212N952869P13405n085739k747284L490145L589070j704049l005900
9113e30695J384747L546396L79415j853748M11322K229709P3636j770902O65213
9104D535093M072559L611280l31599m593285o960173n258784J032662O477197
9096B584950M214632l189870n596880n16261K912927q55879m799752j921406K913684
9087d253855K248024j104133k99010K958292K590680J8209J039414M159150K838260
9078A0195031k369583m307699j294703R90739n1926p93150M36297P11887m38565
9069C078328L57611K713974J604397l276479n237142j313834K282041K72721k897909
$$ plain form
9129 -391985 -5675297 -8165697 -6200378 -1711912 322105 -2340965 -4896583 -1733212
9121 -1733212 4219657 4933062 -152677 -2899961 590184 4179254 2475205 -530695
9113 -530695 854052 4400448 4779863 2926115 3337437 5567146 5640782 3869880 4535093
9104 4535093 8607652 12218932 11887333 7294048 333875 -4924909 -3892247 2584950
9096 2584950 6799582 3609712 -1987168 -2503429 409498 -446381 -5246133 -7167539 -4253855
9087 -4253855 -2005831 -3109964 -3408974 -450682 2139998 2158207 3197621 7356771 10195031
9078 10195031 7825448 3517749 2223046 3213785 3161859 2368709 2805006 3516893 3078328
9069 3078328 3435939 6149913 7754310 4477831 -759311 -2073145 208896 481617 -2416292
9060b416292n95677M836330N556785L4699n401801n858502k909002j69726J193534
9051e729652J307899j90286k719078l866030j990563J433137L556814L395448
9043d802311J979297J35588j859979k554648J35925N300279Q147171N217343p55425
9034A0943240l926565k548500j09326L22277o07016j253742j491995j481242q87437
9025a040306k76723o19797j087223l81975R0016j417013k005032K542742R074421
9016D879110R044625J235042n339647m756402k126141l010667l601324O50565
9008c024839M297815J40253p066568o491100J902784P462413M938517l2527j996188
8999A30560k337536l040481k464648l8736J745564K171766L081874L713783J245362
$$ plain form
9060 -2416292 -3011969 1824361 7381146 7415845 2014044 -3844458 -6753460 -6923186 -5729652
9051 -5729652 -4421753 -4612039 -7331117 -11197147 -13187710 -11754573 -8197759 -4802311
9043 -4802311 -2823014 -2687426 -4547405 -7102053 -6966128 -1665849 6481322 11698665 10943240
9034 10943240 7016675 4468175 4358849 4681126 4074110 2820368 1328373 -152869 -1040306
9025 -1040306 -1317029 -1936826 -3024049 -3406024 -3316008 -4733021 -6738053 -4195311 4879110
9016 4879110 13923735 15158777 9819130 5062728 2936587 -74080 -3675404 -3024839
9008 -3024839 1272976 1413229 -5653339 -12144439 -10241655 -2779242 2159275 2126748 130560
8999 130560 -2206976 -5247457 -7712105 -7750841 -6005277 -3833511 -751637 2962146 4207508
8990D207508k516542k032196K796110N346200K302128j755397k302603j035613
8982E009595j122795k012737k110172j856567j549541l17028J061849O17684p37895
8973c017607m76961J43987j994662m582533k031970M232940O114416J582408j813336
8964a843318L36988K087864k006555o881419m719120L132018Q750890Q048766
8956F906114L089325k310952m729244k510740J260607J064738k917222l998460
8948d145834P15830N273548M023266k96499k176482j272929o2087Q54902P28250
8939C641965k109502m874262j257936P513481J0627120K898404o268880o754490
8931C415900k286904j905799m597391l518440N03709J581882N76251K502760N337967
$$ plain form
8990 4207508 1690966 -341230 2454880 7801080 10103208 8347811 6045208 5009595
8982 5009595 3886800 1874063 -236109 -2092676 -3642217 -3959245 -2897396 -2279712 -3017607
8973 -3017607 -3494568 -3350581 -5345243 -9927776 -11959746 -7726806 -1612390 -29982 -1843318
8964 -1843318 -1506330 581534 -1425021 -8306440 -13025560 -9893542 -1142652 6906114
8956 6906114 9995439 7684487 2955243 444503 1705110 2769848 -147374 -4145834
8948 -4145834 -3430004 1843544 5866810 5570311 3393829 2120900 2058813 2913715 3641965
8939 3641965 1532463 -3341799 -4599735 2913746 13540866 16439270 10170390 3415900
8931 3415900 1128996 -776803 -5374194 -8892634 -8388925 -6807043 -6230792 -3728032 1609935
8922A609935L136842j929199k295467J637848K344170j295865k656189K65019
8914H17094K160777R94973P65186K375457J771403j303285k336609j184703k415243
8905A645050n261258l692181J644680K666735k018236l627735J804405O200491
8897f38049L154771j534731l65028L816800M247315J285024r53522k630198n098168
8888A284214n448101j815886R34616j511946m543770j374574N614458Q185214
8880A324225M132784j490074m779812n680734m184759m77585K491698K395242
8872f269015J783853L538929M691945J208184l598374l077895J735262L274233
8864C287122m74966l295135j504912N43254j284531l978380k859749J135134L925357
$$ plain form
8922 1609935 4746777 2817578 522111 2159959 4504129 3208264 552075 817094
8914 817094 2977871 3972844 4738030 7113487 8884890 7581605 5244996 4060293 1645050
8905 1645050 -3616208 -7308389 -5663709 -2996974 -5015210 -8642945 -6838540 -638049
8897 -638049 2516722 981991 616963 4433763 8681078 9966102 9012580 6382382 1284214
8888 1284214 -4163887 -5979773 -5045157 -6557103 -11100873 -12475447 -6860989 1324225
8880 1324225 5457009 3966935 -812877 -6493611 -10678370 -11155955 -8664257 -6269015
8872 -6269015 -4485162 -946233 3745712 4953896 1355522 -1722373 12889 3287122
8864 3287122 2812156 -482979 -1987891 -1444637 -2729168 -6707548 -9567297 -8432163 -4506806
8855d506806M247561L251062J292503j088470j619353N38161K210941M96705k274270
8846B548034j938877N31245K37273l598682n789775k890941J694473L143662K137696
8837c925892K323723L307144J371627l266928n293907j932369K718893L613745
8829a083964J441385J45723P28264J386983J592721J716290K28309l826034o385340
8820d055663k072202O817452J0558643L896284o511209j0001045m386761L129016
8812b625485N693702L455794O26374n95548j420935l216118m869994m116996p66172
8803g835378K711675M126499L783818K973648J739457l43271k352068k852666
8795A951714j893190o40728K30038N51609L12937N44526K613828M967805L312063
$$ plain form
8855 -4506806 -259245 2991817 4284320 3195850 1576497 2114658 4325599 4822304 2548034
8846 2548034 609157 1140402 1377675 -2221007 -8010782 -10901723 -9207250 -6063588 -3925892
8837 -3925892 -1602169 1704975 3076602 -190326 -5484233 -7416602 -4697709 -1083964
8829 -1083964 357421 503144 1231408 2618391 4211112 5927402 6155711 2329677 -4055663
8820 -4055663 -6127865 689587 11248230 15144514 8633305 -1367740 -5754501 -2625485
8812 -2625485 3068217 6524011 7150385 6554837 5133902 1917784 -2952210 -7069206 -7835378
8803 -7835378 -5123703 -997204 2786614 5760262 7499719 7156448 4804380 1951714
8795 1951714 58524 -582204 -352166 199443 512380 1056906 3670734 8638539 11950602
8786A1950602l079664p993008n400648J893997N457666K156553k821478l667927
8778a503907k39162L688988M613960J354018l877699o413550l902909N93650K880254
8769b806357K977486K798094J492313j842926l722539q92221K958692K173435
8761C135977j295804j262010J637657J530703j213982o65989K483362J061725
8753E411639m634942n356795J170773N289849J553160k514501n72763J766097
8745B112517j088229l481369L87196M514115J851287k218690K10427M489154K108888
8736H885296k687259l26713N459393L004140o270963r232131k936675J675350
8728b429562l06855o89802M748553P548975J715006n454352n585481j674476l92180
$$ plain form
8786 11950602 8870938 877930 -4522718 -2628721 2828945 4985498 2164020 -1503907
8778 -1503907 -1743069 1945919 6559879 7913897 4036198 -2377352 -6280261 -5686611 -2806357
8769 -2806357 171129 2969223 4461536 2618610 -1103929 -1996150 962542 3135977
8761 3135977 1840173 578163 2215820 3746523 2532541 1866552 4349914 5411639
8753 5411639 776697 -4580098 -3409325 1880524 3433684 919183 346420 2112517
8745 2112517 1024288 -2457081 -2069885 2444230 4295517 2076827 2287254 6776408 8885296
8736 8885296 6198037 5871324 11330717 14334857 8063894 -1168237 -4104912 -2429562
8728 -2429562 -2736417 -3426219 1322334 8871309 10586315 5131963 -453518 -2127994 -2520174
8719b520174r60461L68225K225817K075322J976477L654126L588587o59124m677824
8710E070971l812585m61969Q00332K40874k27433j650981l742374j922306M691392
8701a014079Q085629K018792o842879p176124P88535O175419L035292l354412
8693A716173n680692k931648J243264L046824Q66549k820991k576412L072741
8685d064192P731874M943485k329074n769588l296340j638J096990J842558K705609
8676B859684J399238j198217q63472K452718L565733N93860k004773j451215r97487
8667D356069k872096l513902m08913K368682R74930j109492Q83888M284341L389671
8658H353178o92335k301756j223655k140319m674370k793742M113680P871872
$$ plain form
8719 -2520174 -3480635 -3112410 -886593 1188729 3165206 6819332 10407919 9748795 5070971
8710 5070971 1258386 796417 1596749 1837623 1610190 -40791 -3783165 -5705471 -1014079
8701 -1014079 7071550 9090342 2247463 -4928661 -4140126 2035293 5070585 1716173
8693 1716173 -3964519 -6896167 -5652903 -2606079 -1739530 -4560521 -7136933 -4064192
8685 -4064192 3667682 8611167 6282093 512505 -2783835 -2785473 -1688483 154075 2859684
8676 2859684 4258922 3060705 2197233 4649951 8215684 8809544 6804771 5353556 4356069
8667 4356069 1483973 -2029929 -2438842 -70160 904770 -204722 679166 4963507 8353178
8658 8353178 7660843 5359087 4135432 1995113 -2679257 -5472999 -1359319 6512553
8650F512553L212725l850175m730126m79433J009171k726983n887823l710419
8642a0650510R97362K515660p4668k396176p17161L557302N596059K778748k037338
8633d30722l565720j37940M569321O022330L494713l22224k716602k931526k007137
8624A974493j568311j877551j105037J812013M101013K057241k917117n309944
8616b833200l447287j475693j523232M4871M751617O906338K592378k077620N7655
8607B995827M722574K866388l411639l742252K403544L936980k921354p505546
8599f55478k456320L965488K261451k426663l64705N118094L569989l838953n816111
8590f43208P2483L739322j79185l981484o62232M320980K227371m996222p870513
$$ plain form
8650 6512553 9725278 5875103 1144977 665544 1674715 -1052268 -6940091 -10650510
8642 -10650510 -9653148 -7137488 -7212156 -9608332 -10325493 -6768191 -1172132 1606616 -430722
8633 -430722 -3996442 -4134382 434939 6457269 9951982 9629758 6913156 3981630 1974493
8624 1974493 406182 -1471369 -2576406 -764393 3336620 5393861 2476744 -2833200
8616 -2833200 -6280487 -7756180 -9279412 -9234541 -4482924 2423414 5015792 2938172 2995827
8607 2995827 7718401 10584789 7173150 3430898 5834442 9771422 6850068 -655478
8599 -655478 -3111798 853690 3115141 688478 323773 5441867 9011856 5172903 -643208
8590 -643208 -570725 3168597 2989412 -992072 -1654304 2666676 4894047 -102175 -7972688
8581g972688l033041L367938N068999K897735J509667K457658K834067J4860m242290
8572B902905n758981l296531K01626J903514J871374P85870j453472l030659m71660
8563f346014N123870O669978P64973n519842l952122K343583L687239j096506
8555A675159l804352q99129J568091m82073k172008Q79994M068911J431371l902164
8546a636200m315230M76091L465826J127318k337302k329453l24705n88566l341999
8537i804220m331512r44625L676566M398353J027983j426939n4541K005658J279743
8528d173534j22619J384677L855851K682936j281610k937452j581738j363633
8520c537122k757785j154598M103380O749317L168076j646091k074712K2190K42466
$$ plain form
8581 -7972688 -11005729 -7637791 -2568792 328943 1838610 4296268 7130335 7145195 2902905
8572 2902905 -2856076 -6152607 -5950981 -4047467 -2176093 -1390223 -2843695 -5874354 -6346014
8563 -6346014 -1222144 5447834 6212807 692965 -3259157 -915574 2771665 1675159
8555 1675159 -2129193 -3028322 -1460231 -1942304 -4114312 -3234318 834593 2265964 -1636200
8546 -1636200 -5951430 -5475339 -2009513 -882195 -3219497 -5548950 -5873655 -6462221 -9804220
8537 -9804220 -14135732 -15080357 -11403791 -7005438 -5977455 -7404394 -7458935 -5453277 -4173534
8528 -4173534 -4296153 -2911476 944375 3627311 2345701 -591751 -2173489 -3537122
8520 -3537122 -6294907 -7449505 -3346125 3403192 6571268 4925177 2850465 2872655 3115121
8511C115121n24915P61793K271627P0898m252473n084335j239506K504568K532572
8502A55350N18064m20583l7410J45026p709R01391L161645M362315J651478l948132
8492F481435p166036m460996R79804L145734R82935j461437j732877j027421J54548
8483d104311K772145M899039K583862l151655n983052l291199K64322Q05069N99348
8474d606432J843171J654684j725230l715915m57974L873266L380708J041j36891
8465A10428L200979M834546K642693q37140l619062n175905l830060Q38627M432046
8456B597152K467621k515530m310848k286807j238841k828743l536976j365403
8448a3018375J260650K183512K252568K460763K318906J650837Q27915m61757
$$ plain form
8511 3115121 2590206 3351999 5623626 5694524 1442051 -3642284 -4881790 -2377222 155350
8502 155350 673414 252831 215421 360447 352738 1254129 4415774 8778089 10429567 6481435
8492 6481435 -684601 -5145597 -4165793 -1020059 -37124 -1498561 -3231438 -4258859 -4104311
8483 -4104311 -1332166 3566873 6150735 2999080 -2983972 -6275171 -6010849 -5205780 -4606432
8474 -4606432 -2763261 -1108577 -2833807 -6549722 -7007696 -3134430 246278 247319 110428
8465 110428 3311407 8145953 10788646 9951506 6332444 1156539 -2673521 -1834894 2597152
8456 2597152 5064773 2549243 -1761605 -4048412 -5287253 -8115996 -11652972 -13018375
8448 -13018375 -11757725 -9574213 -7321645 -4860882 -2541976 -891139 -63224 -524981
8440e24981j822306j112307J820580K907650j86981k870515j69699M408079L777389
8431F226909j104568k959662o49713n70931m625061o303161j895534K890078K125170
8422f866473j419539j726244J464511M216698M796346L766249J028716k853092
8414B407172m902799l015543Q69828L402370L468722J469446k027570m889564
8406c217938l922739P91109M838409M828762K087673m97408j926261j760119P28183
8397A949671L886706M001776O40026k126064k019672j652424k713892k242845
8389b76718J407054L952883J700181j657254p60991K382281J845232k124436l727085
8380B741147j359370O07519K17392Q85151L933211M749529J82273n214910n138285
$$ plain form
8440 -524981 -2347287 -3459594 -1639014 1268636 1081655 -1788860 -1958559 2449520 6226909
8431 6226909 5122341 2162679 1512966 942035 -3683026 -9986187 -11881721 -8991643 -6866473
8422 -6866473 -8286012 -10012256 -8547745 -4331047 465299 4231548 5260264 2407172
8414 2407172 -2495627 -5511170 -4641342 -1238972 2229750 3699196 1671626 -3217938
8406 -3217938 -7140677 -6349568 -1511159 3317603 5405276 4907868 2981607 1221488 1949671
8397 1949671 5836377 9838153 10478179 8352115 6332443 4680019 1966127 -276718
8389 -276718 1130336 5083219 6783400 5126146 4365155 6747436 8592668 6468232 2741147
8380 2741147 1381777 1989296 2206688 3091839 7025050 11774579 11956852 6741942 1603657
8371A603657p03936J347933j600387m831955l335702J813850N902248O635618
8363F831326N085808K234229j831607n175092m287098P80183M436867K030062
8355A0104678l418443m870164r81110K286048M63375l403592l745052l4082L645507
8346D7165M356280K510259m06112l299171m936229m333282k074975R6477J231517
8337f808071J828459K500194K842502K125120Q22453N42285J596820J492984j909106
8328E033640n764929m339670K555576P210666L766445l146422m673508k5875L844269
8319D460192L312684J468923N29916j216804l361180k159918J690336J680758
8311F404907l952191p527831l197274L621108M631003R08191p26248P66743R33165
$$ plain form
8371 1603657 899721 2247654 647267 -4184688 -7520390 -5706540 195708 6831326
8363 6831326 11917134 14151363 12319756 7144664 2857566 3637749 8074616 10104678
8355 10104678 6686235 1816071 834961 3121009 3584384 180792 -3564260 -3598342 47165
8346 47165 4403445 6913704 6507592 3208421 -1727808 -6061090 -8136065 -8039588 -6808071
8337 -6808071 -4979612 -2479418 363084 2488204 3310657 3852942 5449762 6942746 5033640
8328 5033640 -731289 -5070959 -2515383 4695283 8461728 5315306 641798 615923 4460192
8319 4460192 7772876 9241799 9771715 8554911 5193731 3033813 4724149 6404907
8311 6404907 2452716 -5075115 -8272389 -4651281 -20278 887913 161665 928408 1861573
8302A861573j054136j654213q4397J055812J476975K752082K997780r10428o044874
8293C96174n673408M81270N259275M605646K117785J169117k61484l543347m863146
8284c12118j509892K539218K535034L55411N37947K216958J132405k232234l028619
8275B234110m81377K84451l298076o239334l148175L075196M593629l57851m862844
8266h200271l054568J944372L309219P43760J16627L510460N663827K430020k520340
8257C943106l491101j235459l70472j030778N01691L657213K988506k709617o848714
8248d595625m047439J985920L989276J286490q12756o3551J54957k001737k711089
8239f815554J254763O009282N196145l79672l240174o5558L368480R82503m511845
$$ plain form
8302 1861573 807437 -846776 -931173 124639 1601614 4353696 7351476 6441048 396174
8293 396174 -5277234 -4795964 463311 5068957 7186742 8355859 8094375 4551028 -312118
8284 -312118 -1822010 717208 3252242 3607653 4145600 6362558 7494963 5262729 2234110
8275 2234110 1752733 2037184 -1260892 -7500226 -10648401 -7573205 -2979576 -3337427 -8200271
8266 -8200271 -11254839 -9310467 -6001248 -5257488 -5140861 -1630401 4033426 6463446 3943106
8257 3943106 452005 -783454 -1153926 -2184704 -1683013 1974200 4962706 2253089 -4595625
8248 -4595625 -8643064 -6657144 -2667868 -1381378 -2194134 -2257685 -2102728 -4104465 -6815554
8239 -6815554 -5560791 448491 5644636 5264964 2024790 1959232 5327712 6310215 1798370
8230A798370o076060k676751P36892J741345K262465K403404k36262m013189l509429
8221g569215J209261L125757l22096k245626J906342N512811J588110m412256
8213a206912k721043M403103N878807o03459n794608m175231r37153j118889j876633
8204h152018K6884J577675j05565j495983J203361M671290L335103j624528l789579
8195d353360n09056M013655M322147j66168m630163l860497J533643N004040K266397
8186C620638k429246k341743J509491K344282j016088k398975J060162M219931
8178D568452K559384j393441l510222l705322k895742m48458K106084J159526
8170a559739j877011n53087N673860Q184535K059215n554563o347406k687747
$$ plain form
8230 1798370 -4277690 -6954441 -6217549 -4476204 -2213739 189665 -46597 -4059786 -7569215
8221 -7569215 -6359954 -3234197 -3556293 -5801919 -3895577 1617234 3205344 -1206912
8213 -1206912 -3927955 475148 6353955 5750496 -44112 -4219343 -5156496 -6275385 -8152018
8204 -8152018 -8125134 -6547459 -6653024 -8149007 -6945646 -2274356 1060747 -563781 -4353360
8195 -4353360 -4862416 -848761 3473386 3307218 -1322945 -5183442 -3649799 1354241 3620638
8186 3620638 1191392 -1150351 359140 2703422 1687334 -711641 348521 4568452
8178 4568452 7127836 5734395 2224173 -1481149 -4376891 -4825349 -2719265 -1559739
8170 -1559739 -3436750 -3989837 1684023 9868558 11927773 6373210 25804 -2661943
8162b661943j086736r85271J020530J985249k155653o724046m199670L072313
8154a1735227O262480L852574J976104K695208K227024Q8450j39652Q52377j125801
8145D953537m338146k516178L307149M605454q81639n174884k972260Q98554R32578
8136a185835q45380p81557O736m7318Q81744K938948K262327j733663l306546
8127a810544N25657M222916K378448j829670k636664q42551q26656k663105l089949
8118f572118j103887K117715N492358O504859K009327n379006p165656l65093
8110d461501O547774N107225j178975l418101q11713Q29095J31304M67713J457405
8101D670226n42469m177361m107486n26775O27613k009012k763544J092700M352536
$$ plain form
8162 -2661943 -3748679 -4733950 -3713420 -1728171 -3883824 -10607870 -14807540 -11735227
8154 -11735227 -5472747 -1620173 355931 3051139 5278163 5366613 5226961 6079338 4953537
8145 4953537 615391 -1900787 1406362 6011816 5130177 -44707 -3016967 -2118413 -1185835
8136 -1185835 -2031215 -2812772 -2806036 -2853354 -1971610 967338 3229665 1496002 -1810544
8127 -1810544 -1284887 2938029 5316477 3486807 850143 7592 -819064 -3482169 -6572118
8118 -6572118 -7676005 -5558290 -65932 6438927 8448254 3069248 -4096408 -4461501
8110 -4461501 2086273 7193498 6014523 2596422 1784709 2613804 2745108 3212821 4670226
8101 4670226 4127757 -49604 -4157090 -4683865 -4056252 -6065264 -8828808 -7736108 -3383572
8092c383572K280956k041390k832064L53868L593560M440575L307100J167960
8084F886993j117427k350661j930774o69462K36455L44329j44749o88828o16871
8075e0995J53171R86509J562892J863243R02528k077108m487620k211982L599811
8066B40449N996835J763460l155972k418974J171565J188380j423924r49808J998331
8057D410342J139145m078575o793250l805915K0662Q30848J427952M404201O572986
8048D128396M582322N29292k163529l597963m331205k426995K118663M526796
8040C365777J591760k757864k901227O44238L358300L680067K993754J168719
8032A1143524k618317o017411n481635j687214J191108J381952R12580J214620
$$ plain form
8092 -3383572 -1102616 -3144006 -5976070 -5622202 -2028642 2411933 5719033 6886993
8084 6886993 5769566 3418905 1488131 818669 1055124 1399453 1254704 565876 -50995
8075 -50995 102176 1088685 2651577 4514820 5417348 3340240 -1147380 -3359362 240449
8066 240449 6237284 8000744 4844772 2425798 3597363 4785743 3361819 2412011 4410342
8057 4410342 5549487 1470912 -5322338 -9128253 -9107591 -8276743 -6848791 -2444590 4128396
8048 4128396 8710718 9240010 7076481 3478518 -852687 -3279682 -1161019 3365777
8040 3365777 4957537 2199673 -701554 -57316 3300984 6981051 9974805 11143524
8032 11143524 8525207 2507796 -2973839 -4661053 -3469945 -2087993 -1175413 39207
8024C9207J175573K45483P6606J559207K667297J186339j781423l077882j928360
8015A62047j047739k368381l507493j074878L267341L987683k4505k821243n4856
8006c482024M042532L215721q64874j789980O64439O26850l097945m523059o10791
7997e819131L482924K574291j140846k479351k95515L042790M971914L161614
7989G498690k792762q067466o255396J380859N960979K894990k320618l164702
7981d865426l48018K601091N000114N804992J928714m933883p042130k130864
7973c985410J462994j811404m603708P68070P649012M968706m077490o809835
7965f439065j134018L166629J997143J589625M354619L906744j908226n174571
$$ plain form
8024 39207 1214780 1460263 1536869 3096076 5763373 6949712 5168289 2090407 162047
8015 162047 -885692 -3254073 -6761566 -7836444 -4569103 -581420 -605925 -3427168 -3482024
8006 -3482024 560508 3776229 2911355 1121375 1785814 2412664 -685281 -5208340 -5819131
7997 -5819131 -2336207 238084 -902762 -3382113 -3677628 -634838 4337076 7498690
7989 7498690 4705928 -3361538 -9616934 -8236075 -2275096 619894 -1700724 -4865426
7981 -4865426 -5213444 -2612353 2387761 8192753 10121467 5187584 -1854546 -3985410
7973 -3985410 -2522416 -4333820 -8937528 -8169458 -520446 4448260 370770 -6439065
7965 -6439065 -7573083 -4406454 -2409311 -819686 3534933 7441677 5533451 358880
7957C58880p32469N015081M234845j312958n178361n392294l271722Q98259N528780
7948A48041O175961J515610l264711l363116o53682P04807O57134J142922J474245
7939D537211R5465j943836k774143k418728j320609O93613K042014N3692l711487
7930d746808l474180K346648P365363N688557r9314l670871l778046l374475k958275
7921f701401m09571L720123N692856L703275L76052m66354J956137M517581L323724
7912A5712422j612752n521492m466687n76304J259517M19132o7999J05665j446442
7903C805060l734211k944185K45900Q37898j622111j769815J760789L172559l23082
7894e71198l024704j71735M369940N172233L210870J177442k302049p398369q729856
$$ plain form
7957 358880 -373589 4641492 8876337 7563379 2385018 -3007276 -6278998 -5380739 148041
7948 148041 6324002 7839612 4574901 1211785 558103 1262910 1920044 3062966 4537211
7939 4537211 4632676 2688840 -85303 -2504031 -3824640 -3131027 -1089013 -1035321 -4746808
7930 -4746808 -8220988 -5874340 1491023 7179580 7080266 3409395 -368651 -3743126 -6701401
7921 -6701401 -7110972 -3390849 2302007 6005282 6381334 5914980 7871117 12388698 15712422
7912 15712422 14099670 8578178 4111491 3535187 4794704 5213836 5145837 5251502 3805060
7903 3805060 70849 -2873336 -2627436 -1789538 -3411649 -5181464 -3420675 -248116 -571198
7894 -571198 -3595902 -3767637 602303 5774536 8985406 10162848 7860799 462430 -8267426
7885h267426l551675J772580J119909j456006O02662M573419L877958L33955M27292
$$ plain form
7885 -8267426 -11819101 -10046521 -8926612 -10382618 -9779956 -5206537 -1328579 -994624 -567332
$$ [...]
##END NTUPLES=NMR SPECTRUM
##END=
