##TITLE=31Pdec_SR37_rep_2
 , 124 sc
 11.2.2021
##JCAMPDX= 6.0         $$ Bruker NMR JCAMP-DX V2.0
##DATA TYPE= NMR SPECTRUM
##DATA CLASS= NTUPLES
##ORIGIN= UXNMR, Bruker Analytische Messtechnik GmbH
##OWNER= root
$$ XWIN-NMR		Version 3.5
$$ Thu Feb 11 13:25:29 2021 Russian Standard Time (UT+4h)  she@DPX200
##.OBSERVE FREQUENCY= 81.013821
##.OBSERVE NUCLEUS= ^31P
##.ACQUISITION MODE= SIMULTANEOUS
##.ACQUISITION SCHEME= undefined
##.AVERAGES= 124
##.DIGITISER RES= 16
##SPECTROMETER/DATA SYSTEM= spect
##.PULSE SEQUENCE= zgpg30
##.SOLVENT NAME= DMSO
##.SHIFT REFERENCE= (INTERNAL, DMSO, 0, 248.564)
##AUDIT TRAIL= $$ (NUMBER, WHEN, WHO, WHERE, WHAT)
$$ ##TITLE= Audit trail, XWIN-NMR		Version 3.5
$$ ##JCAMPDX= 5.01
$$ ##ORIGIN= Bruker BioSpin GmbH
$$ ##OWNER= she
$$ F:/spectra/data/she/nmr/P31/1/pdata/1/auditp.txt
$$ ##AUDIT TRAIL=  $$ (NUMBER, WHEN, WHO, WHERE, WHAT)
(   1,<2021-02-11 13:23:32.57 +0400>,<she>,<DPX200>,
      <continue with go, POWCHK disabled, PULCHK disabled
       configuration hash MD5:
       00 E9 B6 7A A2 85 ED C7 34 08 36 98 17 FE 4E 26
       data hash MD5: 32K
       54 03 78 87 D1 85 01 33 F8 DD CE 66 3B DC CC CC>)
(   2,<2021-02-11 13:23:39.17 +0400>,<she>,<DPX200>,
      <Start of raw data processing
       efp BC_mod = 2 LB = 1 FT_mod = 6 PKNL = 1 PHC0 = -2527.354 PHC1 = 799.0022 SI = 64K 
       data hash MD5: 64K
       B1 6F 32 AE C9 95 4E E6 E2 10 8C 63 14 1B DE 01>)
(   3,<2021-02-11 13:24:33.56 +0400>,<she>,<DPX200>,
      <pk PHC0 = -92.48529 PHC1 = 213.9999 
       data hash MD5: 64K
       74 CE AB D5 2E 75 C6 DE 70 23 8A A9 FA 3F 6E 14>)
(   4,<2021-02-11 13:24:37.12 +0400>,<she>,<DPX200>,
      <abs ABSG = 5 
       data hash MD5: 64K
       8C 0F 40 CF 4A 03 5D 9B 4B C4 61 22 D4 01 1B 28>)
$$ ##END=
$$ 
$$ hash MD5
$$ 1E 1D 49 85 DC B6 B9 DA EE 32 CC 89 EA C4 1A 7D
##$RELAX= 
##$RELAX= 
##$RELAX= 
##$RELAX= 
##$RELAX= 
##$RELAX= 
##$RELAX= 
##$RELAX= 
$$ Bruker specific parameters
$$ --------------------------
##$DU= <F:/spectra>
##$EXPNO= 1
##$NAME= <P31>
##$PROCNO= 1
##$TYPE= <nmr>
##$USER= <she>
##$AMP= (0..31)
100 100 100 100 100 100 100 100 100 100 100 100 100 100 100 100 100 100 
100 100 100 100 100 100 100 100 100 100 100 100 100 100 
##$AQSEQ= 0
##$AQ_mod= 1
##$AUNM= <au_zg>
##$AUTOPOS= <>
##$BF1= 81.014009
##$BF2= 200.13
##$BF3= 200.13
##$BF4= 200.13
##$BF5= 200.13
##$BF6= 200.13
##$BF7= 200.13
##$BF8= 200.13
##$BYTORDA= 1
##$CFDGTYP= 0
##$CFRGTYP= 5
##$CHEMSTR= <none>
##$CNST= (0..31)
1 1 145 1 1 1 1 1 1 1 1 1 1 1 1 1 1 1 1 1 1 1 1 1 1 1 1 1 1 1 1 1 
##$CPDPRG= <waltz16>
##$CPDPRG1= <>
##$CPDPRG2= <waltz16>
##$CPDPRG3= <>
##$CPDPRG4= <mlev>
##$CPDPRG5= <mlev>
##$CPDPRG6= <mlev>
##$CPDPRG7= <mlev>
##$CPDPRG8= <mlev>
##$CPDPRGB= <>
##$CPDPRGT= <>
##$D= (0..31)
0 1 0 0 0 0 0 0 0 0 0 0.03 2e-05 3e-06 0 0 0 0 0 0 0 0 0 0 0 0 0 0 0 0 
0 0 
##$DATE= 1613035212
##$DBL= (0..7)
120 120 120 11 120 120 24 19 
##$DBP= (0..7)
150 150 150 150 150 150 150 150 
##$DBP07= 0
##$DBPNAM0= <>
##$DBPNAM1= <>
##$DBPNAM2= <>
$$ [...]
##$SUBNAM3= <"">
##$SUBNAM4= <"">
##$SUBNAM5= <"">
##$SUBNAM6= <"">
##$SUBNAM7= <"">
##$SUBNAM8= <"">
##$SUBNAM9= <"">
##$SW= 501.771253377433
##$SWIBOX= (0..15)
0 1 3 0 0 0 0 0 0 0 0 0 0 0 0 0 
##$SW_h= 40650.406504065
##$TD= 32768
##$TD0= 1
##$TE= 0
##$TE2= 300
##$TE3= 300
##$TEG= 300
##$TL= (0..7)
0 120 53 12 22 120 120 120 
##$TP= (0..7)
150 150 150 150 150 150 150 150 
##$TP07= 0
##$TPNAME0= <>
##$TPNAME1= <>
##$TPNAME2= <>
##$TPNAME3= <>
##$TPNAME4= <>
##$TPNAME5= <>
##$TPNAME6= <>
##$TPNAME7= <>
##$TPOAL= (0..7)
0.5 0.5 0.5 0.5 0.5 0.5 0.5 0.5 
##$TPOFFS= (0..7)
0 0 0 0 0 0 0 0 
##$TUNHIN= 0
##$TUNHOUT= 0
##$TUNXOUT= 0
##$USERA1= <user>
##$USERA2= <user>
##$USERA3= <user>
##$USERA4= <user>
##$USERA5= <user>
##$V9= 5
##$VALIST= <valist>
##$VCLIST= <CCCCCCCCCCCCCCC>
##$VD= 0
##$VDLIST= <DDDDDDDDDDDDDDD>
##$VPLIST= <PPPPPPPPPPPPPPP>
##$VTLIST= <TTTTTTTTTTTTTTT>
##$WBST= 1024
##$WBSW= 4
##$XGAIN= (0..3)
0 0 0 0 
##$XL= 0
##$YL= 0
##$YMAX_a= 8662
##$YMIN_a= -14529
##$ZGOPTNS= <>
##$ZL1= 120
##$ZL2= 120
##$ZL3= 120
##$ZL4= 120
##$ABSF1= 248.5645
##$ABSF2= -253.2056
##$ABSG= 5
##$ABSL= 3
##$ALPHA= 0
##$AQORDER= 0
##$ASSFAC= 0
##$ASSFACI= 0
##$ASSFACX= 0
##$ASSWID= 0
##$AUNMP= <proc_1d>
##$AZFE= 0.1
##$AZFW= 0.5
##$BCFW= 0
##$BC_mod= 2
##$BYTORDP= 0
##$COROFFS= 0
##$CY= -3
##$DATMOD= 1
##$DC= 0
##$DFILT= <>
##$DTYPP= 0
##$F1P= 0
##$F2P= 0
##$FCOR= 1
##$FTSIZE= 65536
##$FT_mod= 6
##$GAMMA= 0
##$GB= 0
##$INTBC= 1
##$INTSCL= 5.30512e-09
##$ISEN= 30
##$LB= 1
##$LEV0= 0
##$LPBIN= 0
##$MAXI= 10000
##$MC2= 0
##$MEAN= 0
##$ME_mod= 0
##$MI= 50
##$NCOEF= 0
##$NC_proc= -8
##$NLEV= 6
##$NOISF1= 182.463
##$NOISF2= 159.3651
##$NSP= 0
##$NTH_PI= 0
##$NZP= 0
##$OFFSET= 248.5645
##$PC= 4
##$PHC0= -2619.839
##$PHC1= 1013.002
##$PH_mod= 1
##$PKNL= yes
##$PPARMOD= 0
##$PSCAL= 0
##$PSIGN= 0
##$REVERSE= no
##$SF= 81.014009
##$SI= 65536
##$SIGF1= 159.3651
##$SIGF2= -187.1042
##$SINO= 113.3802
##$SIOLD= 16384
##$SREGLST= <1H.CDCl3>
##$SSB= 0
##$STSI= 65536
##$STSR= 0
##$SW_p= 40650.406504065
##$SYMM= 0
##$S_DEV= 0
##$TDeff= 32768
##$TDoff= 0
##$TI= <>
##$TILT= no
##$TM1= 0
##$TM2= 0
##$TOPLEV= 0
##$USERP1= <user>
##$USERP2= <user>
##$USERP3= <user>
##$USERP4= <user>
##$USERP5= <user>
##$WDW= 1
##$XDIM= 65536
##$YMAX_p= 495116867
##$YMIN_p= -142161173
$$ End of Bruker specific parameters
$$ ---------------------------------
##NTUPLES= NMR SPECTRUM
##VAR_NAME=  FREQUENCY,     SPECTRUM/REAL,   SPECTRUM/IMAG
##SYMBOL=    X,             R,               I
##VAR_TYPE=  INDEPENDENT,   DEPENDENT,       DEPENDENT
##VAR_FORM=  AFFN,          ASDF,            ASDF
##VAR_DIM=   65536,         65536,           65536
##UNITS=     HZ,            ARBITRARY UNITS, ARBITRARY UNITS
##FACTOR=    0.620285442955139, 1,           1
##FIRST=     20137.2065510759, 0,            0
##LAST=      -20513.1999529892, 0,           0
##MIN=       -20513.1999529892, -142161173,  0
##MAX=       20137.2065510759, 495116867,    0
$$ Real data points
##PAGE= N=1
##DATA TABLE= (X++(R..R)), XYDATA
$$ [...]
14095 -23233863 -26167004 -20913185 -5526390 11060718 13618203 791809 -7050560 7394236
14087 7394236 33622457 47090510 39774411 22534413 5969860 -4365003 -2430076
14080 -2430076 9571391 14215856 334353 -15563644 -10583390 8647364 15604445 4944132
14072 4944132 -2650608 3583095 10433766 6765491 -494834 -2963323 -2988360 -3221907 -2082267
14063 -2082267 -3689376 -14325566 -26440621 -25768914 -17118380 -21738687 -44082362 -62081449
14055 -62081449 -57006518 -34039292 -7843655 12778710 20805190 12700168 1285235
14048 1285235 6845094 27942991 40251148 30914017 13947555 4968815 2297532 1189792
14040 1189792 4657091 10390532 8573358 3085425 12911033 40419828 59592201 49575019
14032 49575019 21091651 -3188190 -16067801 -21740166 -23132869 -25447420 -34944762 -44854712
14024 -44854712 -41201904 -28777651 -27254813 -34991267 -26962232 414154 16642665 6224476
14016 6224476 -5413281 1522852 4483032 -20165255 -50573435 -51108132 -26442254 -7047790
14008 -7047790 -1223388 1601190 -1311871 -16018985 -25024300 -9056808 16844931 25784769
14000 25784769 23299637 29766985 33590082 8759516 -29428605 -36576002 -7628350 14710328
13992 14710328 5880778 -11401396 -13767231 -9682244 -10231554 -6324323 5496833 6060598
13984 6060598 -17908915 -51865848 -73458402 -72505071 -44773882 5402146 48311410
13977 48311410 47658644 10263366 -13721575 3705996 32551466 32912598 9634893 -4698966
13969 -4698966 2359845 17630053 28184037 30829049 27542904 26610238 35836670 45371996
13961 45371996 35308813 8659766 -6947167 -1222652 3169128 -7660471 -12403938
13954 -12403938 7163576 30641298 30908633 16933277 12638356 14738076 7772397 3632745
13946 3632745 24752317 56385876 57547644 21090750 -13455775 -13686757 9347146 26883589
13938 26883589 28157099 19988359 12026934 13131264 26393764 39681576 34718341 10769258
13930 10769258 -13835340 -26161625 -29153859 -25503928 -10549147 10724159 17387835
13923 17387835 -3144592 -34867732 -49356068 -36392593 -9882469 11183574 18783789
13916 18783789 15762335 8157617 80998 -6414616 -9608781 -9500988 -10877398 -19426979
13908 -19426979 -32140357 -38348590 -35216146 -34038151 -42574467 -48822795 -34975298 -3642904
13900 -3642904 22903547 28843679 18851824 6837828 2579175 10416727 29067558 48257871
13892 48257871 53819954 40637191 16529247 -6525153 -19693704 -18466037 -5555704
13885 -5555704 7535600 10338571 5394050 3336017 7205538 10302216 8658170 5611363
13877 5611363 3562713 1333026 1024671 7204982 16675829 18784528 9559288 -2638197
13869 -2638197 -8446313 -6530265 610734 10345108 16351184 11251488 -2724653 -14731679
13861 -14731679 -20871076 -28115445 -37353899 -35395438 -14567157 10032993 17086728 7440988
13853 7440988 1882599 12745081 31092621 42284277 41191640 29064048 7627575
13846 7627575 -17055069 -33438060 -34533699 -24167707 -8901307 9436385 27653709
13839 27653709 35880445 28161296 13462761 5674575 5747638 4693617 1697699 5334122
13831 5334122 15929789 21960445 19206857 19034769 29003292 38423400 34982232 24821017
13823 24821017 22251946 28002121 32467642 33654271 35871813 35919002 27815482 17923639
13815 17923639 17571997 22622459 18870882 6659298 -114643 -24828 -6782250 -22362472
13807 -22362472 -31126199 -28081517 -29209238 -42394355 -50860348 -40246254 -21436339 -9577430
13799 -9577430 479524 18651910 36295647 38750097 27469133 11250934 -9119773
13792 -9119773 -27733219 -23371694 11039374 43537432 37981770 4239790 -16903496
13785 -16903496 -11481004 -2159021 -4074790 -6203295 -248358 4838846 5326796 10969422
13777 10969422 21980597 24642624 19089737 24338498 44203100 55143630 42851150
13770 42851150 25779320 24622137 31014571 26674419 14462020 8962653 11511536 15683961
13762 15683961 24928925 43624190 60033593 58264250 41322516 25971714 20262994
13755 20262994 19689316 18775043 14212722 4679060 -1448761 10171139 35470348 45572585
13747 45572585 22563176 -11245435 -21147173 -6790615 3155040 -3438973 -8704571 2420863
13739 2420863 19923276 25327490 13508887 -7219215 -23791178 -24910737 -10750540
13732 -10750540 3974241 7948869 10210328 24375365 41480247 39202759 16786340
13725 16786340 -1539357 -487802 10781845 21421612 33946268 47586451 48494293
13718 48494293 30419857 8983196 2351386 10780645 24794383 37793065 40322488
13711 40322488 21243011 -9547364 -18305257 10775471 44933032 39083536 -5184845
13704 -5184845 -41800259 -37649180 -3275043 33162082 56332753 61793768 47849567
13697 47849567 23812291 10996859 19877038 33676402 26773948 -4172048 -35867546
13690 -35867546 -43300700 -24071228 1019502 9989759 3052990 562448 13987390 27784657
13682 27784657 22598266 8248807 11355069 30604743 31980372 -655522 -36649160
13675 -36649160 -40609440 -21496244 -11283255 -9972336 11080453 52943179 75112959
13668 75112959 51747586 11890725 1243669 23144745 42137528 35146567 13509236
13661 13509236 -3599118 -13816766 -22821401 -27583738 -20220515 -2072875 15307106
13654 15307106 22692166 22455078 24413691 33148462 40715631 34691264 13764982 -9337822
13646 -9337822 -22865127 -28517410 -34469902 -41604142 -44020479 -39600469 -31611995 -21339552
13638 -21339552 -7581247 6221389 12040178 6162471 -7486153 -23177799 -36359889
13631 -36359889 -40986640 -32273882 -14936349 -1586263 999062 -1621062 -2205260 -2527689
13623 -2527689 -7869130 -16094645 -19841843 -17549657 -15009026 -15536231 -14945658 -8782261
13615 -8782261 366438 7221724 12765100 22823234 37137534 46291383 44030995 37576467
13607 37576467 37907730 42725289 40129473 29978677 27603591 39193116 47530336 36891229
13599 36891229 22367614 33576793 70297039 95882011 82340317 44767233 19059976
13592 19059976 18374692 26751011 27695350 21176356 12591161 692563 -16672636 -32765809
13584 -32765809 -34750210 -14950370 21411276 56790087 71003464 57074353 29549998
13577 29549998 11671503 11409749 15047326 7735981 -5577951 -6660620 11782080 36803830
13569 36803830 50398787 46160900 28815622 5679558 -15670100 -27844964 -29767892
13562 -29767892 -28445607 -27099449 -16428512 11080247 41003457 46596240 22651676
13555 22651676 -3709888 -4057752 19760500 43673552 51265133 43766924 26991948 3089625
13547 3089625 -24009180 -45290583 -52448755 -43777161 -25395835 -9218929 -5175443 -10617783
13539 -10617783 -11933361 -1511838 12591141 19497954 20910869 25732053 35321779 42630119
13531 42630119 41266497 28846669 8201494 -8215373 -5205029 14710739 29001561
13524 29001561 24637497 16866006 23806022 36795283 36456658 25709641 22194336 27357294
13516 27357294 29706846 30590354 36788485 34564386 7305618 -22676876 -11441105 39263851
13508 39263851 72559214 51011427 4671493 -16259849 -4005039 16203375 28523908
13501 28523908 30195018 15792827 -12170434 -33035825 -33437886 -27023883 -27256390 -21700831
13493 -21700831 690839 19017476 9566167 -12522810 -15677176 -1747053 2819031
13486 2819031 -5867567 -9311170 -6347047 -12456778 -22220981 -13358688 9381513 14829972
13478 14829972 -2579810 -10393743 9399639 31626354 29661992 14687866 11579796
13471 11579796 20394838 24741060 20385969 14278179 8025562 521996 -2311162 5079404
13463 5079404 17160705 22786668 14971252 -7350584 -36301536 -53467185 -47124620 -31767571
13455 -31767571 -31238669 -41773173 -36920286 -13798378 -4239255 -26384950 -53935548 -54301463
13447 -54301463 -33817322 -20849575 -22317472 -23138921 -16727529 -10834768 -9356599 -8653432
13439 -8653432 -7185368 -3251016 9562239 30087120 42285602 36021112 24877966 25890458
13431 25890458 31779488 23177868 69957 -19960961 -28301229 -28500900 -18327722 7194089
13423 7194089 35622172 43896292 29549462 15115824 16002067 22055411 17836016 4327500
13415 4327500 -9130468 -20827290 -32773675 -39493865 -32609796 -13608712 6624696
13408 6624696 20784807 31486626 42306153 46676797 33511209 7515408 -4862836
13401 -4862836 16929303 56761023 76269035 62922181 43247913 39707125 38539340
13394 38539340 19541313 -4174969 -5795449 9084316 10372669 -6184893 -11942688
13387 -11942688 6144416 23749746 19701336 9261514 16640796 36418539 46079141
13380 46079141 41876155 37365095 35200560 25860109 12590486 13746730 34637111 55128704
13372 55128704 54466789 36243880 19008621 10812221 4472100 -5778059 -14984894 -17495097
13364 -17495097 -17859574 -24997042 -38271619 -45984684 -38737628 -19738127 -114348 11705223
13356 11705223 13418393 6968973 -778273 1430698 19721194 44399862 55127697 41341179
13348 41341179 15261761 879909 10093280 31888926 45474537 41897319 30384098
13341 30384098 24593622 27678838 33173280 34814502 29318834 14463651 -5437453 -14731749
13333 -14731749 -718519 25303182 36061696 23775001 12568659 24005621 44026148
13326 44026148 41972968 14255082 -11645206 -14943491 -2935203 8819203 18174558
13319 18174558 28290561 32699070 23233615 6406431 -1529789 4765165 13615441 12852847
13311 12852847 5932533 7132280 22364170 39122013 39049422 20126388 1228559 948086
13303 948086 16119702 27931465 27014726 23466120 30165334 44641014 53311206 48804522
13295 48804522 36180884 23446717 12393834 647709 -11578679 -20588834 -23821533
13288 -23821533 -22071665 -17050102 -9947802 -3380068 -1008397 -2556200 -2561597 2038482
13280 2038482 5984810 2271771 -7372275 -13665110 -9786057 4312540 24365194 42472156
13272 42472156 49182862 43080199 35168317 35101542 37335299 31610529 21653830 18737610
13264 18737610 21382795 20013319 18460291 27450987 36470795 20394469 -18415664 -43915287
13256 -43915287 -36383290 -20429434 -23299461 -32330792 -21400203 1718780 6725149 -13468995
13248 -13468995 -38776728 -54464882 -59028700 -47919650 -19066417 10608007 22277519
13241 22277519 23749393 33276464 42359501 27781417 -3584331 -18785275 -8759180
13234 -8759180 2529850 3052649 8111103 21725092 22354906 2994184 -11936262 -10136577
13226 -10136577 -16027424 -45764932 -70173140 -54971226 -13197164 16110959 22556609
13219 22556609 24406135 29313830 29673903 27909139 33301988 38233743 27870034 11219915
13211 11219915 13534410 36789484 54208538 47439190 25829247 4980456 -11579588
13204 -11579588 -23509540 -26214862 -19708258 -9718729 4652847 29226698 57012092
13197 57012092 68803067 57735648 38615422 26333137 19203579 11472648 8403338
13190 8403338 17063286 30587071 33466427 20425215 3740561 2501793 25045263 57929367
13182 57929367 73556518 56214995 20448216 -4676455 -8790754 -6737693 -11722071
13175 -11722071 -17371505 -13446244 -5242491 -4233947 -7630261 -2235993 13343828 24244053
13167 24244053 20566234 12772301 18499851 38719935 55100149 51680692 33115348 17733360
13159 17733360 16441320 24518825 32749827 38108170 40295144 35977992 24188554 12437330
13151 12437330 8086023 5971675 -4947279 -22290481 -29164326 -16994758 893839
13144 893839 6812258 1807837 -91289 4377736 4714700 -1747828 -1463999 13546661
13136 13546661 28489910 24651810 8241655 3479477 18077557 32737412 29344763
13129 29344763 14380611 5974990 9838744 18435387 25059987 27731426 24833672 16240722
13121 16240722 4979324 -7343854 -20047578 -25310901 -13482805 7220974 13109693
13114 13109693 -1160011 -9386928 7869963 29687816 23805552 -5103655 -25109200
13107 -25109200 -25191685 -21992760 -23379900 -18525984 -4982001 5459610 10204132 15576300
13099 15576300 12933089 -11211306 -39353594 -35734837 -1759144 21420875 15907034
13092 15907034 9050847 17064769 14723678 -12756902 -34641558 -26824183 -16265391 -31303748
13084 -31303748 -46810824 -28621088 1037028 -321804 -19490706 -10486604 22593825
13077 22593825 32482700 14142683 14850094 49329058 69436054 41260632 -2765907
13070 -2765907 -19251031 -15993482 -23349234 -38199196 -35223436 -13526812 2260943 -2167217
13062 -2167217 -17795379 -28204827 -22854958 -2659793 17166005 20102741 10797755 10468673
13054 10468673 24599402 33848744 24973553 10744333 8427562 17455819 29648653 42173190
13046 42173190 47629054 31226951 -5543071 -35026834 -35024152 -17679452 -10283118 -18291732
13038 -18291732 -24695626 -19087984 -10791049 -13746413 -28417041 -40592802 -36683942 -20674613
13030 -20674613 -10418424 -11915673 -8766752 9872639 25889762 19769417 6914001
13023 6914001 12696722 21566609 -4119915 -54093497 -70182860 -30872474 13996479
13016 13996479 18472616 3537957 9086242 24526915 14738928 -13499624 -22768617 -7905177
13008 -7905177 802311 -7959389 -11959198 3534419 26136399 41443929 48263493 46009592
13000 46009592 32759518 17614016 12007005 9153823 -5900303 -28711074 -41065671
12993 -41065671 -40190078 -37460998 -32289956 -15357930 4195231 5259540 -9575567 -15038104
12985 -15038104 -4558506 299857 -9215306 -9922775 14809223 43320083 44258496 20098955
12977 20098955 661322 2566436 13631645 14361747 1697781 -9523500 -3519223 17782672
12969 17782672 34086667 29780477 14472243 10505922 21801308 28316996 13390060
12962 13390060 -16096836 -41035983 -50889308 -48109215 -40211463 -33064342 -27921039 -22587682
12954 -22587682 -17120618 -15342840 -17195010 -15607377 -7114794 1413232 4020996 5069153
12946 5069153 8396140 7429846 -1991400 -9362463 -3859267 9217040 20143738 30103618
12938 30103618 38756226 32733389 8575318 -9074158 355882 18056896 15134232 2900258
12930 2900258 13639859 40742634 45880931 25399541 17601743 33535749 33265926 -5900647
12922 -5900647 -44750885 -38150819 1439581 31141032 38180874 37531418 33451488 20027519
12914 20027519 3492142 -7751605 -20939416 -40068396 -47467041 -32053406 -15318719
12907 -15318719 -17708665 -21132103 -2472650 16919670 1951835 -30223446 -28084976
12900 -28084976 13179680 42111949 30006356 8369245 11078579 26193107 30200318
12893 30200318 30161878 40843427 50737086 43206359 28492538 24262396 23682772 12865352
12885 12865352 2863756 12138526 30106373 31688112 20038480 20558867 35591872 40078135
12877 40078135 25266254 12408792 13594934 11555184 -5145582 -15600924 1374182
12870 1374182 29918048 38216759 22875075 5869566 -2535172 -8952056 -9918056 8101064
12862 8101064 36928969 44661972 18186805 -16275485 -30594660 -30924137 -36782266 -43735860
12854 -43735860 -34118194 -13026193 -3358635 -8466850 -9246671 -612437 -1285504 -18002543
12846 -18002543 -27543466 -11245867 13907923 18997549 2934427 -12214235 -14952910
12839 -14952910 -12345311 -10929990 -10305600 -12975574 -21719569 -27830541 -19503920 -2662828
12831 -2662828 3293781 -7568133 -21052521 -25396535 -23443287 -18138426 -4403873 16036283
12823 16036283 28991417 28637239 28376204 36667969 37287947 13628850 -18301733 -25688327
12815 -25688327 -4175985 17491625 20565608 19444110 32443986 51369694 56334417
12808 56334417 45930178 35043593 32248247 35807080 44589616 56500929 62139049 56676004
12800 56676004 52091143 58842606 61236582 35282638 -9857699 -35827148 -26675716 -9297216
12792 -9297216 -10179166 -18136993 -9575391 10992440 20197785 10821648 -6669683 -26338366
12784 -26338366 -46198282 -54194583 -40160151 -17142388 -7387098 -10827371 -10151957 -2349132
12776 -2349132 644868 106259 10815596 31053431 40035732 30683604 18857235 13277049
12768 13277049 2359643 -19842781 -39515792 -45789168 -44990666 -42710715 -35310373 -28523538
12760 -28523538 -37519986 -56150592 -54965660 -26104546 -654856 -1312580 -8584794 43554
12752 43554 8532005 -5362847 -22578671 -9877017 22630342 35408458 21851903 12504104
12744 12504104 19613968 22092972 11652256 11863091 36347781 62212430 64060216 48540700
12736 48540700 36275429 29746525 18004743 -272454 -14309679 -14266150 1327032 22928475
12728 22928475 32021484 18022563 -4559881 -9809030 7079252 26629748 35277853
12721 35277853 39060162 43232906 39594479 23128885 3416083 -10066980 -18884385 -24804804
12713 -24804804 -24258975 -20193106 -21666986 -24647984 -13210880 11065697 22831339 9221070
12705 9221070 -8841226 -7979158 4824376 9901485 6975565 6778234 5644244 -5905467
12697 -5905467 -18942198 -15879817 942161 13293599 15114827 14228620 10828592 -392499
12689 -392499 -8304477 6223711 35091145 43935945 19936470 -6135370 -3187593 15249534
12681 15249534 13081163 -13786152 -32429708 -20973404 4084180 16620312 16306356
12674 16306356 19842202 29775935 32184626 22542810 14451611 17294319 21054069 14304959
12666 14304959 6044792 14375424 37796965 53278839 44910070 22516830 7215828
12659 7215828 7236539 13838229 15592954 10719538 6752680 10886825 20817501 26552566
12651 26552566 23096174 18010018 21764450 33058758 39283964 30630396 9985443 -9224264
12643 -9224264 -12849113 1302957 17902268 18656956 5206873 -4121587 -4397820 -12123597
12635 -12123597 -31699423 -36647297 -7702542 29260152 34926070 13442215 1270751
12628 1270751 6666906 2766336 -17013862 -21870597 4250536 33685687 38462906 28046966
12620 28046966 21500686 14635278 910110 -4693807 7668398 17348238 4832230 -13804387
12612 -13804387 -14825797 -7047582 -10006120 -12069576 10706151 47634249 64833430 55519796
12604 55519796 42060624 34824703 26455398 22196413 36288689 57611017 56844583 32106115
12596 32106115 12639825 12529819 15396872 10877179 10334344 16662394 13737850 -531806
12588 -531806 -3613989 13181045 26304992 18062704 4411672 4527232 9482110 4879702
12580 4879702 1539356 16709201 40933511 49713240 38137946 22091848 12699520 8283169
12572 8283169 5647342 3487356 -1083764 -8095928 -11930687 -9916106 -5236823 3238724
12564 3238724 20318462 37854399 36732004 15939455 1507659 12271923 32892834
12557 32892834 36824564 21870213 6189115 1198153 5123172 13310519 19811344 18027204
12549 18027204 12225682 17015030 33880590 43200086 32958532 17447936 10016513 -2606712
12541 -2606712 -33587696 -60536306 -49322910 -6429849 24427007 18989878 -1704462
12534 -1704462 -7161783 4507880 13611297 7387978 -8462076 -18486835 -12838091 1914562
12526 1914562 9163518 3751779 -507854 7632786 18404461 15991764 1748669 -11327741
12518 -11327741 -17175461 -14964967 -478013 22997287 36332752 26938106 8808089
12511 8808089 -229608 -7592930 -26217696 -39960858 -24034833 6836512 10162854 -22123023
12503 -22123023 -51424061 -50693362 -37883414 -36595410 -37633649 -21742608 5795343 27002106
12495 27002106 38308294 44419210 41508648 27400329 15467412 18767283 30167591
12488 30167591 34819553 32763525 33501258 37239073 37302227 34324373 33907909 35457959 34766269
12479 34766269 32141533 28170607 17377059 -4834006 -33502854 -57512244 -65659716
12472 -65659716 -49309920 -12522727 18718149 16666445 -11478063 -27002066 -10172572
12465 -10172572 14322950 16971655 5260042 3890073 13181076 15276034 8379411 4561092
12457 4561092 938523 -15825290 -37442653 -36844455 -9333161 14560857 8105638 -18522480
12449 -18522480 -35349376 -28705962 -9002383 7733896 14748093 14511081 11422980 6126735
12441 6126735 -2671293 -11136969 -10775687 361868 13621873 22182443 29174164 35984823
12433 35984823 32795495 12827461 -12196088 -24690725 -23430727 -19826465 -18094885 -13892709
12425 -13892709 -7969605 -5843529 -6694664 -6337884 -7833042 -15654196 -23674276 -23289664
12417 -23289664 -19056339 -21555917 -29597133 -34533219 -36141415 -37876593 -33794098 -18977843
12409 -18977843 -4952145 -3186862 -1858640 15233826 34419340 28018362 1102268
12402 1102268 -11497434 3384082 22657419 28121605 27343090 26277661 16979587 2880150
12394 2880150 -35296 1357231 -19105826 -53287289 -55207210 -15229980 11321919 -13594455
12386 -13594455 -46460690 -29227611 18802457 35706754 15109118 3280091 13893847
12379 13893847 15229811 197510 301367 19169493 16460180 -20861891 -48389905 -33235234
12371 -33235234 -3319523 3689055 -4210241 -4572378 -6526240 -23907142 -35392960 -17332548
12363 -17332548 7260569 -650823 -31384399 -38331493 -8229864 22624956 22996076 765837
12355 765837 -21824883 -34629156 -33700168 -16198899 8506403 22394948 21690776 21398003
12347 21398003 32684426 49124066 57471020 50587531 31357601 14823206 19394449
12340 19394449 41293716 48295140 19829637 -17131474 -19657720 10770195 32066933
12333 32066933 24381919 13092972 21989817 38719523 42218120 35153509 30086451 26302889
12325 26302889 18829693 11972412 8545519 3026522 -3106226 -102004 5399754 -8627944
12317 -8627944 -38389096 -44410807 -6686170 38765558 48161232 28948861 15533967
12310 15533967 9642222 -11011851 -38791299 -39751057 -10298160 13823382 11242583 -761681
12302 -761681 -3926932 -4662702 -10156692 -11794808 -6980491 -8555651 -17761504 -15175704
12294 -15175704 5767119 22744506 19644206 12506588 20053228 31067106 24818645 6623098
12286 6623098 -1034756 8456085 21790419 26112302 18392227 4093100 -2325956 11076175
12278 11076175 31506654 28545262 -4322896 -35987408 -40202349 -27889745 -18075657
12271 -18075657 -4004498 23540978 43671656 31921338 2473765 -12175008 -9574227
12264 -9574227 -7847997 -2142737 24174649 52040023 41244072 -2594192 -24056229
12257 -24056229 5041553 47335009 56919097 35927688 12123518 -4622881 -16383078
12250 -16383078 -16498421 -3703231 4252930 -4055754 -14235433 -13432926 -14301984 -27109356
12242 -27109356 -32188343 -11380335 13380269 8533146 -18431966 -31837897 -23624116
12235 -23624116 -17154471 -19217463 -9566439 16205499 31886304 21823592 4504877
12228 4504877 -842234 -1797335 -7484969 -3726085 19011105 33812957 8169595 -41679494
12220 -41679494 -62480355 -34157181 2521909 2063337 -26794938 -40539676 -23482993
12213 -23482993 -1783090 2528537 1412668 13246376 29224166 28299534 11643537 -1853021
12205 -1853021 -7988423 -19721010 -36713786 -37998464 -14015608 14387422 21737356 8456975
12197 8456975 -6107358 -9507942 -4170300 796712 -3333415 -17567655 -29629717 -26866710
12189 -26866710 -17498159 -21761283 -37181118 -36072812 -9001706 14994299 10628822 -5766473
12181 -5766473 -6522041 764706 -10128335 -35326235 -45164302 -30908159 -12036217 1597871
12173 1597871 20134248 42690152 49626586 35849158 23517822 28843485 39305913
12166 39305913 36695521 23146624 11255417 4165206 -2255681 -8802139 -13461799 -14639917
12158 -14639917 -11122166 -6819661 -11409018 -23899582 -24762499 -4466146 10794982 -8648019
12150 -8648019 -44727862 -49527864 -14969487 15704474 14155252 2796906 8421180 20992730
12142 20992730 22858132 22297283 28277780 23231796 -6118198 -36789464 -41818779 -32151439
12134 -32151439 -33034502 -39620461 -31812595 -15860670 -14027939 -25296659 -30851768 -27249970
12126 -27249970 -21838797 -9273447 12932573 21505059 -258573 -22481595 -6670781
12119 -6670781 28359057 30226837 -4074364 -26693736 -21589281 -25132402 -49831744 -52159074
12111 -52159074 -6973173 42630576 50424739 35040560 36885722 46829539 31442338
12104 31442338 1456233 -2490412 20940965 32646509 17409087 793187 -557466
12097 -557466 -771040 -8900535 -11578651 -4403941 -5514686 -21844468 -32502064 -24129091
12089 -24129091 -15556286 -25581932 -39203357 -31224365 -6806205 8422061 8526228 10523789
12081 10523789 21339486 27641578 21804949 15446662 18612141 22810268 15701766 27778
12073 27778 -13438593 -21867968 -27402417 -26488026 -15671443 -2152112 5803388 14036814
12065 14036814 30951963 44102806 30926583 -3526942 -24086848 -12231164 7531160
12058 7531160 5861056 -8055692 -7067938 6013576 3969697 -17149394 -30023065 -19619574
12050 -19619574 -4297677 -3699070 -11517901 -13225814 -9588372 -8605905 -11199281 -16792772
12042 -16792772 -26585193 -30891955 -12106276 26983786 56544963 55691831 36937014 20376535
12034 20376535 5244226 -12673260 -17042049 7174740 41813358 54540805 41512437
12027 41512437 24707085 15078624 6917117 2967867 13580852 30518101 31719148 16747836
12019 16747836 10005992 21977740 33602308 28910883 18770094 18934434 24819331 23002019
12011 23002019 12612825 1858421 -5043996 -7223628 -4278166 -1163209 -3904773 -5588399
12003 -5588399 7526615 29876627 35838374 15612046 -7189804 -7876999 7301117 18585667
11995 18585667 25254297 38358997 52474163 49884031 29885476 12720038 13428021 27426675
11987 27426675 41480930 44709722 30653000 4020187 -15411671 -11719496 3744095
11980 3744095 4225296 -15402423 -31823675 -29038901 -21289293 -27262554 -37236292 -25762945
11972 -25762945 9097792 38908696 39213526 15964017 -7127570 -15309447 -9337744 4508317
11964 4508317 19422762 27695686 26503304 22806035 23318606 22122537 10475643 -2239101
11956 -2239101 5458859 34502054 55643078 44192010 10973522 -14763652 -20516171
11949 -20516171 -12602519 3553329 23104031 31262068 18824410 3090375 6162596
11942 6162596 15907215 707239 -35575332 -50979164 -28541783 -3481808 -6796080
11935 -6796080 -18673658 -9277488 5792897 -7482292 -39366420 -47749131 -24984509
11928 -24984509 -9135717 -24958266 -52053161 -61044579 -49212301 -29112582 -10198580
11921 -10198580 -3393145 -17032249 -35229202 -26629171 9633210 32653758 14404861
11914 14404861 -18312410 -21685081 5353176 29381022 36600600 43530476 56843650
11907 56843650 57808905 35936304 10521440 3239695 7952154 3988065 -13469590 -32283246
11899 -32283246 -43227918 -44236555 -31033123 -2766661 23083924 21173810 -8595241
11892 -8595241 -33936612 -27967124 -2388998 11529726 5427577 -2273002 -490617 377190
11884 377190 -7128924 -12065839 -6090154 -548125 -5543428 -7346176 11724910 40158375
11876 40158375 47383834 24700970 -4962021 -19588702 -21707819 -25392377 -35327783 -45001279
11868 -45001279 -45519984 -33174577 -16037006 -10469405 -20332614 -25682199 -8827680 14197113
11860 14197113 11842022 -14147324 -26403208 -6067435 18530249 13013827 -16020741
11853 -16020741 -35284473 -29611894 -11470882 3260260 9224340 8066276 7301234 17176405
11845 17176405 35780881 44797991 32798140 13709720 7855445 14109735 17770620 17660389
11837 17660389 24725466 36696697 34953214 10813186 -19013861 -28484483 -7038522
11830 -7038522 31905223 62116735 67300692 57163581 54961812 66466940 73818883 65517901
11822 65517901 53697757 48886514 38506964 11796019 -12352323 -10411450 6434718
11815 6434718 9169175 -2813928 -7104939 -3492029 -13561809 -33860635 -32529835 -3796298
11807 -3796298 15778193 4933974 -6778510 11647458 40840086 42784084 19814649
11800 19814649 4201242 4346906 -491025 -18694999 -34810858 -38794259 -35948640 -26048588
11792 -26048588 -1431382 29223585 41951929 30956693 18769381 23803988 37373647
11785 37373647 42396552 36423009 25349638 11468843 46222 2051678 16271170
11778 16271170 22525205 8519477 -8398120 -4484166 14252528 20277095 5945040
11771 5945040 -5112185 7256236 31361592 40310027 26457075 8199683 6025474
11764 6025474 19728458 30310141 22384429 3390323 -3765605 9277811 21013586
11757 21013586 6225181 -26640021 -41394979 -20089680 15183828 34699575 36440848
11750 36440848 34017551 27188371 8896568 -8577108 -3943439 16965735 23804785 6727419
11742 6727419 -7939938 1153354 18372556 18149630 3774213 -2947045 3455548 10709730
11734 10709730 12968105 14032830 12357580 3913202 -3875976 -738072 7593478 8901186
11726 8901186 8927834 23971622 50268445 64116864 54804294 35467957 18314810 2033008
11718 2033008 -11183945 -10266274 3941689 14408619 14595843 18051673 30142661 32945927
11710 32945927 14116601 -9778091 -17589701 -13884508 -15120658 -20923740 -20437173 -14535932
11702 -14535932 -9787317 -1059301 17245051 31791568 26284035 10424939 7958865 19230621
11694 19230621 21529151 7374553 -3553240 3043324 14449532 12212513 -2480585
11687 -2480585 -15987955 -21728543 -21816925 -18750229 -14828375 -13232084 -12941951 -8380330
11679 -8380330 1199626 8213180 6705407 -580303 -9012044 -19116997 -31354605 -39106568
11671 -39106568 -33776009 -15931099 3088010 12049658 11253018 11461939 20330639 32396304
11663 32396304 36933080 33278173 30079209 29999545 26763142 19802734 18179837 23837415
11655 23837415 25019100 15331844 5411281 4776193 6782556 4603483 5611687 12659038
11647 12659038 8735432 -15986786 -37385052 -27492969 -670936 4259232 -16795639
11640 -16795639 -28482839 -12600528 7800951 10660304 6410028 10813939 15895242 8270604
11632 8270604 -6453249 -17263817 -26579425 -37713744 -41766428 -34550069 -29085617 -33943765
11624 -33943765 -37021677 -28820712 -22373434 -28365047 -29616834 -7279570 22757016 30054616
11616 30054616 16796289 13311943 29710879 42328487 31290799 5534997 -15364523
11609 -15364523 -22643486 -15866844 1072519 14656731 10527715 -4343499 -4079658 22569730
11601 22569730 54587347 64047425 48000548 25324773 10824037 3464412 -4064592
11594 -4064592 -13737605 -20563428 -18496058 -7689347 3866131 7857539 4514907 1620138
11586 1620138 5532581 15422626 24733687 26538994 20370409 14935044 18827453 27125385
11578 27125385 25327714 9738500 -6506505 -13356797 -17427171 -26168580 -31030870 -20540438
11570 -20540438 -770284 12600982 15546064 14085924 8774348 -2652972 -13154057
11563 -13154057 -13979286 -9202923 -6194050 855974 17912916 29542854 15801260 -13148491
11555 -13148491 -26771240 -18103134 -9339039 -11837617 -12691005 -8110689 -15712505 -38591655
11547 -38591655 -49579432 -32511478 -10599221 -8390554 -11043035 7957156 38471959
11540 38471959 47392056 28673124 6372253 -5784871 -16127691 -28684931 -34904182
11533 -34904182 -33192898 -31013473 -26378151 -11942599 2476257 -1175798 -15763179 -14280090
11525 -14280090 5611994 14256736 -1530133 -16082613 -10349896 -7053090 -29789445
11518 -29789445 -52681067 -31777967 24172809 56899325 36165037 -3196231 -15495555
11511 -15495555 -4291632 -4649878 -25320629 -38632713 -24802563 -726236 4741925
11504 4741925 -10311347 -20427756 -7762661 14986703 22356984 10112425 264782
11497 264782 10115160 27335853 26254300 3717786 -15289216 -10099387 10052158 20636376
11489 20636376 13605056 3773526 6432712 19331633 28999921 26830364 13653068 -6829115
11481 -6829115 -31265909 -52114910 -56370594 -36067361 -750908 26374003 29340584
11474 29340584 14426446 1126631 1372576 12502205 26746821 38475935 42572798
11467 42572798 36206241 25725131 22917972 29733247 34646867 28784703 16641558 5441789
11459 5441789 -4563389 -10455452 -1075130 23277333 37064848 17574465 -18393361
11452 -18393361 -30522962 -8407748 16603114 18795506 9787053 8798545 7951586 -8077311
11444 -8077311 -26842219 -23690385 -3814323 3297756 -9018546 -15091373 -2442873 4473273
11436 4473273 -14744532 -36726033 -25056277 11589030 25545761 -3233601 -37190682
11429 -37190682 -32508414 2577859 24450327 16016807 2341100 4533394 8444186 -6560346
11421 -6560346 -30894510 -39376062 -28804869 -16172511 -6611045 10384674 33557291
11414 33557291 45299825 39679061 30938075 26402248 15016965 -6368679 -20207511
11407 -20207511 -17357193 -15075492 -26195062 -33757567 -21871965 -10189482 -24557298
11400 -24557298 -48674662 -42966107 -4840673 28264882 35517305 34045308 38356340 36785146
11392 36785146 21707461 8750127 7287007 1680680 -16296698 -23024340 2548561
11385 2548561 40417836 53827736 38544381 20926096 16551408 17832834 18184551 22404676
11377 22404676 31123889 35440493 31297674 24607423 19454881 13400869 6157911 2310963
11369 2310963 4219539 10641420 21218124 33409229 37206223 23747060 -500145 -17398316
11361 -17398316 -16684896 -6108779 -1906835 -12654951 -29961166 -32755431 -7582497 30853882
11353 30853882 48686682 30449014 -1648607 -16180460 -10067628 -3259314 -4792803
11346 -4792803 -4223170 5231421 15721032 21659107 30033104 44021077 48559549 25787551
11338 25787551 -18094422 -51724594 -47732255 -10047201 30423942 46643428 38596498
11331 38596498 24736034 17406990 14956039 13405884 12608793 10403611 3935845 -1207230
11323 -1207230 3109314 11069461 9622244 4358124 15782505 41744589 50477912 27680022
11315 27680022 3799665 9415967 27143808 21013320 -3520941 -8024421 17633198
11308 17633198 41685980 39960348 23809324 12110211 6635328 4634280 8184245 10167446
11300 10167446 -4339102 -31338573 -44918614 -32109710 -9968484 2633643 9323445
11293 9323445 20730416 34956458 46835385 59145807 72057329 77322421 73218196
11286 73218196 68030605 59492594 31929063 -12897095 -43626004 -36331491 -7068307
11279 -7068307 10613250 6399449 -5540499 -12029918 -9372887 2478384 17452204 24385109
11271 24385109 23594930 30310425 48806214 58807209 44400797 21373110 15990831 28927874
11263 28927874 40164506 38522021 26276861 5298748 -20031848 -35090235 -30968626
11256 -30968626 -19939546 -16221768 -13402898 -3096793 -995833 -23032796 -45622931
11249 -45622931 -28033854 24401848 57028897 36818896 -5409751 -20534742 -2743732
11242 -2743732 16293621 16842456 9493670 10173357 18253743 23685511 23861354 25186571
11234 25186571 29796128 28086571 11516446 -9544108 -13547697 1671860 10000931 -9805926
11226 -9805926 -43852537 -61192947 -53059344 -36772979 -27267005 -23629161 -20939755 -17713565
11218 -17713565 -12183926 -5411758 -5550796 -15965284 -24896832 -21636300 -14832085 -17109794
11210 -17109794 -21405048 -14982495 -7325504 -15976048 -30913120 -25364414 -851079 13037210
11202 13037210 7578952 7500357 24433531 33703642 15871644 -9307271 -13342848 581976
11194 581976 10745037 10487000 5461426 -6079180 -26240648 -42146884 -39246751 -22179392
11186 -22179392 -5499065 7412314 20326738 28933421 26801562 19413666 16863168 18559583
11178 18559583 18343941 18258533 24481080 34909325 41229386 38227662 24549046 2933241
11170 2933241 -14675448 -14835418 -2591446 891415 -10921326 -18881363 -9161587 4106260
11162 4106260 3663081 -1727221 5797286 21415496 26259846 18541285 13327598 16849706
11154 16849706 21718395 24461084 29330027 35795478 37047309 30516361 20389055 13145019
11146 13145019 16179200 31026496 41920090 26900624 -9519111 -33284089 -24485478
11139 -24485478 -4133321 552960 -4349490 1173300 12846988 13412491 6116701 4328599
11131 4328599 447505 -19834797 -41380484 -35154003 -6315335 10068058 1743173 -8025665
11123 -8025665 -3653597 2393949 51456 -395015 8210111 16363944 17890278 18094972
11115 18094972 14710042 -1917704 -21704643 -17821716 10724531 27913769 8464853
11108 8464853 -27150668 -42128560 -27562273 -2320960 12627287 6223402 -18579445
11101 -18579445 -40456211 -36268519 -11465588 4293023 -1056515 -7420016 1364671 13330592
11093 13330592 14238711 12021416 17943456 26234821 30373844 37619280 49125403 48373635
11085 48373635 29816585 16370041 25044961 36668825 26569510 6846566 8431599
11078 8431599 34194693 58890908 66686494 61922986 49622939 30762498 12622213
11071 12622213 2057778 -6972407 -20337897 -25900866 -9347321 19148539 35109936
11064 35109936 31127425 18726821 5549726 -8848657 -19718642 -19982918 -13639628 -10135241
11056 -10135241 -9993356 -9293975 -8917151 -5350930 13023343 42015450 51260997 22403366
11048 22403366 -18352785 -34395458 -29907996 -33203088 -43123575 -34339407 -10209933 -4172012
11040 -4172012 -23482370 -34949689 -18503708 4475965 11997446 13463943 20327876 18574448
11032 18574448 -3254656 -25555138 -25643165 -13969037 -14224059 -22958950 -17982258 2535454
11024 2535454 17509960 16719083 12688632 16230027 19412831 9936081 -9116035 -21717227
11016 -21717227 -17755622 -5245391 -1630028 -11806534 -19719614 -9212233 11309489
11009 11309489 18165508 5394262 -7633282 -5256847 4134104 4682165 -4303842 -12880791
11001 -12880791 -16661150 -17245224 -14239418 -7415935 -2383845 -6297421 -20266561 -38747194
10993 -38747194 -51829596 -48334555 -25842855 753251 10862494 1037638 -13166856
10986 -13166856 -18838481 -17124150 -12011485 -2739418 8410209 15109335 18692977 26916117
10978 26916117 37097794 36794313 26041462 19787447 20792262 12027056 -11402487 -25462293
10970 -25462293 -11752895 10364154 10562886 -7734967 -17032129 -11420795 -11740298 -24940294
10962 -24940294 -28684223 -7093490 21861182 31589114 24429504 24435792 39015727 48100675
10954 48100675 35551991 14915413 10839324 22875404 25400351 5311481 -17681273
10947 -17681273 -18493880 -535189 12847202 10595402 -410018 -14278419 -28803631
10940 -28803631 -32653510 -14437081 13209082 22766410 10916069 4788204 20532310
10933 20532310 39933349 41553729 32011736 28044369 26907634 16219023 -855741 -12257682
10925 -12257682 -19443210 -32534134 -48634642 -52737848 -37429172 -8996684 21431751
10918 21431751 42192291 43727256 28904532 15261209 17562041 33710001 52818880
10911 52818880 66210673 65587092 46656313 22586283 15153923 22898129 20955021 5530264
10903 5530264 9232999 48449293 84408066 71918564 25656005 -2929918 -860004
10896 -860004 -599200 -16759824 -23922298 -6440863 11919251 6740677 -10051201 -13022566
10888 -13022566 -1389304 5122322 -5117017 -25585381 -41269301 -41131284 -29618519
10881 -29618519 -26558740 -43268132 -61587790 -54892476 -27739434 -11339028 -17821364
10874 -17821364 -24439860 -10281356 15040277 29677670 26721891 13278133 -59039
10867 -59039 -820908 16914451 39162439 44582710 34184560 27761502 28410527 18220193
10859 18220193 -3861065 -11660144 6344852 25432297 24146052 16013325 18220173 17439721
10851 17439721 -2321480 -21895941 -13540968 10635957 14684429 -5498879 -19284140
10844 -19284140 -10918787 3315737 9506899 14501138 22744688 23671882 12727744 1392562
10836 1392562 -4162087 -13406097 -29890924 -39166565 -30784157 -15438296 -6740162 -347881
10828 -347881 14223234 32341012 40132041 34956343 26994097 24272039 25750767 25608196
10820 25608196 17264334 -1373104 -19905435 -20617806 -1313928 14854322 5530542 -20223285
10812 -20223285 -33049893 -23014940 -10128230 -11533547 -16939516 -8449746 9379329
10805 9379329 16464157 7234047 -4156134 -7403017 -7853154 -11761403 -15304796 -14669196
10797 -14669196 -13665819 -13152771 -5260430 11655519 23714216 19612739 8161861 3734576
10789 3734576 3654409 -2477823 -8413042 1957151 25097414 37462867 28411254 13284909
10781 13284909 7081796 4388403 -3853844 -10168803 -1673226 18602314 34443850 34731024
10773 34731024 20381990 -389499 -16005842 -17331440 -7393203 -643607 -7165444 -21828958
10765 -21828958 -30792852 -22175366 8177072 48961690 71671315 54366713 12145619
10758 12145619 -14220486 -7145049 9976857 12932084 10325544 19444436 31610550 27900683
10750 27900683 13720540 9258319 15735981 19614277 22517240 36093654 51082067 45015585
10742 45015585 22796296 15376133 29596994 33307581 6567196 -23420033 -22434604 332911
10734 332911 11239035 5020035 6097163 23333487 34809230 21326658 -9340559 -38332078
10726 -38332078 -55786267 -56868370 -36120537 1033685 32958917 41604359 32019894
10719 32019894 22869639 23400907 28663357 31645271 30011479 24630349 20404829 24273997
10711 24273997 33332731 31409873 10396315 -11225512 -9237838 9779214 15269091 -1201700
10703 -1201700 -12403280 1140549 20007496 17897434 2742449 -1199119 3701085 -4139473
10695 -4139473 -23026686 -27651277 -12128976 -268409 -5385975 -10053307 1665623 18190618
10687 18190618 22243166 16633295 12013979 8326511 4715620 9095816 19987929 17043505
10679 17043505 -9363164 -34735524 -30139325 -3802651 11026035 2014399 -12558710
10672 -12558710 -16206866 -12978981 -12418038 -14619993 -14312837 -7701987 5924215 20482011
10664 20482011 23813636 11128575 -7118946 -19016296 -24190202 -23396968 -8515199 20628680
10656 20628680 41320555 31269217 474977 -20318627 -17926637 -4322495 7467727
10649 7467727 12764955 5192909 -18100228 -41458476 -43892978 -28453934 -17524031 -19260852
10641 -19260852 -21450102 -18222638 -16561243 -13677880 3329399 27669789 31331873 6127151
10633 6127151 -19324259 -18832294 -1576661 10555233 14986082 16849712 7109648 -20221719
10625 -20221719 -43254323 -34366658 -1703786 18169844 8416427 -11280500 -18730643
10618 -18730643 -17041291 -19498052 -24984099 -22955504 -13846341 -10534740 -20569877 -35859886
10610 -35859886 -42056522 -33986566 -19692009 -10718675 -10119676 -10638418 -4623888 5612306
10602 5612306 10093989 5374515 2869396 16244051 40289128 52478311 41793570 25071764
10594 25071764 21682718 21921489 2151323 -32760768 -50097540 -37397434 -20310245
10587 -20310245 -18994889 -16435500 6961237 33467299 33765000 13725385 1396013 474526
10579 474526 -7032345 -20065690 -19266478 -7115737 -8981143 -28960873 -39900841 -26436027
10571 -26436027 -6112655 3431624 9003752 20575812 31333923 32742342 28447912 22867296
10563 22867296 15574764 12616738 20797462 27586026 14224984 -7839601 -6684071 17669730
10555 17669730 28570119 12289148 586091 13577299 22056901 -3067358 -40323098
10548 -40323098 -52893753 -44915868 -43942136 -50139674 -42734415 -21324563 -3589473 6908357
10540 6908357 17589089 22338528 11612967 -2926800 -3972199 1281117 -3776915 -10683805
10532 -10683805 1347227 25989741 35577980 22336636 4145201 -7742120 -18320329
10525 -18320329 -28122731 -29965699 -26663557 -28849983 -35273915 -34840831 -25961897 -16731169
10517 -16731169 -11139096 -10599271 -19728955 -34657942 -38368893 -24579342 -10787429 -10641164
10509 -10641164 -13492682 -9927644 -11503432 -21714874 -17657888 9938411 30816295 22996172
10501 22996172 9972028 11173392 -564833 -40708922 -61095708 -24818482 14643774
10494 14643774 -4656335 -36471383 113651 66209434 60507586 22012964 110054796
10487 110054796 339022585 495116867 410694440 190946059 51345846 35633506
10481 35633506 32893835 -2630792 -9216726 31334231 50210612 14664962 -21313258
10474 -21313258 -15732359 3808632 7631918 10682189 24794164 31033696 23928747 24384658
10466 24384658 29839031 10305639 -28547937 -39627033 -12876390 1875812 -22968135
10459 -22968135 -48077577 -37822482 -18475884 -24875975 -39413000 -31496676 -16695939
10452 -16695939 -25887585 -46177264 -42790004 -18441442 -4069354 -5718711 -4500918 1137344
10444 1137344 -4776133 -18382730 -17266974 -312324 7200008 -6146159 -19770309 -11547799
10436 -11547799 13280472 31751794 29167489 10772253 -4125764 1024215 22508255
10429 22508255 37932155 30397687 5490021 -20191399 -37244368 -43430199 -38308850
10422 -38308850 -28811407 -28289853 -37437604 -37606175 -17398871 5187245 4379935 -17753854
10414 -17753854 -35286546 -32867902 -18944365 -8113639 -7592200 -20026575 -42449197
10407 -42449197 -59758588 -54060573 -26386860 676719 7452929 -2165960 -8616040 -230214
10399 -230214 16178645 27415026 31789769 38863275 49775778 47426136 17890988 -23541537
10391 -23541537 -44664904 -35613855 -18114062 -11259474 -8068220 3728635 17222775
10384 17222775 19248961 12747845 7395759 -449655 -17568088 -31471159 -21058527 11242627
10376 11242627 37567251 37629687 19021010 2434618 -247051 9318604 21005084 21925978
10368 21925978 6028152 -17938119 -33200091 -30923845 -15703730 2390233 15244147
10361 15244147 18388508 12125728 1643709 -5984544 -3298093 16090817 47524205 67859706
10353 67859706 55118862 20667980 1570186 9957763 13441622 -14110520 -45966525
10346 -45966525 -39067580 -1804872 14970423 -8069995 -34705353 -31443271 -11877321
10339 -11877321 -4953418 -10522145 -11144350 -5367526 -2562199 -27010 8549234 12394459
10331 12394459 -2065558 -21718648 -18117309 10889872 35103567 33010669 16805221
10324 16805221 6192142 -2508388 -22851617 -46735203 -49972109 -28303684 -6417792
10317 -6417792 -3962061 -10149145 -5068171 7793704 9807762 790544 888956 17231578
10309 17231578 31659897 30402250 25176105 30401480 36902755 27304284 5389011 -10280934
10301 -10280934 -14205108 -15892562 -19998827 -23750573 -29059541 -37598514 -38838162 -24433752
10293 -24433752 -9873510 -16579728 -34061112 -28573298 6070706 35174004 31230339
10286 31230339 9745237 2562017 16527156 34426509 40186530 28755948 5642713
10279 5642713 -11240836 -4193802 19401100 31614531 22856348 14955656 22862173 28564910
10271 28564910 13409973 -7554018 -10639414 -3955430 -11778989 -31401962 -37974821 -25723163
10263 -25723163 -13357296 -10884938 -9817783 -6263139 -6355173 -6697713 4558581 23116380
10255 23116380 29204102 18095890 7589663 9318416 14028140 11809202 6309183 1705408
10247 1705408 -4495183 -8167555 1681237 20783050 27192300 12679294 -1455019 6323303
10239 6323303 27266742 35176870 19057328 -8677535 -27586441 -23907782 913139
10232 913139 29163691 42944483 44258439 46774520 47593951 28634172 -7413909 -27427398
10224 -27427398 -9951676 23141118 35989613 23601072 7806014 2872237 7092723
10217 7092723 17710867 31207129 35236423 21658669 3726048 1614367 14678020
10210 14678020 25319634 25103237 18333041 5180661 -16523625 -33922420 -26074989 7261135
10202 7261135 40755045 51791253 40961320 23542214 13418817 15000857 19058355
10195 19058355 10031453 -10309270 -16196199 6082419 27836655 13998677 -17931604
10188 -17931604 -15196792 29649554 59761467 34645666 -10738866 -19081647 8487187
10181 8487187 24266278 7054928 -18860550 -29862467 -28026293 -19097093 -1646380
10174 -1646380 14125419 7766731 -19036841 -36345783 -25682680 -5057149 -181561
10167 -181561 -8977349 -11144227 757336 16687386 26465473 27035393 19248237 9799830
10159 9799830 9546520 17899212 16166519 -9480114 -43419027 -54224258 -32079324 352475
10151 352475 14915318 4493310 -18017346 -35260651 -36297479 -21804005 -4309895
10144 -4309895 1948017 -4897564 -13793344 -14781977 -8407954 -770523 4448588 7279078
10136 7279078 10131416 16484990 25936238 30497697 22277721 5282865 -7756953 -11168835
10128 -11168835 -10748809 -11586653 -12231881 -14057490 -23618737 -38256138 -41736329 -25962886
10120 -25962886 -7178842 -6047872 -18607801 -23586923 -14306046 -4040096 369471 8516295
10112 8516295 22960389 26748243 9556964 -9463178 -5540385 13829898 18291591 701397
10104 701397 -11149258 2568350 21546292 14863749 -11372255 -20846704 1039406 26916100
10096 26916100 26620954 5770779 -9303920 -9182062 -3613133 4351222 21658670 42450214
10088 42450214 45851514 25128473 594047 -7657574 -4478385 -4903925 -9735019 -11814652
10080 -11814652 -13514172 -17918390 -12349341 15236391 47467067 51478917 25118290 4462638
10072 4462638 15194409 37280957 33011116 -4240524 -44966137 -58197644 -37882539
10065 -37882539 -2059734 21294802 13119999 -18883732 -43192400 -35365263 -4704667
10058 -4704667 17616109 14024872 -4602090 -17317188 -16187099 -9020097 -6009900 -7987586
10050 -7987586 -7020343 2692197 16550093 24801370 23758852 16451205 4959405 -8542361
10042 -8542361 -14522859 -3152760 18312623 28459006 17822627 176286 -7798240
10035 -7798240 -4628525 4818610 20351393 37906877 45205054 38690027 30305585 24706256
10027 24706256 8009743 -22958115 -40120722 -18773252 22771173 47872920 53400997
10020 53400997 62806045 76536112 70471202 44681168 31649306 45226219 59434902
10013 59434902 53805556 44244367 47924084 50189867 33457066 12738382 12368860 26169921
10005 26169921 29253910 15147096 -4094630 -20607180 -29067822 -17548157 13187952
9998 13187952 35195269 26700658 7432502 10650110 32231943 41727753 34111207 31475430
9990 31475430 37790215 34186111 21354533 22743225 35583629 22378296 -29261691 -76181680
9982 -76181680 -74112257 -32184084 11401750 39061125 51632406 44147705 18071171
9975 18071171 -1658714 3737678 14059388 -388926 -29022266 -35881490 -16235759
9968 -16235759 -1489831 -9239779 -23638676 -28574450 -27334733 -22300493 -5474945 20296736
9960 20296736 36401490 35122138 28749398 24638579 15716763 3691966 3967987 15411100
9952 15411100 13605540 -9286301 -25756827 -15006098 2760265 495320 -10576130
9945 -10576130 -2481415 18926198 20258821 -8508501 -40088999 -45939836 -23041767 11902789
9937 11902789 34423448 26427476 1317324 3767545 55638304 113344584 115577268 66579573
9929 66579573 28887848 33037378 43475241 26422197 1734268 773656 14771641 19876245
9921 19876245 21318167 35203250 50626810 47177561 31408916 20588510 8187606
9914 8187606 -17080950 -34947728 -19534000 9351527 7279603 -25837262 -44778770
9907 -44778770 -30114573 -12686826 -15935197 -20280328 -5605744 11980924 13463012 13032757
9899 13032757 29005096 44662827 32268604 -769814 -21529201 -16701175 -881716
9892 -881716 11354248 16365553 11525636 -1446026 -7158678 9185250 41597886 72616047
9884 72616047 94579129 107127188 108999078 113251222 150341878 221041468 260428007
9877 260428007 196748510 50669864 -69495812 -89003724 -45468977 -23778050 -48002230
9870 -48002230 -74162813 -67207910 -40241733 -19396090 -8221349 702185 4122348 -4383765
9862 -4383765 -17488067 -19941796 -8061696 5737565 6859423 -8749057 -34685858 -60175240
9854 -60175240 -73258077 -64240827 -35796078 -10165495 -13829037 -45713894 -70195076
9847 -70195076 -56673154 -20641840 -6153638 -27834431 -53134035 -49251178 -24077624
9840 -24077624 -4896306 2846586 11709574 20610296 15153160 -3768590 -17433573 -17776569
9832 -17776569 -16424576 -20894618 -22554112 -15581473 -9075191 -10844725 -15751628 -20126678
9824 -20126678 -31080302 -48883839 -55987070 -39963529 -15239329 -4800077 -10150319
9817 -10150319 -17016424 -21167068 -27137758 -27657659 -9459120 19470613 32108445 18350396
9809 18350396 -886702 -3945183 4609771 8070533 3892309 2569548 9577534 20298454
9801 20298454 27327330 25205571 14345694 5484080 10741759 24278949 23987628 1741220
9793 1741220 -20529129 -18276711 1996582 11881825 -2442928 -28005194 -45452422 -47308109
9785 -47308109 -37621348 -25975230 -21280824 -22313327 -17513603 -2708142 7889482 383772
9777 383772 -16220702 -21003350 -8792303 9281107 26642031 42985109 49496325 35846931
9769 35846931 12958027 5844035 19176496 30722409 24010738 6860111 -7610276
9762 -7610276 -15857347 -13400707 5190763 25533863 19779006 -10598900 -25562622 -1972158
9754 -1972158 27188980 18065568 -19854596 -39428617 -23674171 -1251035 2451657 -5573386
9746 -5573386 -10242743 -11302232 -12589756 -12527993 -15303518 -31405984 -57473622 -73464712
9738 -73464712 -69204530 -57376095 -51136399 -45373155 -31422377 -15680642 -9908844 -12940048
9730 -12940048 -14208168 -8468047 2347732 14925096 23568306 19861931 1974153 -19600524
9722 -19600524 -31304497 -28275241 -15486493 -3865329 -5459623 -21841753 -35804778
9715 -35804778 -28005500 -5465063 2608855 -15122119 -33730280 -26553546 -2042284 11911228
9707 11911228 7955745 1424920 -518059 -7097437 -20359313 -26676452 -20136176 -16503338
9699 -16503338 -31142858 -53786942 -58584141 -35249225 128902 24862946 32489328
9692 32489328 32902760 33600084 27351156 3771213 -29099603 -45866676 -33517543 -11452142
9684 -11452142 -9044125 -27103631 -37283774 -21495347 4311420 13609080 3273258
9677 3273258 -8139271 -7752173 -203148 4489465 1896094 -8292359 -23856301 -38029842
9669 -38029842 -44536275 -46689925 -53040620 -61546728 -58041344 -36550562 -12728320 -7706518
9661 -7706518 -22733856 -39000162 -41145239 -32346423 -25179607 -25123315 -27105602 -24694139
9653 -24694139 -18489401 -14526569 -14707397 -11195952 4503414 25917586 32874257 14627763
9645 14627763 -14512699 -31611503 -32440028 -30943115 -34215149 -33165889 -21583561 -10482832
9637 -10482832 -14439140 -31833939 -47346379 -49238396 -37426437 -18532222 347455
9630 347455 14382966 21720249 21917769 15228105 6260049 3598992 7924486 6047359
9622 6047359 -10061730 -23681357 -13571593 7048195 97937 -38838559 -61625438
9615 -61625438 -30067141 26315879 45904203 14096685 -26679829 -39397545 -29433637
9608 -29433637 -16279892 -2039778 17789040 35164090 37218238 20864260 -8707241
9601 -8707241 -41891650 -62295005 -55910025 -29765620 -8190321 -4835633 -11172857 -15430772
9593 -15430772 -16211163 -13524622 -6237871 -5268807 -27303441 -63818760 -78203257 -50436382
9585 -50436382 -6168258 17115068 15576894 9459328 4904319 -6085336 -16647882 -7656992
9577 -7656992 18835813 35310956 25189090 2703372 -12355462 -21345328 -35413680
9570 -35413680 -50622142 -50596554 -30329817 -5040856 6105129 -1955657 -20286428 -37878022
9562 -37878022 -47463403 -42070621 -16811901 18841355 39084083 26287075 -4464944
9555 -4464944 -20947474 -15331973 -11714349 -25606778 -37085176 -20693005 14330555 35927567
9547 35927567 32161314 19317629 11487461 5907989 -201483 -1291309 1264553 -4582722
9539 -4582722 -19868961 -25976456 -11024502 8201311 7031628 -12153670 -23412654 -13765573
9531 -13765573 1275439 3265857 -3673905 -4730640 -1551951 -9488205 -28164353 -34105365
9523 -34105365 -13122240 14086472 15547742 -9817854 -32296674 -31602818 -17070501 -4908688
9515 -4908688 3883567 13905478 21995351 26461756 35076552 49838314 56494623 44448167
9507 44448167 25898595 18929589 21758765 21643088 20035121 27674660 39991902 39765323
9499 39765323 24062398 8746135 4279759 4555710 2607357 1807554 7802683 21246452
9491 21246452 38770426 49660538 36678974 -1876602 -35033840 -27576209 13289460
9484 13289460 44466181 44504269 36953462 45702667 56538586 44933791 19159027 6944405
9476 6944405 11824534 12245549 -58766 -8929744 -4487239 -406863 -9976680 -22909359
9468 -22909359 -20725930 -4713554 7586040 10252800 16710816 34341205 44863891 24600156
9460 24600156 -19015965 -47495506 -34098073 5392490 34055437 35412672 20429749
9453 20429749 2524446 -14038619 -22608754 -13215114 9593870 25066242 22824601 18554540
9445 18554540 31802545 56997938 68178187 48669736 8894375 -21753204 -17568370
9438 -17568370 21150047 63219909 71958850 42053345 4867503 -7694277 3764141
9431 3764141 15048652 10381134 -4721957 -16552311 -18621189 -15388005 -16942596 -29109339
9423 -29109339 -46691608 -59614652 -65026585 -66110128 -60435098 -42198847 -17927137 -4807345
9415 -4807345 -7693658 -12959486 -12406333 -15584568 -26873469 -29512557 -11087385 10845988
9407 10845988 11931935 -915448 -228751 18998139 33941777 31379527 23867435 22857966
9399 22857966 19478373 2447144 -23328803 -46575772 -62462882 -66187670 -50182969
9392 -50182969 -19906847 2473538 4643534 1504007 9746946 17297378 116577 -36404339
9384 -36404339 -57661915 -44856466 -18560038 -8631017 -18109291 -29620107 -33464902 -31970556
9376 -31970556 -24098701 -5895850 13935313 17510838 2805139 -9032357 253372 23499211
9368 23499211 40112618 40265061 27296336 6557455 -14461211 -22774033 -12522850 3509110
9360 3509110 10049745 12165220 24648136 43215763 48394720 37619810 28571414 26286170
9352 26286170 14046448 -12218991 -27708426 -15356675 4303355 2686507 -15904597
9345 -15904597 -27796882 -28445207 -28583838 -23512501 745387 33894058 46257308 31221588
9337 31221588 15239360 19008481 33377851 41581572 41218588 33047871 10607247 -23024561
9329 -23024561 -45077346 -37003350 -8344041 16407587 25409691 22615611 13830273 3995199
9321 3995199 2358430 16236734 39335889 53745460 44668180 13278708 -20398187 -29421942
9313 -29421942 -5495807 26681940 33602040 13842466 -650645 11382227 34425565
9306 34425565 44738679 45046574 51659280 61343883 55434318 32331173 13555200 15145137
9298 15145137 29313628 37872736 31450221 12775821 -8043789 -18381325 -12159788 3117727
9290 3117727 14830241 20479785 26545471 33218448 31596402 19192814 8079842 10996618
9282 10996618 25279212 37042057 38141691 32910576 28552837 24605855 15912087 3843279
9274 3843279 -2611038 -797136 -2431376 -17664603 -34910425 -31766923 -8722963 4903801
9266 4903801 -11104032 -37951417 -41102265 -14533397 15283007 25009150 16407294 2952435
9258 2952435 -8325715 -16394357 -20023839 -19039674 -15330216 -9305933 -615201 7593493
9250 7593493 12029107 15766157 22480859 25205396 12477327 -12140922 -27915385 -19092743
9242 -19092743 8729931 36981961 49817715 39256997 7008167 -31273352 -52575349
9235 -52575349 -46691017 -25908446 -9649724 -4918229 -6199030 -6927448 -3748567 4502975
9227 4502975 13632373 13692144 -206862 -18546041 -25537618 -16033139 9118 8542641
9219 8542641 3585741 -9180132 -17498119 -13666261 -3264144 576038 -6200860 -12979012
9211 -12979012 -9074314 2431562 11421409 15571732 20366245 27799725 33524290 33894999
9203 33894999 28750818 18717950 7184607 3568730 15449030 35962675 47452516
9196 47452516 41368439 27894944 20839758 18189610 5139541 -24085696 -54171080 -63049056
9188 -63049056 -46849341 -25333795 -19387407 -27011961 -28678033 -15480960 -1272387 -1276743
9180 -1276743 -8604782 -4255067 13762424 25981249 18541253 1514517 -7210629 -6257910
9172 -6257910 -7624185 -14429518 -15370467 -3026668 13850642 22923488 25453402 31551753
9164 31551753 41698729 44034990 32287187 17179351 14183261 25886745 42577742
9157 42577742 54560972 55877889 41565386 14141533 -8176588 -4452045 22553099
9150 22553099 44728082 40833709 20389922 6602708 5511965 5340036 -46128 -3496103
9142 -3496103 -203972 4004580 4431431 6313559 15925011 30670976 43145786 48510962
9134 48510962 43833969 27951596 8001763 -1469115 5254414 14724122 10399868 -3403993
9126 -3403993 -5425971 12581230 31148205 26013834 -1277393 -25979599 -31134389 -24765189
9118 -24765189 -22903707 -25469167 -18400014 4059321 29499031 41515956 36602985 23687749
9110 23687749 12097809 4124846 -3649299 -15619145 -32417062 -48653503 -56870771 -55146292
9102 -55146292 -48864993 -44070551 -41631707 -38889613 -34133959 -28170635 -23402693 -20899383
9094 -20899383 -16180042 -1544579 21337561 35465234 26322054 4528389 -2988576 13264527
9086 13264527 35019049 43873033 41767414 34964148 17390309 -12193185 -32150974 -21751644
9078 -21751644 3988869 8237592 -18726578 -46482537 -44548987 -16972871 9722502
9071 9722502 18298260 12548400 7286799 13170173 26233152 31264731 20003937 1194069
9063 1194069 -14698483 -30584221 -48344297 -51308628 -25107734 10418868 19152311 -1047688
9055 -1047688 -15873885 -6876171 6267962 6886838 10768717 33191972 55028367 49722878
9047 49722878 24498677 6732750 3687880 3131280 3023182 12627042 29462523 39887970
9039 39887970 40159493 36862975 30494549 17649434 4326399 -1993323 -7225867 -18017659
9031 -18017659 -22803125 -9301794 7213277 2504963 -13395362 -4852873 33435277 62460294
9023 62460294 52814675 23265295 8248552 11495302 13593382 7087007 -640330 -8820877
9015 -8820877 -23253896 -37712363 -36419075 -18329547 -3314833 -7316044 -21249373 -23160130
9007 -23160130 -6860640 10822466 12520570 1237239 -8216725 -11683222 -15967528 -19028090
8999 -19028090 -9091539 10624381 17096754 1385784 -12049651 -1152015 14937184
8992 14937184 1842476 -33916218 -47849386 -18470602 24839849 43551981 34296663
8985 34296663 19426165 13810435 15709675 17540991 13369944 3044463 -5684090 -6628249
8977 -6628249 -6377691 -14811578 -27320768 -31606142 -28000251 -23991002 -14379599 7040564
8969 7040564 20186126 -2520195 -46370958 -61313679 -31241971 1124986 -1477738
8962 -1477738 -18071577 -9526299 19845552 36735588 32859946 26645389 24392641 16295940
8954 16295940 4595775 2476377 6660434 -187438 -18880746 -29448428 -19055651 4297799
8946 4297799 24763320 29671160 13345776 -13242056 -24682481 -11278676 3307677
8939 3307677 -4463976 -19619401 -11203083 17218295 32826227 25331695 18398697 26076738
8931 26076738 30967818 15290699 -13404657 -37621482 -48405145 -41457168 -18088020
8924 -18088020 3177058 317113 -19095605 -23676326 -5669970 5579248 -8956100
8917 -8956100 -26176393 -17563567 6652930 16006038 5310723 -5084887 -3780627 2139081
8909 2139081 6048730 7746912 3331480 -11237265 -27314467 -31044224 -23331394 -17540056
8901 -17540056 -17831731 -14998714 -5517036 -76300 -7435281 -19965280 -22082078 -8392135
8893 -8392135 10177178 15608672 -1683450 -31715981 -49335650 -35728654 2230002
8886 2230002 37633140 49314694 38113001 17770421 -2189176 -18506393 -25520126
8879 -25520126 -17413492 -1934073 474423 -18146461 -36705205 -28677536 400616 16889814
8871 16889814 3532103 -18964714 -23911559 -13950162 -8885849 -12416318 -10546395 4528703
8863 4528703 26757338 46851963 55016809 40724256 7981800 -15779770 -6300994 25987667
8855 25987667 49864783 52956465 46421720 37474203 24861003 18600939 32730976 54896450
8847 54896450 54175221 27140373 6330856 11789140 23527933 17555740 2076244 -1470621
8839 -1470621 9074968 22497991 33280072 36682608 23343950 -3333911 -21758177
8832 -21758177 -20128132 -11377169 -6184498 4778449 23868480 29826822 13137068 295792
8824 295792 11386675 20008885 -5207921 -41374727 -40417533 -3302199 25396347 30782342
8816 30782342 40920226 62595765 60456089 20094877 -17158039 -12655589 13901913
8809 13901913 20181950 3227233 -9224085 -7747700 -5413006 -6018994 -2292289 426101
8801 426101 -10811442 -29784917 -35989806 -26168459 -16207859 -10666551 3197125 24966947
8793 24966947 31411608 12020230 -7084423 4042207 35047562 47455564 26623313
8786 26623313 -2193128 -13166927 -11920510 -14948040 -16280098 1491894 30884981 41957500
8778 41957500 25682199 10303055 21393970 45333050 51183649 34555832 17217980
8771 17217980 11601981 10258544 8031478 9641080 12006716 3093197 -13333911 -14066176
8763 -14066176 9072955 29942250 21136196 -7103326 -21319278 -10725571 2499757
8756 2499757 -1789814 -15994631 -20781495 -13069255 -6707982 -10139511 -14022687 -4506552
8748 -4506552 15984160 28632287 21734755 7896342 8894636 26192267 39455309 37054257
8740 37054257 32999122 43064102 56336165 47913437 15530567 -15092298 -24348519 -21623917
8732 -21623917 -25465251 -33920155 -29026892 -5817596 17870577 22723957 8511342 -11144816
8724 -11144816 -26002263 -34048632 -35010319 -28773938 -19375918 -12313398 -7080368 70989
8716 70989 4791615 -4262579 -27776704 -47983022 -47644586 -31813152 -20757298 -23524388
8708 -23524388 -28687750 -21866268 -3192147 15407545 23164419 17386732 3114953 -10400076
8700 -10400076 -16309585 -15356359 -11719416 -4437379 10820795 30405940 40823659 33100117
8692 33100117 14459965 1192144 3029161 17694380 36404649 49643222 50617128 39615774
8684 39615774 25823478 21199875 30732174 48348526 60900247 56620043 34505128 8620347
8676 8620347 -660954 14862418 42012697 59020360 56477000 41999458 26416793 12881794
8668 12881794 1669017 -2106084 6533090 21763134 29027377 19953391 492290 -17938820
8660 -17938820 -30526004 -38452959 -40739557 -33583790 -17571629 -274803 9610361 8126866
8652 8126866 -2981827 -17352123 -26952000 -28458654 -26250161 -25062157 -22052949 -12831322
8644 -12831322 -3019715 -3295938 -11564507 -11556974 5166398 25155483 28585609 12332347
8636 12332347 -9434825 -22047362 -21094759 -12041991 -6236289 -12452837 -25779453 -29995288
8628 -29995288 -17478259 -684760 3561440 -5450078 -16047210 -20812700 -18416788 -6113901
8620 -6113901 14943827 30992636 28143448 12881177 5067322 9930894 12672718 3632670
8612 3632670 -7780420 -11165560 -12195909 -20966649 -34106108 -40259537 -36499747 -28480806
8604 -28480806 -19344114 -9191778 -2287734 -3288665 -6009740 3413819 27645444 49435599
8596 49435599 48553752 25242622 759975 -6230762 1419138 7271386 3464002 -2402539
8588 -2402539 -1865801 1586282 -1378841 -12638853 -24760873 -29406743 -23620756 -10482804
8580 -10482804 3290235 12874745 19882985 27394853 30512445 19694362 -4338414 -28041716
8572 -28041716 -41034221 -45067211 -43405750 -34135919 -20928043 -16007691 -21294587 -20331630
8564 -20331630 -2998269 14825127 13089885 -3059699 -15339199 -22432128 -33984499
8557 -33984499 -42113261 -26670523 11041112 44501683 54831383 46428238 28577332
8550 28577332 4172359 -19642019 -31826709 -34161828 -38039159 -40959304 -27910191 -847985
8542 -847985 16954216 14403153 8001948 13343487 21802904 17465009 -258677 -21132907
8534 -21132907 -35011081 -31528797 -7849581 17320534 19660213 5929046 9029175 37159629
8526 37159629 57204947 43642408 14340576 -2462227 -8773250 -19851554 -31084767
8519 -31084767 -28950550 -15863453 219204 21909368 45831831 52668509 38214616
8512 38214616 29083388 39569955 41677780 13407266 -13250093 946558 32728824
8505 32728824 29295663 -4187457 -12079389 19627044 42493473 27891968 10227576
8498 10227576 24637316 51865838 55995478 38785361 24872328 21095163 18681551 14464414
8490 14464414 7663395 -5525941 -18074964 -13747073 4969514 15248468 11413435 13880840
8482 13880840 27252765 25651807 1143978 -10616374 16300431 51837366 52616423 23157950
8474 23157950 -3754397 -22449793 -45669081 -59818264 -39663452 -831107 11812521
8467 11812521 -8168471 -16781704 14180379 56674633 67828210 42005827 4219526
8460 4219526 -25269725 -41483186 -45318587 -40232947 -31609027 -21220825 -7704759 5987576
8452 5987576 13700061 13986564 8459793 -3687451 -19308721 -27073446 -23818403 -25827142
8444 -25827142 -44658077 -60870076 -46711881 -9349658 16829479 19340096 18240697
8437 18240697 24802572 22543680 177925 -26233086 -38953340 -41032152 -38170600 -23713374
8429 -23713374 -337882 7427999 -13756364 -38685414 -34274165 -4846297 16782528
8422 16782528 13891301 -1037987 -11314378 -13223100 -11336565 -13059147 -24272788 -37676640
8414 -37676640 -33277045 -4947475 23074279 23967358 4274771 -7685245 -2806310 1301783
8406 1301783 -8635915 -24018879 -29194099 -17575429 6206604 25501183 18195844 -16859925
8398 -16859925 -45393080 -33501190 4815628 23505617 8822307 -4538539 9047762
8391 9047762 26407129 14740780 -16488164 -31833655 -21607639 -7162425 -2099818
8384 -2099818 2757548 14862327 24660993 21309120 7092008 -9979046 -25440965 -35411768
8376 -35411768 -35586452 -28526584 -22955959 -21378146 -17113864 -8257426 -5075584 -15680256
8368 -15680256 -31488100 -37046003 -30847228 -25280605 -25391355 -19625534 1380766 25628378
8360 25628378 31315727 14754949 -6008439 -16230330 -18697346 -18053763 -8006899 12633921
8352 12633921 25880782 16515018 -1602331 -4918452 61414 -14456211 -48059451 -64745794
8344 -64745794 -46905080 -24872333 -30872215 -49997742 -46252838 -18634745 2303478
8337 2303478 4124259 4777825 16548936 28574838 29949471 24716341 17735550 7658730
8329 7658730 -545192 2311297 9158159 645831 -22679675 -35213118 -23970870 -8056103
8321 -8056103 -5661309 -4753861 11968751 31961342 29981830 9702425 -192558 11003012
8313 11003012 22893687 17205004 1468733 -8444573 -10460610 -8827226 928644 22829620
8305 22829620 42928354 39060057 10840095 -14159524 -12739765 4801999 10306195 -2594957
8297 -2594957 -11644785 -1182397 15018829 17713347 12128695 14746567 22082604 17532255
8289 17532255 4318375 3975290 19686461 28434210 17801371 4963439 6634990 13900665
8281 13900665 12806538 7928465 6483777 -295256 -17036792 -23934457 -3928216 23614813
8273 23614813 26506384 8397700 1937955 15843708 21378672 -2342775 -37190269 -51304135
8265 -51304135 -36001411 -7713659 11605319 8802516 -12023126 -30000440 -28565664
8258 -28565664 -17447288 -18838868 -32177704 -33057552 -10670455 15767984 25882015 22230445
8250 22230445 14609108 824440 -21022060 -37035191 -32439385 -12969318 2787111
8243 2787111 5536551 -140557 -5125334 -1855600 8813988 11054087 -10712106 -42786172
8235 -42786172 -48969702 -20331609 4068237 -11099947 -44098378 -45005266 -6382781 29539763
8227 29539763 31898199 14421457 1336976 -6805647 -17254564 -20957077 -6456806 17139438
8219 17139438 31354085 33702191 35008956 38061647 34986141 22329194 4626990 -15153721
8211 -15153721 -36101668 -51563214 -53739193 -47109508 -45076561 -49871680 -46998103 -25801428
8203 -25801428 3255277 19713213 15588574 -1064269 -19835581 -35103517 -41935602
8196 -41935602 -36846854 -25200381 -17619207 -14532902 -4628785 13895660 21890457 3559958
8188 3559958 -24532087 -28235174 -774277 26663896 26784043 9685654 114176 -2130782
8180 -2130782 -15447118 -37496738 -41064622 -14626523 16143036 21151012 4400764 -6937545
8172 -6937545 -1906125 5317346 3906826 4940785 24067130 56224381 77228643 68768332
8164 68768332 37765396 11098859 10788760 32510643 50730602 48120286 34733035 30257712
8156 30257712 33224904 23904471 -1385311 -19150407 -13283340 -3305150 -17627921 -48073161
8148 -48073161 -56014727 -24659726 17982050 36248016 27627044 14154056 8848526 8114797
8140 8114797 9120980 16212290 29593822 40104212 38502023 24333330 5313785 -8766167
8132 -8766167 -13853684 -15642551 -20974158 -24360715 -13508256 7544029 15067253 -4031917
8124 -4031917 -31863115 -44005242 -41597091 -39931465 -36409832 -16021690 15288826 31088655
8116 31088655 22315095 9414593 9046722 12183846 6435374 -1636237 -1811841 -434224
8108 -434224 -8508009 -22397855 -31965101 -37110391 -41544194 -40385261 -29411124 -18125216
8100 -18125216 -17920714 -23379444 -19579684 -2649837 19791941 42321718 61834383 69520842
8092 69520842 58223554 36501777 23587884 30973422 55313085 82833263 93224501
8085 93224501 71026220 26973320 -2583725 5470512 31387083 39433398 24384624
8078 24384624 8651320 1668860 -8311032 -22694985 -24321092 -9507766 -1386929 -16823415
8070 -16823415 -39905995 -43200970 -20719085 12372346 38981915 47661608 34754241
8063 34754241 11542144 -1798315 240833 2380658 -5350617 -10641990 -786713 13131891
8055 13131891 10828147 -8413035 -27461592 -33790838 -26113410 -7916668 9909997 8752267
8047 8752267 -17573617 -47985253 -55924399 -40604788 -20888492 -5953551 7831439
8040 7831439 16888604 11818879 -792437 -1187369 14325537 27003975 24159395 15436155
8032 15436155 14065060 19261391 24772401 29060080 29809535 23677754 17546767 22790809
8024 22790809 31887891 21152167 -13179121 -43092878 -46877212 -37336422 -34283983 -31624373
8016 -31624373 -16912257 -3822575 -12359047 -28658663 -20515987 10379722 27183142
8009 27183142 12418171 -9496730 -13217529 -5291754 -2109276 -2264069 446906 -2119891
8001 -2119891 -17895849 -35655360 -39069109 -28566985 -14564467 -864129 11431590
7994 11431590 16804185 17018945 26245081 48509281 64833262 61569147 55888431 68986684
7986 68986684 87202270 79018815 43070716 8035458 -12514589 -32212021 -55624112
7979 -55624112 -63556734 -46582797 -24554272 -16029546 -11639584 3336536 19612621 19170768
7971 19170768 6584508 2791894 14346565 27919828 31959862 27651763 19802670 10731221
7963 10731221 3926465 3194954 6389356 6496804 -355781 -11254196 -18665933 -13989242
7955 -13989242 6094055 33111421 51116510 50231687 31891064 2624527 -26976521
7948 -26976521 -38373228 -17963227 19004921 34237070 9048233 -31053461 -47829874
7941 -47829874 -35279111 -17704116 -11923583 -10317656 27012 16505957 22664400 5037543
7933 5037543 -29756750 -53155682 -40536311 -4486297 12872717 -8136623 -37292819
7926 -37292819 -36261104 -11076999 2412642 -6377140 -14088053 -7404275 -2844348 -14546351
7918 -14546351 -29674482 -30195372 -19912623 -14889573 -19706216 -25957359 -25659257 -16456991
7910 -16456991 168432 19463898 36904622 52633033 66198512 69722278 57471501
7903 57471501 39341223 30310201 28826623 22988052 15923166 22564557 39808749 46003420
7895 46003420 37207906 36871775 56707609 74439161 68702244 51628891 43672667 37956897
7887 37956897 18251928 -4561893 -6988714 5966360 8310633 -1975289 -470705 18138958
7879 18138958 27588661 15489847 8693312 30660462 57968064 49975392 10464007 -13230355
7871 -13230355 4119777 29452879 17565913 -24354838 -43948866 -13517123 33251747
7864 33251747 47041640 24956603 2584766 -4119669 -14193289 -35274991 -40118544
7857 -40118544 -11962839 16921380 7117444 -25122496 -27172096 13566385 54008683
7850 54008683 61093979 52435259 55457940 62822563 55188913 40298275 36435825 35057446
7842 35057446 15403233 -12133776 -13146414 18301483 45809983 38834095 10086539
7835 10086539 -8242608 -6683329 -1227203 -5796628 -17371970 -24190418 -18999690 -6079516
7827 -6079516 1625771 -3039403 -10379392 -7287652 -868312 -11214916 -35788617 -43116749
7819 -43116749 -17178341 12137390 7628289 -19523163 -24045310 6473606 32719617
7812 32719617 20770689 -12179069 -28355901 -23100101 -21976805 -35555635 -44320369 -29536175
7804 -29536175 1022940 24183200 26300514 12444760 -1590159 -3916432 1702469 -86824
7796 -86824 -14936917 -26557945 -15942055 11198049 29827020 27332112 14757511 4939980
7788 4939980 -2977085 -10542063 -9533212 1636396 4816839 -15666037 -44767784 -51362404
7780 -51362404 -30652322 -11306874 -14157844 -23473534 -13953031 8351091 14610897 -1502206
7772 -1502206 -12390802 1599775 21040672 16859146 -3585219 -6042149 18619635 40623695
7764 40623695 37039025 24006841 25094290 29980755 13107956 -18372290 -28437612 -4831027
7756 -4831027 22490727 24754563 10184529 1788238 1763800 -1401296 -6766036 -6265904
7748 -6265904 -6737255 -20701625 -37817905 -31919951 -1602033 20461098 10820588 -12249236
7740 -12249236 -17633810 -7937116 -12523666 -38823976 -57799113 -46224320 -21526010 -17181798
7732 -17181798 -36429176 -51588363 -45294645 -30847172 -27343310 -32974494 -33206910 -22621995
7724 -22621995 -6650948 9820122 23782693 30156168 27783525 24947936 28720389 33352798
7716 33352798 29592864 20327054 14761260 11650237 2809512 -8890071 -10396335 2048922
7708 2048922 18288336 29956954 36518624 34526396 17651707 -7224686 -19322461 -7932398
7700 -7932398 13701905 25020365 18932859 1910683 -14587486 -17825500 -2375501 17825530
7692 17825530 18574870 -5479321 -32222060 -39243769 -26764730 -7184065 11249176 19668029
7684 19668029 5827672 -26562598 -49564625 -41427776 -15532616 -374585 -165550 2984822
7676 2984822 14029600 17162879 4521211 -9353973 -8940986 1835785 8216217 3098319
7668 3098319 -8966755 -18506047 -17826216 -6913581 5327641 10212421 8601720 6004735
7660 6004735 1981135 -7467985 -19327392 -24123324 -16675080 -533916 15737098 21724076
7652 21724076 10533650 -11371158 -25622781 -21477378 -7236199 6003608 21442446
7645 21442446 44130875 61987999 58756280 40984281 31712233 37579610 41163615 28809972
7637 28809972 9600770 1877155 12889416 34197648 47018251 33733097 -3094024
7630 -3094024 -35511691 -38810842 -22836235 -17683789 -30897657 -40604382 -32748340 -21427222
7622 -21427222 -24304330 -38257809 -50070740 -54592465 -51444517 -37895807 -16015707 3375986
7614 3375986 11437809 7451424 -6584380 -23499488 -24186044 4924125 43740888 52582402
7606 52582402 23513326 -7096570 -9596126 1702572 -38592 -12115335 -17202237 -18535676
7598 -18535676 -29178279 -40148067 -30896620 -4153583 18433592 29819530 38490245
7591 38490245 40733978 23516480 -3920009 -12640973 4688350 22753003 23258013 19098514
7583 19098514 25519135 32237436 24141450 10777281 11932628 25365008 32250509 29343276
7575 29343276 32879350 49338525 62636606 57611413 40748394 26660301 14998311
7568 14998311 -4521885 -29005128 -41632376 -37778206 -36010097 -51298941 -68556198
7561 -68556198 -60833152 -29891896 -7774643 -13479446 -27560625 -21209842 4691589 24938096
7553 24938096 24324680 10339676 -2696499 -6610295 1015170 16368449 28486260 28830537
7545 28830537 21020857 14094201 11072709 12297533 21610153 36823745 42706642 29756056
7537 29756056 12904770 12504888 22199414 18103986 -2539316 -17346182 -15717772 -12995412
7529 -12995412 -19602909 -21865778 -7259830 13489237 25759037 32750789 39882197 36450153
7521 36450153 15551412 -2707299 5811171 31743782 43601955 31976606 16495445
7514 16495445 9997710 3174957 -10000601 -17553268 -12044140 -7149896 -16503522 -30966232
7506 -30966232 -33004270 -23130597 -16111784 -18192146 -24252190 -33521209 -51083427 -72319728
7498 -72319728 -80814339 -68447735 -48425642 -40894918 -50129544 -61821891 -60549089 -44961099
7490 -44961099 -26013456 -13601966 -6580091 3731900 20217871 32541228 26930591
7483 26930591 3388104 -21863193 -33807427 -33912266 -32800247 -31370073 -18940993 7034771
7475 7034771 28325280 22209754 -11545101 -48238217 -63809086 -55869963 -37480691 -19120658
7467 -19120658 -3983377 5686470 9106093 12548802 23192172 35392376 34104688 16975505
7459 16975505 2178279 5289029 17402597 18665499 7150230 -1581238 -1500198 -4325206
7451 -4325206 -16567687 -25979652 -20843788 -8406364 -857191 5280140 18983059 32125908
7443 32125908 27476283 7782332 -3834753 2316805 6655663 -10544654 -37163584 -41672568
7435 -41672568 -13602626 21412921 29946926 7646459 -17033702 -15841541 6671326
7428 6671326 20301082 9684844 -4345518 5235194 30078007 34747108 5835212 -28633087
7420 -28633087 -36519054 -20070417 -4535360 -2235340 -4091980 -41851 6824840 5925516
7412 5925516 -8016250 -25720771 -26154132 1409102 36107225 42764452 18000388 -533002
7404 -533002 14606541 40590759 38322471 9381540 -11505651 -10919165 -8414228 -14568932
7396 -14568932 -14044412 -412717 4799197 -14008551 -38423392 -42689863 -30283749 -22945407
7388 -22945407 -27049643 -31881284 -31281048 -25920933 -10421511 20523751 54233139 66928153
7380 66928153 52133087 29455591 21532925 30949321 41728226 36682743 12981981 -13755506
7372 -13755506 -22698528 -10960302 753547 -6140877 -22039775 -21463192 683408 20297606
7364 20297606 14945450 -10071790 -33670209 -45367830 -48421221 -44257833 -29215930 -7804804
7356 -7804804 4181479 -2306329 -15568282 -16489783 -2905187 9071083 8012473 857123
7348 857123 -190030 5648720 11283806 13384245 11109346 1098130 -13895936 -17408757
7340 -17408757 4036247 38130195 55796413 43968779 16038325 -9887914 -26882265
7333 -26882265 -32315160 -24593072 -13083394 -13392710 -24426256 -26969844 -13598682 -1113121
7325 -1113121 -1718158 -2187426 11536953 27924767 29375263 22519478 24601021 31251154
7317 31251154 24054956 2948991 -14894849 -23948630 -32532939 -39355181 -34522474 -23367669
7309 -23367669 -21935264 -26563737 -15862456 11547489 29198626 22070405 7775218 6911407
7301 6911407 16846370 28363521 43914041 62140015 66373532 48703274 27487474 21164822
7293 21164822 21351416 12190445 -58138 565498 12086512 22996921 34886588 50976980
7285 50976980 54600569 29560208 -5475156 -15216900 1561531 11447211 -1859405 -18224530
7277 -18224530 -20848703 -22075035 -33462612 -38468655 -18249224 13649021 26219748 11481771
7269 11481771 -8687809 -10826660 8657300 34890296 46085439 29211015 -5821269
7262 -5821269 -32192023 -33288852 -17438838 -912945 12366066 25612184 35328970 34743030
7254 34743030 23528395 5173979 -16122316 -28552540 -17508206 10342677 24229184
7247 24229184 8928468 -8110697 6090793 37616777 41542690 6842689 -27692505
7240 -27692505 -28380200 -7211739 5342151 2431404 -2575140 -3174162 -3216141 -3474075 -1416842
7231 -1416842 1120414 1095093 -455906 -2923960 -7254993 -7678877 4225644 19930565
7223 19930565 15046709 -17621398 -51688743 -59233344 -45310960 -33861724 -33445331 -37004098
7215 -37004098 -42466883 -49642276 -46940455 -27555077 -10999040 -19376453 -37272483 -28369774
7207 -28369774 7638361 30448167 18751284 -1692407 -4322751 -1112530 -12383026
7200 -12383026 -27691159 -27506074 -21475089 -30790128 -46901899 -43346885 -21375923 -7880817
7192 -7880817 -7891566 5262447 43179004 76847987 75058756 45995114 20630200 10047182
7184 10047182 1409909 -11200785 -15572149 -4853675 5641524 -2760597 -24693929 -36403491
7176 -36403491 -28489329 -18289108 -22475493 -31680085 -28267873 -18249135 -20577504 -28537335
7168 -28537335 -14285908 20113151 31388711 -3099775 -42768172 -36038246 6828608
7161 6828608 31940516 18643463 -5081026 -18158818 -30108171 -43613406 -39912496
7154 -39912496 -18554800 -11408998 -33413141 -53148049 -39284693 -7137692 10725929
7147 10725929 14618236 24568717 37237865 33811759 19490827 17822859 29725618 32461694
7139 32461694 20098827 13204260 22793896 32384041 25148119 7346694 -4410382 -2573403
7131 -2573403 10836336 27753778 34092627 21943973 4833218 4248059 18276854 22273054
7123 22273054 4934832 -16726971 -25912550 -28572071 -35294053 -39570211 -30970271 -16479578
7115 -16479578 -10413541 -11142664 -5426055 7599007 12910948 1740966 -14588041 -18053516
7107 -18053516 -5700557 7109198 5469344 -6292542 -10124549 706204 11944250
7100 11944250 11125406 8436215 18820695 32122516 25188559 2527832 -3297103 19591182
7092 19591182 40329442 28911232 -867612 -15117528 -9666078 -8224751 -18960176
7085 -18960176 -22273310 -4368628 21006653 33069068 30210644 26359846 31205030 41839626
7077 41839626 48204505 41938983 23837685 4595002 -5528412 -7379151 -8414821 -9315343
7069 -9315343 -2798603 13387010 29620146 34026728 25378895 14115999 11681120 18491503
7061 18491503 21916709 9325078 -15139963 -31559683 -25463606 -3195495 17579780
7054 17579780 25989900 20930716 4631651 -15245496 -21733076 -1117747 37655911 65394625
7046 65394625 59467152 25189512 -10541128 -24531639 -17098355 -8818015 -16183528 -31657401
7038 -31657401 -34876610 -23058402 -15939677 -23795593 -27437598 -6811407 22568314 25150862
7030 25150862 -5451909 -35425000 -32625378 -514938 35729996 59093366 66316677
7023 66316677 57836892 36834390 13517414 120990 1686858 13917619 26497188
7016 26497188 28509438 17359185 2948823 -4151154 -7437888 -17045691 -28806987 -25974610
7008 -25974610 -5999970 9298619 -1324216 -34372122 -69286330 -88957332 -86082451
7001 -86082451 -63557377 -39696162 -39631657 -66404020 -90426673 -83512083 -54995451 -36414854
6993 -36414854 -37212057 -37363388 -22788333 -5030659 541007 -3527539 -7674398 -12520791
6985 -12520791 -21165014 -24880911 -12784079 8139485 17427028 6556203 -11356521 -20121082
6977 -20121082 -19224497 -18772657 -22599665 -23898996 -15660537 198826 14345701 17913073
6969 17913073 9866064 -1023793 -3524380 3653591 9890684 7976245 6989428 20016934
6961 20016934 40671396 45987233 27505818 5303765 487428 6024102 1073786 -13903397
6953 -13903397 -17530704 -2583717 11025904 6136575 -6441152 -5666883 8545420 17500793
6945 17500793 12212738 4876376 9969346 23928620 29506400 17885602 2023874 4058612
6937 4058612 27634845 47912848 37427892 372185 -30120604 -31667176 -17510956
6930 -17510956 -14133926 -25029852 -30516086 -19246754 -4724486 -6595407 -25538958 -43758414
6922 -43758414 -45852675 -32146748 -12279929 6659202 21030976 25502874 17404544 6925900
6914 6925900 11580153 33982890 54389556 54370850 39533627 27346396 20897361 10641989
6906 10641989 -3718646 -12480810 -15052187 -19156589 -19918902 -2336736 29618322 48880897
6898 48880897 40615841 21489272 11423997 6026683 -6757861 -20457490 -20859643 -10818360
6890 -10818360 -4737477 -6851014 -11747365 -17498417 -21549073 -12991911 12537518 37897024
6882 37897024 43028975 32143941 24094207 22381231 15223707 953603 -8531740 -9302179
6874 -9302179 -10631134 -16844162 -20585079 -16578365 -8994080 -4554561 -8546910 -23274423
6866 -23274423 -38992257 -35337307 -8378889 13387750 1811249 -29492869 -41467597
6859 -41467597 -22965506 -479527 4774035 1038427 3285958 12815154 25913521 39198952
6851 39198952 41081772 22107839 -1299347 90181 24773811 37950780 21475258
6844 21475258 -2910165 -12094514 -12236330 -14069042 -8866050 7493117 14188420 -2538924
6836 -2538924 -19275494 -7650246 20191572 28837180 10025193 -13775689 -27271866
6829 -27271866 -34845006 -40022093 -39319490 -35690105 -36388396 -38403069 -33604037 -24437546
6821 -24437546 -17915889 -11207564 -1582389 -1412498 -20547070 -41160711 -35906425 -7835445
6813 -7835445 13484008 15207863 14833970 27262139 42504348 44448160 33705828 23594046
6805 23594046 25718181 43180631 66634435 76564759 61469549 32693793 10156645
6798 10156645 -1039865 -6113737 -2666928 11583346 20824961 7170243 -17846020 -24678130
6790 -24678130 -9179895 2633289 -4261059 -16560746 -21913305 -25586123 -28034326 -15966927
6782 -15966927 8626654 18167800 -1280362 -23173878 -15755133 13546595 32432389
6775 32432389 28579869 15531153 2559616 -15601075 -38600610 -50420022 -36869889
6768 -36869889 -4375566 23845125 29005924 13985897 -2237350 -9404928 -17536373 -34513520
6760 -34513520 -43489955 -23952032 10194986 21248682 -984534 -26393773 -29787787
6753 -29787787 -19768780 -11284390 -85361 17025657 24221323 12170133 -909730
6746 -909730 3153194 14108038 14691803 8846406 4530788 -8273191 -33107643 -42921497
6738 -42921497 -15948591 21064069 23561050 -7840275 -32289641 -28356438 -11256839
6731 -11256839 3605247 15502529 18740145 6299319 -5838985 5402248 28103126
6724 28103126 25761479 -7605359 -40231716 -53194733 -57406775 -55643911 -34622257 -7197661
6716 -7197661 -13015536 -54727372 -79899643 -55615775 -17841790 -11049253 -19394163 -3169836
6708 -3169836 28586108 34625125 12072561 -1519350 10174768 25125251 27335691 26899110
6700 26899110 30565068 27652909 13797273 756910 -4882489 -9644680 -15428009 -15887872
6692 -15887872 -13707660 -20044671 -33971762 -42805339 -44063590 -45897578 -45361017 -30174928
6684 -30174928 -4937139 8875973 4700951 -405190 4314912 7432382 -1299858 -12705061
6676 -12705061 -15255462 -13548967 -17845516 -27610207 -34381140 -31338441 -16837763 193501
6668 193501 419838 -22504887 -41309893 -23122020 19996281 38544249 12593570 -20134574
6660 -20134574 -19963817 924574 5476002 -11324804 -23336414 -16772171 -2165133 11039858
6652 11039858 24699950 36964411 38329084 25689714 7418920 -5242881 -3729082
6645 -3729082 13872448 34542237 36466539 16360107 -664221 6312666 23993470 26206594
6637 26206594 13061839 5096360 6833423 3010629 -11222442 -21814376 -19277318 -9339001
6629 -9339001 785417 6786317 -485150 -24067137 -43219212 -33468550 -6119638 2316947
6621 2316947 -13783407 -17689139 10351185 36848387 24465724 -10154758 -22301988
6614 -22301988 -5138336 8079649 108215 -10564364 -9234290 -8132834 -16328558 -15709435
6606 -15709435 11127820 47504920 61069719 46646986 28985566 26342250 32218156
6599 32218156 34930143 34754365 32849552 20526116 -4893244 -24339244 -16290088 11429236
6591 11429236 28277529 21656387 11815309 18051881 28405619 18982846 -9069420 -31895992
6583 -31895992 -36562565 -32082032 -27659960 -20622007 -11039216 -9307760 -18512982 -24079911
6575 -24079911 -14919602 -4515506 -14422531 -41038446 -55597194 -39920078 -9243487
6568 -9243487 6862879 -2714975 -25202153 -44905225 -57330104 -62086892 -55078855 -36958876
6560 -36958876 -21367320 -21230323 -28410326 -20773773 7760312 37444189 48426367 42932195
6552 42932195 33220877 21370716 5411018 -4875381 3259855 24283889 37592120
6545 37592120 31240710 10818448 -11935214 -26666664 -24966575 -8328417 7475377
6538 7475377 10630165 11384836 24907844 41791475 38705426 16950719 4032588 11971947
6530 11971947 19676711 6748186 -17512103 -30792161 -24625109 -4314696 18673076
6523 18673076 24632852 -1500544 -42030135 -54739372 -26452964 4919702 3254625
6516 3254625 -14080393 -6096671 28336311 51474116 43121742 22472849 13238882 15298382
6508 15298382 15830682 7031286 -11846902 -33397704 -41315233 -25739606 1300449 19408067
6500 19408067 23865314 20866219 8581181 -13880507 -26810144 -9542130 21484960
6493 21484960 26774748 1276512 -14736325 5517864 36333564 38685506 13221816
6486 13221816 -9744034 -15007930 -11575749 -7747086 -1764507 6041745 11164754 14504085
6478 14504085 19872510 23079262 15805539 -121585 -12282107 -11187809 2626573 22379431
6470 22379431 39047024 44894860 39776053 30990082 22564270 11166911 -1853566 -4470242
6462 -4470242 8952619 23185944 20112216 6750555 7691907 28502765 44464754 33632101
6454 33632101 7326416 -4867813 6662752 21886243 19155362 1501506 -10099798
6447 -10099798 -3657318 10458568 12916993 -1886727 -19085010 -19389280 -688820 18852792
6439 18852792 21241406 9796896 4464255 16008598 32908655 38380251 31950762 24581041
6431 24581041 18955133 9049661 -2407530 -2604708 11087899 24206600 25532007 21484688
6423 21484688 22256436 26452140 29689520 36125139 48570745 57389390 53273334 42944033
6415 42944033 38406050 38227231 33505594 24738320 17569125 9102158 -4724667 -14111783
6407 -14111783 -5651208 16109876 34084420 41819654 44557815 41577453 26182971 1566321
6399 1566321 -19837411 -30464727 -27454236 -7224356 21328406 29934800 3522349 -28898026
6391 -28898026 -26318986 6894497 29540623 26309978 22474790 32294668 35675898 20260809
6383 20260809 7373400 15262705 29284521 30102766 22169110 13658022 -2016073 -22382878
6375 -22382878 -23872671 631945 20285603 9728381 -12632583 -18000093 -11080297 -8543930
6367 -8543930 -1437067 22133032 39767220 23311533 -10864729 -22252193 -5913658
6360 -5913658 8129643 5579905 -1942566 -9095963 -18547298 -17038328 8472376 35055709
6352 35055709 27326557 -4724967 -15415372 7770067 30325406 30685458 27081725 33552839
6344 33552839 35138320 24086791 19011987 27922491 30153183 15925646 7406377 17928979
6336 17928979 25790328 13872438 1456812 8007083 16248901 3149661 -18394927 -21454270
6328 -21454270 -7142777 6493478 18302689 35330447 47114347 40503806 27535307
6321 27535307 29005203 40611716 42142509 30270187 17375092 8265800 1702973 3623082
6313 3623082 15677495 22939191 15401545 7180501 12138093 19443626 18649883 24984237
6305 24984237 46323656 50619690 10837119 -38033605 -39849874 -2844975 14021782
6298 14021782 -3954819 -10168775 16993775 37428242 23277534 8421280 26712645
6291 26712645 52189854 46504540 25216592 26405364 43707950 43706661 29264192 30627999
6283 30627999 43266237 29014132 -18155379 -55591456 -52313080 -26884554 -11070148
6276 -11070148 -8559093 -6215801 435500 10249783 24062645 33973750 23406556 -7365023
6268 -7365023 -31806527 -27730957 -3999285 15761116 22323356 20787538 15364111 10086643
6260 10086643 13894300 28563749 39153761 31561945 13364232 3288204 6325153 13306350
6252 13306350 18063707 18649702 8087123 -15817753 -34366082 -24766840 3891053 14766479
6244 14766479 -7137316 -30899098 -21406090 11496719 27685108 12109926 -9393770
6237 -9393770 -11511793 -3699260 -10567779 -32823484 -46402551 -37355340 -19613571 -11477018
6229 -11477018 -8163147 7432437 32026057 39404655 17169005 -9926722 -8443585 20232507
6221 20232507 42484734 36570884 16047222 5419017 9288071 15182194 14882704 11003613
6213 11003613 8337340 7638203 4700153 -7994103 -31771420 -51413039 -46091157 -16813947
6205 -16813947 9774218 13528102 3014739 -5013312 -11544264 -23169808 -29331180 -16169241
6197 -16169241 5708263 13056257 4834903 -915833 -2113976 -15170820 -40410424 -55452421
6189 -55452421 -50561592 -41114902 -34666927 -17199279 11588657 22156672 469674 -18629001
6181 -18629001 2385610 43934691 54600505 26070330 2566551 15153966 44296437
6174 44296437 57000486 48964487 34142379 17656239 -756424 -12071878 -6560443
6167 -6560443 9538398 19546719 15257461 2477503 -8384873 -11872654 -10962540 -12707055
6159 -12707055 -16140107 -7773233 20184351 49405043 49364504 15228594 -23414197 -37475954
6151 -37475954 -27244155 -9619810 6359669 18729185 21729704 12254336 -1062508
6144 -1062508 -9254644 -16012359 -25956371 -29053119 -14210221 7517632 13098487 81466
6136 81466 -9373975 1034953 23921247 43394747 50647492 39996656 9096746 -26689614
6128 -26689614 -38648151 -19495018 532976 -8210380 -31664180 -31449888 -2274119 19520360
6120 19520360 10973207 -3001751 10860337 41561681 49005303 23187536 -2119458
6113 -2119458 1002945 17988577 19030866 3890705 -1416502 15182552 35520574 36736355
6105 36736355 18519494 -252540 -2965786 11416627 29891243 35529808 20645139
6098 20645139 -5353080 -23165445 -21671988 -7945224 1691418 -1442904 -11930938 -19053689
6090 -19053689 -19267145 -17834099 -18041244 -13539726 1966751 19261033 19602859 1546290
6082 1546290 -9879145 7212121 40624971 58380267 49966042 34680371 27943854 21075689
6074 21075689 4462432 -8918965 -2019770 15706204 18382606 1858111 -9028720
6067 -9028720 4147752 27808251 35630084 21606845 2223723 -7640592 -8634920 -8293224
6059 -8293224 -9359840 -9790090 -7837576 -3434490 2087321 5602320 5001442 4218124 11015301
6050 11015301 26272058 39579237 40613559 31757602 23309711 19176513 15855412 13645325
6042 13645325 16505807 18512398 5118068 -23170072 -41545084 -30274620 -4588145
6035 -4588145 3602003 -9487030 -14586300 6205353 30693294 25341951 -10642128 -45609838
6027 -45609838 -53411992 -36884202 -15918480 -5198859 -6207832 -12408398 -16927422 -16723939
6019 -16723939 -11277402 370219 17080603 31045585 33518303 27361582 25269540 31382430
6011 31382430 34552432 26556898 15985470 13238119 11987268 805870 -13829236 -14363585
6003 -14363585 453039 13427919 14970196 12841511 12462604 6869328 -5854397 -13700746
5995 -13700746 -11262793 -12362758 -26544764 -38024809 -29018590 -13443739 -21354322 -51828956
5987 -51828956 -67934825 -45486172 -4457905 20107726 20424178 13886792 12888693 15702484
5979 15702484 19612665 23822947 21931697 9022347 -4297504 -2380252 9471308 8157216
5971 8157216 -12939709 -32132913 -31766550 -23665379 -27138786 -37972729 -39349298 -31078862
5963 -31078862 -24660144 -18413139 -4148307 7319143 -1261968 -16048596 -3767618 30604091
5955 30604091 37876270 -2271468 -40592729 -25771998 18220426 28969641 810799
5948 810799 -12365490 12330370 30939392 5235140 -37617962 -49500228 -30665944
5941 -30665944 -17880181 -24925832 -31929277 -23942071 -7656555 7830321 21242864 30101959
5933 30101959 31174829 29007321 28177175 21716354 3903235 -12541107 -12563167 -6155434
5925 -6155434 -15950188 -40303536 -54225652 -47653629 -35894827 -27561051 -11097818 14996612
5917 14996612 25958746 4997618 -25578539 -30210271 -5695220 19833704 26145950
5910 26145950 18852359 10817950 5002040 122269 12922 8943642 21744479 24771868
5902 24771868 9806541 -12811669 -20391492 -3523875 19453401 24479800 14174680
5895 14174680 12066884 25257098 33808767 23332683 6617254 824622 2662309 2036747
5887 2036747 2751988 10185230 13309658 1442760 -12341836 -8223783 8419699 16908093
5879 16908093 16763096 25545913 42494626 43535740 18955122 -9238963 -18214794 -12624556
5871 -12624556 -10685814 -18149183 -27463533 -30204022 -20556036 2763902 29776471 43906301
5863 43906301 39843588 28466173 21375023 21426336 29330936 43861042 52002819 36627428
5855 36627428 1076639 -30123278 -42042165 -43496467 -43366303 -34489671 -14372502 -795752
5847 -795752 -7795657 -22731766 -27255939 -25844534 -30829255 -32632487 -12615238 21054744
5839 21054744 38350571 28262407 10472043 3253564 1509828 -7031146 -21369456 -30734487
5831 -30734487 -27021974 -9878842 10779276 17720034 4160156 -12599512 -9553491 11025999
5823 11025999 25130306 21189732 11836127 8787664 6226800 -3114886 -13158853 -16181171
5815 -16181171 -15140417 -14095834 -8405507 5892321 23502000 38579972 50801492 55814004
5807 55814004 43796322 17774595 -387248 4379864 19396727 21797772 7144459
5800 7144459 -12194535 -26339873 -30344137 -17519230 10901304 35284225 35409986 16166104
5792 16166104 -657964 -6428122 -9807652 -14467603 -14291119 -11947058 -19808882 -35938670
5784 -35938670 -39619267 -20987638 2273862 9693326 4137057 -241536 -2326188 -9742754
5776 -9742754 -19882065 -22520135 -16319946 -8235628 -1401692 2622950 -3865741 -22795049
5768 -22795049 -35262239 -19255232 16917187 39563443 32318470 13847926 5812606
5761 5812606 4366352 -3313015 -12998989 -12465601 -3298446 5635038 16083486 31420845
5753 31420845 38878422 24920937 3511409 2181762 19159317 22369278 -2018887 -27980503
5745 -27980503 -30008827 -19204894 -18870456 -25846716 -22813489 -14737849 -22775725 -46587020
5737 -46587020 -61072408 -52692829 -34961618 -23087926 -15118006 -5726179 1171293 3960065
5729 3960065 10655711 22923541 27259177 15258881 360252 -179979 10288121 17751013
5721 17751013 23722297 41312632 66868060 76530379 57831970 28632503 13350233
5714 13350233 11256971 2924205 -16570942 -27866000 -15369578 8605654 19868776
5707 19868776 15405301 14195977 24565706 29095673 12742182 -8674330 -6934080 17608473
5699 17608473 34158618 22038201 -5874819 -25933764 -31865031 -29977448 -22662373 -12012252
5691 -12012252 -8350502 -17730456 -27634819 -21930377 -5519948 3047247 293695 -622911
5683 -622911 2408900 -6309119 -30733786 -46551585 -29958577 9080469 38690872 42900043
5675 42900043 31416010 16025879 -3969458 -28816477 -45855652 -40851143 -17459067
5668 -17459067 1940840 -3707173 -33027312 -60515518 -59524385 -30601450 -2162631 2985306
5660 2985306 -5286346 -2303160 13314154 19469103 9200227 5052821 22989551 43932673
5652 43932673 42594526 29178735 34419846 59104312 68930382 44473032 9016867 -6238452
5644 -6238452 -3378224 -6600795 -24247095 -41620175 -45271739 -37261773 -26285829 -17221393
5636 -17221393 -10577651 -4501498 3017622 9675424 9148599 -437483 -12634313 -20671973
5628 -20671973 -23349238 -19711879 -6852568 10866542 19461694 10653207 -6936597 -18253474
5620 -18253474 -16231155 -2012036 16999573 24104095 5723859 -22751742 -23581991 13861550
5612 13861550 50427530 47525209 20764794 11577789 21163315 14838888 -12514395 -22799072
5604 -22799072 2859910 31140515 27859428 7386730 2410133 10586925 4232761 -21634299
5596 -21634299 -42483316 -40523168 -22871275 -4455839 7908436 13294504 12710974 9702976
5588 9702976 7900638 9228174 16651654 30079263 36252975 16994334 -23824264 -55746735
$$ [...]
##END NTUPLES=NMR SPECTRUM
##END=
