##TITLE=31Pdec_SR37_rep
 , 172 sc
 11.2.2021
##JCAMPDX= 6.0         $$ Bruker NMR JCAMP-DX V2.0
##DATA TYPE= NMR SPECTRUM
##DATA CLASS= NTUPLES
##ORIGIN= UXNMR, Bruker Analytische Messtechnik GmbH
##OWNER= root
$$ XWIN-NMR		Version 3.5
$$ Thu Feb 11 13:14:55 2021 Russian Standard Time (UT+4h)  she@DPX200
##.OBSERVE FREQUENCY= 81.013821
##.OBSERVE NUCLEUS= ^31P
##.ACQUISITION MODE= SIMULTANEOUS
##.ACQUISITION SCHEME= undefined
##.AVERAGES= 172
##.DIGITISER RES= 16
##SPECTROMETER/DATA SYSTEM= spect
##.PULSE SEQUENCE= zgpg30
##.SOLVENT NAME= DMSO
##.SHIFT REFERENCE= (INTERNAL, DMSO, 0, 248.564)
##AUDIT TRAIL= $$ (NUMBER, WHEN, WHO, WHERE, WHAT)
$$ ##TITLE= Audit trail, XWIN-NMR		Version 3.5
$$ ##JCAMPDX= 5.01
$$ ##ORIGIN= Bruker BioSpin GmbH
$$ ##OWNER= she
$$ F:/spectra/data/she/nmr/P31/1/pdata/1/auditp.txt
$$ ##AUDIT TRAIL=  $$ (NUMBER, WHEN, WHO, WHERE, WHAT)
(   1,<2021-02-11 13:13:54.68 +0400>,<she>,<DPX200>,
      <continue with go, POWCHK disabled, PULCHK disabled
       configuration hash MD5:
       00 E9 B6 7A A2 85 ED C7 34 08 36 98 17 FE 4E 26
       data hash MD5: 32K
       2C 5A 60 3D 77 F5 3E B1 23 3C F5 21 1D 9F 5A 6C>)
(   2,<2021-02-11 13:13:57.07 +0400>,<she>,<DPX200>,
      <Start of raw data processing
       efp BC_mod = 2 LB = 1 FT_mod = 6 PKNL = 1 PHC0 = -2356.971 PHC1 = 656.4023 SI = 64K 
       data hash MD5: 64K
       5F 06 B6 35 AC 24 4C F2 03 F4 46 D0 BC C5 50 19>)
$$ ##END=
$$ 
$$ hash MD5
$$ 6D 1F 82 04 E2 58 9E BE AB E2 07 83 E0 F3 53 86
##$RELAX= 
##$RELAX= 
##$RELAX= 
##$RELAX= 
##$RELAX= 
##$RELAX= 
##$RELAX= 
##$RELAX= 
$$ Bruker specific parameters
$$ --------------------------
##$DU= <F:/spectra>
##$EXPNO= 1
##$NAME= <P31>
##$PROCNO= 1
##$TYPE= <nmr>
##$USER= <she>
##$AMP= (0..31)
100 100 100 100 100 100 100 100 100 100 100 100 100 100 100 100 100 100 
100 100 100 100 100 100 100 100 100 100 100 100 100 100 
##$AQSEQ= 0
##$AQ_mod= 1
##$AUNM= <au_zg>
##$AUTOPOS= <>
##$BF1= 81.014009
##$BF2= 200.13
##$BF3= 200.13
##$BF4= 200.13
##$BF5= 200.13
##$BF6= 200.13
##$BF7= 200.13
##$BF8= 200.13
##$BYTORDA= 1
##$CFDGTYP= 0
##$CFRGTYP= 5
##$CHEMSTR= <none>
##$CNST= (0..31)
1 1 145 1 1 1 1 1 1 1 1 1 1 1 1 1 1 1 1 1 1 1 1 1 1 1 1 1 1 1 1 1 
##$CPDPRG= <waltz16>
##$CPDPRG1= <>
##$CPDPRG2= <waltz16>
##$CPDPRG3= <>
##$CPDPRG4= <mlev>
##$CPDPRG5= <mlev>
##$CPDPRG6= <mlev>
##$CPDPRG7= <mlev>
##$CPDPRG8= <mlev>
##$CPDPRGB= <>
##$CPDPRGT= <>
##$D= (0..31)
0 1 0 0 0 0 0 0 0 0 0 0.03 2e-05 3e-06 0 0 0 0 0 0 0 0 0 0 0 0 0 0 0 0 
0 0 
##$DATE= 1613034407
##$DBL= (0..7)
120 120 120 11 120 120 24 19 
##$DBP= (0..7)
150 150 150 150 150 150 150 150 
##$DBP07= 0
##$DBPNAM0= <>
##$DBPNAM1= <>
##$DBPNAM2= <>
##$DBPNAM3= <>
##$DBPNAM4= <>
##$DBPNAM5= <>
##$DBPNAM6= <>
##$DBPNAM7= <>
##$DBPOAL= (0..7)
0.5 0.5 0.5 0.5 0.5 0.5 0.5 0.5 
##$DBPOFFS= (0..7)
0 0 0 0 0 0 0 0 
##$DE= 6
##$DECBNUC= <off>
##$DECIM= 3
##$DECNUC= <off>
##$DECSTAT= 4
##$DIGMOD= 1
##$DIGTYP= 9
##$DL= (0..7)
0 0 52 120 120 21 21 25 
##$DP= (0..7)
$$ [...]
##$SUBNAM2= <"">
##$SUBNAM3= <"">
##$SUBNAM4= <"">
##$SUBNAM5= <"">
##$SUBNAM6= <"">
##$SUBNAM7= <"">
##$SUBNAM8= <"">
##$SUBNAM9= <"">
##$SW= 501.771253377433
##$SWIBOX= (0..15)
0 1 3 0 0 0 0 0 0 0 0 0 0 0 0 0 
##$SW_h= 40650.406504065
##$TD= 32768
##$TD0= 1
##$TE= 0
##$TE2= 300
##$TE3= 300
##$TEG= 300
##$TL= (0..7)
0 120 53 12 22 120 120 120 
##$TP= (0..7)
150 150 150 150 150 150 150 150 
##$TP07= 0
##$TPNAME0= <>
##$TPNAME1= <>
##$TPNAME2= <>
##$TPNAME3= <>
##$TPNAME4= <>
##$TPNAME5= <>
##$TPNAME6= <>
##$TPNAME7= <>
##$TPOAL= (0..7)
0.5 0.5 0.5 0.5 0.5 0.5 0.5 0.5 
##$TPOFFS= (0..7)
0 0 0 0 0 0 0 0 
##$TUNHIN= 0
##$TUNHOUT= 0
##$TUNXOUT= 0
##$USERA1= <user>
##$USERA2= <user>
##$USERA3= <user>
##$USERA4= <user>
##$USERA5= <user>
##$V9= 5
##$VALIST= <valist>
##$VCLIST= <CCCCCCCCCCCCCCC>
##$VD= 0
##$VDLIST= <DDDDDDDDDDDDDDD>
##$VPLIST= <PPPPPPPPPPPPPPP>
##$VTLIST= <TTTTTTTTTTTTTTT>
##$WBST= 1024
##$WBSW= 4
##$XGAIN= (0..3)
0 0 0 0 
##$XL= 0
##$YL= 0
##$YMAX_a= 6139
##$YMIN_a= -17931
##$ZGOPTNS= <>
##$ZL1= 120
##$ZL2= 120
##$ZL3= 120
##$ZL4= 120
##$ABSF1= 0
##$ABSF2= 0
##$ABSG= 0
##$ABSL= 0
##$ALPHA= 0
##$AQORDER= 0
##$ASSFAC= 0
##$ASSFACI= 0
##$ASSFACX= 0
##$ASSWID= 0
##$AUNMP= <proc_1d>
##$AZFE= 0.1
##$AZFW= 0.5
##$BCFW= 0
##$BC_mod= 2
##$BYTORDP= 0
##$COROFFS= 0
##$CY= -3
##$DATMOD= 1
##$DC= 0
##$DFILT= <>
##$DTYPP= 0
##$F1P= 0
##$F2P= 0
##$FCOR= 1
##$FTSIZE= 65536
##$FT_mod= 6
##$GAMMA= 0
##$GB= 0
##$INTBC= 1
##$INTSCL= 5.30512e-09
##$ISEN= 30
##$LB= 1
##$LEV0= 0
##$LPBIN= 0
##$MAXI= 10000
##$MC2= 0
##$MEAN= 0
##$ME_mod= 0
##$MI= 50
##$NCOEF= 0
##$NC_proc= -8
##$NLEV= 6
##$NOISF1= 182.463
##$NOISF2= 159.3651
##$NSP= 0
##$NTH_PI= 0
##$NZP= 0
##$OFFSET= 248.5645
##$PC= 4
##$PHC0= -2356.971
##$PHC1= 656.4023
##$PH_mod= 1
##$PKNL= yes
##$PPARMOD= 0
##$PSCAL= 0
##$PSIGN= 0
##$REVERSE= no
##$SF= 81.014009
##$SI= 65536
##$SIGF1= 159.3651
##$SIGF2= -187.1042
##$SINO= 113.3802
##$SIOLD= 16384
##$SREGLST= <1H.CDCl3>
##$SSB= 0
##$STSI= 65536
##$STSR= 0
##$SW_p= 40650.406504065
##$SYMM= 0
##$S_DEV= 0
##$TDeff= 32768
##$TDoff= 0
##$TI= <>
##$TILT= no
##$TM1= 0
##$TM2= 0
##$TOPLEV= 0
##$USERP1= <user>
##$USERP2= <user>
##$USERP3= <user>
##$USERP4= <user>
##$USERP5= <user>
##$WDW= 1
##$XDIM= 65536
##$YMAX_p= 276982271
##$YMIN_p= -517194654
$$ End of Bruker specific parameters
$$ ---------------------------------
##NTUPLES= NMR SPECTRUM
##VAR_NAME=  FREQUENCY,     SPECTRUM/REAL,   SPECTRUM/IMAG
##SYMBOL=    X,             R,               I
##VAR_TYPE=  INDEPENDENT,   DEPENDENT,       DEPENDENT
##VAR_FORM=  AFFN,          ASDF,            ASDF
##VAR_DIM=   65536,         65536,           65536
##UNITS=     HZ,            ARBITRARY UNITS, ARBITRARY UNITS
##FACTOR=    0.620285442955139, 1,           1
##FIRST=     20137.2065510759, 0,            0
##LAST=      -20513.1999529892, 0,           0
##MIN=       -20513.1999529892, -517194654,  0
##MAX=       20137.2065510759, 276982271,    0
$$ Real data points
##PAGE= N=1
##DATA TABLE= (X++(R..R)), XYDATA
$$ [...]
##PAGE= N=2
##DATA TABLE= (X++(I..I)), XYDATA
12723B0531608P176640M190191J0160080O875816j2074268j7472254O166119K3986580
$$ 20531608 27708248 31898439 42058519 48934335 36860067 19387813 25553932 49540512
12715D9540512M751552k3001810j6686903Q147323N916531k0278716k6845831
$$ 49540512 54292064 31290254 14603351 22750674 28667205 8388489 -18457342
12708a8457342n586731P426288k262112q468132K049751Q589056K203535N135447
$$ -18457342 -24044073 -16617785 -18879897 -27348029 -25298278 -16709222 -14505687 -9370240
12700i370240K5045569L1452470L833864k9575899l0365608m428805J1058459
$$ -9370240 15675329 47127799 50961663 21385764 -8979844 -13408649 -2350190
12693b350190Q77111j5052714j5934593m860054K692429O97468k774180J907776
$$ -2350190 -1473079 -16525793 -32460386 -37320440 -34628011 -33930543 -36704723 -34796947
12685c4796947J2421831J5767446M690114j1234942j6551818q470423K950664
$$ -34796947 -22375116 -6607670 -1917556 -13152498 -29704316 -38174739 -35224075
12678c5224075J0238796J4957074J9121025J8569495P668813j1996592k7855269
$$ -35224075 -24985279 -10028205 9092820 27662315 35331128 23334536 -4520733
12671d520733k3538236K512260K6221376J9504392j2544489l2329212j7676189
$$ -4520733 -28058969 -25546709 674667 20179059 7634570 -24694642 -42370831
12664d2370831Q094748J0516093o972646j1981395O842066K5111216J9670480
$$ -42370831 -34276083 -23759990 -30732636 -42714031 -35871965 -10760749 8909731
12657H909731j673571j4877636r410315N137346J3759881J0405272M78878p891853
$$ 8909731 7236160 -7641476 -17051791 -11914445 1845436 12250708 12729586 4837733
12649D837733j3487137j8981655k0033424q320032J1741543K2898341J8327006
$$ 4837733 -8649404 -27631059 -47664483 -55984515 -44242972 -21344631 -3017625
12642c017625J0554760Q460374K820045j1366200j6910231m14115J8554129J1075756
$$ -3017625 7537135 15997509 18817554 7451354 -9458877 -9872992 8681137 19756893
12634A9756893j6531886k9738975j4683624P597291J7293469J8353385J7758987
$$ 19756893 3225007 -26513968 -41197592 -33600301 -16306832 2046553 19805540
12627A9805540Q868478j0002568k0996349r623319J0414660J4225242O24636q452378
$$ 19805540 28674018 18671450 -2324899 -11948218 -1533558 12691684 13316320 4863942
12619D863942j589443P670993N020051k823781l214278k190918j3810474k9143487
$$ 4863942 3274499 10945492 15965543 13141762 9927484 7736566 -6073908 -35217395
12611c5217395k1536125J0253119L0498340J5755045q117696n284573J3415493
$$ -35217395 -56753520 -46500401 -16002061 -247016 -8364712 -13649285 -233792
12604b33792J0019249j5926616k6295352p625968J0312003Q585535O568211J7574991
$$ -233792 9785457 -6141159 -32436511 -40062479 -29750476 -21164941 -14596730 2978261
12596B978261K0479185J849410j2464143k90683J5128232K094025k7498352l9057510
$$ 2978261 23457446 25306856 12842713 12552030 27680262 29774287 2275935 -36781575
12588c6781575k5851156m337988J8594822L7825063L2050598n554241l7184127
$$ -36781575 -62632731 -66970719 -48375897 -10550834 21499764 15945523 -21238604
12581b1238604k4151275J2852050K0986638p078250k7503447j3459459J3359881
$$ -21238604 -45389879 -32537829 -11551191 -18629441 -46132888 -59592347 -46232466
12574d6232466K1192213L535362k4485423l7108416j2763890L3593994M8949860
$$ -46232466 -25040253 -21504891 -45990314 -83098730 -95862620 -62268626 -13318766
12567a3318766R112384l3166947j4916297M0257109N2689567O100566l2169394
$$ -13318766 -4206382 -37373329 -52289626 -12032517 40657050 46757616 14588222
12560A4588222j7748976J2772398J3062263n297791j0051157l809533m595066
$$ 14588222 -3160754 9611644 22673907 17376116 7324959 3515426 -1079640
12553a079640p498306q33826P049708N785282L757808Q105280P773911m502934
$$ -1079640 -8577946 -9411772 -2362064 3423218 7181026 15286306 23060217 18557283
12545A8557283j7199766k1677580k2997494j8721608J344624K4258060K0752314
$$ 18557283 1357517 -20320063 -43317557 -62039165 -60694541 -36436481 -15684167
12538a5684167m104664r632764J3956618K4970529Q25349j9859449o95618L1595288
$$ -15684167 -19788831 -29421595 -15464977 9505552 10330901 -9528548 -10224166 21371122
12530B1371122L1783627M620926j4991517j9066394k0378536j6616452k975332
$$ 21371122 53154749 57775675 42784158 23717764 3339228 -13277224 -16252556
12523a6252556M043583n174596p567251J1454699K1987819j099135k5898908j3144701
$$ -16252556 -12208973 -17383569 -24950820 -13496121 8491698 7392563 -18506345 -31651046
12515c1651046J2889957N056870k0658185j1299039K5619326K9121513j0003660
$$ -31651046 -18761089 -13704219 -34362404 -45661443 -20042117 9079396 -924264
12508i24264k9609893J462814L4350569K3571184l872803l364774J3919530R750302
$$ -924264 -30534157 -29071343 5279226 28850410 24977607 21612833 35532363 45282665
12500D5282665j3767216k2876569q581484O250615O125375k497167r762351j1065523
$$ 45282665 31515449 8638880 57396 6308011 12433386 9936219 173868 -10891655
12492a0891655k132667J5122428K6538764K0966222O263538k716477n155472r973111
$$ -10891655 -13024322 2098106 28636870 49603092 55866630 53150153 47994681 38021570
12484C8021570j6574751j4607637k029235Q394747M348513r639181j5867662m769394
$$ 38021570 21446819 6839182 4809947 13204694 17553207 7914026 -7953636 -12723030
12476a2723030J1082623J1682117k412655j0222452l280236j77013j4537496k7206542
$$ -12723030 -1640407 10041710 7629055 -2593397 -5873633 -6050646 -20588142 -47794684
12468d7794684j3571090J5401283K8473753K2080644J9793323K5607434J4448453
$$ -47794684 -61365774 -45964491 -17490738 4589906 24383229 49990663 64439116
12461F4439116k1277866m8695022l6564676K418426L0209962K8284907P821055
$$ 64439116 43161250 -5533772 -42098448 -39680022 -9470060 18814847 26635902
12454B6635902j1614506j7905795r972386J783625M542513n90482O3017J0099672
$$ 26635902 15021396 -2884399 -12856785 -11073160 -6530647 -7121129 -7058112 3041560
12446C041560J4380863J589410j6223731j8189046j797419J4671750J3763700
$$ 3041560 17422423 19011833 2788102 -15400944 -17198363 -2526613 11237087
12439A1237087l450889j9386726j7352684O44407J4886987J1074663j993807n944920
$$ 11237087 7786198 -11600528 -28953212 -28308805 -13421818 -2347155 -4340962 -10285882
12431a0285882J241095N045676k667313j3820135j6952883q813735N739156J5942917
$$ -10285882 -9044787 -3999111 -6666424 -20486559 -37439442 -46253177 -40514021 -24571104
12423b4571104J1652210k082443n143986R560256J9790438N366055j6423789j4033991
$$ -24571104 -12918894 -15001337 -20145323 -10585067 9205371 14571426 -1852363 -15886354
12415a5886354Q572657J8562571P176537j575401J431139m937238k6463017l2645977
$$ -15886354 -7313697 11248874 18425411 16850010 18281149 13343911 -13119106 -45765083
12407d5765083n316588K5024357K1625394m520713j5304878k466019R320435O429852
$$ -45765083 -51081671 -26057314 -4431920 -8952633 -24257511 -26723530 -17403095 -10973243
12399a0973243J342958N335399J2374202J3152521O132339p695140k5448735l5819032
$$ -10973243 -9630285 -4294886 8079316 21231837 27364176 19669036 -5779699 -41598731
12391d1598731k5857225J534448K6063076K9814626J4226634l482387q254605
$$ -41598731 -67455956 -65921508 -39858432 -10043806 4182828 700441 -7554164
12384g554164j922303M56975q540621j6056104n679589J7393808L1141267K4833618
$$ -7554164 -9476467 -9019492 -17560113 -33616217 -39295806 -21901998 9239269 34072887
12376C4072887P589912r498081k1756175k1944542m787459J6113850J8251390
$$ 34072887 41662799 32164718 10408543 -11535999 -16323458 -209608 18041782
12369A8041782K178570r159046o883090m272831l065053J2678805L5308272K6398203
$$ 18041782 20220352 11061306 4178216 -94615 -3159668 9519137 44827409 71225612
12361G1225612k2531155n9190588l7809502J2117647K7845654K221759j8008912
$$ 71225612 48694457 -10496131 -48305633 -36187986 -8342332 -6120573 -24129485
12354b4129485r610847L921426N457501Q996194K0443115J9066107k533576j7211700
$$ -24129485 -33740332 -29818906 -24361405 -15365211 5077904 24144011 21610435 4398735
12346D398735n982079P918044m857053l1433567l4653558p711904J8159667J8835100
$$ 4398735 -1583344 6334700 1477647 -29955920 -64609478 -72321382 -54161715 -35326615
12338c5326615N312181j64231K363648l997830k0526600k4078437P93557L2667263
$$ -35326615 -30014434 -30178665 -27815017 -31812847 -52339447 -76417884 -75624327 -42957064
12330d2957064L4024405J29533l1609036k6924179P699748M0601428M9785288
$$ -42957064 -8932659 -8803126 -40412162 -67336341 -59636593 -19035165 30750123
12323C0750123L1379828n907127l8107465l7698766q529602J0084369l150078
$$ 30750123 62129951 56222824 18115359 -19583407 -28113009 -18028640 -21178718
12316b1178718j6458327N701083M0712415L7741276m174416l6347255l4590594
$$ -21178718 -37637045 -31935962 8776453 46517729 42343313 5996058 -28594536
12309b8594536k2790370j8134573m712939K2991724L8223072K6568458J1274655
$$ -28594536 -51384906 -69519479 -74232418 -51240694 -13017622 13550836 24825491
12302B4825491R432020K594882k0464944l1105348p433691K0142476J2025838
$$ 24825491 34257511 36852393 16387449 -14717899 -22151590 -2009114 10016724
12295A0016724j8102280k7890776j2476296O05664O952346K4356214M2556136
$$ 10016724 -8085556 -35976332 -48452628 -47846964 -40894618 -16538404 26017732
12288B6017732K7672235j6099130l8250940j2803604K3081431K4118269k224506
$$ 26017732 53689967 37590837 -660103 -13463707 9617724 33735993 31511487
12281C1511487j6780196o259712R784823J5238358J2333002N650144m587206j1935051
$$ 31511487 14731291 8471579 18256402 33494760 45827762 51477906 46890700 34955649
12273C4955649n197611J3539051K4615386J2661517j3307096k9658934k6134971
$$ 34955649 29758038 43297089 67912475 80573992 67266896 37607962 11472991
12266A1472991j5442945j2293670j3002872o543178J841466l085499j7005708
$$ 11472991 -3969954 -16263624 -29266496 -35809674 -33968208 -37053707 -54059415
12259e4059415j5756041P032917K5051885J7626644J286025J183493J0559202
$$ -54059415 -69815456 -62782539 -37730654 -20104010 -18817985 -17634492 -7075290
12252g075290P516889k732116K778278K0636924K3434413O261103n725447j363709
$$ -7075290 441599 -2290517 487761 21124685 44559098 50820201 45094754 43731045
12244D3731045J001780q122652j1522044j148565K881858r797319j5342031L931460
$$ 43731045 44732825 36610173 25088129 23939564 26821422 17024103 1682072 5613532
12236E613532K3299603J2502059j3301737j6174146M903231J4744125k508138
$$ 5613532 28913135 41415194 28113457 11939311 16842542 31586667 29078529
12229B9078529k3354161k2972702n021065J2111469J7227013R693266k269074
$$ 29078529 5724368 -17248334 -22269399 -10157930 7069083 16762349 14493275
12222A4493275m634789O930765J6998839J0868642j132801L05128R427739K997918
$$ 14493275 9858486 16789251 33788090 44656732 43523931 43829059 53256798 56254716
12214E6254716j9395817l0417666j5817309M912893Q248002l620486j3158812
$$ 56254716 36858899 6441233 -9376076 -4463183 3784819 164333 -12994479
12207a2994479j0806541J419231J5328828J8595179N282644j0955305r525456
$$ -12994479 -23801020 -22381789 -7052961 11542218 16824862 5869557 -3655899
12200c655899P817130J8330856J2571544N467996O241082K057566j4713225k6249805
$$ -3655899 4161231 22492087 35063631 40531627 46772709 48830275 34117050 7867245
12192G867245j6197378P78698q92631j8597826k4594678m509597K4556427L5171904
$$ 7867245 -8330133 -7551435 -8444066 -27041892 -51636570 -56146167 -31589740 3582164
12184C582164J8918851o149802j4609428k581466O436654n633709k1012481r997628
$$ 3582164 22501015 16351213 1741785 -839681 5596973 -36736 -21049217 -31046845
12176c1046845J9598691K8886523P617536j0173590m317571j537400k3111365
$$ -31046845 -11448154 17438369 25055905 14882315 10564744 9027344 -14084021
12169a4084021l7871503q756257M0796821N4649308K3795433p982987j1652609
$$ -14084021 -51955524 -60711781 -19914960 34734348 58529781 50546794 38894185
12162C8894185j275762M815085Q139025R033617o01937j4298100j3559985j724407
$$ 38894185 37618423 42433508 50572533 59606150 59004213 44706113 31146128 29421721
12154B9421721l612347k3022502l2863175j8352787J636938R041688J1091653
$$ 29421721 25809374 2786872 -30076303 -48429090 -46792152 -37750464 -26658811
12147b6658811J5302064J1198785l582358p662113J0312721K6234640J3769928
$$ -26658811 -11356747 -157962 -3740320 -11402433 -1089712 25144928 38914856
12140C8914856j5682046l0163368j9570530M17429J3895741J5294353O578362
$$ 38914856 23232810 -6930558 -26501088 -26083659 -12187918 3106435 9684797
12133I684797N3628J0367750K9441155K7223389n611679l6038305l1745718o428028
$$ 9684797 9738425 20106175 49547330 76770719 71159040 35120735 3375017 -3053011
12125c053011M647295k563732m253604O112890J0655918K558400l594866q60268
$$ -3053011 1594284 -969448 -5223052 889838 11545756 14104156 10509290 9649022
12117I649022j739427j3264514k2469292j6134484J189073J6602720K3458627
$$ 9649022 7909595 -5354919 -27824211 -43958695 -42769622 -26166902 -2708275
12110b708275K0928505J0328323l149172j3493086k0723862k7126609k8218744
$$ -2708275 18220230 28548553 25399381 11906295 -8817567 -35944176 -64162920
12103f4162920j7898876j610372P262400N250221K992940R797496K1751652K6538326
$$ -64162920 -82061796 -83672168 -76409768 -71159547 -68166607 -58369111 -36617459 -10079133
12095a0079133J5433937p381594k3635463j5717696J0583081K6415702J2943006
$$ -10079133 5354804 -2026790 -25662253 -41379949 -30796868 -4381166 8561840
12088H561840j3836931k3328954p991172J3185289K2491897J8666514P759110
$$ 8561840 -5275091 -28604045 -36595217 -23409928 -918031 17748483 25507593
12081B5507593m381359j0186639n375406K021824r34979j3616881k0090331q311190
$$ 25507593 21126234 10939595 5564189 7586013 6651034 -6965847 -27056178 -35367368
12073c5367368J4734914K8347441J7333720j0540026k7212318j4046858J1736529
$$ -35367368 -20632454 7714987 25048707 14508681 -12703637 -26750495 -15013966
12066a5013966J6161284m766589k0343172j3234246k422165l362998L08555J8334828
$$ -15013966 1147318 -3619271 -23962443 -37196689 -39618854 -42981852 -42673297 -24338469
12058b4338469K1751985r897630l7650653j2025569M4080420O0256552K1513834
$$ -24338469 -2586484 -12484114 -50134767 -62160336 -18079916 42176636 63690470
12051F3690470j4989162j2438600m21344q602313j5442593J527417J5390988m572429
$$ 63690470 48701308 36262708 35841364 27239051 11796458 13323875 28714863 24142434
12043B4142434l4335971l0462316J834377K3023520K3117289K4020284K8913085
$$ 24142434 -10193537 -40655853 -38821476 -15797956 7319333 31339617 60252702
12036F0252702J6627241j3562730l3109318k7114822j2935121p575170m605022
$$ 60252702 76879943 63317213 30207895 3093073 -9842048 -17417218 -22022240
12029b2022240O452117K0293121K5450854J7733025o09705j9807546k0990554
$$ -22022240 -15570123 4722998 30173852 47906877 47297172 27489626 6499072
12022F499072L788015K9020254J8342590k3544927m7486201k2428833K1402229
$$ 6499072 10287087 39307341 57649931 34105004 -13381197 -35810030 -14407801
12015a4407801L2227780K978081k6721175k6349176o086000Q871455J2193820
$$ -14407801 17819979 20798060 -5923115 -32272291 -38358291 -29486836 -17293016
12008a7293016J3387911J5436290J0906037l125677j7785468k2112189j4800442
$$ -17293016 -3905105 11531185 22437222 19311545 1526077 -20586112 -35386554
12001c5386554m923685l197024j1223955j7205677o598280J7615110L0811550
$$ -35386554 -40310239 -43507263 -54731218 -71936895 -78535175 -60920065 -30108515
11994c0108515J3641154j9644086l4169135j7307576P441761J4729125P662878
$$ -30108515 -16467361 -36111447 -70280582 -87588158 -80146397 -65417272 -57754394
11987e7754394L326443N827598R783055J5287567K0453452J3018430r106351k2761454
$$ -57754394 -54427951 -48600353 -38817298 -23529731 -3076279 9942151 835800 -21925654
11979b1925654j0250476Q669345N922737p403928j416934J5258273P730527j6919980
$$ -21925654 -32176130 -23506785 -17584048 -24987976 -26404910 -11146637 -3416110 -20336090
11971b0336090j1534032K7685602M0767298k335588m4925820k7063550K1693540
$$ -20336090 -31870122 -4184520 36582778 34247190 -10678630 -37742180 -16048640
11964a6048640L1580343l04863j8805151o047226K827595n545307k446033J8160717
$$ -16048640 15531703 15226840 -3578311 -9625537 -6797942 -12343249 -14789282 3371435
11956C371435J9428119j1330918l1959611j2173377J7541197J9300922P422476
$$ 3371435 22799554 11468636 -20490975 -32664352 -15123155 4177767 11600243
11949A1600243J2305598K0294077M12669l1676371l1412855O93594J5788112p162758
$$ 11600243 23905841 44199918 44612587 12936216 -18476639 -17783045 -1994933 -9157691
11941i157691k9575798j4580563J8896141K8982188J0316045q416857r960324
$$ -9157691 -38733489 -53314052 -34417911 -5435723 4880322 -3536535 -13496859
11934a3496859k914965J818248L331507P62161o980080r737912N532338L0127162
$$ -13496859 -16411824 -14593576 -11262069 -10499908 -17479988 -27217900 -21685562 8441600
11926H441600L6402402J3984784j3619650k0246057r758764k647301l411561r76737
$$ 8441600 44844002 58828786 45209136 24963079 15204315 12557014 9145453 8168716
11918H168716P027403J2313548J4375299J8813320J8480574K87630k6243156l2820001
$$ 8168716 15196119 27509667 41884966 60698286 79178860 79466490 53223334 20403333
11910B0403333j3698924J592072q447939k3720229j3316039J6549078L0361044
$$ 20403333 6704409 8296481 -151458 -23871687 -37187726 -20638648 9722396
11903I722396J1878780j7456175k7654311j1010924J6720981L3496332K8035587
$$ 9722396 21601176 4145001 -23509310 -34520234 -17799253 15697079 43732666
11896D3732666P307729j2557168k3454779k6767973j9752129K011262K4442970
$$ 43732666 51040395 38483227 15028448 -11739525 -31491654 -29480392 -5037422
11889e037422K0533481j0474098l1820572j6664402J3432654K1196901O275790
$$ -5037422 15496059 5021961 -26798611 -43463013 -30030359 -8833458 -2557668
11882b557668l603405O70892M541141K656214L768983O921791L538101j14062
$$ -2557668 -6161073 -5490181 -949040 1707174 5476157 12397948 15936049 15821987
11874A5821987P245937J4398901L161929j3381837o916977J3567628J0110567
$$ 15821987 23067924 37466825 40628754 27246917 20329940 33897568 44008135
11867D4008135j8249076k7341587j143204J7352193l838919l1154062j9659347
$$ 44008135 25759059 -1582528 -2725732 14626461 10787542 -20366520 -40025867
11860d0025867J5654472K8199286J2354569k91031J001041J180228K448099K1473593
$$ -40025867 -24371395 3827891 16182460 15891429 16892470 18072698 20520797 41994390
11852D1994390M3585737K9550939k0366325n2970402l3111563O914193J4171101
$$ 41994390 85580127 115131066 94764741 41794339 8682776 15596969 29768070
11845B9768070j4751552l7900403k5564463J2153406M5300172M9185400J6998222
$$ 29768070 15016518 -22883885 -48448348 -36294942 9005230 58190630 75188852
11838G5188852l1230193n6853142m0100374o283549N576858m108111j233910K1749467
$$ 75188852 43958659 -12894483 -52994857 -59278406 -53701548 -57809659 -59043569 -37294102
11830c7294102K7614324n311033l8729003k5712397J6133244K8851503K620518
$$ -37294102 -9679778 -14990811 -53719814 -79432211 -63298967 -34447464 -31826946
11823c1826946j2899456P172197K3657069M687556j6192218J540824L0273319
$$ -31826946 -44726402 -37554205 -13897136 -9209580 -25401798 -23860974 6412345
11816F412345J7110052k3811587k9927803O947279K7562129M499342j5087746
$$ 6412345 23522397 -289190 -30216993 -23269714 4292415 8791757 -6295989
11809f295989O871623L5239998K3514294r414233j5720570K646827O425164j0573877
$$ -6295989 575634 35815632 59329926 49915693 34195123 36841950 43267114 32693237
11801C2693237j7616410n277092K084557o604738j2246115l061879O142549K263003
$$ 32693237 15076827 9799735 11884292 5279554 -6966561 -10028440 -3885891 -1622888
11793a622888o709541j0553272j1707479j2129127n560451P936039J6511393J3615218
$$ -1622888 -8332429 -18885701 -30593180 -42722307 -48282758 -40346719 -23835326 -10220108
11785a0220108O522695J791841m333457j4850630k3111769k1747394j2511531
$$ -10220108 -3697413 -1905572 -6239029 -21089659 -44201428 -65948822 -78460353
11778g8460353k342894N270584J2334357K1591132K8573311K0511474o760992
$$ -78460353 -80803247 -75532663 -63198306 -41607174 -13033863 7477611 716619
11771G16619l1002526k1346370J8368387M5262657L1059905j332633j4930897
$$ 716619 -30285907 -51632277 -33263890 11998767 43058672 41726039 26795142
11764B6795142j0058435j0355377j6680655j1459907J649242J379209j0354193
$$ 26795142 16736707 6381330 -10299325 -21759232 -20109990 -18730781 -29084974
11757b9084974q573220J0721254K1141175P869847j1016450j3855484q03256J6146885
$$ -29084974 -37658194 -26936940 -5795765 2074082 -8942368 -22797852 -23601108 -7454223
11749g454223K5247806J5359028j0407209k3194340j412465K7657891J8427364
$$ -7454223 17793583 33152611 22745402 -448938 -1861403 25796488 44223852
11742D4223852k0274399l1329676J269211K2941820n743674m4609292l5345655
$$ 44223852 23949453 -7380223 -6111012 16830808 11087134 -33522158 -68867813
11735f8867813J1965026M0742588K9351645L498057j4683981k3609684j8407701
$$ -68867813 -56902787 -16160199 13191446 16689503 2005522 -21604162 -40011863
11728d0011863N893176K9431855K3417882p383345k8675117k3414453o746610
$$ -40011863 -34118687 -4686832 18731050 11347705 -17327412 -40741865 -47488475
11721d7488475M730304J0440030J1472629M915654m140959n791207j241219K004993
$$ -47488475 -42758171 -32318141 -20845512 -15929858 -20070817 -25862024 -27103243 -25098250
11713b5098250N791297J2620489J0716020p285362k0701048o640019J8251439
$$ -25098250 -19306953 -6686464 4029556 -3255806 -23956854 -30596873 -12345434
11706a2345434J7786978n502063j2690867P189046J8073996l847941l1087979
$$ -12345434 5441544 -60519 -12751386 -5562340 12511656 8663715 -22424264
11699b2424264k7406704J501592K4429164K8125292K0696968R747801j531772
$$ -22424264 -49830968 -48329376 -23900212 4225080 24922048 34669849 33138077
11692C3138077r558987j6296208k6130392k8999493q999756K0960399K3540944
$$ 33138077 23579090 7282882 -18847510 -47847003 -56846759 -35886360 -12345416
11685a2345416o846539k5563837k074347K9760828K2780533r206269j5137104
$$ -12345416 -19191955 -44755792 -46830139 -17069311 5711222 -3495047 -18632151
11678a8632151J1455927K6408494Q474142j1877640p608265N189507J904441j1256726
$$ -18632151 -7176224 19232270 27706412 15828772 8220507 13410014 15314455 4057729
11670D057729j5483637j0778860o440698k39266J1233737J7092865P449969p616750
$$ 4057729 -11425908 -22204768 -28645466 -28884732 -17650995 -558130 6891839 -724911
11662g24911j2076173o498484r78727L140979P750444N192844r572982k1845934
$$ -724911 -12801084 -19299568 -20278295 -17137316 -9386872 -4194028 -13767010 -35612944
11654c5612944j2767588J1540086K5544679J7749668P16889j1932311j9220368
$$ -35612944 -48380532 -36840446 -11295767 6453901 7170790 -4761521 -23981889
11647b3981889j9981871o010640K1113706L9963005L0216800j258921k6059942
$$ -23981889 -43963760 -49974400 -28860694 11102311 41319111 40060190 14000248
11640A4000248k5108202o945071N462944J627488o144092k28307J7444195K5287132
$$ 14000248 -11107954 -18053025 -12590081 -10962593 -17106685 -17334992 109203 25396335
11632B5396335R834749j5087310k5766716j8117032o957343q49822M888128J0474617
$$ 25396335 35231084 20143774 -5622942 -23739974 -30697317 -31547139 -26659011 -16184394
11624a6184394P541397j227259Q81280J5937850J9938990r79177k0660589o689530
$$ -16184394 -8642997 -9870256 -8988976 6948874 26887864 25908687 5248098 -1441432
11616a441432K6466558L1833073j624601k9749526j5591720J9149034K8301713
$$ -1441432 25025126 56858199 55233598 25484072 9892352 29041386 57343099
11609E7343099N628044j3731932o238013J3733594K0013099M968821j9005029
$$ 57343099 62971143 49239211 43001198 56734792 76747891 81716712 62711683
11602F2711683l2185861k1380679M045256J3419078q941191l3171392j6851334
$$ 62711683 30525822 9145143 13190399 26609477 17668286 -15503106 -32354440
11595c2354440L0350087M9490519J3126180l2049800l0562693L486303J3333668
$$ -32354440 -2004353 47486166 60612346 28562546 -2000147 1486156 14819824
11588A4819824j2877881l0002737j1106796J3915830J2117700r02731O578973
$$ 14819824 1941943 -28060794 -39167590 -25251760 -13134060 -14036791 -7457818
11581g457818K6387561K4405338j992253j7999560m238699J6147567J4096126
$$ -7457818 18929743 43335081 41342828 23343268 19104569 35252136 49348262
11574D9348262n265726j5591282p977092J738501q96766j1731350j8570147j7260185
$$ 49348262 44082536 28491254 20514162 22252663 21355897 9624547 -8945600 -26205785
11566b6205785j1690027m515680M671362J3285059J4396182M659674q941398j4250601
$$ -26205785 -37895812 -42411492 -37740130 -24455071 -10058889 -5399215 -14340613 -28591214
11558b8591214o854458M073494N087785n699788j4003768m467434J8357458K9922362
$$ -28591214 -35445672 -31372178 -26284393 -31984181 -45987949 -50455383 -32097925 -2175563
11550b175563J3686098j4307194k1037766J095797K1705089J1579457j7977663
$$ -2175563 11510535 -2796659 -23834425 -22738628 -1033539 10545918 -7431745
11543g431745l0561182j2217699J4825516K4476489J4462303j288242j0977889
$$ -7431745 -37992927 -50210626 -35385110 -10908621 3553682 2265440 -8712449
11536h712449r130000L324073J4865078J0346590j0039274k7613712k6688871
$$ -8712449 -17842449 -14518376 346702 10693292 654018 -26959694 -53648565
11529e3648565j0239359R170445K2071058K2024223Q191128n382460N74542K2255891
$$ -53648565 -63887924 -54717479 -32646421 -10622198 -2431070 -7813530 -7238988 15016903
11521A5016903L0901339J1078256j6171072k3006830j0591978K262377R170950
$$ 15016903 45918242 56996498 40825426 17818596 7226618 9488995 18659945
11514A8659945J3093446Q531723o954519j4760291K362745K6435507K2376927
$$ 18659945 31753391 40285114 33330595 18570304 20933049 47368556 69745483
11507F9745483j1718732m0458940l8484790j6069803M480115J2789047P857561
$$ 69745483 58026751 17567811 -20916979 -36986782 -32506667 -19717620 -11860059
11500a1860059m370673q175204M338264J3944337j36640j8538584k732518L8998780
$$ -11860059 -16230732 -24405936 -20067672 -6123335 -6259975 -24798559 -27531077 11467703
11492A1467703N0811032J0057210l5211570l6126712j0257108k442333j1945956
$$ 11467703 62278735 72335945 37124375 997663 -9259445 -11701778 -23647734
11485b3647734n461442J7363457K2040421j294083k1501316j5997819o81100J270778
$$ -23647734 -29109176 -11745719 10294702 9000619 -12500697 -28498516 -29179616 -27908838
11477b7908838p090799q413688K049088J4738233K0718645J9522833J6649719
$$ -27908838 -34999637 -43413325 -41364237 -26626004 -5907359 13615474 30265193
11470C0265193J5553922J0729673m886994k2579008k2161717k991094P428658
$$ 30265193 45819115 56548788 51661794 29082786 6921069 3929975 11358633
11463A1358633p497760k4876556j7131261K296879P75471j8193629k0751247k79571
$$ 11358633 3860873 -21015683 -38146944 -35850065 -35074594 -53268223 -74019470 -74299041
11455g4299041J2936193N681381L506271K2630462L8437639K6668008M958390
$$ -74299041 -61362848 -55681467 -52175196 -29544734 8892905 35560913 40519303
11448D0519303K921147J3571197Q255293j3413792k2689069p527071J0299136
$$ 40519303 43440450 57011647 65266940 51853148 29164079 21637008 31936144
11441C1936144P893068j1262545k8397415l0852301j6398340Q922762K9412480
$$ 31936144 39829212 28566667 169252 -30683049 -47081389 -38158627 -8746147
11434h746147K7834926M502746j8690906k1737954r128313n58216k629235j509580
$$ -8746147 19088779 23591525 4900619 -16837335 -25965648 -26523864 -29153099 -30662679
11426c0662679J3243162K8428493K1431383q549670l4777576l1337778k68629
$$ -30662679 -17419517 11008976 32440359 23890689 -10886887 -42224665 -42493294
11419d2493294L1724750L7441858J0531264k6896806l7273975l354450M3686218
$$ -42493294 -10768544 26673314 37204578 10307772 -26966203 -30320653 13365565
11412A3365565M9906172L796278m2976532l8457135L680568K7698407J2020509
$$ 13365565 63271737 67068015 24091483 -14365652 -10685084 17013323 29033832
11405B9033832j3062628k0466096j9406143k2636927j6758450J1094740M1130834
$$ 29033832 15971204 -4494892 -23901035 -46537962 -63296412 -52201672 -11070838
11398a1070838M2808624J6489162r833908j7705306j2432022o152830n264573
$$ -11070838 31737786 48226948 38393040 20687734 8255712 2102882 -3161691
11391c161691j1194962j7433228r532646J5488606L4014009K0331079j4210701
$$ -3161691 -14356653 -31789881 -41322527 -25833921 8180088 28511167 14300466
11384A4300466k9506928j0017517J3834174J1169550m940494k803084J3818691
$$ 14300466 -15206462 -25223979 -11389805 -220255 -5160749 -7963833 5854858
11377E854858J1226770j6076269k9855490n175523K8743168L0458008N720860
$$ 5854858 17081628 1005359 -28850131 -34025654 -5282486 25175522 30896382
11370C0896382p752866K28276N954090j083012n113707j286727o036052k0170211
$$ 30896382 23143516 23371792 29325882 28242870 23129163 21842436 15806384 -4363827
11362d363827k0310778k176477O419386m658756o215934J5333690K4565268l270248
$$ -4363827 -24674605 -26851082 -20431696 -25090452 -31306386 -15972696 8592572 5322324
11354E322324l0080589j2509217K2527973J9830678j1712997j7217757O983664
$$ 5322324 -24758265 -37267482 -14739509 5091169 -6621828 -23839585 -16855921
11347a6855921R267520k1347816l1196450N741692M0682630K9098039r97829j883305
$$ -16855921 -7588401 -28936217 -60132667 -54390975 -13708345 15389694 14391865 12508560
11339A2508560J8501591K0329955j490591j9648120k2219463j8343960j0253354
$$ 12508560 31010151 51340106 49849515 30201395 7981932 -10362028 -20615382
11332b0615382O120821K1154419J9546610L837207p915176l142788J4613707K6503949
$$ -20615382 -14494561 6659858 26206468 30043675 22128499 18985711 33599418 60103367
11324F0103367J0155073l0362070n1531250j9328449L2519566L7924896n033775
$$ 60103367 70258440 39896370 -11634880 -30963329 1556237 39481133 34447358
11317C4447358k9101791l805939J8695285l706655l0621222j2246445K1635532
$$ 34447358 5345567 1539628 20234913 16528258 -14092964 -26339409 -4703877
11310d703877J3483225k2393188k6967491K028907J2296138r379891j9110693
$$ -4703877 8779348 -13613840 -40581331 -38552424 -26256286 -35636177 -54746870
11303e4746870M364149K6738735J8835598k236475r662276l870052K396836M778741
$$ -54746870 -50382721 -23643986 -4808388 -7044863 -16707139 -20577191 -18180355 -13401614
11295a3401614K959034p01928K522291J1636061P163785j5287470k2599228P623369
$$ -13401614 -10442580 -11144508 -8622217 3013844 10177629 -5109841 -27709069 -20085700
11287b0085700L8473439K2110581k1663624l2770698m723858J2952535J711207
$$ -20085700 18387739 40498320 18834696 -13936002 -18659860 -5707325 -3996118
11280c996118n859258J791266n451397l1101755l2942836J332572K4331992P746319
$$ -3996118 -9855376 -8064110 -13515507 -44617262 -77560098 -76227526 -51895534 -44149215
11272d4149215j0459810K942721J6658198m739635l1023059j4733874K7179484
$$ -44149215 -54609025 -51666304 -35008106 -39747741 -70770800 -85504674 -58325190
11265e8325190L9510313J3266941j1546143j3675543j0036746j2500296r495726
$$ -58325190 -18814877 -5547936 -17094079 -30769622 -40806368 -53306664 -62802390
11258f2802390O142200K2640543K6577627J5882572j066221p003149J0185217
$$ -62802390 -56660190 -34019647 -7442020 8440552 7374331 371182 10556399
11251A0556399L2391865K2378993k1968688n1744725l2216726L483554K269522
$$ 10556399 42948264 65327257 43358569 -8386156 -40602882 -37119328 -34849806
11244c4849806k9452243l8760731p590380K5678671K8226802J4688940J4087633
$$ -34849806 -64302049 -103062780 -110653160 -84974489 -56747687 -42058747 -27971114
11237b7971114K6113192K9143142J4349844n102564j3034038r073278p957945
$$ -27971114 -1857922 27285220 41635064 36532500 23498462 14425184 6467239
11230F467239j9829306l2839094k4549061O336016L2326780K9413941N780158
$$ 6467239 -13362067 -46201161 -70750222 -64414206 -32087426 -2673485 3106673
11223C106673j1292513p744660O870450J3252928L85323k2673558l1834460j5769899
$$ 3106673 -8185840 -15930500 -9060050 4192878 4578201 -18095357 -49929817 -65699716
11215f5699716M754490L461822j0299658m307324K3601658L9741225K7659478
$$ -65699716 -60945226 -57483404 -67783062 -72090386 -48488728 -8747503 18911975
11208A8911975R540251K844364m261670j6041293j0283425J6861174K8417723
$$ 18911975 28452226 31296590 27034920 10993627 710202 17571376 45989099
11201D5989099L684549k0522222p333226J6551512N067678k7133856k7194359
$$ 45989099 49673648 29151426 21818200 38369712 43437390 16303534 -10890825
11194a0890825Q079461K7230186O836899j6427032q440422J3396024J4071077
$$ -10890825 -2811364 24418822 31255721 14828689 6388267 19784291 33855368
11187C3855368p783223k4045646j5607894Q096320K1136095Q446623j6058467
$$ 33855368 26072145 2026499 -13581395 -5485075 15651020 24097643 8039176
11180H039176k5298458j5251111p586613r982327k455609K0579694K8883545N404874
$$ 8039176 -17259282 -32510393 -40097006 -50079333 -52534942 -31955248 -3071703 2333171
11172B333171j6714115m253641J9308268J3308158j0011393r277581J1056853
$$ 2333171 -14380944 -18634585 673683 13981841 3970448 -5307133 5749720
11165E749720J0335732j2079462j3181428J7739460L8824033K3145879n804375
$$ 5749720 16085452 4005990 -9175438 8564022 47388055 70533934 64729559
11158F4729559k0593613k4068885k1728484n824569J4633816J0733366j8873413
$$ 64729559 44135946 20067061 -1661423 -7485992 7147824 17881190 -992223
11151i92223l5548267j6113600J4172527K3032284J2019866j957634j2703157
$$ -992223 -36540490 -52654090 -38481563 -15449279 -3429413 -5387047 -18090204
11144a8090204j4420582J975208K4590016K4680165R99817j4149504q254371p944805
$$ -18090204 -32510786 -30535578 -5945562 18734603 19734420 5584916 -2669455 -10614260
11136a0614260k4965670k7083471O158275L9137597L0920636j644126j3763775
$$ -10614260 -35579930 -62663401 -56505126 -17367529 13553107 11908981 -1854794
11129a854794j064027N499198l653353q573962r73196M837051J260482k914139
$$ -1854794 -2918821 2580377 -1072976 -9646938 -10620134 -5783083 -4522601 -7436740
11121g436740k553669j307396K364836J2285970J9004734Q158950j4778315k6262893
$$ -7436740 -9990409 -11297805 -8932969 3353001 22357735 30516685 15738370 -10524523
11113a0524523j4108858Q395752K0855260J8236676J0810169O760111R19188j4287553
$$ -10524523 -24633381 -16237629 4617631 22854307 33664476 40424587 41343775 27056222
11105B7056222k8710379k0246019J0153533K7748160R241695j8302724j4611884
$$ 27056222 -1654157 -21900176 -11746643 16001517 25243212 6940488 -7671396
11098g671396J1404126J6832879m739794j6283988l702147L267739r851777j4864358
$$ -7671396 3732730 20565609 15825815 -458173 -4160320 -892581 -10744358 -25608716
11090b5608716M044381J7990837P236241j32868J7748737K7838762l698037m3919623
$$ -25608716 -21564335 -3573498 3662743 3529875 21278612 49117374 45419337 1499714
11082A499714l5837604J2598128L8352285J3748189k3136860k8943960m075220
$$ 1499714 -34337890 -21739762 16612523 30360712 7223852 -21720108 -25795328
11075b5795328K4157224L4990679K3708671k07269j9942679k8127363l1554410
$$ -25795328 -1638104 33352575 57061246 56853977 36911298 8783935 -22770475
11068b2770475l1312143j5459365J5269853L6370990L2109453J6610953M966690
$$ -22770475 -54082618 -69541983 -54272130 -17901140 14208313 30819266 35785956
11061C5785956q442563k2545617j6209681R067522J2087752k3917156m9018444
$$ 35785956 27343393 4797776 -11411905 -2344383 9743369 -14173787 -63192231
11054f3192231j7087667L6949859M7762100J7309802k917268k903903j3554159
$$ -63192231 -80279898 -43330039 4432061 21741863 18824595 15920692 2366533
11047B366533k8959904r480902L5623424M6752099R096999k2850464j6085932
$$ 2366533 -26593371 -36074273 -450849 46301250 55398249 32547785 16461853
11040A6461853m888027j7833624k5632797j125405K5454852J7161853q067477
$$ 16461853 11573826 -6259798 -31892595 -33018000 -7563148 9598705 1531228
11033A531228j2594976r04703j571691j4165356j5862885k300946J2534910K1082248
$$ 1531228 -11063748 -11968451 -13540142 -27705498 -43568383 -45869329 -33334419 -12252171
11025a2252171K0086626L212936j9677742j8956611J2643115L8310276K6403756
$$ -12252171 7834455 11047391 -8630351 -27586962 -14943847 23366429 49770185
11018D9770185k532271j0487447j299099o827834k8730619l4569268q505866K7295578
$$ 49770185 47237914 36750467 35451368 28623534 -107085 -34676353 -43182219 -15886641
11010a5886641M2761605K7340320r553771m2972267m2620631l372661L6861065
$$ -15886641 26874964 54215284 44661513 1689246 -40931385 -44304046 -7442981
11003g442981L3944328p333208l7505696k4972844P455319J7585826j623718j8371776
$$ -7442981 26501347 19168139 -18337557 -43310401 -35855082 -18269256 -19892974 -38264750
10995c8264750p688885J5294403J6798628p870444k5431783r560078K2844223
$$ -38264750 -45953635 -30659232 -13860604 -21731048 -47162831 -56722909 -33878686
10988c3878686L6227092K2592431J334892j3910098k0003629p398684K5124014
$$ -33878686 2348406 24940837 26275729 12365631 -7637998 -15036682 10087332
10981A0087332M5164229J9157024k8980111l8824322j206069K5791447N361272
$$ 10087332 55251561 74408585 45428474 6604152 5398083 31189530 36550802
10974C6550802k6661897k6683698q008859k314225k723739Q291619J3179158p282425
$$ 36550802 9888905 -16794793 -24803652 -27117877 -29841616 -21549997 -8370839 -15653264
10966a5653264k6501057j1071853J9136282K3875047J1356695J6279683L0025989
$$ -15653264 -42154321 -53226174 -34089892 -10214845 1141850 17421533 47447522
10959D7447522J7242403j1413150j2173307J0372446N996524l1018427m6121247
$$ 47447522 64689925 53276775 41103468 51475914 57472438 26454011 -19667236
10952a9667236j6108390J2378008L872301r905489P218489L2142815K6489670
$$ -19667236 -35775626 -23397618 -19525317 -29430806 -22212317 9930498 36420168
10945C6420168O85144j2203738j1418552j2017257m819998J9428289L2054186
$$ 36420168 37105312 24901574 13483022 1465765 -3354233 16074056 48128242
10938D8128242L948437l6902601l7734956j165838J8942006J51260k1279535j4041282
$$ 48128242 52076679 15174078 -22560878 -23726716 -4784710 -4633450 -25912985 -39954267
10930c9954267M961130R603330P252574J6200663K8587784K4722128P342511n183662
$$ -39954267 -34993137 -25389807 -18137233 -1936570 26651214 51373342 58715853 53532191
10922E3532191r954869j8690963k9244937k2162568Q048035L5806586L1698917
$$ 53532191 43577322 24886359 -4358578 -26521146 -18473111 17333475 49032392
10915D9032392k13413k5499227k0655901J2340O430170o266400j3536048R41513
$$ 49032392 48818979 23319752 2663851 2676191 9106361 2839961 -10696087 -9754574
10907i754574J9959984J6497433p599725k3255238j3127407O542009R023724p912445
$$ -9754574 10205410 26702843 19103118 -4152120 -17279527 -10737518 -1713794 -9626239
10899i626239j9834440o832253K0443692L0915483R766016k0277565k2889983
$$ -9626239 -29460679 -36292932 -15849240 15066243 24832259 4554694 -18335289
10892a8335289O068808K9322853J4413561k1683981l3017968o896785J8552592
$$ -18335289 -12266481 17056372 31469933 9785952 -23232016 -30128801 -11576209
10885a1576209Q734687j8144323j8803234J1216232L1825058J7092090j1112907
$$ -11576209 -2841522 -20985845 -39789079 -28572847 3252211 20344301 9231394
10878I231394k0736263j3623761r268306n488664J2606806L4434409L1031617
$$ 9231394 -11504869 -25128630 -34396936 -39885600 -27278794 7155615 38187232
10871C8187232K713969j4576512j715536J5356663P379053j4854516k2321992
$$ 38187232 40901201 26324689 24609153 39965816 47344869 32490353 10168361
10864A0168361j2452132n230631q079328j0796888p676167k460252K016878J478923
$$ 10168361 -2283771 -7514402 -15593730 -26390618 -34066785 -36527037 -34510159 -33031236
10856c3031236j0892492k5356101j4362689K4140610M4920165J4503579k8418539
$$ -33031236 -43923728 -69279829 -83642518 -59501908 -14581743 -78164 -28496703
10849b8496703k1771381K3340463L6296283k160188l1719889j3394691J1805319
$$ -28496703 -50268084 -26927621 9368662 7208474 -24511415 -37906106 -26100787
10842b6100787K024801j3193994N507141K8336593Q018077k9186983k2206603
$$ -26100787 -24075986 -37269980 -31762839 -3426246 4591831 -24595152 -46801755
10835d6801755J8107342K3884538j3977008k9135145Q530314M4160494K9682553
$$ -46801755 -28694413 -4809875 -18786883 -47922028 -39391714 4768780 34451333
10828C4451333n581429j5808558j0198162j5965891k0192106k758515J2480992
$$ 34451333 28869904 13061346 2863184 -13102707 -33294813 -36053328 -23572336
10821b3572336l050209k3491727q879798J9923494J2477312k0263857j8503045
$$ -23572336 -26622545 -50114272 -58994070 -39070576 -26593264 -46857121 -65360166
10814f5360166K3505827M2002385Q254922k2742261k810786L1581859K1465993
$$ -65360166 -41854339 148046 8402968 -14339293 -17150079 14431780 35897773
10807C5897773k0558190l6336501j4067053N108304L0947o866942P68450R113750
$$ 35897773 15339583 -20996918 -35063971 -29955667 -29924720 -36791662 -36023212 -26909462
10799b6909462Q279104Q626643J0899767j558281k4375255k2778613J4822323
$$ -26909462 -18630358 -10003715 896052 -662229 -25037484 -47816097 -32993774
10792c2993774M5355244K6135324k0003598l2628076J910113L2539633J5406506
$$ -32993774 12361470 38496794 18493196 -14134880 -12224767 20314866 35721372
10785C5721372k8714416m6139353j9082610J9222279L1012487J5104719k603751
$$ 35721372 7006956 -39132397 -58215007 -38992728 -7980241 7124478 4520727
10778D520727n332450M56847L302133M296620R047759J2440002N540885o230987
$$ 4520727 -811723 -354876 2947257 7243877 16291636 28731638 34272523 28041536
10770B8041536q665970l403096p291939k0080230j5439523J7991220M6724974
$$ 28041536 19375566 15972470 8680531 -11399699 -26839222 -8848002 37876972
10763C7876972L2452400r081369k4852836p90002J7619533m386745l7004239l2627450
$$ 37876972 70329372 61248003 36395167 35605165 53224698 48837953 11833714 -20793736
10755b0793736P51107J4887342j988176j1071818R057239K6171319Q570217k1050353
$$ -20793736 -20042629 -5155287 -7143463 -18215281 -9158042 17013277 25583494 4533141
10747D533141k0421556P049572K1764221J1306327J930871O305454K784728j9370007
$$ 4533141 -15888415 -8838843 12925378 24231705 26162576 32468030 35252758 15882751
10739A5882751l2635840j4439759J1785066J0698905r925815j3583451O971322
$$ 15882751 -16753089 -31192848 -19407782 -8708877 -18634692 -32218143 -25246821
10732b5246821K2832440J7095309M003842l866681j2580697k0399997q193555
$$ -25246821 -2414381 14680928 18684770 14818089 2237392 -18162605 -26356160
10725b6356160K4333368M1409147J6757427k3548342l2907826o621976J7190723
$$ -26356160 -2022792 39386355 56143782 32595440 -312386 -6934362 10256361
10718A0256361J3483645l165295j0720695j0443130j3180003j4828821l369181
$$ 10256361 23740006 20574711 9854016 -589114 -13769117 -28597938 -31967119
10711c1967119J7738370K8921293J8039456m324023j6694530j0280753L447261
$$ -31967119 -14228749 14692544 32732000 28407977 11713447 1432694 4879955
10704D879955Q711033L477633l421202q119123j3453780j5557169l877125J8815159
$$ 4879955 13590988 17068621 13647419 5528296 -7925484 -23482653 -27359778 -8544619
10696h544619L0518703J6285401r554819k1392500j5246045p928225p608787l483604
$$ -8544619 21974084 38259485 28704666 7312166 -7933879 -15862104 -23470891 -26954495
10688b6954495J2301109K7757974K4982317M126205j4430348j2110298N959272
$$ -26954495 -14653386 13104588 38086905 42213110 27782762 15672464 21631736
10681B1631736J4357790k686260k7447081k6688262L837580K9067504J9820479
$$ 21631736 35989526 33303266 5856185 -20832077 -16994497 12073007 31893486
10674C1893486p192014j3751654N606795J8738789M734706j7505569j9228903
$$ 31893486 24701472 10949818 16556613 35295402 40030108 22524539 3295636
10667C295636j726743R700671L168773n237855K880751J9150395J6684238j1597803
$$ 3295636 1568893 11269564 14438337 9200482 12081233 31231628 47915866 36318063
10659C6318063l5791742k3764982J3054657K9506742N627235k6606821k7078762
$$ 36318063 526321 -23238661 -10184004 19322738 24949973 -1656848 -28735610
10652b8735610K181534K8001888L0800983J7154964n65283j4967742k0474539
$$ -28735610 -26554076 1447812 32248795 49403759 48838476 33870734 13396195
10645A3396195j7276301j2602493o417311J0194760K9584058K4068475r554386
$$ 13396195 -3880106 -16482599 -22899910 -12705150 16878908 40947383 31392997
10638C1392997k9135752n260705K5206747R935011l3836340m2326160n359256
$$ 31392997 2257245 -3003460 22203287 32138298 -1698042 -44024202 -49383458
10631d9383458K0684841O763980p665264R990527K9267773J2307617k2085215
$$ -49383458 -28698617 -21934637 -29599901 -19609374 9658399 21966016 -119199
10624a19199l2207019j6490509k365150J389857M384539P820593R240662J4606917
$$ -119199 -32326218 -48816727 -51181877 -49792020 -45407481 -37586888 -28346226 -13739309
10616a3739309K0770829R953633j4983156k0407626N394704K3799585M336218
$$ -13739309 7031520 16985153 2001997 -18405629 -13010925 10788660 15124878
10609A5124878k3466828j8120779P294698J4957974Q738060J5516182K3999736
$$ 15124878 -8341950 -26462729 -19168031 -4210057 4528003 20044185 44043921
10602D4043921L428493l1161513l4853738p611833P375851k219861o077935M914699
$$ 44043921 47472414 16310901 -18542837 -26154670 -18778819 -20998680 -27076615 -22161916
10594b2161916N426428o279636m72095J9935575J1722614k9581362m6137268o029007
$$ -22161916 -16735488 -23015124 -23487219 -3551644 8170970 -21410392 -67547660 -73576667
10586g3576667M2739175M6789927K3879569J7062160J7549460q935516m8861970
$$ -73576667 -30837492 15952435 39832004 56894164 74443624 65508108 16646138
10579A6646138n4404168j8162507J7111789K0561238L620367j1246006j7085333
$$ 16646138 -37758030 -55920537 -38808748 -18247510 -14627143 -25873149 -42958482
10572d2958482j5020701p293606l95990K668996Q620978J7168449J1646524j2548824
$$ -42958482 -57979183 -65272789 -65668779 -62999783 -54378805 -37210356 -25563832 -38112656
10564c8112656k6785464n679157K8316202L1193553J039893k1582691j5962832
$$ -38112656 -64898120 -70577277 -42261075 -11067522 -10027629 -31610320 -47573152
10557d7573152m843053p485473p432295J2417861L2242043K1794464j1042166
$$ -47573152 -52416205 -59901678 -67333973 -54916112 -22674069 -879605 -11921771
10550a1921771k7179221q620969J9556811K3686396R57043k3620037k8120101
$$ -11921771 -39100992 -47721961 -28165150 -4478754 -3521711 -27141748 -55261849
10543e5261849j1434486J2592317K6812368J9811871l705573k1297665j4739162
$$ -55261849 -66696335 -54104018 -27291650 -7479779 -11185352 -32483017 -47222179
10536d7222179M819569R401448m981256j1921622J189103R309442q329297k7763117
$$ -47222179 -42402610 -33001162 -37982418 -49904040 -48714937 -39405495 -47734792 -75497909
10528g5497909j4960644J6964076K5327072L747411j2053947k899044J2185572
$$ -75497909 -90458553 -73494477 -48167405 -44419994 -56473941 -59372985 -47187413
10521d7187413J7286145K0058771K1588159P495312j7234087k4419846r413967
$$ -47187413 -29901268 -9842497 11745662 19240974 2006887 -22412959 -31826926
10514c1826926k220377j4712646j8447461K561513J8870430M379781j9160263
$$ -31826926 -34047303 -48759949 -67207410 -64645897 -45775467 -41395686 -60555949
10507f0555949j8127181L991948K2800880K8471205J9737610n209849k8524296
$$ -60555949 -78683130 -74691182 -51890302 -23419097 -3681487 -8891336 -37415632
10500c7415632k0209809J1637443K0974579l692173k0013463r994116j0107650
$$ -37415632 -57625441 -45987998 -25013419 -28705592 -48719055 -58713171 -68820821
10493f8820821k8634010j7035598K1775846k631876j05011455j29084102M2808259
$$ -68820821 -97454831 -114490429 -92714583 -95346459 -200357914 -329442016 -286633757
10486b86633757K60185203K64338959N0800547j19666334q9873322R137164Q892917
$$ -286633757 -26448554 237890405 288690952 169024618 79151296 88288460 97181377
10479I7181377m6464572k6068466N0923575O2654083o487081n4266277k8808032
$$ 97181377 50716805 24648339 75571914 138225997 131738916 77472639 48664607
10472D8664607J5359803K3196639L512438j5606580k1779291p311664K0553428
$$ 48664607 64024410 87221049 90733487 75126907 53347616 46035952 66589380
10465F6589380K6745167n654882l6153092k3486283O259756N415043j2111562
$$ 66589380 93334547 87679665 51526573 28040290 34300046 39715089 27603527
10458B7603527j508094K5039629J8106761j6541936k4990998j13200R107523j2418223
$$ 27603527 26095433 51135062 69241823 52699887 27708889 27595689 36703212 24284989
10450B4284989k3037300n039645M050924j6456222l1310281j1281909J9553475
$$ 24284989 1247689 -3791956 258968 -16197254 -47507535 -58789444 -39235969
10443c9235969K8917593K3900795K3830786K2824347P869747j3276825k3945617
$$ -39235969 -10318376 13582419 37413205 60237552 68107299 54830474 30884857
10436C0884857j7744680L187907K6210726K5074541r922305m2082666k7693888
$$ 30884857 13140177 16328084 42538810 67613351 57691046 15608380 -12085508
10429a2085508J7283159L4997958R448135j8617132k2962162k0199267j7575716
$$ -12085508 5197651 40195609 49643744 31026612 8064450 -12134817 -29710533
10422b9710533M646161L8626227L9083475k536930l1547603j1959565J9040934
$$ -29710533 -25064372 13561855 52645330 50108400 18560797 6601232 25642166
10415B5642166J6274354n887473j3388188j0272686j0054881L370076L4584199
$$ 25642166 41916520 36029047 22640859 12368173 2313292 5683368 40267567
10408D0267567M1061854l246627m8294531l5374637R563676J8858804p811896
$$ 40267567 81329421 78082794 29788263 -5586374 3977302 22836106 15024210
10401A5024210j3295895J3645905K4799741K384510j4110777l701815L249374
$$ 15024210 1728315 15374220 40173961 42558471 28447694 24745879 27995253
10394B7995253j0357422j3956729J0465781K8345354R651651j8017924j4172002
$$ 27995253 17637831 3681102 14146883 42492237 52143888 34125964 19953962
10387A9953962J0228614J5700306j321349r998013k91519L667410j2499353k8417063
$$ 19953962 30182576 45882882 44561533 34563520 34272001 37939411 25440058 -2977005
10379b977005k0104912L944796J4838678M186270m726004P912355K6540755K1006800
$$ -2977005 -23081917 -19137121 -4298443 -112173 -4838177 3074178 29614933 50621733
10371E0621733o914065k3592795j4727295o258880j7672076k5510339l569786
$$ 50621733 43707668 20114873 5387578 -871302 -18543378 -44053717 -47623503
10364d7623503K6100098K3337971m223412j1683442J0521622K1607172m266887
$$ -47623503 -21523405 1814566 -2408846 -14092288 -3570666 18036506 13769619
10357A3769619l9600659m5544514j9001881J6927370M0284053L5388393Q94586
$$ 13769619 -25831040 -71375554 -90377435 -73450065 -33166012 2222381 3116967
10350C116967l2865555k4830377K1190676N0547400K6530576k2553576m6199859
$$ 3116967 -29748588 -54578965 -33388289 17159111 43689687 21136111 -25063748
10343b5063748l3991274r750568J0846107K5751765K8478646J6561832N997921
$$ -25063748 -59055022 -68805590 -57959483 -32207718 -3729072 12832760 18830681
10336A8830681R067550R444346j2094670l8308328l4283825n32083K4879699J8156061
$$ 18830681 27898231 37342577 25247907 -13060421 -47344246 -47876329 -22996630 -4840569
10328d840569n028895j9506649j8723749o704980J2465322K6986865K1398515
$$ -4840569 -9869464 -29376113 -48099862 -54804842 -42339520 -15352655 6045860
10321F045860Q95454p356572Q485876K3299239Q903208k2905876l3751902j1147521
$$ 6045860 6941314 -415258 8070618 31369857 40273065 17367189 -16384713 -27532234
10313b7532234J5081576J3878050q505733k3427855k0137716j2533950r900942
$$ -27532234 -12450658 1427392 -7078341 -30506196 -50643912 -63177862 -73078804
10306g3078804k554557J5816118K9291905J9494385m878402j6395047m655933
$$ -73078804 -75633361 -59817243 -30525338 -11030953 -15909355 -32304402 -36960335
10299c6960335J2583014J5526584N146334m092397k720967O893799J3723688O631838
$$ -36960335 -24377321 -8850737 -3704403 -7796800 -10517767 -3623968 10099720 16731558
10291A6731558j1846405k2360376j1074315Q460441J2016018J05343m787252M003734
$$ 16731558 4885153 -17475223 -28549538 -20089097 -8073079 -7967736 -12754988 -8751254
10283h751254Q841761K315710Q01630J1268667J4128759j851659j5338721p407291
$$ -8751254 90507 2406217 3207847 14476514 28605273 26753614 11414893 4007602
10275D007602N043042K69762p743165M011865J9629971O556546k4912144l1527930
$$ 4007602 9050644 9320406 1577241 5589106 25219077 31775623 6863479 -24664451
10267b4664451n308669J5529502J0277968K335345P212365K691782k2089998l2827563
$$ -24664451 -29973120 -14443618 -4165650 -1830305 5382060 8073842 -14016156 -46843719
10259d6843719m839412K4887740J0476478k3090584j2510964L9853368N9503206
$$ -46843719 -51683131 -26795391 -16318913 -39409497 -51920461 -12067093 47436113
10252D7436113J1683972m0393812k5427090L3014315N4284828J6220766k4603117
$$ 47436113 59120085 18726273 -6700817 26313498 80598326 96819092 72215975
10245G2215975k4053215m910187l687176j1797797l266354J2826220R723711o016355
$$ 72215975 48162760 43252573 39565397 27767600 24501246 37327466 47051177 41034822
10237D1034822n175369R662218N625544k0538628k9355171j764796K5703002J6085130
$$ 41034822 35859453 45521671 51147215 30608587 1253416 -511380 25191622 41276752
10229D1276752j1449662j5372359K875935Q303903p320904j7769991j1396451
$$ 41276752 29827090 14454731 17330666 25634569 18313665 543674 -10852777
10222a0852777o523388j2525675j2878970R21820J0504794K104981q859812k653477
$$ -10852777 -17376165 -29901840 -42780810 -41858990 -31354196 -29249215 -38109027 -40762504
10214d0762504J5499552K7742925K7899598J8231348r52245k2035222k6187299
$$ -40762504 -25262952 2479973 30379571 48610919 47658674 25623452 -563847
10207e63847o655728J6323607K0083192P354478m966872j0895140j2560951p111107
$$ -563847 -7219575 9104032 29187224 36541702 31574830 20679690 8118739 1007632
10199A007632L557067L585697j3240786k2619654N76646L9381544N0572184K1335983
$$ 1007632 4564699 8150396 -5090390 -27710044 -27133398 12248146 62820330 84156313
10191H4156313j7573593l5720776l2364504j9162498k491954Q804052M583806
$$ 84156313 66582720 30861944 -1502560 -20665058 -23157012 -14352960 -9769154
10184i769154o694284l072455J5154105K0109810L28907j7089886q337752Q565663
$$ -9769154 -16463438 -19535893 -4381788 15728022 16056929 -1032957 -9370709 -805046
10176h05046L795220j6110508k1406558o915237O134316Q518787J0473949J3272647
$$ -805046 2990174 -13120334 -34526892 -41442129 -35307813 -26789026 -16315077 -3042430
10168c042430N984845o816774n668681Q491600J0077606q452729j8815490J37485
$$ -3042430 2942415 -3874359 -9543040 -1051440 9026166 573437 -18242053 -18104568
10160a8104568K6363617K4956810k524230k3818131k1325760q337619l245397
$$ -18104568 8259049 33215859 30691629 6873498 -14452262 -22789881 -26035278
10153b6035278p262868r878853l934061P532372J4452674J1360735O547798J0848877
$$ -26035278 -33298146 -43176999 -47111060 -39578688 -25126014 -13765279 -7217481 3631396
10145C631396J6676685N002995k0776215k9921023q226638J5057467P756579j5833105
$$ 3631396 20308081 25311076 4534861 -25386162 -33612800 -18555333 -10798754 -26631859
10137b6631859j6822992Q090742K3616194J1435510o129278n032517Q310135J5676996
$$ -26631859 -43454851 -35364109 -11747915 -312405 -6441683 -11474200 -3164065 12512931
10129A2512931J3095774N215095n617706j2515935n521370Q975962J0211550m446563
$$ 12512931 25608705 30823800 25206094 12690159 7168789 16144751 26356301 21909738
10121B1909738j1804050j957679J268536j7955267l0654506l087545M1405908
$$ 21909738 10105688 8148009 9416545 -8538722 -39193228 -42280773 -874865
10114h74865M3165515r406302n5964466m1299898J3366973M2112867K0759079
$$ -874865 42290650 32884348 -23080118 -64380016 -51013043 -8900176 11858903
10107A1858903r501145n281093K0764397K3238234q893512l6135585k4131971
$$ 11858903 2357758 -2923335 17841062 41079296 32185784 -3949801 -28081772
10100b8081772R322496K2232235P146092o375620k501073R53146r476218j7313568
$$ -28081772 -18759276 3472959 10619051 4243431 1742358 2695504 -6780714 -24094282
10092b4094282p242469M573020k633569j5986511q266034J5374816K3018930O711301
$$ -24094282 -31336751 -26763731 -29397300 -45383811 -53649845 -38275029 -15256099 -8544798
10084h544798m642943R077528K8219458K3761699l01847j4756010o640341O066159
$$ -8544798 -13187741 -4110213 24109245 47870944 47569097 32813087 26172746 32238905
10076C2238905K216497j3983576k0439995p734821Q469057Q911583m264638j3623032
$$ 32238905 34455402 20471826 31831 -7702990 766067 9677650 5413012 -8210020
10068h210020j1867301o772222k175455P747874K0465829K0157591J697789j6069301
$$ -8210020 -20077321 -26849543 -29024998 -21277124 -811295 19346296 21044085 4974784
10060D974784j4293634J528819J4179130J8456929J7574752Q972774q450032k2802838
$$ 4974784 -9318850 -7790031 6389099 24846028 42420780 51393554 42943522 20140684
10052B0140684k2062143j0265609L031794J7055979K7967112J9619909j0943074
$$ 20140684 -1921459 -12187068 -9155274 7900705 35867817 55487726 44544652
10045D4544652l3924603k0916701J2220352K6480257J4783802K723782N8405j0446102
$$ 44544652 10620049 -10296652 1923700 28403957 43187759 45911541 45969946 35523844
10037C5523844l2757993m2955094k5717422L750722K4839551L3305435L0174098
$$ 35523844 2765851 -40189243 -65906665 -62155943 -37316392 -4010957 26163141
10030B6163141J5099550r63400k427818L930199m198097k3817857k4152994L846076
$$ 26163141 41262691 40299291 37871473 41801672 37603575 13785718 -10367276 -6521200
10022f521200K8671346K5205112Q442182N72818m068177j6628024k5096400j6373126
$$ -6521200 22150146 47355258 55797440 56370258 52302081 35674057 10577657 -5795469
10014e795469l066003r0236L075270J7664056K5595703P554383j7740746j8471163
$$ -5795469 -8861472 -8951708 -5876438 11787618 37383321 44937704 27196958 8725795
10006H725795J05079O979061l748747j0735899p190392o731123r938291k448415
$$ 8725795 8830874 15809935 12061188 1325289 -5865103 -12596226 -22534517 -24982932
9998b4982932J2063694J2960260P24529j523605Q897802O635227j4016454k1033759
$$ -24982932 -12919238 41022 765551 -758054 8139748 14774975 758521 -20275238
9990b0275238M517291L1629800K2229705j1529484k4970865m235297J9141127
$$ -20275238 -15757947 15871853 38101558 26572074 1601209 -2634088 16507039
9983A6507039J5548245o771155j9696256j1709820L768682Q536831p52273j2208612
$$ 16507039 32055284 25284129 5587873 -6121947 -2353265 6183566 5431293 -6777319
9975f777319j3221955k775740R914040J5126618R025590m893984j6242808j4582564
$$ -6777319 -19999274 -22775014 -12860974 2265644 11291234 6397250 -9845558 -24428122
9967b4428122k143051N745627J018788l353061P412984K3102717J9404193m656731
$$ -24428122 -26571173 -20825546 -19806758 -23159819 -15746835 7355882 26760075 22103344
9959B2103344k0552100q615654J4560867J8630313k434275k6912994l2407420
$$ 22103344 1551244 -7064410 7496457 26126770 23692495 -3220499 -35627919
9952c5627919j5580010R990530K6433422K5212275J4476389R664104J3978406
$$ -35627919 -51207929 -41217399 -14783977 10428298 24904687 34568791 48547197
9945D8547197J5563820P626701k41924P23112K131454o602617j6547899j1220111
$$ 48547197 64111017 71737718 71495794 72218906 74350360 67747743 51199844 39979733
9937C9979733M448177Q501538l583263j1129682k043072P619007J544970r139111
$$ 39979733 44427910 52929448 49346185 38216503 36173431 43792438 45337408 36198297
9929C6198297o245215L038634j41129j0389258o799007N374674k872805l2752690
$$ 36198297 29953082 32991716 32850587 22461329 15662322 21036996 18164191 -14588499
9921a4588499m4610508j5431613K2395926K7743240J0023872O060781J6465080
$$ -14588499 -59199007 -74630620 -52234694 -24491454 -14467582 -8406801 8058279
9914H058279Q908226k0655065l5403234j4852397J4054219J9302142O094061k546990
$$ 8058279 16966505 -3688560 -39091794 -53944191 -39889972 -20587830 -14493769 -17040759
9906a7040759j683513R35580O094260J5914311J9497761P162666j0758461j7440190
$$ -17040759 -18724272 -17788692 -11694432 4219879 23717640 30880306 20121845 2681655
9898B681655j2955603p906352l569887L743832P222361j286322j1476670n136148
$$ 2681655 -10273948 -18180300 -21750187 -18006355 -10783994 -12070316 -23546986 -28683134
9890b8683134J3286486J7431085k896266k2260440j2576874J5361780K4685585
$$ -28683134 -15396648 2034437 -861829 -23122269 -35699143 -20337363 4348222
9883D348222P629554J952579L2652731N8952833K0843315o3644161j00550616
$$ 4348222 11977776 13930355 46583086 105535919 126379234 62735073 -37815543
9876c7815543m3288730L6220454M4944538m215998k6320889K518316K5102882
$$ -37815543 -81104273 -44883819 60719 -4155279 -30476168 -27957852 -2854970
9869b854970R985975o138203J255569J709374k1146256k9502206j321005K3988639
$$ -2854970 7131005 992802 2248371 3957745 -17188511 -46690717 -48011722 -24023083
9861b4023083J5507607N013726K0096468K4532248j2391934m4134713j8126335
$$ -24023083 -8515476 -3501750 16594718 41126966 28735032 -15399681 -33526016
9854c3526016K8959142K7872404r701326k0284927j345216k705031k3564937j4148810
$$ -33526016 -4566874 23305530 13604204 -6680723 -8025939 -10730970 -34295907 -48444717
9846d8444717K3793018L2148679k68168j8266410J012090J4228786k532138j4507539
$$ -48444717 -24651699 7496980 7228812 -11037598 -10025508 4203278 1671140 -12836399
9838a2836399p13138R277631n80845l011925R920690N554116j8193735j4394959
$$ -12836399 -13549537 -4271906 -4852751 -7864676 2056014 7610130 -10583605 -24978564
9830b4978564K5080332L9379485l39529l4834986j3929616K1765399J6677269
$$ -24978564 101768 39481253 39141724 4306738 -9622878 12142521 28819790
9823B8819790q098587o555506P033091l169337k0221810j1515021L655016m427799
$$ 28819790 20721203 14165697 21198788 18029451 -2192359 -13707380 -10052364 -14480163
9815a4480163r923763J7478866L8087403L430884m4578561k9539209K9707745
$$ -14480163 -24403926 -6925060 31162343 34593227 -9985334 -39524543 -9816798
9808i816798M5012004K680445k1877190K514791J7435555j3857937m3200954k4767321
$$ -9816798 35195206 37875651 15998461 18513252 35948807 22090870 -21110084 -45877405
9800d5877405J1005320J6404394l44985n518214L016210Q778720R571910O324358
$$ -45877405 -34872085 -18467691 -18812676 -24330890 -21314680 -12535960 -2964050 3360308
9792C360308o662609j7631038k105913K8059360K5557061j7247336m2245358q990448
$$ 3360308 -3302301 -20933339 -23039252 5020108 30577169 13329833 -28915525 -37905973
9784c7905973M0430438M2007836j181203l6021054l7436230k3045797q676303
$$ -37905973 2524465 44532301 43351098 7330044 -30106186 -53151983 -61828286
9777f1828286O334466J8524807K0935379J8526777J7067613Q254780r942891j5673087
$$ -61828286 -55493820 -36969013 -16033634 2493143 19560756 27815536 17872645 2199558
9769B199558M858599K5684526J5837650r161430j0031485J1629363J5398166j1364721
$$ 2199558 7058157 32742683 48580333 39418903 29387418 41016781 56414947 45050226
9761D5050226l3384929k4526006m764406r73082m905378K863154J2772272K992532
$$ 45050226 11665297 -12860709 -17625115 -18598197 -23503575 -20640421 -7868149 -4875617
9753d875617j7708978j8288399N437056K1595594R774204r097478n629795J5892630
$$ -4875617 -22584595 -40872994 -35435938 -13840344 -4066140 -13163618 -18793413 -2900783
9745b900783K9025422K4684960J4417376K091707j8617954l7679465l0591080
$$ -2900783 26124639 50809599 65226975 67318682 48700728 11021263 -19569817
9738a9569817J807846K2937692Q724435j6209998j4087697J2080185K7751933
$$ -19569817 -17761971 5175721 13900156 -2309842 -16397539 -4317354 23434579
9731B3434579J8576127L389177r4428M692553P527387K910425j2386639l2204782
$$ 23434579 42010706 45399883 45305455 49998008 57525395 60435820 48049181 15844399
9723A5844399l4530560o366841K7517977K8860377k85727j8815087o834373Q814077
$$ 15844399 -18686161 -25053002 2464975 31325352 31039625 12224538 5390165 14204242
9715A4204242K062083j2404593r053881N074776N480875p785076j2536829j388462
$$ 14204242 16266325 3861732 -5192149 -117373 5363502 -2421574 -14958403 -16346865
9707a6346865J0006377J0393929O236712M347314k42489j1188108j8605143j1254281
$$ -16346865 -6340488 4053441 10290153 14637467 14394978 3206870 -15398273 -26652554
9699b6652554M580988J0158491l12796r801811j969346J3499793J3912188j146863
$$ -26652554 -22071566 -11913075 -12225871 -22027682 -23997028 -10497235 3414953 2268090
9691B268090q035686L297907J3698700R017840M717627J4985400K1197605K141401
$$ 2268090 -5767596 -2469689 11229011 20246851 24964478 39949878 61147483 63288884
9683F3288884k2896199j9510195M317401Q606138j3512016k5656176r001062J0994366
$$ 63288884 40392685 20882490 25199891 33806029 20294013 -5362163 -14363225 -3368859
9675c368859J2803317J2008960K3876335K8847196M811533l1591888m5063075
$$ -3368859 9434458 21443418 45319753 74166949 78978482 47386594 2323519
9668B323519k6943672J876440J9169029J5495713l996802j7536415m654856K1720945
$$ 2323519 -24620153 -22743713 -3574684 11921029 7924227 -9612188 -14267044 7453901
9660G453901K4639741j962810j8072940J534842K4268805R940708k4325150l0560592
$$ 7453901 32093642 30130832 12057892 13592734 37861539 47802247 23477097 -7083495
9652g083495k650975K1399782K0301864R174460Q17479j0556688k1910146j6266517
$$ -7083495 -9734470 11665312 31967176 41141636 41959115 31402427 9492281 -6774236
9644f774236M197761J3351225K916662j464118J6507728L2087146J5217657k1773227
$$ -6774236 -2576475 10774750 13691412 12227294 28735022 60822168 76039825 54266598
9636E4266598l9972610k7404149r233672n595119n383810Q190433K5610927K3274573
$$ 54266598 14293988 -13110161 -22343833 -27938952 -33322762 -25132329 478598 23753171
9628B3753171k1055j8903524j6072049l359214P23638j501899K197575P581466
$$ 23753171 23732116 4828592 -11243457 -14602671 -13879033 -15380932 -13183357 -5601891
9620e601891R82926j1865497r106321J1740918K4847669J1833550j2469926k1280440
$$ -5601891 -4618965 -16484462 -25590783 -13849865 10997804 22831354 10361428 -10919012
9612a0919012q328019J1044031J9021029Q088894j3170167k2678118p960781J1493387
$$ -10919012 -19247031 -8203000 10818029 18906923 5736756 -16941362 -24902143 -13408756
9604a3408756N462830k0758667k9064903o129021J4176379M125339j4568194r333070
$$ -13408756 -7945926 -28704593 -57769496 -63898517 -49722138 -45596799 -60164993 -69498063
9596f9498063Q554606M944421j7963178k2934772N796571M1002664N0106258K9397372
$$ -69498063 -60943457 -55999036 -73962214 -96896986 -91100415 -50097751 8507 29405879
9588B9405879j805966k1243918j6810730L860579J6999820Q353777r206249j5011618
$$ 29405879 27599913 6355995 -10454735 -6594156 10405664 18759441 9553192 -5458426
9580e458426p942705m73092K847676L842284q35905j1125607j4371394l092597
$$ -5458426 -13401131 -13874223 -11026547 -7184263 -8020168 -19145775 -33517169 -36609766
9572c6609766R568534R453484J847626m829579j5056077k4385340q397621L4798077
$$ -36609766 -27041232 -17587748 -15740122 -20569701 -35625778 -60011118 -68408739 -33610662
9564c3610662N8289997K5388383k7245990l5846211k404746J6084412J665064
$$ -33610662 24679335 50067718 22821728 -13024483 -15429229 655183 2320247
9557B320247o865261O585535P429043j8839006l2220939o009882K6100021K7561958
$$ 2320247 -4545014 2040521 9469564 -9369442 -41590381 -47600263 -21500242 6061716
9549F061716J5106023J6297576J5129880j1704105l9551214k9773172M614412
$$ 6061716 21167739 37465315 52595195 40891090 1339876 -28433296 -23818884
9542b3818884J8319801K894969j1524453j1986192j2871796j6156291o831498
$$ -23818884 -5499083 -2604114 -14128567 -26114759 -38986555 -55142846 -61974344
9535f1974344J2061220K0061741J6036476J6945879J9896255M963198k1257239
$$ -61974344 -49913124 -29851383 -13814907 3130972 23027227 27990425 6733186
9528F733186k6470856n345439R523830J824291m549582O038350J0678469o028096
$$ 6733186 -19737670 -25083109 -15559279 -13734988 -18284570 -12246220 -1567751 -7595847
9520g595847j4499554J2382535M4254935L2737991j1053560k8743668j465385
$$ -7595847 -22095401 -9712866 34542069 67280060 56226500 27482832 26017447
9513B6017447K4270683P901470l0002832m4389585k5671301J899166J9040688
$$ 26017447 50288130 58189600 28186768 -16202817 -41874118 -39974952 -20934264
9506b0934264K2497240J2469150n594557j5419004p842569K611600j767754j3691996
$$ -20934264 1562976 14032126 8437569 -6981435 -14824004 -12212404 -13980158 -27672154
9498b7672154j4675934p589914q375005j1467362L497822K9200630L1097269J625326
$$ -27672154 -42348088 -49938002 -58313007 -69780369 -66282547 -37081917 -5984648 -4359322
9490d359322k0815187p262105J7981173J6431307o226207j4486906J96806J3185259
$$ -4359322 -25174509 -32436614 -14455441 1975866 -4250341 -18737247 -18540441 -5355182
9482e355182J0477115L888772J993005k236397r205724o630522N078874O647495
$$ -5355182 5121933 9010705 11003710 8767313 -438411 -7068933 -1990059 4657436
9474D657436q393731j8019345l921069J8074663J9589593J496046p126235Q455374
$$ 4657436 -3736295 -21755640 -25676709 -7602046 11987547 13483593 6357358 14812732
9466A4812732K5142479J1439936k6857252m5897492j6633393L2427760M4861562
$$ 14812732 39955211 51395147 24537895 -21359597 -37992990 -5565230 39296332
9459C9296332Q007000l0202922k6548759K559190J4467277M197940p16176N359072
$$ 39296332 47303332 17100410 -9448349 -6889159 7578118 11776058 11059882 16418954
9451A6418954M59188j7346933k0280172Q05354J7465448J0218331q22301N504567
$$ 16418954 16878142 -468791 -20748963 -19943609 -2478161 7740170 6917869 12422436
9443A2422436J3275886p22621k2605811k0532782M780585K1113325J2071521m198108
$$ 12422436 25698322 24975701 2369890 -18162892 -13382307 7731018 19802539 15604431
9435A5604431n154239Q381464J9053895J4212405k698356j5140861j0262484L038487
$$ 15604431 10450192 18831656 37885551 52097956 49399600 34258739 23996255 27034742
9427B7034742K136852j6463651k6847470r701331J6145621J8346467l452880k0677252
$$ 27034742 29171594 12707943 -14139527 -23840858 -7695237 10651230 7198350 -13478902
9419a3478902j8815661j0974825p479075R95931J9728461L1317545J7799528j0561961
$$ -13478902 -32294563 -43269388 -50748463 -49752532 -30024071 1293474 19093002 8531041
9411H531041k5447647j5251910L459258Q969494j157341j1562543q970707L872439
$$ 8531041 -16916606 -32168516 -28709258 -19739764 -20897105 -32459648 -41430355 -37557916
9403c7557916J2874934Q584335l382308q097634J919906J6312928J6528702j484814
$$ -37557916 -24682982 -16098647 -19480955 -27578589 -25658683 -9345755 7182947 5698133
9395E698133j8083617j1158871J4134812K8322813J4949128p931054j4504699
$$ 5698133 -12385484 -23544355 -9409543 18913270 33862398 25931344 11426645
9388A1426645o949257n736341j1994277n165051J9149619L4701226K0604792p691265
$$ 11426645 4477388 -1258953 -13253230 -18418281 731338 35432564 56037356 48346091
9380D8346091k0662783j4401855q414057j1551519j2114746k987144L364496m760406
$$ 48346091 27683308 13281453 4867396 -6684123 -18798869 -21786013 -18421517 -23181923
9372b3181923j5400498o134613K1447191L6145999J5275286k1359971l1728164
$$ -23181923 -38582421 -44717034 -23269843 12876156 28151442 6791471 -24936693
9365b4936693m464910K6673820K7082047K001976j8805854k0248409q614493O847892
$$ -24936693 -29401603 -2727783 24354264 26356240 7550386 -12698023 -21312516 -14464624
9357a4464624J8313942J6020472K070518k640248J1625167J9190100n497810l9616965
$$ -14464624 3849318 19869790 21940308 19300060 30925227 50115327 44617517 5000552
9349E000552l7897308k083133J9481146N391196j2214191o968620L155817j065959
$$ 5000552 -32896756 -34979889 -15498743 -10107547 -22321738 -29290358 -26134541 -27200500
9341b7200500k909151J3260796K5788877J2428801q700569j2146896r479597j9694488
$$ -27200500 -30109651 -16848855 8940022 21368823 12668254 521358 -8958239 -28652727
9333b8652727k3179276O092250M2959225L9751898K480299j6356304o5461J1618790
$$ -28652727 -51832003 -45739753 -2780528 36971370 39451669 23095365 23029904 34648694
9325C4648694o842168k7468159k0366518r66705K455486m210796K047560J8187602
$$ 34648694 27806526 338367 -20028151 -20994856 -18539370 -22750166 -20702606 -2515004
9317b515004J9910874Q15964j7807893j5912442J219638J0301017k832760k3543763
$$ -2515004 17395870 18211834 403941 -15508501 -14288863 -3987846 -6820606 -30364369
9309c0364369k0078994J7580726N6939696N5767702J2406644l3524241m8794486
$$ -30364369 -50443363 -32862637 24077059 79844761 92251405 58727164 9932678
9302I932678l5816969j4575746K065527R080588N327811j697393j078098N818017
$$ 9932678 -25884291 -40460037 -38394510 -29313922 -23986111 -25683504 -26761602 -20943585
9294b0943585P895093M175669M266800P701053L609796n396832k826443J0748077
$$ -20943585 -13048492 -8872823 -4606023 3095030 6704826 1307994 -1518449 9229628
9286I229628J1863129p832064k2574379r816709J5054390K3177442J3189089L176206
$$ 9229628 21092757 13260693 -9313686 -19130395 -4076005 19101437 32290526 35466732
9278C5466732l180252j3835735k1134154q578574J5968860K2946314K739378j9638693
$$ 35466732 32286480 18450745 -2683409 -11261983 4706877 27653191 30392569 10753876
9270A0753876j9899528l226122J2267529K0147338K0036371O994968j3989813
$$ 10753876 -9145652 -12371774 -104245 20043093 40079464 47074432 33084619
9263C3084619j8840383N127650K9771914J7515489k0165022l0709891L525372
$$ 33084619 14244236 19371886 49143800 66659289 46494267 15784376 19309748
9256A9309748L3514529J2521967l3546323m3356741r755294J5671756O286104
$$ 19309748 52824277 65346244 31799921 -11556820 -21312114 -5640358 645746
9249F45746k436645K2026999N1141625L7493488j2424471m7582542m2037885j7651171
$$ 645746 -1790899 20236100 71377725 108871213 96446742 48864200 6826315 -10824856
9241a0824856m06078J0211301K0738754K2246419O125731j5357123k1390329r251999
$$ -10824856 -11230934 -1019633 19719121 41965540 48091271 32734148 11343819 2091820
9233B091820L687943L286805n331556q763707o225737q703010j5694808q923932
$$ 2091820 5779763 9066568 3735012 -5028695 -11254432 -19957442 -35652250 -44576182
9225d4576182J6984494L3351372J3751897j8129137j4568646K1502954L3345989
$$ -44576182 -27591688 5759684 19511581 1382444 -13186202 8316752 41662741
9218D1662741l008283l7132184k0501692J9092252K4415656l928064k0794007
$$ 41662741 38654458 1522274 -18979418 112834 24528490 20600426 -193581
9211a93581j3734752p984194o695482J1749346L7007644K8573514j4113559l8632676
$$ -193581 -13928333 -21912527 -28608009 -16858663 20148981 48722495 34608936 -4023740
9203d023740j5676803J9999788K6808283J0877535j619010p240282j2176872r673818
$$ -4023740 -19700543 299245 27107528 37985063 36366053 29125771 16948899 7275081
9195G275081J251849K758465j0805551j6180391N22938J7252591J2867905J224875
$$ 7275081 8526930 11285395 479844 -15700547 -15177609 2074982 14942887 16167762
9187A6167762O24648o07721j4931122k0901993J964799K6427815J1290532l1103327
$$ 16167762 16792410 16184689 1253567 -19648426 -17683627 8744188 20034720 -11068607
9179a1068607m7482172k0374385J1244872J2868446k577214n101819R213809K2349805
$$ -11068607 -58550779 -78925164 -67680292 -54811846 -57389060 -62490879 -53277070 -30927265
9171c0927265K2414354J2104474n94916r422367j1964150r346723k600397P896597
$$ -30927265 -8512911 3591563 2996647 -6425720 -18389870 -27736593 -30336990 -22440393
9163b2440393J6971952J6281034O599518n48199N86914K832328J313436J154864
$$ -22440393 -5468441 10812593 17412111 16863912 17450826 20283154 21596590 22751454
9155B2751454K489622l685693j3810212q034581J5207394K4734717R08070k7640787
$$ 22751454 25241076 21555383 7745171 -289410 14917984 39652701 40560771 12919984
9147A2919984k2875302M428120J2371930o579279j8579174n617512J0930767J1906494
$$ 12919984 -9955318 -5527198 6844732 265453 -18313721 -23931233 -13000466 -1093972
9139a093972Q446675J2898054J2610169n796061k7858697k9592596j1255742O487972
$$ -1093972 7352703 20250757 32860926 27064865 -793832 -30386428 -41642170 -35154198
9131c5154198J1499798Q694745N542967M298097O558635J2901145J7264013J1468455
$$ -35154198 -23654400 -14959655 -9416688 -5118591 1440044 14341189 31605202 43073657
9123D3073657k190445j0445473n562650L247851K102320o764916p390618M326495
$$ 43073657 40883212 30437739 24875089 28122940 30225260 23460344 16069726 20396221
9115B0396221J0762061j811965j9875618k1053796o596003M865598Q441481J1924029
$$ 20396221 31158282 29346317 9470699 -11583097 -18179100 -13313502 -4872021 7052008
9107G052008Q511999j5707967m4095776l7672287N389926L5851093K0771165r775238
$$ 7052008 15564007 -143960 -44239736 -81912023 -76522097 -40671004 -19899839 -29675077
9099b9675077j1424093J0633745K1156846J2289850K813048j148456o041526n702785
$$ -29675077 -41099170 -30465425 -9308579 2981271 5794319 4645863 -1395663 -7098448
9091g098448O917717J5515699L612418j1641462n912198P334107R5494j6750879
$$ -7098448 -180731 15334968 18947386 7305924 1393726 8727833 8823327 -7927552
9083g927552j1589976P428036M112816j8457286k0474772K778628J2872862J371974
$$ -7927552 -19517528 -12089492 -7976676 -26433962 -46908734 -44130106 -31257244 -29885270
9075b9885270O097495L3817570L3072353j9518029o4924959m2676028J9059972
$$ -29885270 -23787775 10029795 43102148 23584119 -41340840 -84016868 -64956896
9068f4956896M7510887K6396879n31491m240563L670715P845270O277420l404414
$$ -64956896 -17446009 8950870 8419379 4178816 7849531 15694801 21972221 18567807
9060A8567807j7883319j6276248J1746795L6569264K3640901j1436734k1846859
$$ 18567807 684488 -15591760 -3844965 32724299 56365200 44928466 23081607
9053B3081607J522276K0424217R563883j2410018j9783893j3439881n764599M82083
$$ 23081607 24603883 45028100 54591983 42181965 22398072 8958191 3193592 3675675
9045C675675N276337M348317m30618n71675L071145Q12833o006853m737437N328596
$$ 3675675 8952012 13300329 12869711 12298036 15369181 16182014 10175161 5437724 10766320
9036A0766320R716486L701390n65375J462684k800825j7405362k3500940o321980
$$ 10766320 20482806 24184196 23618821 25081505 22280680 4875318 -18625622 -24947602
9028b4947602J8974432K5773826J0771932n552626p843383j228515J059937n160536
$$ -24947602 -5973170 19800656 30572588 25019962 17176579 15948064 17008001 11847465
9020A1847465j2775229j3759833q896336n234859l576334N012007K3627256L6992772
$$ 11847465 -927764 -14687597 -23583933 -28818792 -32395126 -27383119 -3755863 33236909
9012C3236909K6685829l295374k8839886l3514070k2026176o596763N443391Q638470
$$ 33236909 59922738 56627364 27787478 -5726592 -27752768 -34349531 -28906140 -20267670
9004b0267670L5207j1286851r203809P724977K1626093J9292810Q313969J489257
$$ -20267670 -20232463 -31519314 -40723123 -32998146 -11372053 7920757 16234726 17723983
8996A7723983j263612m511339l800015M546653R751407M8227j5310907j5494936
$$ 17723983 16460371 11949032 8149017 12695670 22447077 22495304 7184397 -8310539
8988h310539J038978J2553467N086399q025970p041161M614782N028324j4518473
$$ -8310539 -7271561 5281906 10368305 2342335 -4698826 -84044 4944280 -9574193
8980i574193l4672386k9950324r7470K7695254K8916742Q739254n964246J019680
$$ -9574193 -44246579 -74196903 -74294373 -46599119 -17682377 -8943123 -14907369 -13887689
8972a3887689J8614168K5992533J8424182Q309419N236186N292329R58604p609533
$$ -13887689 4726479 30719012 49143194 57452613 62688799 67981128 68939732 61330199
8964F1330199j5779394k2221223k6655080k3745797q013198J4532594K7511063
$$ 61330199 45550805 23329582 -3325498 -27071295 -35084493 -20551899 6959164
8957F959164K1364048M959063m863856k432133L471424L581866j512919o045358
$$ 6959164 28323212 33282275 28418419 25986286 29457710 33039576 31526657 25481299
8949B5481299p564736p093902n160124k009610P61864K526843N376805R825514
$$ 25481299 17916563 10822661 5662537 3652927 4414791 6941634 12318439 22143953
8941B2143953J0933778L444139r976336k0057682k0629771j3453047l834120L934829
$$ 22143953 33077731 36521870 26545534 6487852 -14141919 -27594966 -31429086 -27494257
8933b7494257O296327J350235o512894p036631N498084K3119505K9793602J7305701
$$ -27494257 -21197930 -19847695 -26360589 -33397220 -27899136 -4779631 25013971 42319672
8925D2319672o504449k5230744k7128405j1598616J2378866L1353858L4663928
$$ 42319672 35815223 10584479 -16543926 -28142542 -15763676 15590182 50254110
8918E0254110K1740645K316848j2688501j9078315j7150278p512396M624508O819209
$$ 50254110 71994755 74311603 61623102 42544787 25394509 17882113 22506621 29325830
8910B9325830o905482k1291752j3728524J3312785K9246224J3824267j5359990
$$ 29325830 22420348 1128596 -12599928 712857 29959081 43783348 28423358
8903B8423358k6760075j4344030K784077J0333290R329699L472501l259544o98647
$$ 28423358 1663283 -12680747 -9896670 436620 9766319 13238820 9979276 9280629
8895I280629J3975694K0655000N6342k8819064k6898335N053273K1682213J899841
$$ 9280629 23256323 43911323 43967665 15148601 -11749734 -6696461 14985752 16885593
8887A6885593j7185048j765801K0764022O861198k7307323k7083164J4386776
$$ 16885593 -299455 -2065256 18698766 25559964 -1747359 -28830523 -14443747
8880a4443747M4709859L1102528J250629r217444o188515j0424573j7018457j0845032
$$ -14443747 30266112 61368640 62619269 53401825 47213310 36788737 19770280 8925248
8872H925248K004819O197348K856061j48307o181943j5817077j4049174L191149
$$ 8925248 10930067 17127415 19983476 19835169 13653226 -2163851 -16213025 -13021876
8864a3021876R559969j3686608l7610200k1207963K3560055M4025677K1846259
$$ -13021876 -3461907 -17148515 -54758715 -75966678 -52406623 -8380946 13465313
8857A3465313o604200j0194390j111242Q14630K189846J2140493J7068468N599780
$$ 13465313 6861113 -3333277 -4444519 -3629889 -1440043 10700450 27768918 33368698
8849C3368698p086996n619085j447775p207979q484738P551788J8426613n70771
$$ 33368698 26281702 20662617 19214842 12006863 3522125 11073913 29500526 28929755
8841B8929755k7899725k4264226K383065R393818p328225p251647K0099746L1458731
$$ 28929755 1030030 -23234196 -20851131 -11457313 -18785538 -26037185 -5937439 25521292
8833B5521292L316094k4073348j2021227J2588518N169759j9965057j6370755
$$ 25521292 28837386 4764038 -7257189 5331329 10501088 -9463969 -25834724
8826b5834724J3261563K3380888N701222P08736K1134388K4407502j3616520m9350376
$$ -25834724 -12573161 10807727 16508949 17217685 38352073 62759575 49143055 -207321
8818b07321l4821657P357776J9048433n910503j9535767J194128K2217953J0416361
$$ -207321 -35028978 -27671202 -8622769 -14533272 -34069039 -32874911 -10656958 -240597
8810b40597j6326730k0654558j144920J2454670O690046j577171K207159Q348667
$$ -240597 -16567327 -37221885 -38366805 -25912135 -19222089 -20799260 -18592101 -10243434
8802a0243434K089313j2419436j9746618j4458185k528105J0861884K1715615
$$ -10243434 -8154121 -20573557 -40320175 -54778360 -57306465 -46444581 -24728966
8795b4728966K1686884Q363034k439485N896707K0817255J1362004k4187340m6858306
$$ -24728966 -3042082 5320952 2881467 8778174 29595429 40957433 16770093 -30088213
8787c0088213k9185569M541056J4493802K908304L323322K2553238L0458994R762722
$$ -30088213 -59273782 -54732726 -40238924 -37330620 -34007298 -11454060 19004934 28767656
8779B8767656j7786044k5299777j3372203L468558J8334493K5167023J2522134
$$ 28767656 10981612 -14318165 -27690368 -24221810 -5887317 19279706 31801840
8772C1801840j7011548l7230371k6590344M741812K9816528L5078574K3650340
$$ 31801840 14790292 -22440079 -49030423 -44288611 -14472083 20606491 44256831
8765D4256831L410145j3081525j1039166O801777J5210902j337875k3973819k5904559
$$ 44256831 47666976 34585451 23546285 30348062 45558964 44221089 20247270 -5657289
8757e657289j0745069j794003m078971l653502J844037N33299o864163n397191
$$ -5657289 -16402358 -18196361 -22275332 -25928834 -24084797 -23551498 -30415661 -35812852
8749c5812852N488668P725370m278262j2312620l699083R458261J1976962Q031360
$$ -35812852 -30324184 -22598814 -26877076 -39189696 -42888779 -33430518 -21453556 -13422196
8741a3422196Q967686J3925732J5287203J0907825M56360j7044138l1514073k2965946
$$ -13422196 -4454510 9471222 24758425 35666250 36122610 19078472 -12435601 -35401547
8733c5401547J1141152M2430546M1698537J3376240j4272763k3490401j6516606
$$ -35401547 -24260395 18170151 59868688 73244928 58972165 35481764 18965158
8726A8965158j711368J0856547Q259414j0089398k1946652q716302J2606948R438757
$$ 18965158 17253790 28110337 36369751 26280353 4333701 -4382601 8224347 17663104
8718A7663104j6364712k8435055j0595590J0562119J0753617L460892Q005868
$$ 17663104 1298392 -27136663 -37732253 -27170134 -16416517 -12955625 -4949757
8711d949757J1434782n391014k5429189j8799170L433225K391329k3193540l0092016
$$ -4949757 6485025 1094011 -24335178 -43134348 -39701123 -37309794 -60503334 -90595350
8703i0595350O36825L1284848K5293137J24737o915086M370378R075884L950699
$$ -90595350 -89958525 -58673677 -33380540 -33255803 -40170889 -35800511 -26724627 -22773928
8695b2773928M284504Q254786K356540o102650L94886J1464402O61536k4772434
$$ -22773928 -18489424 -10234638 -7878098 -13980748 -13585862 -2121460 -1459924 -26232358
8687b6232358k7461093J11820K0826281J2153768l99825Q776477K1122789Q323825
$$ -26232358 -53693451 -53581631 -32755350 -20601582 -21001407 -12224930 8897859 17221684
8679A7221684j7893527k5469486j1758396J245375P506245J7655020K6905734
$$ 17221684 -671843 -26141329 -37899725 -36654350 -29148105 -11493085 15412649
8672A5412649J7184660q499395k3799215j5593734J224709R887487J0890639R580881
$$ 15412649 32597309 24097914 298699 -15295035 -14070326 -4182839 6707800 16288681
8664A6288681M780862j967268j859513P287600J3992454P825305o756789j6876536
$$ 16288681 21069543 19102275 17242762 24530362 38522816 46348121 39591332 22714796
8656B2714796j5467998n384349N676652J1304972R907022L624607m761536j0381120
$$ 22714796 7246798 1862449 7539101 18844073 28751095 32375702 27614166 17233046
8648A7233046n180509J1236241K1301810O664052k1556362l0463452j1242715
$$ 17233046 12052537 23288778 44590588 51254640 29698278 -765174 -12007889
8641a2007889O700832J683336o777317N905441K4537504J8790558m610130j2589307
$$ -12007889 -5307057 -3623721 -10401038 -4495597 20041907 38832465 34222335 21633028
8633B1633028L35180P896859m20328o342746j059899l6470j0768705j8209257
$$ 21633028 21968208 29865067 29444739 23101993 22042094 22005624 11236919 -6972338
8625f972338j3299200o937023m666666M148555K0126679K5133800J3421158M072050
$$ -6972338 -20271538 -27208561 -31875227 -27726672 -7599993 17533807 30954965 35027015
8617C5027015P330627O337807r400740k0076571q557776O747968m78515k1706334
$$ 35027015 42357642 48695449 39294709 19218138 10660362 17408330 16929815 -4776519
8609d776519k6611354p478637J5021983K2788476J4940499j752412j6810086j6289457
$$ -4776519 -31387873 -38866510 -23844527 -1056051 13884448 12132036 -4678050 -20967507
8601b0967507J903266J7980775J3138118k991300o111093N952284J0979521k121093
$$ -20967507 -19064241 -1083466 12054652 9063352 2952259 8904543 19884064 17762971
8593A7762971j5259396p147662J5181787K3580455O091343j3957971o281723K1750998
$$ 17762971 2503575 -4644087 10537700 34118155 40209498 26251527 19969804 41720802
8585D1720802K7427372r163861m8732995m0426019O385203L3417774J4434322
$$ 41720802 69148174 59984313 11251318 -29174701 -22789498 10628276 25062598
8578B5062598j5470532k0004938r115657o315498p102942Q15870O793484p73468
$$ 25062598 9592066 -10412872 -19528529 -25844027 -32946969 -32131099 -25337615 -26111083
8570b6111083o719736M171549J5501121P670377m305681K257604J4414874P985650
$$ -26111083 -32830819 -28659270 -13158149 -5487772 -9793453 -7535849 6879025 14864675
8562A4864675m597232K338582J2820636p432284m0697207l1865913K0281097M8114776
$$ 14864675 10267443 12606025 25426661 17994377 -22702830 -54568743 -34287646 13827130
8554A3827130J3078176l6006813l5859668L355226K3888263N399723j8100403
$$ 13827130 26905306 -9101507 -44961175 -41605949 -17717686 -12317963 -30418366
8547c0418366j3357904J4445717L5989779K8243365n945234l6007963l0020220
$$ -30418366 -43776270 -29330553 6659226 34902591 28957357 -7050606 -37070826
8540c7070826P284728L5982569K9902008O295663o061390p334796j4657325k6522589
$$ -37070826 -29786098 6196471 36098479 42394142 36332752 28997956 14340631 -12181958
8532a2181958k4740053m891834J6587481K3449042J3211031o153438k1000666
$$ -12181958 -36922011 -41813845 -25226364 -1777322 11433709 5280271 -15720395
8525a5720395j9065077k881025R611472O779054k299641l207544M564216J2667679
$$ -15720395 -34785472 -37666497 -28055025 -21275971 -23575612 -26783156 -22218940 -9551261
8517i551261J6107819J0766147p091170k7184758k6899521j685786K1307930J7235787
$$ -9551261 6556558 17322705 10231535 -16953223 -43852744 -45538530 -24230600 -6994813
8509f994813l113513j2682078o403602J382388M361003M841391j644231j6105854
$$ -6994813 -10108326 -22790404 -29194006 -27811618 -23450615 -18609224 -20253455 -36359309
8501c6359309k0059952J765172K9754918L0894590P830744n599432L118962J1299511
$$ -36359309 -56419261 -54654089 -24899171 5995419 13826163 8226731 11345693 22645204
8493B2645204L626561o052473n220875k673385m653211p34398J0966339J2564358
$$ 22645204 26271765 20219292 14998417 12325032 7671821 6937423 17903762 30468120
8485C0468120k062876j1250663m86782J2445039Q574953j922504m804503j0337304
$$ 30468120 28405244 17154581 16667799 29112838 37687791 35765287 30960784 20623480
8477B0623480k6500590k9257061J941018L8386268L5685022J505272j6349360
$$ 20623480 -5877110 -35134171 -33193153 5193115 40878137 42383409 26034049
8470B6034049m504499K707016j1630034j9762403l193194J3057932N922370n547078
$$ 26034049 21529550 24236566 12606532 -7155871 -10349065 2708867 8631237 3084159
8462C084159K741684J4992376M063611j9105075k3153263p670102J080353l444739
$$ 3084159 5825843 20818219 24881830 5776755 -17376508 -25046610 -23966257 -27410996
8454b7410996l147242N993446N671489r744862j9729059q164282J4249782K6250545
$$ -27410996 -30558238 -24564792 -18893303 -28638165 -48367224 -56531506 -42281724 -16031179
8446a6031179J9105605l34115j6325100j4476392J910957J1515672N372668M160978
$$ -16031179 3074426 2740311 -13584789 -28061181 -26150224 -14634552 -9261884 -5100906
8438e100906K2163350L1801563K471808l7219163k8076966K6190907N2135509
$$ -5100906 17062444 48864007 51335815 14116652 -13960314 12230593 64366102
8431F4366102J2926737l5552121l1073719L644432P907215j7505935k1976266
$$ 64366102 77292839 41740718 10666999 14311431 22218646 4712711 -17263555
8424a7263555L789073J5638780n384000k3691762j1691744J0031012J5438233
$$ -17263555 -13474482 2164298 -3219702 -26911464 -38603208 -28572196 -13133963
8417a3133963J2569661J5526347J3244819m932505k0561077j2922283N913076
$$ -13133963 -564302 14962045 28206864 23274359 2713282 -10209001 -4295925
8410d295925J1044783L498531J304900M488554k117063j7163764k0930364n611781
$$ -4295925 6748858 10247389 11552289 16040843 13923780 -3239984 -24170348 -29782129
8402b9782129J3401677J8578496P149483j2616393k7284786k1925301N590023
$$ -29782129 -16380452 2198044 9347527 -3268866 -30553652 -52478953 -46888930
8395d6888930L2918010L1957707L103160k3030090k2667059m136845J0542594
$$ -46888930 -13970920 17986787 21089947 -1940143 -24607202 -28744047 -18201453
8388a8201453J5382271J8751881K0770980J0335573j3188806l0371006k4271051
$$ -18201453 -2819182 15932699 36703679 47039252 33850446 3479440 -20791611
8381b0791611m812888L142082n316202q143457R617137L0736039K9809464J1221251
$$ -20791611 -25604499 -22462417 -27778619 -35922076 -26304939 4431100 34240564 45461815
8373D5461815J669729Q552290J0390281o318574k4284665k2003758m457768Q698761
$$ 45461815 47131544 55683834 66074115 59755541 35470876 13467118 9009350 17708111
8365A7708111J1225685R160561L141253q842352j8602227j6811110r951219r797522
$$ 17708111 28933796 38094357 41235610 32393258 13791031 -3020079 -12971298 -22768820
8357b2768820j0679476J841365K1539120K4316871M424404j4529177j3492423
$$ -22768820 -33448296 -31606931 -10067811 14249060 18673464 4144287 -9348136
8350i348136k820960p73831m812813j462761P490659Q315314n72818o416240l990015
$$ -9348136 -12169096 -12942927 -17755740 -19218501 -11727842 -3412528 -3985346 -10401586 -14391601
8341a4391601l326503j0828422j5404216k787733K1884962L5341559K1693890
$$ -14391601 -17718104 -28546526 -43950742 -46738475 -24853513 10488046 32181936
8334C2181936q049873k6220470j7752872N300860K0441343J9731178J1391936
$$ 32181936 24132063 -2088407 -19841279 -14540419 5900924 25632102 37024038
8327C7024038J988720r988578k2302425k5046761j5105515l495358l86972k337405
$$ 37024038 39012758 29024180 6721755 -18325006 -33430521 -36925879 -37312851 -39650256
8319c9650256k284351j156997R82604J2930056L5349784M5970712K3157973j9815900
$$ -39650256 -41934607 -43091604 -42109000 -29178944 6170840 52141552 75299525 55483625
8311E5483625m5996306l9889439j9561386l082574J0478138J9738519J0662273
$$ 55483625 9487319 -30402120 -49963506 -53046080 -42567942 -22829423 -12167150
8304a2167150j4355906k2666904O823553M5360081M7740755J3934590j4110636
$$ -12167150 -26523056 -49189960 -42366407 2993674 50734429 64669019 50558383
8297E0558383j3549488n152306j1348033k1704653j6239895M18614Q849992M754387
$$ 50558383 37008895 31856589 20508556 -1196097 -17435992 -17017378 -8167386 -3412999
8289c412999n21395j279812j602075j979461K372184R436340R242571j640627
$$ -3412999 -3934394 -5214206 -6816281 -8795742 -6423558 3012782 12255353 10614726
8281A0614726j2717131j1739261p85269M752705n215738k0241321j8258349P405439
$$ 10614726 -2102405 -13841666 -14626935 -9874230 -15089968 -35331289 -53589638 -46184199
8273d6184199L5670529L9503444J6723367r533167j9388514j5591000j3397854
$$ -46184199 -10513670 28989774 45713141 36179974 16791460 1200460 -12197394
8266a2197394j9594850k5083457j5728957Q667605K7061890J8932768l705643
$$ -12197394 -31792244 -56875701 -72604658 -63937053 -36875163 -17942395 -21648038
8259b1648038m524514K4413915M0992554J0099696l7862353m4595214q657542
$$ -21648038 -26172552 -1758637 39233917 49333613 11471260 -33123954 -41781496
8252d1781496J5507573L545193p825720R025864K5693353J1925145r967961o411786
$$ -41781496 -26273923 -22728730 -30554450 -21528586 4164767 16089912 6121951 -289835
8244b89835Q610858L074248j2928635p395034J2604139J3058161m474162n809786
$$ -289835 8321023 11395271 -1533364 -8928398 3675741 16733902 12259740 6449954
8236F449954J2190071J3051918j6211459m0273915k9486711p60670J3824477R598016
$$ 6449954 18640025 31691943 15480484 -24793431 -54280142 -55040812 -41216335 -31618319
8228c1618319K751868L754667J1998249K0529681J8100659J328738j4229731j2594990
$$ -31618319 -28866451 -25111784 -13113535 7416146 25516805 26845543 12615812 20822
8220B0822k951531m503686j2373566p028034Q278880J3109052Q710770J3164091
$$ 20822 -2930709 -7434395 -19807961 -26835995 -18557115 -5448063 3262707 16426798
8212A6426798J9574965K917675k7797664l1844330k132668J9907616J1592435
$$ 16426798 36001763 38919438 11121774 -20722556 -22855224 -2947608 8644827
8205H644827K451839J6528115K8798780J1936634j4524559j8904037p690939m436795
$$ 8644827 11096666 27624781 56423561 68360195 53835636 34931599 27240660 22803865
8197B2803865p521195m651662k978156j0428333j2578156q21302M141407r309439
$$ 22803865 15282670 10631008 7652852 -2775481 -15353637 -16174939 -12033532 -21342971
8189b1342971j3231906J2367066L3456567J1235603k9606152l4997024l263918
$$ -21342971 -34574877 -22207811 11248756 22484359 -7121793 -42118817 -45382735
8182d5382735K2087164K4707686K2511689J5066200j2586470l7759952j8648898
$$ -45382735 -23295571 1412115 23923804 38990004 26403534 -11356418 -30005316
8175c0005316K8496891L7352817o426326l6155724o087343L7537795K9761301
$$ -30005316 -1508425 35844392 29418066 -6737658 -12825001 24712794 54474095
8168E4474095j6644827l9469019k0587361K035048J245446q969742r294724k565267
$$ 54474095 37829268 -1639751 -22227112 -20192064 -18946618 -27916360 -37211084 -39776351
8160c9776351J981869M835662P022065K884585q620086j6668424j0967177L950779
$$ -39776351 -37794482 -32958820 -25936755 -23052170 -31672256 -48340680 -59307857 -55357078
8152e5357078J3068974Q608694m90158N19700J3124266K3114998J9183617O468960
$$ -55357078 -42288104 -33679410 -34169568 -33649868 -20525602 2589396 21773013 28241973
$$ [...]
##END NTUPLES=NMR SPECTRUM
##END=
