##TITLE=31Pdec_SR36_oil3
 CDCl3, 24 sc
 14.05.2021
##JCAMPDX= 6.0         $$ Bruker NMR JCAMP-DX V2.0
##DATA TYPE= NMR SPECTRUM
##DATA CLASS= NTUPLES
##ORIGIN= UXNMR, Bruker Analytische Messtechnik GmbH
##OWNER= root
$$ XWIN-NMR		Version 3.5
$$ Fri May 14 10:16:30 2021 Russian Standard Time (UT+4h)  she@DPX200
##.OBSERVE FREQUENCY= 81.013821
##.OBSERVE NUCLEUS= ^31P
##.ACQUISITION MODE= SIMULTANEOUS
##.ACQUISITION SCHEME= undefined
##.AVERAGES= 24
##.DIGITISER RES= 16
##SPECTROMETER/DATA SYSTEM= spect
##.PULSE SEQUENCE= zgpg30
##.SOLVENT NAME= CDCl3
##.SHIFT REFERENCE= (INTERNAL, CDCl3, 0, 248.564)
##AUDIT TRAIL= $$ (NUMBER, WHEN, WHO, WHERE, WHAT)
$$ ##TITLE= Audit trail, XWIN-NMR		Version 3.5
$$ ##JCAMPDX= 5.01
$$ ##ORIGIN= Bruker BioSpin GmbH
$$ ##OWNER= she
$$ F:/spectra/data/she/nmr/P31/1/pdata/1/auditp.txt
$$ ##AUDIT TRAIL=  $$ (NUMBER, WHEN, WHO, WHERE, WHAT)
(   1,<2021-05-14 10:14:59.07 +0400>,<she>,<DPX200>,
      <created by zg, POWCHK disabled, PULCHK disabled
       configuration hash MD5:
       00 E9 B6 7A A2 85 ED C7 34 08 36 98 17 FE 4E 26
       data hash MD5: 32K
       F9 AC D0 8D FE 44 18 71 E8 97 A8 DE A2 71 CF 09>)
(   2,<2021-05-14 10:15:01.17 +0400>,<she>,<DPX200>,
      <Start of raw data processing
       efp BC_mod = 2 LB = 1 FT_mod = 6 PKNL = 1 PHC0 = -6635.363 PHC1 = 154.4005 SI = 64K 
       data hash MD5: 64K
       53 51 64 5B 2B 7F 5D BD C3 EA 0A A7 4F 73 51 DA>)
(   3,<2021-05-14 10:15:26.28 +0400>,<she>,<DPX200>,
      <pk PHC0 = 120.0689 PHC1 = -245.2 
       data hash MD5: 64K
       F9 0A 27 78 12 11 6B EF 20 90 8D 20 6B AC 09 B3>)
(   4,<2021-05-14 10:15:29.32 +0400>,<she>,<DPX200>,
      <abs ABSG = 5 
       data hash MD5: 64K
       A5 E4 D0 EB 8F 89 3D 27 74 D0 F2 D3 9A 17 D9 1B>)
$$ ##END=
$$ 
$$ hash MD5
$$ 74 D1 5D C7 04 E6 ED C7 74 B4 6A F8 03 CD 94 41
##$RELAX= 
##$RELAX= 
##$RELAX= 
##$RELAX= 
##$RELAX= 
##$RELAX= 
##$RELAX= 
##$RELAX= 
$$ Bruker specific parameters
$$ --------------------------
##$DU= <F:/spectra>
##$EXPNO= 1
##$NAME= <P31>
##$PROCNO= 1
##$TYPE= <nmr>
##$USER= <she>
##$AMP= (0..31)
100 100 100 100 100 100 100 100 100 100 100 100 100 100 100 100 100 100 
100 100 100 100 100 100 100 100 100 100 100 100 100 100 
##$AQSEQ= 0
##$AQ_mod= 1
##$AUNM= <au_zg>
##$AUTOPOS= <>
##$BF1= 81.014009
##$BF2= 200.13
##$BF3= 200.13
##$BF4= 200.13
##$BF5= 200.13
##$BF6= 200.13
##$BF7= 200.13
##$BF8= 200.13
##$BYTORDA= 1
##$CFDGTYP= 0
##$CFRGTYP= 5
##$CHEMSTR= <none>
##$CNST= (0..31)
1 1 145 1 1 1 1 1 1 1 1 1 1 1 1 1 1 1 1 1 1 1 1 1 1 1 1 1 1 1 1 1 
##$CPDPRG= <waltz16>
##$CPDPRG1= <>
##$CPDPRG2= <waltz16>
##$CPDPRG3= <>
##$CPDPRG4= <mlev>
##$CPDPRG5= <mlev>
##$CPDPRG6= <mlev>
##$CPDPRG7= <mlev>
##$CPDPRG8= <mlev>
##$CPDPRGB= <>
##$CPDPRGT= <>
##$D= (0..31)
0 1 0 0 0 0 0 0 0 0 0 0.03 2e-05 3e-06 0 0 0 0 0 0 0 0 0 0 0 0 0 0 0 0 
0 0 
##$DATE= 1620972898
##$DBL= (0..7)
120 120 120 11 120 120 24 19 
##$DBP= (0..7)
150 150 150 150 150 150 150 150 
##$DBP07= 0
##$DBPNAM0= <>
##$DBPNAM1= <>
##$DBPNAM2= <>
$$ [...]
##$SUBNAM3= <"">
##$SUBNAM4= <"">
##$SUBNAM5= <"">
##$SUBNAM6= <"">
##$SUBNAM7= <"">
##$SUBNAM8= <"">
##$SUBNAM9= <"">
##$SW= 501.771253377433
##$SWIBOX= (0..15)
0 1 3 0 0 0 0 0 0 0 0 0 0 0 0 0 
##$SW_h= 40650.406504065
##$TD= 32768
##$TD0= 1
##$TE= 0
##$TE2= 300
##$TE3= 300
##$TEG= 300
##$TL= (0..7)
0 120 53 12 22 120 120 120 
##$TP= (0..7)
150 150 150 150 150 150 150 150 
##$TP07= 0
##$TPNAME0= <>
##$TPNAME1= <>
##$TPNAME2= <>
##$TPNAME3= <>
##$TPNAME4= <>
##$TPNAME5= <>
##$TPNAME6= <>
##$TPNAME7= <>
##$TPOAL= (0..7)
0.5 0.5 0.5 0.5 0.5 0.5 0.5 0.5 
##$TPOFFS= (0..7)
0 0 0 0 0 0 0 0 
##$TUNHIN= 0
##$TUNHOUT= 0
##$TUNXOUT= 0
##$USERA1= <user>
##$USERA2= <user>
##$USERA3= <user>
##$USERA4= <user>
##$USERA5= <user>
##$V9= 5
##$VALIST= <valist>
##$VCLIST= <CCCCCCCCCCCCCCC>
##$VD= 0
##$VDLIST= <DDDDDDDDDDDDDDD>
##$VPLIST= <PPPPPPPPPPPPPPP>
##$VTLIST= <TTTTTTTTTTTTTTT>
##$WBST= 1024
##$WBSW= 4
##$XGAIN= (0..3)
0 0 0 0 
##$XL= 0
##$YL= 0
##$YMAX_a= 5058
##$YMIN_a= -5028
##$ZGOPTNS= <>
##$ZL1= 120
##$ZL2= 120
##$ZL3= 120
##$ZL4= 120
##$ABSF1= 248.5645
##$ABSF2= -253.2056
##$ABSG= 5
##$ABSL= 3
##$ALPHA= 0
##$AQORDER= 0
##$ASSFAC= 0
##$ASSFACI= 0
##$ASSFACX= 0
##$ASSWID= 0
##$AUNMP= <proc_1d>
##$AZFE= 0.1
##$AZFW= 0.5
##$BCFW= 0
##$BC_mod= 2
##$BYTORDP= 0
##$COROFFS= 0
##$CY= -3
##$DATMOD= 1
##$DC= 0
##$DFILT= <>
##$DTYPP= 0
##$F1P= 0
##$F2P= 0
##$FCOR= 1
##$FTSIZE= 65536
##$FT_mod= 6
##$GAMMA= 0
##$GB= 0
##$INTBC= 1
##$INTSCL= 5.30512e-09
##$ISEN= 30
##$LB= 1
##$LEV0= 0
##$LPBIN= 0
##$MAXI= 10000
##$MC2= 0
##$MEAN= 0
##$ME_mod= 0
##$MI= 50
##$NCOEF= 0
##$NC_proc= -7
##$NLEV= 6
##$NOISF1= 182.463
##$NOISF2= 159.3651
##$NSP= 0
##$NTH_PI= 0
##$NZP= 0
##$OFFSET= 248.5645
##$PC= 4
##$PHC0= -6515.294
##$PHC1= -90.7995
##$PH_mod= 1
##$PKNL= yes
##$PPARMOD= 0
##$PSCAL= 0
##$PSIGN= 0
##$REVERSE= no
##$SF= 81.014009
##$SI= 65536
##$SIGF1= 159.3651
##$SIGF2= -187.1042
##$SINO= 113.3802
##$SIOLD= 16384
##$SREGLST= <1H.CDCl3>
##$SSB= 0
##$STSI= 65536
##$STSR= 0
##$SW_p= 40650.406504065
##$SYMM= 0
##$S_DEV= 0
##$TDeff= 32768
##$TDoff= 0
##$TI= <>
##$TILT= no
##$TM1= 0
##$TM2= 0
##$TOPLEV= 0
##$USERP1= <user>
##$USERP2= <user>
##$USERP3= <user>
##$USERP4= <user>
##$USERP5= <user>
##$WDW= 1
##$XDIM= 65536
##$YMAX_p= 347251227
##$YMIN_p= -22802679
$$ End of Bruker specific parameters
$$ ---------------------------------
##NTUPLES= NMR SPECTRUM
##VAR_NAME=  FREQUENCY,     SPECTRUM/REAL,   SPECTRUM/IMAG
##SYMBOL=    X,             R,               I
##VAR_TYPE=  INDEPENDENT,   DEPENDENT,       DEPENDENT
##VAR_FORM=  AFFN,          ASDF,            ASDF
##VAR_DIM=   65536,         65536,           65536
##UNITS=     HZ,            ARBITRARY UNITS, ARBITRARY UNITS
##FACTOR=    0.620285442955139, 1,           1
##FIRST=     20137.2065510759, 0,            0
##LAST=      -20513.1999529892, 0,           0
##MIN=       -20513.1999529892, -22802679,   0
##MAX=       20137.2065510759, 347251227,    0
$$ Real data points
##PAGE= N=1
##DATA TABLE= (X++(R..R)), XYDATA
$$ [...]
13018a66077l481636O23496K666563L63425j46921L992367O086015J270251m223890
$$ -166077 -3647713 -3024217 -357654 5771 -141150 3851217 9937232 11207483 6983593
13009F983593k910653J600315J145565l017578k975897J680067L230687n78103
$$ 6983593 4072940 5673255 6818820 3801242 825345 2505412 5736099 5157996
13001E157996k837184J15675K361414p12654l751044o56312M198215K730039l094775
$$ 5157996 2320812 2436487 4797901 4085247 334203 -322109 3876106 6606145 3511370
12992C511370m047349J265093M069776m10397n670415m575479L90953K833127
$$ 3511370 -535979 729114 4798890 4388493 -1281922 -5857401 -5466448 -2633321
12984b633321K259901J863266J124534k185428n457650m027214P32600K996534
$$ -2633321 -373420 1489846 2614380 428952 -5028698 -9055912 -8323312 -5326778
12976e326778J772354J703329M035656L933318q49499m972428l060878K292131
$$ -5326778 -3554424 -1851095 2184561 6117879 5268380 295952 -2764926 -472795
12968d72795M241867N59098m652825o121238j870680N449834R854775O929707
$$ -472795 3769072 4328170 -324655 -6445893 -8316573 -2866739 6988036 13917743
12960A3917743q90380o311258n588692j932457L88349J010713O73198j579709
$$ 13917743 13027363 6716105 1127413 -805044 -416695 594018 1267216 -312493
12952c12493n024138n594085j743104J990773J661850P6851J169934K496158J4414
$$ -312493 -5336631 -10930716 -12673820 -10683047 -9021197 -8944346 -7774412 -5278254 -5263840
12943e263840l152609r05771M746991N660748N87933k652594L13505M286882L986554
$$ -5263840 -8416449 -9322220 -4575229 1085519 1673452 -979142 -665637 3621245 7607799
12934G607799J678293Q85634k11454l330547m377787j96716L913784J295547m863440
$$ 7607799 9286092 10171726 9960272 6629725 2251938 2055222 5969006 7264553 2401113
12925B401113n778375n95972L044380J620073o8265J173451J541033j667926m311409
$$ 2401113 -3377262 -3973234 -928854 691219 622954 1796405 3337438 1669512 -2641897
12916b641897k835737r15944k539807l982404n5084N734650N672654K60782k589693
$$ -2641897 -5477634 -6393578 -8933385 -12915789 -12970873 -7236223 -1563569 -1302787 -3892480
12907c892480k43084J634341j95207j634790J8675P60679k133959m169610j494698
$$ -3892480 -4135564 -2501223 -2696430 -4331220 -4312545 -3551866 -5685825 -9855435 -11350133
12898a1350133J629329Q1074k680107l09200N172353O394533K628384q91N55162
$$ -11350133 -9720804 -9639730 -12319837 -12629037 -7456684 -1062151 1566233 1565342 2120504
12889B120504o6244l263838m111868J76229N273226O204553L406842j22731k811407
$$ 2120504 2054260 -1209578 -5321446 -5145217 128009 6332562 9739404 9616673 6805266
12880F805266l581060j747426L13335q42828l699834l070348J288918L530074
$$ 6805266 3224206 1476780 1790115 947287 -2752547 -5822895 -4533977 -1003903
12872a003903J063825j639903j193246j78987n39415N10818L557440L494736j450593
$$ -1003903 59922 -1579981 -2773227 -2952214 -3491629 -2980811 576629 4071365 2620772
12863B620772m499183q06595L756462K078703k388290k293767P70677L27498k340866
$$ 2620772 -1878411 -2685006 1071456 3150159 761869 -1531898 -761221 -433723 -2774589
12854b774589p06482M270908N058112L80428l311786l099687k262758j540293
$$ -2774589 -3481071 789837 5847949 6228377 2916591 -183096 -2445854 -3986147
12846c986147J865222N601872L218902l928495o393513j427465K399691l53474
$$ -3986147 -2120925 3480947 6699849 2771354 -3622159 -5049624 -2649933 -3003407
12838c003407l320782p0907M931244M557980N22001j175031j02482P89972J738003
$$ -3003407 -6324189 -6395096 -1463852 3094128 3616129 2441098 2338616 3128588 4866591
12829D866591L220872J676873m213714p794237l173643M376764N359870P1246
$$ 4866591 8087463 9764336 5550622 -2243615 -5417258 -1040494 4319376 4390622
12821D390622l372752k580476k604130m754428l680292K541579P778694O451436
$$ 4390622 1017870 -1562606 -4166736 -8921164 -12601456 -10059877 -2281183 4170253
12813D170253O46153m074306m936929k056000K773492N413432K330903l666768
$$ 4170253 4816406 742100 -4194829 -6250829 -3477337 1936095 4266998 600230
12805F00230n282731o49016L263923K89714n996100p091802p79379O613280Q304036
$$ 600230 -4682501 -5331517 -2067594 -1777880 -7773980 -14865782 -15645161 -9031881 -727845
12796g27845M196072m19662j485030l31005q42722l246655l429853K07805K877343
$$ -727845 3468227 3048565 1563535 1232530 389808 -2856847 -6286700 -6078895 -3201552
12787c201552L31135l430844j529814M336004N519765N5294l768566n04272L953338
$$ -3201552 -2870417 -6301261 -7831075 -3495071 2024694 2079988 -1688578 -2192850 1760488
12778A760488K439798j930006j882040J369829O40473m348759n879090n65989
$$ 1760488 4200286 2270280 388240 1758069 2398542 -1950217 -7829307 -8395296
12770h395296N269651M952484n3722l987867m303340k230151M33689K082510J581268
$$ -8395296 -3125645 1826839 1773117 -2214750 -6518090 -8748241 -8314552 -6232042 -4650774
12761d650774Q1623J26088J497877J176916j043315j081875K587558M955803J508554
$$ -4650774 -4569151 -4443063 -2945186 -1768270 -2811585 -3893460 -1305902 3649901 5158455
12752E158455m313924n829394k796932o58294j440022j537366J251968M233530
$$ 5158455 844531 -4984863 -7781795 -8440089 -9880111 -11417477 -10165509 -5931979
12744e931979M665768L254992J286808j193253k687315n11270L894188M670856
$$ -5931979 -1266211 1988781 3275589 2082336 -604979 -1116249 2777939 7448795
12736G448795k30846m987034m038871j52030O11454j548839j717326Q00938J691766
$$ 7448795 7217949 2230915 -1807956 -1959986 -1348532 -2897371 -4614697 -3813759 -2121993
12727b121993p02342l067919l010093j764457j08492L056994O464473O002647
$$ -2121993 -2824335 -5892254 -8902347 -10666804 -10775296 -7718302 -1253829 4748818
12719D748818R65687l573449l370318k80011J679990J853275J552079N68730j422791
$$ 4748818 5714505 2141056 -1229262 -1509273 170717 2023992 3576071 4144801 2722010
12710B722010k620371j616149j2180L85690O14677J862684K412922P57518q07737
$$ 2722010 101639 -1514510 -1526690 -1141000 -526323 1336361 3749283 4506801 3699064
12701C699064K77962J925921N03297k816135l592061j060447J191745J091247
$$ 3699064 3977026 5902947 6406244 3590109 -1952 -1062399 129346 1220593
12693A220593P7158p00943j753639k520494j457868O34331J251517M88582P45371
$$ 1220593 1297751 596808 -1156831 -3677325 -5135193 -4500862 -3249345 -2760763 -2015392
12684b015392J943280J502108m05473m89915J632939K162300k39344j518880J358368
$$ -2015392 -72112 1429996 1024523 534608 2167547 4329847 4090503 2571623 3929991
12675C929991N524960O691904M460255L20294n224635j0024822r283124j885937
$$ 3929991 9454951 16146855 20607110 20927404 15702769 5677947 -3605177 -5491114
12667e491114N692326O590297J922412k371728l832335l679650j988647J208622
$$ -5491114 201212 6791509 8713921 6342193 2509858 -1169792 -3158439 -1949817
12659a949817K375589j288644n499630l696384K491877M874159J079800k255907
$$ -1949817 425772 -862872 -6362502 -10058886 -7567009 -2692850 -1613050 -3868957
12651c868957l08840L295643L639729J714041N34475l30259j920981k280920l20694
$$ -3868957 -4177797 -882154 2757575 4471616 5006091 4675832 2754851 473931 153237
12642A53237O97708j716320m132213k135625K392767M012789J658548j047082
$$ 153237 850945 -865375 -4997588 -7133213 -4740446 -727657 930891 -116191
12634a16191j783989j136793M44219K614211L081902J65185l346697l303873m15283
$$ -116191 -1900180 -3036973 -2592754 21457 3103359 3268544 -78153 -3382026 -3797309
12625c797309J182151P38745J078886K323512J303442j923028k817471M08930
$$ -3797309 -2615158 -1876413 -797527 1525985 2829427 906399 -1911072 -1502142
12617a502142L587039L200003J365794J029962O32831k338821n919959o319259
$$ -1502142 2084897 5284900 6650694 7680656 8313487 5974666 54707 -6264552
12609f264552l812437j732311r96110L78958L049830N238353N723384N061816
$$ -6264552 -10076989 -11809300 -12805410 -12426452 -9376622 -4138269 1585115 6646931
12601F646931L770147J595308j254766l729810m619509k782529J979711P043343
$$ 6646931 10417078 12012386 10757620 7027810 2408301 -374228 1605483 8648826
12593H648826P985180L629793j793773l959652l742460m085535m073010r59237
$$ 8648826 16634006 20263799 18470026 14510374 10767914 6682379 2609369 1650132
12585A650132L237546L076531j765155m933879k437957J706250J967740p21191
$$ 1650132 4887678 7964209 6199054 1265175 -1172782 533468 2501208 1780017
12577A780017j583068K93861J498449K61941j439198j696953j083245o72076l32091
$$ 1780017 196949 490810 1989259 2251200 812002 -884951 -1968196 -2640272 -2972363
12568b972363K04476M97879K64575l42124j439110k821973k793191K42175M612747
$$ -2972363 -2767887 -2270008 -2005433 -2347557 -3786667 -6608640 -9401831 -9159656 -4546909
12559d546909O136741L129371j285994l167989k217033o38950N35664J530746
$$ -4546909 1589832 4719203 3433209 265220 -1951813 -2590763 -2055099 -524353
12551e24353J589001j61756j970654r93204J887734K307748q92415k794234O10949
$$ -524353 1064648 902892 -1067762 -2060966 -173232 2134516 1242101 -1552133 -941184
12542i41184N377062M226784k871107q031028o178852j372090J20687j351095
$$ -941184 4435878 8662662 5791555 -2239473 -8418325 -9790415 -9669728 -11020823
12534a1020823j050849K015498M235067L579713J845831O08483o01393j218454
$$ -11020823 -12071672 -10056174 -5821107 -2241394 -395563 212920 -388473 -1606927
12526a606927Q84548M926294O083927J683824m387117o572236m605454k256694
$$ -1606927 -722379 4203915 10287842 11971666 7584549 1012313 -3593141 -5849835
12518e849835j213446k63575P34856O65029O68971L082165O132396M679873j689665
$$ -5849835 -7063281 -7326856 -6592000 -5926971 -5258000 -2175835 3956561 8636434 6946769
12509F946769o108162l529104J652647K025116j678800k171147K440331N260974
$$ 6946769 838607 -2690497 -1037850 987266 -691534 -2862681 -422350 4838624
12501D838624J165742n226280o228447j672323K218982K336630J636644K762992
$$ 4838624 6004366 778086 -5450361 -7122684 -4903702 -2567072 -930428 1832564
12493A832564L723399J710572k127433m196231l055877n16161J013711Q15516
$$ 1832564 5555963 7266535 5139102 942871 -2113006 -2629167 -1615456 -799940
12485g99940k3881J68701J913455L482568K247998k059521n978690n319147J79543
$$ -799940 -823821 -655120 1258335 4740903 6988901 4929380 -1049310 -6368457 -6188914
12476f188914N715967N660327n58008p037392o968748o4522O765507P086357J928021
$$ -6188914 -472947 5187380 4629372 -2408020 -9376768 -9441290 -2675783 4410574 6338595
12467F338595k504376k772765j190792j232587k950875l894487k488716O19064
$$ 6338595 3834219 1061454 -129338 -1361925 -4312800 -8207287 -10696003 -10076939
12459a0076939L306665L581710J668234L40763J474225K849962J070702k791423
$$ -10076939 -6770274 -3188564 -1520330 -1179567 294658 3144620 4215322 1423899
12451A423899m182531j988424M172j55256M83110L280573L771287j196230o371361
$$ 1423899 -2758632 -4747056 -4742884 -4898140 -4415030 -1134457 2636830 1440600 -4930761
12442d930761m630259J965604M831733J704829q11657J355078L442309N82856
$$ -4930761 -9561020 -7595416 -2763683 -1058854 -1870511 -515433 2926876 3509732
12434C509732l436570j889479M019170O249844J017235o488885r208795n981423
$$ 3509732 73162 -1816317 2202853 8452697 9469932 2981047 -6227748 -12209171
12426a2209171o14233L563639N463906M439724M50674l621549l251993J886887
$$ -12209171 -12823404 -9259765 -3795859 643865 1094539 -2527010 -5779003 -3892116
12418c892116N770553L183293k364890k609582L483741P513526L830078k038668
$$ -3892116 1878437 5061730 2696840 87258 3570999 11084525 14914603 12875935
12410A2875935k215772J196339J19817n711884p769445k102516M562289N013407
$$ 12875935 10660163 11856502 11976319 6264435 -1505010 -3607526 954763 5968170
12402E968170R98701j687508j989618k298381k397565m36996K127593J830562
$$ 5968170 6966871 5279363 3289745 991364 -1406201 -1843197 284396 2114958
12394B114958j179933k976680j355874J600366K685756J096376j324414k001353
$$ 2114958 935025 -2041655 -3397529 -1797163 888593 1984969 660555 -1340798
12386a340798j10087K133455J780884p63514k024137n78233R86877O68410J36707
$$ -1340798 -1450885 682570 2463454 1699940 -324197 -902430 84447 752857 889564
12377H89564Q12883N20037k320438m410962k149903J950744K679742L88803Q5168
$$ 889564 1702447 2222484 -97954 -4508916 -6658819 -4708075 -2028333 -1639530 -1554362
12368a554362K736325L520572j55338m316530m368915j201815J285705J682366
$$ -1554362 1181963 4702535 4547197 230667 -4138248 -5340063 -4054358 -2371992
12360b371992J505620K137848L261649L130074j20086n587357q360156m463641
$$ -2371992 -866372 1271476 4533125 7663199 7543113 1955756 -6404400 -10868041
12352a0868041K723834N238370R85548l217210j551975K614136K715321p17693
$$ -10868041 -8144207 -2905837 -1920289 -5137499 -6689474 -4075338 -1360017 -2077710
12344b077710j638003J422072L135954j52745n025780o113627k934585Q29218
$$ -2077710 -3715713 -2293641 842313 689568 -4336212 -10449839 -13384424 -12555206
12336a2555206K416425J909863O17324j81244M86037K509297M343602M472878
$$ -12555206 -10138781 -8228918 -7611594 -7792838 -7306801 -4797504 -453902 4018976
12328D018976L042549J357815J53317r14048k326179l863003m542074l186515
$$ 4018976 7061525 8419340 8572657 7658609 5332430 1469427 -3072647 -6259162
12320f259162L38245M045836M885763J921526k027977l113413p03686K206842
$$ -6259162 -5920917 -1875081 3010682 4932208 2904231 -209182 -912868 1293974
12312A293974K799119J285421l65555j056020r21764k36999O56401R68371L20981
$$ 1293974 4093093 5378514 5012959 3956939 3035175 2798176 3454577 4422948 4743929
12303D743929n29143j120800k639254n819110q003963n249532J856347P371653
$$ 4743929 4214786 3093986 454732 -5364378 -13368341 -18617873 -16761526 -9389873
12295i389873O872050K781286L16134K16619p28376k897606k426259K057128N565416
$$ -9389873 -2517823 263463 579597 796216 67840 -2829766 -5256025 -3198897 2366519
12286B366519L012907l143701n643983k044851K593563L374330J787272J678129
$$ 2366519 5379426 2235725 -3408258 -5453109 -2859546 514784 2302056 3980185
12278C980185K268391k94173n460770p476716l496193J800108K733274N07815
$$ 3980185 6248576 5954403 493633 -6983083 -10479276 -8679168 -5945894 -5438079
12270e438079L45281K834300L520990R24498p97901R17132K342567l73138m395372
$$ -5438079 -5092798 -2258498 1262492 2186990 1389089 2306221 4648788 4275650 -119722
12261a19722m436412j209100K3813j565117r34948M047355P952908N212510j592229
$$ -119722 -4556134 -5765234 -5741421 -7306538 -8241486 -4194131 3758777 8971287 7379058
12252G379058n077521k840599L39132j03923k661018k698325J018230M813814
$$ 7379058 2301537 -539062 -199930 -303853 -2964871 -5663196 -4644966 168848
12244A68848M595239M52456l524929l539121Q3276L311201K580191j583935n239169
$$ 168848 4764087 5216543 1691614 -1847507 -1764231 1546970 4127161 2543226 -2695943
12235b695943n187132k034673J086867K224228J981902J291127l54018k958795
$$ -2695943 -7883075 -9917748 -8830881 -6606653 -4624751 -3333624 -3687642 -6646437
12227f646437l794625r5170N872500P744188K838704l682764n123559j603827
$$ -6646437 -10441062 -10536232 -4663732 3080456 5919160 2236396 -2887163 -4490990
12219d490990J408899J392830Q56964J140825l82958m518298o422194j967871
$$ -4490990 -3082091 -1689261 -832297 308528 -74430 -4592728 -11014922 -12982793
12211a2982793M994026O882900K641596j572558j955837j565640l346129m229335
$$ -12982793 -7988767 -1105867 1535729 -36829 -1992666 -3558306 -6904435 -11133770
12203a1133770n28356M671404N207949J158509j479443k41868P85446j082407
$$ -11133770 -11662126 -6990722 -1782773 -624264 -2103707 -2345575 -1560129 -2642536
12195b642536k214531P05063M127849K896752j327248k825842j066071o93726
$$ -2642536 -4857067 -4152004 -24155 2872597 1545349 -1280493 -2346564 -3040290
12187c040290k692302k421821J889667N036647K611367k105071l265898o98395
$$ -3040290 -5732592 -8154413 -6264746 -1228099 1383268 -721803 -3987701 -4686096
12179d686096J621549K450219L404649L865977J342130l062843m648508j924632
$$ -4686096 -3064547 -614328 2790321 6656298 7998428 4935585 287077 -1637555
12171a637555P75696l17379k717304j510308K934254M721986K83532o243257p431977
$$ -1637555 -861859 -1179238 -3896542 -5406850 -2472596 2249390 2532922 -3710335 -11142312
12162a1142312j436542N840369P946331N015380J887662R88580M24203j322176
$$ -11142312 -12578854 -6738485 1207846 6223226 8110888 9099468 9523671 8201495
12154H201495k697751k169086p72931j0891J06136m68131k336110m107197k714255
$$ 8201495 5503744 3334658 2561727 2550836 2656972 2188841 -147269 -4254466 -6968721
12145f968721J595415M090316K016740j321486j957158q44295l30897P28165L416403
$$ -6968721 -5373306 -1282990 733750 -587736 -2544894 -3389189 -3720086 -2991921 424482
12136D24482M335285P99334l013713k023584P39922p70206l934658p46782P693863
$$ 424482 4759767 5559101 2545388 521804 1261726 491520 -3443138 -4189920 3503943
12127C503943J0711162M084581l772532n357458l842547l956229k757973K716960
$$ 3503943 14215105 18299686 14527154 9169696 5327149 1370920 -1387053 1329907
12119A329907O606450K567877m526158n203106j65157J679900j775317l172518
$$ 1329907 7936357 10504234 5978076 774970 609813 2289713 514396 -2658122
12111b658122J212197N260626L065824k296726m411780k665012j071568j223859
$$ -2658122 -1445925 3814701 6880525 4583799 172019 -2492993 -3564561 -4788420
12103d788420r00001J418343L888617L460123n28082n095403o136926k716162
$$ -4788420 -5688421 -4270078 -381461 3078662 2550580 -2544823 -8681749 -11397911
12095a1397911J817244L859681L432054K556254J547256l61308j980924j276387
$$ -11397911 -9580667 -5720986 -2288932 267322 1814578 1453270 -527654 -1804041
12087a804041P49194Q01396j525907k598626q8704L249240L198759j04447k218212
$$ -1804041 -1054847 -253451 -1779358 -4377984 -4466688 -1217448 1981311 1876864 -341348
12078c41348r1408L883647M491703N4643n210938o208658l068993r8378M03858
$$ -341348 -432756 3450891 7942594 7997237 2786299 -3422359 -6491352 -6589730 -6185872
12069f185872q4949m94612j659969k590992k53249M495965N853540J633733k106044
$$ -6185872 -6270821 -6765433 -8425402 -11016394 -11269643 -6773678 -920138 713595 -1392449
12060a392449R3314M344666L726028p50519k923641k101108k436045l653506j678468
$$ -1392449 -1299135 3045531 6771559 6021040 3097399 996291 -1439754 -5093260 -6771728
12051f771728K043169J641556j925754r09573N517660Q036474K106308l975030
$$ -6771728 -4728559 -3087003 -5012757 -5922330 -404670 7631804 9738112 5763082
12043E763082k381159K082498J435437j778013m15131L426372J908443m243989
$$ 5763082 3381923 5464421 6899858 5121845 4706714 8133086 10041529 5797540
12035E797540o417185k519371J19643k323380m301741j252420K736410K360068
$$ 5797540 -619645 -3139016 -3019373 -5342753 -9644494 -10896914 -8160504 -5800436
12027e800436m32186p80500J072081J575539N42357Q71785L169455M784797L599443
$$ -5800436 -6232622 -7013122 -5941041 -4365502 -3823145 -2951360 218095 5002892 8602335
12018H602335L347m148111o454257m963677l23573L984484N198852L956858K114984
$$ 8602335 8605682 4457571 -1996686 -6960363 -7283936 -3299452 1899400 5856258 7971242
12009G971242k10370l301297n310106m063962o96363J354509R19164J51342P13941
$$ 7971242 7760872 4459575 -850531 -4914493 -5610856 -4256347 -3337183 -3185841 -2471900
12000b471900J374039M75635j072135r73468J072556K780494K244150M19143j65010
$$ -2471900 -1097861 -622226 -1694361 -2667829 -1595273 1185221 3429371 3848514 3683504
11991C683504J134758K017788L25090k656508l502346j247119J144884Q38256
$$ 3683504 4818262 6836050 7161140 4504632 1002286 -244833 900051 1738307
11983A738307r45128q68277J489237K870873R86854k133885k888994j112346l40197
$$ 1738307 793179 -75098 1414139 4285012 5271866 3137981 248987 -863359 -1203556
11974a203556k771731n652066m308723J552292O496753N374094n30324n053254
$$ -1203556 -3975287 -9627353 -13936076 -12383784 -5887031 -512937 -1043261 -6096515
11966f096515m307734j73850L407829M915266M648702K290179j948867n026194
$$ -6096515 -10404249 -10578099 -7170270 -2255004 2393698 4683877 2735010 -2291184
11958b291184l524513J298573M079055K051988j583694k587469j224794l17836
$$ -2291184 -5815697 -4517124 -438069 1613919 30225 -2557244 -3782038 -4099874
11950d099874J769J818656M473970M202870j97546m544428m192161J05694L387063
$$ -4099874 -4098105 -2279449 2194521 6397391 6199845 1655417 -2536744 -2431050 956013
11941I56013K567174n93866k407215j657175n33144j477047l602830l333370N68558
$$ 956013 3523187 2929321 522106 -1135069 -1668213 -3145260 -6748090 -10081460 -9512902
11932i512902M066910K489378k496287m221541k35831L870395K514378j594071
$$ -9512902 -5445992 -2956614 -5452901 -9674442 -9910273 -6039878 -3525500 -5119571
11924e119571j543719L485616P134417M909035l33216l104134j866537Q05867
$$ -5119571 -6663290 -3177674 3956743 8865778 8532562 5428428 3561891 4367758
11916D367758K081706J198594n21052j091624m31626j067268m247511o461647
$$ 4367758 6449464 7648058 7127006 6035382 5603756 4536488 288977 -6172670
11908f172670l480537K588612N019559J899850j407747j013424L7212j508021
$$ -6172670 -9653207 -7064595 -2045036 -145186 -1552933 -2566357 -2529145 -4037166
11900d037166k518946R50428N709722N529934P19626k851637k828346k018690
$$ -4037166 -6556112 -5605684 104038 5633972 6353598 3501961 673615 -1345075
11892a345075j728256j69609K136908J969467l27634m30478K285376K868676p91513
$$ -1345075 -3073331 -3242940 -1106032 863435 535801 105323 2390699 5259375 4467862
11883D467862l828524k348789K32547m52419k076289j38039L630457L792416N3279
$$ 4467862 639338 -1709451 -1476904 -1929323 -4005612 -4143651 -513194 3279222 3332501
11874C332501k449941q50357K474577M075949K471005j939276o105834n280541
$$ 3332501 882560 32203 2506780 6582729 9053734 7114458 1008624 -4271917
11866d271917Q47124N249234K234297l455874l208832J862085K910485j414798
$$ -4271917 -3424793 1824441 4058738 602864 -2605968 -743883 2166602 751804
11858G51804k434906L244878O858832J785341n037898m399897L82558K46535l697642
$$ 751804 -1683102 1561776 8420608 10205949 5168051 768154 1150712 1397247 -2300395
11849b300395k849627K947766M450995j373809o048285l063005K711393L650555
$$ -2300395 -5150022 -2202256 2248739 874930 -5173355 -8236360 -5524967 -1874412
11841a874412Q495l099234l587747k367467O1446K587060K865205J267538J408363
$$ -1874412 -1865917 -4965151 -8552898 -10920365 -10858919 -8271859 -5406654 -4139116 -2730753
11832b730753L651752L237409j187222l079248K120948P988102N608507k663690
$$ -2730753 920999 4158408 2971186 -108062 2012886 10000988 15609495 12945805
11824A2945805o455998k525697J930926J023992k735925m315320k411402J615241
$$ 12945805 6489807 3964110 5895036 6919028 4183103 -132217 -2543619 -928378
11816i28378N237253M388920k234369p954248m458229N365372R245008K835911
$$ -928378 4308875 8697795 6463426 -1490822 -5949051 -583679 8661329 11497240
11808A1497240l908095k476051J466373j060714o745137n837311J320534N128099
$$ 11497240 7589145 5113094 6579467 5518753 -1226384 -7063695 -5743161 -615062
11800f15062K121520j559241k007470k013705k121900J863187Q492308Q112911
$$ -615062 1506458 -52783 -2060253 -4073958 -6195858 -4332671 4159637 12272548
11792A2272548k640801j2160297q239498M590943J1367613O813028n97195l443920
$$ 12272548 9631747 -2528550 -10768048 -6177105 5190508 12003536 11406341 7962421
11784G962421m004215n921497o276292j436608M803609N331817k53703m997873
$$ 7962421 3958206 -1963291 -8239583 -9676191 -4872582 459235 205532 -4792341
11776d792341l593614J870531N603968M679219Q83834k198835k649763j223786
$$ -4792341 -8385955 -6515424 -911456 3767763 4651597 2452762 -197001 -1420787
11768a420787K69949J023613J260298Q48460n09430j566595k03523K991526L994408
$$ -1420787 -1150838 -127225 1133073 1981533 1472103 -94492 -298015 2693511 6687919
11759F687919M06953m459736n505124k733785o11353q30898j32264L310944N683670
$$ 6687919 7094872 2635136 -2869988 -5603773 -6215126 -7046024 -7178288 -3867344 1816326
11750A816326K961213k405467m317028j190761K598706L051846O79290k025278
$$ 1816326 4777539 2372072 -1944956 -3135717 -537011 2514835 3194125 1168847
11742A168847l850220m432936l235329n78976J897747K951397K699581J481631
$$ 1168847 -2681373 -7114309 -10349638 -10928614 -9030867 -6079470 -3379889 -1898258
11734a898258n40213k209885j855038K53641J808490J586840O83936m293r98372
$$ -1898258 -2438471 -4648356 -6503394 -6249753 -4441263 -2854423 -2170487 -2174780 -3173152
11725c173152j891551p25754K426369M060833J957750j109632j304415P02893
$$ -3173152 -5064703 -5790457 -3364088 696745 2654495 1544863 240448 943341
11717I43341J399904L8174j065099q33071l78325j02559O83476J389951O91162
$$ 943341 2343245 2381419 1316320 483249 104924 2365 685841 2075792 2766954
11708B766954n50332j13317J678144K048767P7562k131096k844891k208134k91811
$$ 2766954 2216622 2103305 3781449 5830216 5907778 3776682 931791 -1276343 -1568154
11699a568154K786434M506764J846497l430550n557588k489236J186005J112333
$$ -1568154 1218280 5725044 7571541 4140991 -1416597 -3905833 -2719828 -1607495
11691a607495j121959j851745j011424m49856J12064J441035J721805o16555k902376
$$ -1607495 -2729454 -4581199 -5592623 -6042479 -5930415 -4489380 -2767575 -3384130 -6286506
11682f286506j387984K735614M650598K697892N81o36149N6694J70137o20163
$$ -6286506 -7674490 -4938876 -288278 2409614 2410195 1774046 1830740 2000877 1380714
11673A380714j411398j395462m36687O79937J029140J159801K341161L464471
$$ 1380714 -30684 -1426146 -1862833 -1182896 -153756 1006045 3347206 6811677
11665F811677J537169l061406n380988k813346N88949O44430j72770J989291M101528
$$ 6811677 8348846 5287440 -93548 -2906894 -2317945 -1673515 -1846285 143006 4244534
11656D244534Q17589m955283m825837J822710O126779K928277k599714m262221
$$ 4244534 5062123 106840 -4718997 -2896287 3230492 6158769 3559055 -703166
11648g03166k920670j478040P96327L995294M141788l02371l943673k237296J165144
$$ -703166 -3623836 -5101876 -4305549 -310255 3831533 3529162 -414511 -2651807 -1486663
11639a486663P70998j789062j675741N36373J238531J149390K770802L605771
$$ -1486663 -715665 -2504727 -4180468 -3644095 -2405564 -1256174 1514628 5120399
11631E120399Q4977m101848k441794K933697L545599j665650m456761p51997L311064
$$ 5120399 5205376 1103528 -1338266 1595431 5141030 3475380 -981381 -1733378 1577686
11622A577686J951716j992177l401483k093789N45649M992437Q841626N912965
$$ 1577686 3529402 1537225 -1864258 -3958047 -3412398 1580039 10421665 16334630
11614A6334630l698274r391522l644472N634962N444744l331528p598111j731568
$$ 16334630 12636356 3244834 -399638 5235324 10680068 7348540 -249571 -1981139
11606a981139M962740K951085m198753o267538n78933N850896N865322m18842
$$ -1981139 2981601 5932686 1733933 -4533605 -5112538 738358 6603680 6184838
11598F184838o866952p424331j618434M609065M629427j339858o050751l807488
$$ 6184838 -682114 -8106445 -9724879 -5115814 -486387 -1826245 -7876996 -11684484
11590a1684484K656168N913771L098939j283639j750829J472688L513561J292355
$$ -11684484 -9028316 -3114545 -15606 -1299245 -3050074 -1577386 1936175 3228530
11582C228530l010858n092893l552297n91388J441652K383626K957765K950315
$$ 3228530 217672 -4875221 -8427518 -9018906 -7577254 -5193628 -2235863 714452
11574G14452J808666K0142j316062j760407j457527l83079J235555K093240P05697
$$ 714452 2523118 2543260 1227198 -533209 -1990736 -2373815 -1138260 954980 1660677
11565A660677k441973m434933k614664J942905M476435J553053l940609n071998
$$ 1660677 -781296 -5216229 -7830893 -5887988 -1411553 141500 -3799109 -8871107
11557h871107N06602O546160N586276j401804o509131n091383q1516L772215M936406
$$ -8871107 -8364505 -1818345 3767931 2366127 -4143004 -9234387 -9315903 -5543688 -607282
11548f07282L312431j222815n926552n611783M73083O006070N547901J649117
$$ -607282 2705149 1482334 -4444218 -10056001 -9582918 -3576848 1971053 3620170
11540C620170M567R07610M40174k234704l925851k588867P14155L882700M502081
$$ 3620170 3624737 4532347 4972521 2737817 -1188034 -3776901 -3062746 819954 5322035
11531E322035O93937n111117o259898l82278N490964M140273q60194q45427L859187
$$ 5322035 6015972 904855 -5355043 -5737321 -246357 3893916 3033722 2188295 6047482
11522F047482M736955p71610n765692n732843m131180l426607l06961N644526
$$ 6047482 10784437 10012827 4247135 -1485708 -5616888 -9043495 -9350456 -3705930
11514c705930P701648K659764k325568r55453J373050l072486r884357q157798
$$ -3705930 3995718 6655482 4329914 3374461 4747511 1675025 -8209332 -16367130
11506a6367130K070632Q924037N629531j158123k433561J481040M191560K715938
$$ -16367130 -14296498 -5372461 257070 -901053 -3334614 -1853574 2337986 5053924
11498E053924n57919k313621j329632J229214K465813J83113l948687n235878
$$ 5053924 4496005 2182384 852752 2081966 4547779 4730892 782205 -4453673
11490d453673j337977M453623O634338L462961j569828m021890l267297k189730
$$ -4453673 -5791650 -1338027 5296311 8759272 7189444 3167554 -99743 -2289473
11482b289473k344589j434226K474981N945943L463116m051785q623186n187067
$$ -2289473 -4634062 -6068288 -3593307 2352636 5815752 1763967 -6859219 -12046286
11474a2046286J820173M809510K512699n79510j427234p35075L39546J565197
$$ -12046286 -10226113 -5416603 -2903904 -3483414 -4910648 -5645723 -5306177 -3740980
11466c740980K227118J480474j95543j802146k864965k270764J308050N748971
$$ -3740980 -1513862 -33388 -228931 -2031077 -4896042 -7166806 -5858756 -109785
11458a09785N741332J2898n190387m041771O91333K282736j20750j942694j131857
$$ -109785 5631547 5644445 454058 -3587713 -2896380 -613644 -734394 -2677088 -3808945
11449c808945L49119J386754K158224J109518k572341m946766k139237K273012
$$ -3808945 -3459826 -2073072 85152 1194670 -1377671 -6324437 -8463674 -6190662
11441f190662J719088k716886l966733p04237J335481K48319Q19408M496316N840507
$$ -6190662 -4471574 -7188460 -11155193 -11859430 -10523949 -10275630 -9456222 -4959906 880601
11432H80601K462654k48803J196134K121370j553371n627039m720600p59223J703394
$$ 880601 3343255 3094452 4290586 6411956 4858585 -768454 -5489054 -6248277 -4544883
11423d544883K857697M222082L471807o80811l494879j015620K652834J925749
$$ -4544883 -1687186 2534896 6006703 5325892 1831013 815393 3468227 5393976
11415E393976q08457L2151K942377K346953r26128j113866J980320K677324o19824
$$ 5393976 4585519 4617670 7560047 9907000 8980872 7867006 9847326 12524650 11904826
11406A1904826l254204k632813j303099p88596O45558K656585J826649k008955
$$ 11904826 8650622 6017809 4714710 3926114 4571672 7228257 9054906 7045951
11398G045951m244090k517648j21699j85532j163134n92427O50427M30588j276286
$$ 7045951 2801861 284213 162514 -23018 -1186152 -1778579 -1128152 -697564 -1973850
11389a973850l073216l901851l079216q23904J005122J165992J500446L930982
$$ -1973850 -5047066 -8948917 -12028133 -12852037 -11846915 -10680923 -9180477 -5249495
11381e249495N922944L399358k057378m027762k44183L963013K938165k410134
$$ -5249495 673449 4072807 2015429 -2012333 -2256516 1706497 4644662 2234528
11373B234528o735035o171641q39006N756904Q874620O590378K049790n72113
$$ 2234528 -4500507 -10672148 -11511154 -5754250 3120370 9710748 11760538 11188425
11365A1188425j412219l027187m751497l688480m48614J392882J223323J347226
$$ 11188425 9776206 6749019 1997522 -1690958 -2139572 -746690 476633 1823859
11357A823859J415191q96089l600821j798995L633298N928372K738972p57403
$$ 1823859 3239050 2342961 -1257860 -3056855 576443 6504815 9243787 8486384
11349H486384j365588k574760o087075o568482l86103O915105Q052428L881973
$$ 8486384 7120796 4546036 -1541039 -8109521 -8495624 -1580519 6471909 10353882
11341A0353882K7738j780381l085159l402991j586459M52094N93173L06644J130847
$$ 10353882 10381620 8601239 5516080 2113089 526630 978724 1571897 1878541 3009388
11332C009388P73515k559048n487977m174994m57591J629373K073549K642466
$$ 3009388 3782903 1223855 -4264122 -8439116 -8896707 -7267334 -5193785 -2551319
11324b551319K062479j037168l633649k343896R98174K872482L637279M369819
$$ -2551319 -488840 -1526008 -5159657 -7503553 -6505379 -3632897 4382 4374201
11316D374201K512324l093966p155085m891970N686J639612J580763L988644N819155
$$ 4374201 6886525 3792559 -3362526 -8254496 -8248810 -6609198 -5028435 -1039791 4779364
11307D779364J968196l693909l697468m66928k085282o448807l551029O078869
$$ 4779364 6747560 3053651 -643817 -1110745 -3196027 -9644834 -13195863 -7116994
11299g116994R827443K909551m143482k871029J384364J673781J002127L327969
$$ -7116994 2710449 5620000 1476518 -1394511 -10147 1663634 2665761 5993730
11291E993730L924838j411584o353736l588421K576172L334561n95734k203860
$$ 5993730 9918568 8506984 2153248 -1435173 1140999 4475560 3879826 1675966
11283A675966p82332j016178k737154j681992J257509Q82105k780505m019033
$$ 1675966 893634 -122544 -2859698 -4541690 -3284181 -2402076 -5182581 -9201614
11275i201614o93158K992392L339068J095747j458147k635214j296453J143695
$$ -9201614 -9894772 -6902380 -3563312 -2467565 -3925712 -6560926 -7857379 -6713684
11267f713684N87237l503381m866190R24866Q023501P658283J149361k596393
$$ -6713684 -6126447 -9629828 -14496018 -13571152 -5547651 2110632 3259993 663600
11259F63600p77579J127361L61383M59590K412598J538956l489734o451451k861348
$$ 663600 -113979 1013382 1374765 1834355 4246953 5785909 2296175 -4155276 -7016624
11250g016624K795520L811263M03269k345075j916930L25355K351516K604076
$$ -7016624 -4221104 -409841 -6572 -2351647 -4268577 -3943222 -1591706 1012370
11242A012370L84567k288449j812072J738828L491180N32126l271258k596575
$$ 1012370 1396937 -891512 -2703584 -964756 2526424 3058550 -212708 -2809283
11234b809283J528884L229810K18566l062957j627844L175785N090200J044633
$$ -2809283 -1280399 1949411 2167977 -894980 -2522824 652961 5743161 6787794
11226F787794m318747m295047P37669L606846N60119l481758k757169R32388K400643
$$ 6787794 2469047 -1826000 -1088331 2518515 3078634 -403124 -3160293 -2227905 172738
11217A72738J537656J332293P89728k546541n321726k469407K463682J049533
$$ 172738 1710394 3042687 3832415 1285874 -4035852 -6505259 -4041577 -2992044
11209b992044n410426o013992K160380Q096473M148859j694430M98317O075773
$$ -2992044 -8402470 -14416462 -12256082 -4159609 -10750 -1705180 -1206863 4868910
11201D868910M340591k942506m631249J074929M148543l63092m868849k252645
$$ 4868910 9209501 6266995 1635746 2710675 6859218 6496126 1627277 -625368
11193f25368L292122L877299m65315l695630l026765q93198K8571m58145j211920
$$ -625368 2666754 6544053 6078738 2383108 -643657 -1536855 -1508284 -1966429 -3178349
11184c178349r42082P33873J981951L30914l150705l850840J85992M664507M510232
$$ -3178349 -4120431 -3386558 -1404607 -1073693 -4224398 -8075238 -7889246 -3224739 1285493
11175A285493Q43391j105939J53983Q97308j023806k185229J037793N915614O073902
$$ 1285493 2128884 1022945 1176928 2074236 1050430 -1134799 -97006 5818608 11892510
11166A1892510K11396n661922n903182k088543K35944n65625j162110O40948K707745
$$ 11892510 12103906 6441984 538802 -1549741 -1313797 -1879422 -3041532 -2400584 307161
11157C07161K471774P35984l71948q33421j778494k694086k054626j636J610201
$$ 307161 2778935 3514919 3142971 2309550 531056 -2163030 -4217656 -4219292 -2609091
11148b609091J467347l03604k808006m525023l609077J17356L803876L955961
$$ -2609091 -1141744 -1445348 -4253354 -8778377 -12387454 -12270098 -8466222 -4510261
11140d510261L84070l377762l790508p32703K777781L722938J885018m20214j417901
$$ -4510261 -4126191 -7503953 -11294461 -12027164 -9249383 -5526445 -3641427 -4061641 -5479542
11131e479542j788476k468207j891117J774283O043963N671436N8595m620842
$$ -5479542 -7268018 -9736225 -11627342 -9853059 -3809096 1862340 1920935 -2699907
11123b699907l168984J901731M443115K743821j61701k017718k804627k012332
$$ -2699907 -5868891 -3967160 475955 3219776 3058075 1040357 -1764270 -3776602
11115c776602Q53017L342288K129886j613974l119017j050562N69482j079772
$$ -3776602 -2923585 418703 2548589 934615 -2184402 -3234964 -2665482 -3745254
11107c745254l223898k022524J834129M820061N292363L814684J104665j417923
$$ -3745254 -6969152 -8991676 -7157547 -2337486 2954877 6769561 7874226 6456303
11099F456303j205517J833336L104307j126972o941927o517821P71629O223370
$$ 6456303 5250786 7084122 10188429 9061457 2119530 -4398291 -3626662 2596708
11091B596708L276642l423042m734037K98910M157582K341406j035007p79106
$$ 2596708 5873350 2450308 -2283729 -1984819 2172763 4514169 3479162 2700056
11083B700056J664754J764399n59866j704727p82312l13407j005340o57293R71457
$$ 2700056 4364810 6129209 5569343 3864616 3082304 2768897 1763557 1106264 2077721
11074B077721P68092k219090l763240k31189N173566N867400P54818m072395l194356
$$ 2077721 2845813 626723 -3136517 -3367706 1805860 7673260 8428078 4355683 1161327
11065A161327J478007L783629J399449j908403k302508j225005k300316m733376
$$ 1161327 2639334 6422963 7822412 5914009 3611501 2386496 86180 -4647196
11057d647196m084699R8435K496800M64977p51604L707902Q831735N876545l705804
$$ -4647196 -8731895 -8633460 -6136660 -5671683 -6423287 -2715385 6116350 11992895 8287091
11048H287091q919284m723038J416478J546368j876135k197714O33843K069252
$$ 8287091 -632193 -5355231 -3938753 -2392385 -4268520 -6466234 -5832391 -3763139
11040c763139J467820J671937K590525J751771j52007l19161M36139j044718l556912
$$ -3763139 -2295319 -623382 1967143 3718914 3566907 3247746 3683885 2639167 -917745
11031i17745k271780K854134N288844R97363n365970o674975k576338J132624
$$ -917745 -3189525 -335391 4953453 5950816 584846 -6090129 -8666467 -7533843
11023g533843P24859j492888j585290M84393J571803N61239K45207K793410N493175
$$ -7533843 -6808984 -8301872 -9887162 -9402769 -7830966 -7269727 -7024520 -4231110 1262065
11014A262065M047601o62529l008214m95852K708000J960974j664515l830108
$$ 1262065 5309666 4647137 1638923 1143071 3851071 5812045 4147530 317422
11006C17422k570968J040149M971339O424210L116889k698358m842342j200488
$$ 317422 -2253546 -1213397 3757942 10182152 13299041 10600683 5758341 4557853
10998D557853K499795R95652k316700j074783L306727L526279k155850p188907
$$ 4557853 7057648 8053300 5736600 4661817 7968544 11494823 9338973 2150066
10990B150066n998391m23523M194526M984366K618837j66903o55712P25166L15290
$$ 2150066 -3848325 -4271848 -77322 4907044 7525881 7358978 6703266 7428432 7743722
10981G743722k988459m367238j1963N241659L660688l360782o456337j900611
$$ 7743722 4755263 388025 376062 5617721 9278409 5917627 -538710 -2439321
10973b439321L339717K347753k447240m243881j387063K000860K235465p9039
$$ -2439321 900396 3248149 800909 -3442972 -4830035 -2829175 -593710 -672749
10965f72749j323720J031164M856256N109906R15870j940842P22496M141144J420819
$$ -672749 -1996469 -965305 3890951 9000857 9916727 7975885 8698381 12839525 14260344
10956A4260344n097249o911415k319346K178035L097684L416478L893808Q04864
$$ 14260344 9163095 2251680 -67666 2110369 5208053 8624531 12518339 13323203
10948A3323203m968712o323573j649891J100780k477692n066373K07075P377833
$$ 13323203 8354491 2030918 381027 1481807 -995885 -6062258 -5855183 1522650
10940A522650O494720q86617m826007k197234Q36877K45614q90366L48297J680201
$$ 1522650 8017370 7130753 2304746 107512 944389 1190003 299637 647934 2328135
10931B328135J04320l300666n210322l966121n01877K875821M268631L780239
$$ 2328135 2432455 -868211 -6078533 -10044654 -10546531 -7670710 -3402079 378160
10923C78160K903645K023553L19273j453785j058854J155018J617667j154775
$$ 378160 3281805 5305358 5624631 4170846 3111992 4267010 5884677 4729902
10915D729902l855873l200740m27153J238508P82937q55686k324795j643977K072679
$$ 4729902 874029 -2326711 -2753864 -1515356 -732419 -1588105 -3912900 -5556877 -3484198
10906c484198N410881L504539k389517n296148k555723M71270k46764r44108K280319
$$ -3484198 1926683 5431222 3041705 -2254443 -4810166 -4338896 -4585660 -5529768 -3249449
10897c249449N470773K959291k868092m718219p25377M087250M809304P01044
$$ -3249449 2221324 5180615 2312523 -2405696 -3131073 956177 5765481 6466525
10889F466525n513251q784912n156554K620064O615618L981743O40300J162767
$$ 6466525 953274 -7831638 -12988192 -10368128 -3752510 229233 869533 2032300
10881B032300J697182j422957l255773J357855O941907M753981k969168o307816
$$ 2032300 3729482 2306525 -949248 408607 7350514 12104495 9135327 2827511
10873B827511k793692P93345N32174n81186o22343j485759k758854j267825K007112
$$ 2827511 33819 827164 1359338 778152 155809 -1329950 -4088804 -5356629 -3349517
10864c349517K306018l40495m93415L079860M611001O78470m247913m695617j298859
$$ -3349517 -1043499 -1383994 -1877409 1202451 5813452 6491922 2244009 -2451608 -3750467
10855c750467J925360L142918K970703K360926J980625J581308n8954k483407
$$ -3750467 -1825107 1317811 4288514 6649440 8630065 10211373 10152419 7669012
10847G669012k618398L67917K074935p86013m290472l255127J96260J118636J194763
$$ 7669012 5050614 5418531 7493466 6707453 2416981 -838146 -641886 476750 1671513
10838A671513M630810P442105K064051p924128r870973r41052O821480M436804
$$ 1671513 6302323 13744428 15808479 7884351 -1986622 -2927674 3893806 8330610
10830H330610j996767l180839n96126o66857k654472j489268K035709K608649
$$ 8330610 6333843 3153004 2556878 1890021 -764451 -2253719 -218010 2390639
10822B390639l04865j838026K22210K457102J386228j764303k901763j45461L565048
$$ 2390639 2085774 247748 469958 2927060 4313288 2548985 -352778 -498239 3066809
10813C066809L487302o19357l200925m76701L316838J935874k861510l888544
$$ 3066809 6554111 5934754 2733829 2257128 5573966 7509840 4648330 759786
10805G59786j35149J900082q18130l461548k130564L37152N27534k15312j92857
$$ 759786 624637 2524719 1706589 -1754959 -3885523 -3548371 -3020837 -3236149 -3429006
10796c429006r85889k824198k006909K802839O682042N158238N89909k109989
$$ -3429006 -4414895 -7239093 -9246002 -6443163 238879 5397117 5987026 3877037
10788C877037k241779k069012k298840k329440k199824j680518q9469J464616
$$ 3877037 1635258 -433754 -2732594 -5062034 -7261858 -8942376 -9031845 -7567229
10780g567229Q93984r37964j015143O39471J195022N36809J017864J758554j40300
$$ -7567229 -6673245 -7611209 -8626352 -7986881 -6791859 -6255050 -5237186 -3478632 -3618932
10771c618932k582653n19858M312021M521608o44082l775367k193837j649243
$$ -3618932 -6201585 -6721443 -2409422 2112186 1468104 -2307263 -4501100 -6150343
10763f150343l885201k433240L955372O123399K14516l712273J595550P038642
$$ -6150343 -10035544 -12468784 -8513412 -2390013 -2175497 -5887770 -4292220 2746422
10755B746422K441329n126554k921315N517539O215189k018391o627920k240616
$$ 2746422 5187751 61197 -2860118 2657421 8872610 6854219 226299 -2014317
10747b014317K807017K143742K7710J206039L180237K486321L39948j126006j793442
$$ -2014317 792700 2936442 2964152 4170191 7350428 9836749 10176697 9050691 7257249
10738G257249j227808P31480J158331j994772m488912j603481K725123J460069
$$ 7257249 6029441 6760921 7919252 5924480 1435568 -167913 2557210 4017279
10730D017279k737534j050555N674866O850071k57815n286240j562589L438783
$$ 4017279 1279745 229190 5904056 12754127 12496312 7210072 5647483 9086266
10722I086266J089256m793419n626053j810905K36253k59639J184796M798392
$$ 9086266 10175522 5382103 -243950 -2054855 -1818602 -2078241 -893445 3904947
10714C904947N578781J549439l189504m386993k355791M9798J149550J123927
$$ 3904947 9483728 11033167 7843663 3456670 1100879 1150677 2300227 3424154
10706C424154O89073R2651p42213j367392r56749R1990J17044r22819n29171K133390
$$ 3424154 4113227 4205878 3463665 2096273 1139524 1231514 1348558 425739 -103432 2029958
10696B029958L579221J023225k352586j829919J097050J101357j991974l034432
$$ 2029958 5609179 6632404 4279818 2449899 3546949 4648306 2656332 -378100
10688c78100k99374K260859K334737K089558K085187o83146n845092p468984k883550
$$ -378100 -677474 1583385 3918122 6007680 8092867 7409721 1564629 -5904355 -8787905
10679h787905K142698J812281j151238p94057K356475L050177K31008j994340
$$ -8787905 -6645207 -4832926 -5984164 -6778221 -4421746 -1371569 -1140561 -3134901
10671c134901j372981n4428M6955j2036R87831K118672J918305L00648j786765
$$ -3134901 -4507882 -4562310 -4515355 -4527391 -3539560 -1420888 497417 798065 -988700
10662i88700l230272l173173j772787l34749L46951J154839K887281M185083L122614
$$ -988700 -4218972 -7392145 -9164932 -9499681 -9152730 -7997891 -5110610 -925527 2197087
10653B197087N77874j45275K252510M687602L208409j789662n607713m969510
$$ 2197087 2774961 2629686 4882196 9569798 12778207 10988545 5380832 411322
10645D11322k138989j660469l838826m247411m99914L463278K602635j423122
$$ 411322 -1727667 -3388136 -7226962 -11474373 -11974287 -8511009 -5908374 -7331496
10637g331496j656460M405436J0062407P169460k915154r655282n607217M251085
$$ -7331496 -8987956 -4582520 5479887 12649347 9734193 78911 -5528306 -1277221
10629a277221Q292445K425792n353683n848200j34451L460153J160653k650282
$$ -1277221 7015224 9441016 4087333 -1760867 -1895318 1564835 2725488 75206
10621G5206l019377l92847K026083K607546J469379l15419o55247J253562K431901
$$ 75206 -2944171 -3337018 -1310935 1296611 2765990 2450571 1795324 3048886 5480787
10612E480787k8599k988530r39152M007986L355836m221404q806280l543663M612973
$$ 5480787 5452188 2463658 1524506 5532492 8888328 4666924 -4139356 -7683019 -3070046
10603c070046N303626l63093l566716j836552k27937q49616l72392K123469K817588
$$ -3070046 2233580 1870487 -1696229 -3532781 -3760718 -4610334 -4982726 -2859257 -41669
10594d1669R5344k359789j312536J674351L250762K406215N06585o01399k35153
$$ -41669 53675 -2306114 -3618650 -1944299 1306463 3712678 4219263 3617864 3382711
10585C382711R2453j664675m373538m217538n36652K278485J216674q31320j70096
$$ 3382711 3475164 1810489 -2563049 -6780587 -7317239 -5038754 -3822080 -4653400 -4823496
10576d823496J963721K490984J559923O11965q43610k568853j789786J769587
$$ -4823496 -2859775 -368791 1191132 1803097 959487 -1609366 -3399152 -1629565
10568a629565L385964K98007l416892l474907j732131r47142Q69062M827029O018218
$$ -1629565 1756399 2054406 -1362486 -4837393 -6569524 -7516666 -6647604 -1820575 4197643
10559D197643J245120l781837k852023N18983k70609l230895k147669J711242
$$ 4197643 5442763 1660926 -1191097 -672114 -942723 -4173618 -6321287 -4610045
10551d610045K191730n84057j346110K50666k54995l418810n127290l267392P51598
$$ -4610045 -2418315 -3002372 -4348482 -4097816 -4352811 -7771621 -12898911 -16166303 -15414705
10542a5414705M631591M959451o27971o883056m340844N638702R577549K431481
$$ -15414705 -10783114 -5823663 -6451634 -13334690 -17675534 -12036832 -2459283 -27802
10534b7802l362289J029404N348946o76223p705949l602130L923114J688687m374080
$$ -27802 -3390091 -2360687 2988259 2312036 -5393913 -8996043 -5072929 -3384242 -7758322
10525g758322j468879M568889P75539n971897n85771R949344P073523m996729
$$ -7758322 -9227201 -4658312 -3882773 -9854670 -10440441 -491097 6582426 1585697
10517A585697o313739K099650J496542p220377m376626R697455J2717383P00414
$$ 1585697 -4728042 -2628392 -1131850 -8352227 -12728853 -3031398 9685985 10386399
10509A0386399n689013k111J142697n955961m875260N038892M659214n447609
$$ 10386399 4697386 4695275 5837972 -117989 -4993249 45643 4704857 -742752
10501g42752l291063R050869M980037j2378697r279814J2375488J0410725j6195623
$$ -742752 -4033815 5017054 9997091 -2381606 -11661420 714068 11124793 -5070830
10493e070830j4415230K2256729K5447107k1440241k0823923Q4488363J75338083
$$ -5070830 -19486060 2770669 28217776 6777535 -14046388 70441975 245780058
10486B45780058J01471169q3303825j73866603r4174740J7292436K7493843k2694403
$$ 245780058 347251227 263947402 90080799 -4093941 13198495 40692338 17997935
10479A7997935l0938241J997980J1228916p103421p317842J2574164J5439961
$$ 17997935 -12940306 -10942326 286590 -6816831 -14134673 -1560509 13879452
10472A3879452o93662n139262L485197q7201j3556036j1152007M910513P664809
$$ 13879452 13185790 8046528 11531725 11444524 -2111512 -13263519 -8353006 -688197
10464f88197m155034n682904O079835Q141103l640520p290683L449304Q413897
$$ -688197 -4843231 -10526135 -4446300 3694803 54283 -7236400 -3787096 4626801
10456D626801q54650p052403l61212N310765P9976n206251j698260J678747k636982
$$ 4626801 3772151 -3280252 -3641464 1669301 1749277 -3456974 -5155234 -3476487 -6113469
10447f113469o008153j97398P457568O920627Q54121k385007j183194J051530
$$ -6113469 -12121622 -12319020 -4861452 2059175 2913296 528289 -654905 396625
10439C96625K048261P15705k175983k289489K229261N006204N81115m621197j734347
$$ 396625 2444886 3160591 984608 -1304881 924380 5930584 6511699 1890502 156155
10430A56155M649918L754816k214023k009605M090213M771242j880332n725959
$$ 156155 4806073 8560889 6346866 4337261 8427474 13198716 11318384 5592425
10422E592425l224758j680141l061746o94850N028863M711470k227416m462214
$$ 5592425 2367667 687526 -2374220 -3069070 1959793 6671263 4443847 -18367
10414a8367J610095N619296K288300Q7846L679752M242933l504206j0009856p244716
$$ -18367 1591728 7211024 9499324 9587170 13266922 17509855 14005649 3995793 -3248923
10405c248923k407010l705868n259525Q49470Q399862O964601k96707k678267
$$ -3248923 -5655933 -9361801 -14621326 -13771856 -5371994 1592607 1295900 -1382367
10397a382367L22778N63268l575147n789712l284024O23963L457952M778710K969364
$$ -1382367 -1059589 -496321 -4071468 -9861180 -13145204 -12521241 -9063289 -4284579 -1315215
10388a315215j574986l375783M74054L679633K2566n232259l074726L749194M405944
$$ -1315215 -2890201 -6265984 -5791930 -2112297 -2089731 -7321990 -10396716 -6647522 -2241578
10379b241578k319642n945025j192365M201082K391798l074221m240654o65164
$$ -2241578 -4561220 -10506245 -11698610 -7497528 -5105730 -8179951 -12420605 -13085769
10371a3085769J847751P65392o18848R04899M038904N140793L105565R05888J644397
$$ -13085769 -11238018 -10472626 -11091474 -10186575 -6147671 -1006878 2098687 3004575 4648972
10362D648972L707187K417522k636490n612165k595725J914120J431825k460232
$$ 4648972 8356159 10773681 8137191 2525026 -70699 1843421 3275246 815014
10354H15014k711322J871218M959904K958496j11997l14694P7188j944934l930101
$$ 815014 -1896308 -25090 4934814 7893310 7781313 7466619 7543807 5598873 1668772
10345A668772k390255M79787K48462k013675j421554K295424L974607J109626
$$ 1668772 -721483 -241696 6766 -2006909 -3428463 -1133039 2841568 3951194
10337C951194k513235k734373j51572K474253L908283L416703L8998m312258m785883
$$ 3951194 1437959 -1296414 -1447986 1026267 4934550 8351253 8390251 4077993 -707890
10328g07890k04729L593109J320712l724609m382598l46524J905796o12489l338637
$$ -707890 -912619 2680490 4001202 276593 -4106005 -4452529 -2546733 -3159222 -6497859
10319f497859j540861L270487O080513L930111k108206p171683n265975L773723
$$ -6497859 -8038720 -4768233 1312280 5242391 3134185 -4037498 -9303473 -5529750
10311e529750J0814011P132498k757277n951549K74841M526237n73701o902723
$$ -5529750 5284261 12416759 9659482 3707933 3982774 8509011 7935310 1032587
10303A032587m590108K158234K966479j831750l578817l77801J743445P26866
$$ 1032587 -3557521 -1399287 1567192 -264558 -3843375 -4221176 -2477731 -1750865
10295a750865M29447J176202j003981m931046m090122K222220O612122M765244
$$ -1750865 -1321418 -145216 -1149197 -6080243 -10170365 -7948145 -1336023 3429221
10287C429221O41533j687863l065673l645808q83864L570992L438686j765929
$$ 3429221 4070754 2382891 -682782 -4328590 -5212454 -1641462 1797224 31295
10279C1295m175272J6703M030019J974457j543903l32549K553503J247518k095453
$$ 31295 -4143977 -4127274 -97255 1877202 333299 750 2554253 3801771 1706318
10270A706318k043921k86842j670314l914612j398243L595091L816223k78395
$$ 1706318 -337603 -624445 -2294759 -6209371 -7607614 -4012523 -196300 -474695
10262d74695j288147K013225K945523o38312k814935j084278r52248m680257n411929
$$ -474695 -1762842 250383 3195906 2557594 -257341 -1341619 -2293867 -6974124 -12386053
10253a2386053R93508O828746L561091m284010n473292J451807P153254N415975
$$ -12386053 -11392545 -4563799 -1002708 -5286718 -10760010 -9308203 -2154949 3261026
10245C261026k07047l739114l599938r68947K735843N101028M068164J384850
$$ 3261026 3053979 -685135 -4285073 -5254020 -2518177 2582851 6651015 8035865
10237H035865P80768K103492J661507j008567j948461P7630P29592k618105n620055
$$ 8035865 8816633 10920125 12581632 11573065 9624604 9702234 10431826 7813721 2193666
10228B193666l218358K400715M742596J707306k911785n195910m460929j736339
$$ 2193666 -1024692 1376023 6118619 7825925 4914140 -281770 -4742699 -6479038
10220f479038J553889L587289L365978J693100m08274k653667l572099p66790
$$ -6479038 -4925149 -1337860 2028118 3721218 3312944 659277 -2912822 -3679612
10212c679612M317314N622909N59097m791482l945071n4079n38221m239114l086760
$$ -3679612 637702 6260611 6819708 2028226 -1916845 -1970924 -2509145 -6748259 -9835019
10203i835019L613219O653413J509699l973042j837734L843050M220094n49300
$$ -9835019 -6221800 431613 1941312 -2031730 -3869464 -26414 4193680 3644380
10195C644380k881868j30942K569958J302349j428835j708313J29738P45573j528157
$$ 3644380 762512 631570 3201528 4503877 3075042 1366729 1496467 2242040 713883
10186G13883m489489m131215O66090N639642N394280L69813l497232k770397k96854
$$ 713883 -3775606 -7906821 -7240731 -1601089 3793191 4163004 665772 -2104625 -2401479
10177b401479L47431l40048q09902j537314k040412L26805M890077N996147J402100
$$ -2401479 -2054048 -2394096 -3203998 -4741312 -6781724 -6454919 -1564842 4431305 5833405
10168E833405k795970j245798J683091r09288o468568o610028l61726M745329
$$ 5833405 3037435 1791637 3474728 2565440 -3903128 -10513156 -10874882 -6129553
10160f129553M037352L54338k496620l654289k347771J943411N902871N278183
$$ -6129553 -2092201 -1737863 -4234483 -7888772 -10236543 -8293132 -2390261 2887922
10152B887922J657048J71382Q27207p20361l949794l424340R68374K535041r35839
$$ 2887922 4544970 4716352 5543559 4823198 873404 -2550936 -1582562 952479 16640
10143A6640k998171N24221M460819L102690r52970k393663j591317j439585r83291
$$ 16640 -2981531 -2457310 2003509 5106199 4153229 1759566 168249 -1271336 -2254627
10134b254627J474002L102711Q44020k177800q32222L592349N011876J331887
$$ -2254627 -780625 2322086 3166106 988306 156084 3748433 8760309 10092196
10126A0092196l456446n201216l502438m71947J092483o41509m015522m680258
$$ 10092196 6635750 1434534 -2067904 -2539851 -1447368 -2088877 -6104399 -10784657
10118a0784657j271402K299970K740048J935100K254023J684573j393670k928926
$$ -10784657 -12056059 -9756089 -7016041 -5080941 -2826918 -1142345 -2536015 -5464941
10110e464941O57457M563325J921423m240541m723003O73539K269431l015384
$$ -5464941 -4807484 -244159 1677264 -2563277 -7286280 -6612741 -4343310 -7358694
10102g358694n372825J833042R536965N935717m733137p943303n27989N670427
$$ -7358694 -12731519 -10898477 -1361512 4574205 -158932 -8102235 -8630224 -2959797
10094b959797K758523k499312j831816Q95202k241673q266373p082864K211967
$$ -2959797 -201274 -2700586 -4532402 -3637200 -5878873 -14145246 -21228110 -19016143
10086a9016143R176393P130996J460995k01169J434408J219604j511750l341347
$$ -19016143 -9839750 -2708754 -1247759 -1448928 -14520 1205084 -306666 -3648013
10078c648013k669028n33576K044127L864528L232237J003564Q43440L309189
$$ -3648013 -6317041 -6850617 -4806490 -941962 2290275 3293839 4137279 7446468
10070G446468L758695Q6030k437418K77064K793697j748682r058001q808980n45483
$$ 7446468 11205163 11291193 8853775 9130839 11924536 10175854 1117853 -7691127 -8236610
10061h236610N727581M900440K329200K284685J305774k891757n334565k321201
$$ -8236610 -2509029 2391411 4720611 7005296 8311070 5419313 84748 -2236453
10053b236453J732378K085817J454506L439311M570460O86431l843298k035043
$$ -2236453 -504075 1581742 3036248 6475559 11046019 11732450 7889152 5854109
10045E854109L673511M177466k562649q694736p928127k850521P85003J408793
$$ 5854109 9527620 13705086 11142437 2447701 -5480426 -8330947 -7545944 -6137151
10037f137151R57191R17928J419508J836329Q90990k001693m881029m600476n51157
$$ -6137151 -5179960 -4262032 -2842524 -1006195 -115205 -2116898 -6997927 -11598403 -12149560
10028a2149560M391406O726391N082851Q37299k641498k390330Q09558K601637
$$ -12149560 -7758154 -1031763 4051088 4888387 2246889 -143441 666117 3267754
10020C267754M25521k660829k032276J759090L500312N40212l570330l786044
$$ 3267754 3693275 1032446 -999830 759260 4259572 4799784 1229454 -2556590
10012b556590J02401L511053K868007o0702o08877K267877L866648l6015o337398
$$ -2556590 -2454189 1056864 3924871 3864169 3255292 5523169 9389817 9353802 3016404
10003C016404p539598j640875M825964N188324N24316l282850l327242j253086
$$ 3016404 -4523194 -6164069 -1338105 3850219 4374535 1091685 -2235557 -3488643
9995c488643Q23966K265546K565216J232436q59906k082018k066327j757784j739121
$$ -3488643 -2664677 -399131 2166085 3398521 2538615 456597 -1609730 -3367514 -5106635
9986e106635j624961p14853J477350M543775O458066M857475L5699m526822n660737
$$ -5106635 -6731596 -7446449 -5969099 -1425324 5032742 9890217 9925916 5399094 -261643
9977b61643l587800q04634R07048J464381J468502J197347M57269n90968n37778
$$ -261643 -3849443 -4654077 -3747029 -2282648 -814146 383201 840470 249502 -288276
9968b88276J941936N127880M930689M26083l904407m264916k812742k899774k688668
$$ -288276 1653660 6781540 11712229 12138312 8233905 3968989 1156247 -1743527 -4432195
9959d432195N33317L024509k08164m842305j905706O786826Q981968O88263o643711
$$ -4432195 -3898878 -874369 -1082533 -5924838 -7830544 -1043718 7938250 8626513 1982802
9950A982802l312343M432257N353592j492l129274k111679j923590l567749k863198
$$ 1982802 -1329541 3102716 8456308 8454816 5325542 3213863 1290273 -2277476 -5140674
9941e140674R07406L452746K672882Q79693k36662j357291k295926j734951j06158
$$ -5140674 -4233268 -780522 1892360 2772053 2535391 1178100 -1117826 -2852777 -2958935
9932b958935R88222J523402K096209J785369P9348j116770n00803O2584j005557
$$ -2958935 -1970713 -447311 1648898 3434267 3513615 2396845 1896042 1958626 953069
9923I53069j998872j408118q01402j094201k42578J960380J951041p69892q98395
$$ 953069 -1045803 -2453921 -3255323 -4349524 -4592102 -2631722 -680681 -1450573 -2348968
9914b348968L571795O137799K049819k982114k146046R24064p87580m834480m031922
$$ -2348968 1222827 7360626 9410445 6428331 4282285 5206349 4418769 -415711 -4447633
9905d447633M46233J741091j61358L40487L050752K793276O7553K33687L137979
$$ -4447633 -4001400 -2260309 -2421667 -2081180 969572 3762848 3830401 4064088 7202067
9896G202067L630182J264556j25424o61446k585226l179342J7236J054239n166505
$$ 7202067 10832249 12096805 11971381 11309935 8724709 5545367 5562603 6616842 1450337
9887A450337j0323023m096198O518555O801759o70368j153123M556489K003360
$$ 1450337 -8872686 -12968884 -6450329 351430 -318938 -1472061 3084428 5087788
9879E087788o491645j703860J5378095J6781319p411709k6311371j2753581J3990451
$$ 5087788 -1403857 -3107717 12270378 29051697 21639988 -4671383 -17424964 -3434513
9871c434513J7841408l98704j0573660k761522M086088m46634m164367P18176
$$ -3434513 14406895 14008191 3434531 673009 4759097 4312463 148096 866272
9863H66272M006826r94411m769779k2880N166725K509619k804511l001715k03693
$$ 866272 4873098 3878687 -891092 -913972 4252753 6762372 3957861 956146 752453
9854G52453N52774N01392J817660K088325L62030K94885K312643J484964k544381
$$ 752453 1305227 1806619 3624279 5712604 6074634 6369519 8682162 10167126 7622745
9845G622745l345482K24414O63711m159987n468602Q89108N442023R63126m170412
$$ 7622745 4277263 4501677 5165388 1005401 -4463201 -3574093 1867930 2831056 -1339356
9836a339356k68672N992851K426541p211370q387804P22576O432899R03373p277837
$$ -1339356 -1608028 4384823 6811364 -400006 -8787810 -8065234 -1632335 -728962 -8006799
9827h006799p286048j35052O083496P252256M829763J588665n01947j206840k357454
$$ -8006799 -15292847 -15427899 -9344403 -2092147 2737616 4326281 3824334 2617494 260040
9818B60040m611358m719423k45133M534371L554045j030256j149351M273740O811425
$$ 260040 -4351318 -9070741 -9315874 -4781503 -1227458 -2257714 -3407065 866675 7678100
9809G678100J513921n307877n759206j450940P07739q88128k228261j098200Q92783
$$ 7678100 9192021 3884144 -1875062 -3326002 -2618263 -3506391 -5734652 -6832852 -5940069
9800e940069K209390K573032J169177k266554n117104m108022L18728M388821
$$ -5940069 -3730679 -1157647 11530 -2255024 -7372128 -11480150 -11161422 -6772601
9792f772601N271470L047571m04171k453127j162923K140511L453658J338810
$$ -6772601 -1501131 1546440 1142269 -1310858 -2473781 -333270 3120388 4459198
9784D459198p82499o7706J163205o7870j683199m69172J203404q74893m188472
$$ 4459198 3676699 3608993 4772198 4704328 3021129 2551957 3755361 2880468 -1308004
9775a308004k480578K959855L553620l138352q616544n959628L50344K521948
$$ -1308004 -3788582 -828727 2724893 -413459 -9030003 -14989631 -14639287 -12117339
9767a2117339R95561J119099L027229K543132l00534j068529J376280L269764
$$ -12117339 -11121778 -10002679 -6975450 -4432318 -4732852 -5801381 -4425101 -1155337
9759a155337K328001N35629j21209m18480j478662k813997l433079k698217m30635
$$ -1155337 1172664 1708293 1587084 1168604 -310058 -3124055 -6557134 -9255351 -9685986
9750i685986J912014J661234j046740j960764J310291M682244L298043p42987
$$ -9685986 -7773972 -6112738 -7159478 -9120242 -7809951 -3127707 170336 -572651
9742e72651j741443O56090K123568J749786K342479L175865K60462n189399o369005
$$ -572651 -2314094 -1658004 465564 2215350 4557829 7733694 7994156 2804757 -3564248
9733c564248j293592L572268L116603K47470q00547j102309k364084j859249K161932
$$ -3564248 -4857840 -1285572 1831031 2078501 1277954 175645 -2188439 -4047688 -1885756
9724a885756N090181K376083k512187l034669M01495J937355j10944j684107l98442
$$ -1885756 3204425 5580508 3068321 33652 435147 2372502 2261558 577451 179009
9715A79009J458730J715296J141250P88326N08330O41955J679280K050588k08681
$$ 179009 1637739 3353035 4494285 5282611 5790941 6432896 8112176 10162764 9954083
9706I954083l402397l480678K2561K948857K361598J0411j367496j831485k234222
$$ 9954083 6551686 3071008 3093569 6042426 8404024 8414435 7046939 5215454 2981232
9697B981232j384550J731487M642514L736087m36696l338397k563974q98913j600537
$$ 2981232 1596682 3328169 7970683 11706770 11270074 7931677 5367703 4468790 2868253
9688B868253l234494k322558M79819J174074o95815r63350J663876K303290k130392
$$ 2868253 -366241 -2688799 -2208980 -1034906 -1730721 -2694071 -1030195 1273095 -857297
9679h57297o359364l844553K854394N636523K948924Q48629K323251L400579J336420
$$ -857297 -7216661 -11061214 -8206820 -2570297 378627 1227256 3550507 6951086 8287506
9670H287506p45981j74210P96271J20020k35034Q82226P32972j685935k295102
$$ 8287506 7541525 7367315 8163586 8283606 8048572 8930798 9663770 7977835 5682733
9661E682733J348684M815045L093184j971097n158757n021939l213018o05197
$$ 5682733 7031417 11846462 14939646 12968549 7809792 2787853 -425165 -1030362
9653a030362J544245O80656k305524j990622K974497N405235O9600o548422n091121
$$ -1030362 513883 1194539 -1110985 -3101607 -127110 5278125 5347725 -1200697 -6291818
9644f291818K047517M316193q63309n330231l537452N58445J702248M61720o42754
$$ -6291818 -4244301 71892 -791417 -6121648 -9659100 -9100655 -7398407 -6936687 -7579441
9635g579441j609872k365540r01277K752857M707227K404849j290663j809062
$$ -7579441 -9189313 -11554853 -12456130 -9703273 -4996046 -2591197 -3881860 -5690922
9627e690922J255277L951309K694132j728648m656489k658618J820134L182207
$$ -5690922 -4435645 -484336 2209796 481148 -4175341 -6833959 -5013825 -1831618
9619a831618N32896j102110R32986K608176O38207j417179J66159J829698j104699
$$ -1831618 -1298722 -2400832 -1467846 1140330 1778537 361358 527517 2357215 1252516
9610A252516n345367m646524k45010K165787K534762M209797M699814m73033o610718
$$ 1252516 -4092851 -8739375 -8984385 -6818598 -4283836 -74039 4625775 4152742 -2457976
9601b457976m585619L445851N649298p71332n438087k537287N75207j948934l809841
$$ -2457976 -7043595 -3597744 2051554 1280222 -4157865 -6695152 -6119945 -8068879 -11878720
9592a1878720J392340Q112476Q065938L023929o06420k506830m660187l832032
$$ -11878720 -10486380 -2373904 5692034 8715963 8109543 5602713 942526 -2889506
9584b889506K220910O758283K653001n248457o518068o95493L507760K211472
$$ -2889506 -668596 6089687 8742688 3494231 -3023837 -3719330 -211570 1999902
9576A999902k84778q53839q36761n07518J059690J080599l304170p026236k350294
$$ 1999902 1715124 861285 24524 -482994 576696 1657295 -1646875 -8673111 -11023405
9567a1023405P378320R732193J429720n950059l261378L030033K346341l333778
$$ -11023405 -3645085 6087108 7516828 1566769 -1694609 1335424 3681765 347987
9559C47987m134853J046302L409411q95758m914838k605452J858429J708834j453132
$$ 347987 -3786866 -2740564 668847 -226911 -5141749 -7747201 -5888772 -4179938 -5633070
9550e633070j403838J252943j66212o067721p593814K31756R554176J0194380
$$ -5633070 -7036908 -5783965 -5950177 -12017898 -19611712 -19379956 -9825780 368600
9542C68600L821262l07569p1422j149403m249316k885412L905054P450689L013046
$$ 368600 4189862 3882293 3810871 2661468 -1587848 -4473260 -568206 6882483 9895529
9533I895529k136842r81947J559462j976011p643465o258698J013469M650759
$$ 9895529 7758687 6776740 8336202 6360191 -1283274 -7541972 -6528503 -1877744
9525a877744K270289P72073K970705L219242j203971m319538j460074K900752
$$ -1877744 392545 1164618 4135323 7354565 6150594 1831056 370982 3271734
9517C271734K622102q21124k036610l56077O19483n59976j923281j873445p86574
$$ 3271734 5893836 5072712 3036102 2680025 3299508 2739532 816251 -1057194 -1843768
9508a843768M14218J034866P10426L864j34488J4528m20569n27432J466369M333496
$$ -1843768 -1429550 -394684 315742 319606 185118 199646 -220923 -748355 718014 5051510
9498E051510M048543o69809n642787n886579j226383M034617N565601K445901
$$ 5051510 9100053 8430244 2787457 -3099122 -4325505 -290888 5274713 7720614
9490G720614k203780l701671o28330L081554K937263k14499k222419k254863k658301
$$ 7720614 5516834 1815163 1186833 4268387 7205650 6991151 4768732 2513869 -144432
9481a44432k842084M12963N445323N455838r74845n600104j881256M712288M424515
$$ -144432 -2986516 -2573553 2871770 8327608 7352763 1752659 -128597 4583691 9008206
9472I008206k420820o409449l014110K044175K336711r33303k761458j683122
$$ 9008206 6587386 177937 -2836173 -791998 1544713 611410 -2150048 -3833170
9464c833170J32894J144470J443458R89314m11712j821055j748802l9306J864848
$$ -3833170 -3700276 -2555806 -1112348 -123034 -534746 -2355801 -4104603 -4143909 -2279061
9455b279061K528998J793347N42697k90393l82862Q7792Q38942J449357J218845
$$ -2279061 249937 2043284 2585981 2295588 1912726 2000518 2839460 4288817 5507662
9446E507662j81441j925607k775646k627574k199493j253697J033951L547250
$$ 5507662 5326221 3400614 624968 -2002606 -4202099 -5455796 -4421845 -874595
9438h74595L559658R88372k97277K023720M220903J374843m504118o117281j231245
$$ -874595 2685063 3673435 3376158 5399878 9620781 10995624 6491506 374225 -857020
9429h57020L611305K278342k329583l167586K07859J488746k107430n302798k846472
$$ -857020 2754285 5032627 2703044 -464542 -256683 1232063 -875367 -6178165 -9024637
9420i024637K465992L983913P69730j832276m50396K252395K678210J288133L16115
$$ -9024637 -6558645 -2574732 -1805002 -3637278 -4087674 -1835279 842931 2131064 2447179
9411B447179k94112j638130k543256q42284K729283M721944L129554n65021l437629
$$ 2447179 2153067 514937 -2028319 -2870603 -141320 4580624 7710178 7145157 3707528
9402C707528l659646j330927J616798K675496J366108J4976M87089J248817j87217
$$ 3707528 47882 -1283045 333753 3009249 4375357 4390333 4877422 6126239 5939022
9393E939022k959713l866233k220819o05891n90470p28652L99598J748771J482225
$$ 5939022 2979309 -886924 -3107743 -3713634 -4304104 -5032756 -4633158 -2884387 -1402162
9384a402162o94204l342027l912412j92697O388650R825386N612323k559958o516340
$$ -1402162 -2096366 -5438393 -9350805 -9543502 -3154852 6670534 12282857 9722899 3206559
9375C206559m135288j084835j229621j515466R58754L091947J638585l27316J364398
$$ 3206559 -928729 -2013564 -3243185 -4758651 -3799897 -707950 930635 603319 1967717
9366A967717M195187K809913j896838m035565j740301J086637J412266M038j820936
$$ 1967717 6162904 8972817 7075979 3040414 1300113 2386750 3799016 3803054 1982118
9357A982118l275877k505007J012673L292083O07913l516787k539265K420049
$$ 1982118 -1293759 -3798766 -2786093 505990 1113903 -2402884 -4942149 -2522100
9349b522100L634311q99662m370655k521316J53518o92379j946217J66266K699949
$$ -2522100 1112211 212549 -4158106 -6679422 -6525904 -7218283 -9164500 -8998234 -6298285
9340f298285J553801r96493o55356J501327K175917K181272L255571K664113j951532
$$ -6298285 -4744484 -5740977 -6396333 -4895006 -2719089 -537817 2717754 5381867 3430335
9331C430335n957111l721328J611416K564361n69603q94137K883697M729900K224711
$$ 3430335 -2526776 -6248104 -4636688 -2072327 -2641930 -3536067 -652370 4077530 6302241
9322F302241J11652J106454J574846r68927l655889m428449n183416n807000k555759
$$ 6302241 6413893 7520347 9095193 8126266 4470377 41928 -5141488 -10948488 -13504247
9313a3504247L940951O584159K346823k199218j191557J615222N02607k196731
$$ -13504247 -9563296 -2979137 -632314 -2831532 -4023089 -2407867 -1905260 -4101991
9305d101991j239882J807953K204161J102127K456991M207526J513729l420267
$$ -4101991 -5341873 -3533920 -1329759 -227632 2229359 6436885 7950614 4530347
9297D530347l946207l14026Q05875j894701k471522R43550K228794j905562n332640
$$ 4530347 584140 270114 1075989 -818712 -3290234 -2346684 -117890 -2023452 -7356092
9288g356092j783515N321477P800672L616489j969245l804599j700674P71931
$$ -7356092 -9139607 -3818130 3982542 7599031 5629786 1825187 124513 896444
9280H96444J56401l115773m442686o58378M755338N824097K747737J031589J898300
$$ 896444 1052845 -2062928 -6505614 -7163992 -2408654 3415443 6163180 7194769 9093069
9271I093069M72471m515916o624034j636578M648776M343201j399210n240917
$$ 9093069 9565540 5049624 -1574410 -3210988 1437788 5780989 4381779 -859138
9263h59138m334829j971789o18913P44058K912128M669804M587602J782440l659415
$$ -859138 -5193967 -7165756 -7784669 -7040611 -4128483 541321 5128923 6911363 3251948
9254C251948q410161o936684J258865Q279677O690133m34396l765335m47596L475865
$$ 3251948 -5158213 -12094897 -10836032 -2556355 4133778 3699382 -65953 -513549 2962316
9245B962316K900839k65070j942984j609220j212434j849510l028823l035009
$$ 2962316 5863155 5598085 3655101 2045881 833447 -1016063 -4044886 -7079895
9237g079895m7400M742161O431432K357781k845958k846079J068015K011879j777404
$$ -7079895 -7127295 -2385134 4046298 6404079 3558121 712042 1780057 3791936 2014532
9228B014532m882620l864974j510788l25415J168265L019808J812398k226407
$$ 2014532 -2868088 -6733062 -8243850 -8569265 -7401000 -4381192 -2568794 -4795201
9220d795201k943155K028938N790404K535291k559031j430903L591643L598046
$$ -4795201 -7738356 -5709418 80986 2616277 57246 -1373657 2217986 5816032
9212E816032k463142o551589m295034j11530J588133K232476L672580L987654
$$ 5816032 3352890 -3198699 -7493733 -7605263 -6017130 -3784654 -112074 3875580
9204C875580K075945O55110J129989N14404k833646n120480l023021M13220O23483
$$ 3875580 5951525 6606635 7736624 8251028 5417382 296902 -2726119 -2312899 -1689416
9195a689416j014998J2401L230357L698053K50508k223768o1460L683152L391698
$$ -1689416 -2704414 -2692013 538344 4236397 4486905 2263137 2201677 5884829 9276527
9186I276527j553195n694910l923555K121345N234874J137463n404629n875176
$$ 9276527 7723332 2028422 -1895133 226212 5461086 6598549 1193920 -4681256
9178d681256N83995N404427K320842l733851l974931J374277L890822k96310n094673
$$ -4681256 -4097261 1307166 3628008 -105843 -4080774 -2706497 1184325 888015 -4206658
9169d206658l469099L042300O768879L283545m012344p666947l770123L551338
$$ -4206658 -7675757 -4633457 2135422 5418967 1406623 -6260324 -10030447 -6479109
9161f479109O148187J715585k785289p42952M139237L350231k866369n453217
$$ -6479109 -330922 1384663 -1400626 -2143578 1995659 5345890 2479521 -2973696
9153b973696o73265M257459K848739j317057k059520n63424j212281k757167j172371
$$ -2973696 -3646961 610498 3459237 2142180 82660 -480764 -1693045 -4450212 -5622583
9144e622583K176426K709317P49560L63141J631644J046914j298261j776536j62879
$$ -5622583 -3446157 -736840 12720 375861 2007505 3054419 1756158 -20378 -183257
9135a83257J51213j062619n20335J699863J741918n55370p78667J686427J674334
$$ -183257 -32044 -1094663 -1614998 84865 1826783 1271413 492746 2179173 3853507
9126C853507k304599l775951J675139P990099O445073j880767p742326o019228
$$ 3853507 1548908 -2227043 -551904 7438195 13883268 12002501 4260175 -1759053
9118a759053p26160J933855Q15358r68825j116028n29493j150865k459662j551740
$$ -1759053 -2485213 -551358 264000 -704825 -1820853 -2350346 -3501211 -5960873 -7512613
9109g512613K350708N311482L420685j058640k211165J084962L660399J783722
$$ -7512613 -5161905 149577 3570262 2511622 300457 1385419 5045818 6829540
9101F829540j982147l233725j225761J835406L694540K820821n54809l274758
$$ 6829540 4847393 1613668 387907 2223313 5917853 8738674 8183865 4909107
9093D909107k528026m89445j317746l638092k045633L154697M994469R26627k789288
$$ 4909107 2381081 1891636 573890 -3064202 -5109835 -1955138 3039331 3965958 1176670
9084A176670j521836O17564p64991k331483k03966J703665j208246m458583j253291
$$ 1176670 -345166 272398 -492593 -2824076 -3028042 -1324377 -2532623 -6991206 -8244497
9075h244497N019902N171452j058476m757195j999238J327742J99010k477807
$$ -8244497 -3224595 1946857 888381 -3868814 -5868052 -4540310 -4341300 -6819107
9067f819107k088490J014622L899709N144800M340015J532285j401321k281652
$$ -6819107 -8907597 -7892975 -3993266 1151534 5491549 7023834 5622513 3340861
9059C340861j933894k450858k741031k80082L266196L416886J930k308449j156632
$$ 3340861 1406967 -1043891 -3784922 -4065004 -798808 2618078 2620008 311559 -845073
9050h45073Q37116J338111J331156J720008J307155m20137j984686k300532j534198
$$ -845073 -7957 1330154 2661310 4381318 5688473 5268336 3283650 983118 -551080
9041e51080K15930K178511J994719j024339l491466k642283q10150o03996N95267
$$ -551080 -335150 1843361 3838080 2813741 -677725 -3320008 -4130158 -4734154 -4138887
9032d138887M909968P004506J700210m964533l288385L540308L299532m779746
$$ -4138887 771081 7775587 9475797 4511264 1222879 4763187 8062719 3282973
9024C282973p703442o0265O874653L825728k160824j228246L040025K043408k263167
$$ 3282973 -4420469 -4480734 2393919 6219647 4058823 2830577 5870602 7914010 5650843
9015E650843k442706K36504j028325n391529o027074k513233p70808j971546j488529
$$ 5650843 3208137 3444641 2416316 -2975213 -9002287 -11515520 -12286328 -14257874 -15746403
9006a5746403J550467K877059J478543J006285K166451J457927j439670k159477
$$ -15746403 -14195936 -11318877 -9840334 -8834049 -6667598 -5209671 -6649341 -8808818
8998h808818R30337L972090L845609J826769j42905j835338k399778m24842K696465
$$ -8808818 -7878481 -3906391 -60782 1765987 1623082 -212256 -2612034 -3036876 -340411
8989c40411L750224K534063J497871P16597j798813m696602l844666O43852L411034
$$ -340411 3409813 5943876 7441747 8158344 6359531 1662929 -2181737 -1537885 1873149
8980A873149J682180r05162n88893J011000P00812p30183m55786J127282P75269
$$ 1873149 3555329 2650167 2061274 3072274 3773086 3042903 2587117 3714399 4489668
8971D489668k401582m822116k596928K991799N798277J994908m145407m864374
$$ 4489668 2088086 -2734030 -5330958 -2339159 3459118 5454026 1308619 -3555755
8963c555755N72578M535556K008961k370629k164927J012794J351409j267114
$$ -3555755 -2983177 1552379 3561340 1190711 -974216 38578 1389987 122873
8955A22873k158228k82895J213095J484373K166890K212828l97410k688367n8503
$$ 122873 -2035355 -2318250 -1105155 379218 2546108 4758936 4361526 1673159 1614656
8946A614656M764015M385518j157963l739832k26580K776847L22536l456993l649083
$$ 1614656 6378671 10764189 9606226 5866394 5639814 8416661 8739197 5282204 1633121
8937A633121k170002j735909K53457N296367P755772K817584m362158n316150
$$ 1633121 -536881 -2272790 -2019333 3277034 11032806 13850390 9488232 4172082
8929D172082p45509J396855j670840m583475k993656P82489K403055J190045l05207
$$ 4172082 3426573 4823428 3152588 -1430887 -4424543 -3642054 -1238999 -48954 -354161
8920c54161J02551J834645J916347j260078m321315k207403L882679O434950K082720
$$ -354161 -251610 1583035 3499382 2239304 -2082011 -4289414 -406735 6028215 8110935
8911H110935k969946k135442J903931K444174l89509r18957K340755N020404L908890
$$ 8110935 5140989 3005547 4909478 7353652 6964143 6045186 8385941 13406345 17315235
8902A7315235j91102n529012r887202r468755l128240L598727M593924J743569
$$ 17315235 17124133 11595121 1707919 -7760836 -10889076 -7290349 -2696425 -952856
8894i52856J108242K595852J390959j794354j486162J405151k07238o067906o410044
$$ -952856 155386 2751238 4142197 2347843 861681 2266832 2059594 -4008312 -10418356
8885a0418356J910226P856720K393052o837032o751521J815547O884280L618060
$$ -10418356 -8508130 -651410 1741642 -5095390 -11846911 -10031364 -3147084 470976
8877D70976j237223j995619o63993J10312J563373L603932K575920k169391n243729
$$ 470976 -766247 -2761866 -3425859 -3315547 -1752174 1851758 4427678 2258287 -2985442
8868b985442k579283K558761M526655K794056R73949J009204J750158J711916
$$ -2985442 -5564725 -3005964 1520691 4314747 5288696 6297900 8048058 9759974
8860I759974M13096k025878m459761m694865j667839K744326N155742L626971
$$ 9759974 10173070 8147192 3687431 -1007434 -2675273 69053 5224795 8851766
8852H851766r44094n426923o505650l607239P6071J018177k63612k42981K179500
$$ 8851766 7907672 2480749 -4024901 -7632140 -7556069 -6537892 -6801504 -7044485 -4864985
8843d864985L856046J927516j983222l515187m20814M958061P352138L338657
$$ -4864985 -1008939 918577 -1064645 -4579832 -5000646 -42585 7309553 10648210
8835A0648210m114776p337693k871457L040611K135931m078066o299197j240247
$$ 10648210 6533434 -804259 -3675716 -635105 1500826 -2577240 -8876437 -10116684
8827a0116684L941684L301413M68395P17645J844634j96202k323934M89139M965468
$$ -10116684 -6175000 -2873587 -2405192 -1687547 157087 -39115 -2363049 -1873910 3091558
8818C091558L878632j350255k401746J698275K559453k921829o107051k61472
$$ 3091558 6970190 5619935 3218189 4916464 7475917 4554088 -1552963 -1814435
8810a814435P701237O827275j887342p512769m769347M04665J103542j418270
$$ -1814435 5886802 12714077 10826735 3313966 -1455381 -1050716 52826 -1365444
8802a365444j434758K462803N673218L807668j573443m551111k172670J393183
$$ -1365444 -2800202 -337399 5335819 9143487 7570044 3018933 846263 2239446
8794B239446J83493m875603o388058o68362O482609P131472J417909l487183l078140
$$ 2239446 2422939 -2452664 -8840722 -9509084 -3026475 4104997 5522906 2035723 -1042417
8785a042417j4120J058656m49628j622640n91163J220212J151197j228462l379224
$$ -1042417 -1056537 2119 -447509 -2070149 -2661312 -1441100 -289903 -1518365 -4897589
8776d897589k893671n38635J124341J460212J857917K344653J141689j659502
$$ -4897589 -7791260 -8329895 -7205554 -5745342 -3887425 -1542772 -401083 -2060585
8768b060585l115137j653235N39805J154687R92145J407603J321919m55334k273920
$$ -2060585 -5175722 -6828957 -6289152 -5134465 -4142320 -2734717 -1412798 -1868132 -4142052
8759d142052k000014l86691P64077J766983L248669L272830J00704l667055l840397
$$ -4142052 -6142066 -6528757 -5764680 -3997697 -749028 2523802 2624506 -1042549 -4882946
8750d882946p73421J267991N58049l10872N42386J340386L7108k194174k509021
$$ -4882946 -5656367 -4388376 -3830327 -4141199 -3598813 -2258427 -2221319 -4415493 -6924514
8741f924514M5712L462464M580238K129025j397189k021422O69206K758316J742856
$$ -6924514 -6878802 -3416338 1163900 3292925 1895736 -125686 543520 3301836 5044692
8732E044692J11381M86579N92106k422423n439375l267148K191366L473065j262061
$$ 5044692 5156073 5642652 6234758 3812335 -1627040 -4894188 -2702822 770243 -491818
8723d91818n241121l177036J741693L956578L259923K457190J637213n88806k967759
$$ -491818 -5732939 -8909975 -7168282 -3211704 48219 2505409 4142622 3553816 586057
8714E86057l178437j837404j234427j412383p44030Q45949K283117L707470N332434
$$ 586057 -2592380 -4429784 -5664211 -7076594 -7820624 -6974675 -4691558 -984088 4348346
8705D348346N167464J432522l394243m693928k030784K21720o34518k023849p31205
$$ 4348346 9515810 10948332 7554089 2860161 829377 1051097 416579 -1607270 -2338475
8696b338475J927407K419094O04905l06739J115438K648422K107516L5448k308096
$$ -2338475 -411068 2008026 2612931 2306192 3421630 6070052 8177568 8213016 5904920
8687E904920m712254n982446l283093L267995P983456O091685J081598L6481K567862
$$ 5904920 1192666 -4789780 -8072873 -4804878 3178578 9270263 10351861 10388342 12956204
8678A2956204J430053n001783r001955n652948o93218m37075j287693K568891
$$ 12956204 14386257 9384474 382519 -5270429 -5963647 -6400722 -7688415 -5119524
8670e119524P218171N151135p16733j022317L646331L111066m458043q047722
$$ -5119524 2098647 7249782 6533049 5510732 9157063 12268129 7810086 -237636
8662b37636j617576N728207M472211q73765j232840J600789P588m676170m425746
$$ -237636 -1855212 3872995 8345206 7471441 6238601 7839390 7846978 3170808 -1254938
8653a254938Q52875K612495j950011n129259j080217N395613O594176K389323
$$ -1254938 -402063 2210432 260421 -4868838 -5949055 -553442 6040734 8430057
8645H430057j635607k565126k168444k527550l316508l088686j261308J271422
$$ 8430057 6794450 4229324 2060880 -466670 -3783178 -6871864 -8133172 -6861750
8637f861750K882476K725246J350251n10994k812568m965951n158366k559517
$$ -6861750 -3979274 -1254028 96223 -414771 -3227339 -8193290 -13351656 -15911173
8629a5911173R08797K761711K848648K429312J812487R02502N29756R34293N18840
$$ -15911173 -15002376 -12240665 -9392017 -6962705 -5150218 -4247716 -3717960 -2783667 -2264827
8620b264827j405688k508101j055033M44532r01708k710147m67841M535585N992864
$$ -2264827 -3670515 -6178616 -7233649 -6789117 -7690825 -10400972 -10868813 -6333228 -340364
8611c40364J826290k747272l061396r77817l75851r19093j2655J893711K054335
$$ -340364 1485926 -1261346 -4322742 -5300559 -5676410 -6595503 -6608158 -4714447 -2660112
8602b660112K69412o03153R58913K815595K070766r99885k978943j327460K186515
$$ -2660112 -2390700 -2993853 -2034940 780655 2851421 1851536 -1127407 -2454867 -268352
8593b68352L174173J46981l216305k850036J29027J217763r05285k850189j853656
$$ -268352 2905821 3052802 -163503 -3013539 -2884512 -1666749 -2572034 -5422223 -7275879
8584g275879N17080J300537L59403j15699J034126K583513K509939M26899j392345
$$ -7275879 -6758799 -5458262 -5098859 -5214558 -4180432 -1596919 913020 1339919 -52426
8575e2426k03961L098868L695526j072908o822476o807005q12736M607682M854705
$$ -52426 -256387 2842481 6538007 5465099 -1357377 -8164382 -8977118 -4369436 485269
8566D85269J908523n66283k042703k986142k164719P96207L316421L351760K404563
$$ 485269 2393792 1827509 -215194 -3201336 -5366055 -4569848 -1253427 2098333 4502896
8557D502896K396436K347880J059387Q6310N36064j51286l918789p122384m994205
$$ 4502896 6899332 9247212 10306599 10392909 10928973 10777687 6858898 -263486 -5257691
8548e257691N16739K932562O65942j491986o20857N87578Q281J72047K851819
$$ -5257691 -4740952 -1808390 -1142448 -2634434 -3255291 -2667713 -2659432 -2487385 364434
8539C64434M361593Q95455m494860n276599m67286M310972M628056J927285l99228
$$ 364434 4726027 5621482 1126622 -4149977 -4617263 -306291 4321765 6249050 5849822
8530E849822j813803l294237l813834j513236K126056K536151j997962o717870
$$ 5849822 4036019 741782 -3072052 -4585288 -2459232 76919 -1921043 -8638913
8522h638913n479808R84789N207927K680464j898594j361584L332114M477415
$$ -8638913 -14118721 -13133932 -7926005 -5245541 -7144135 -8505719 -5173605 -696190
8514f96190n36944m804422k119431L439189L305378k956839o946525l204935L846858
$$ -696190 -1233134 -6037556 -8156987 -4717798 -1412420 -4369259 -11315784 -14520719 -10673861
8505a0673861O534611L272700j423447l292610j557500K360915O035310O557502
$$ -10673861 -4139250 -866550 -2289997 -5582607 -7140107 -4779192 1256118 7813620
8497G813620K849365k243441m405512k901622j187844j775073k709364r62563
$$ 7813620 10662985 8419544 4014032 1112410 -75434 -1850507 -4559871 -5522434
8489e522434K367274L186735N25963j721276o14475J138598o51110m526775m734585
$$ -5522434 -3155160 31575 557538 -1163738 -1778213 -639615 -1290725 -5817500 -10552085
8480a0552085J37094M453718L557770M22706N35845L116763K600267k157248n626637
$$ -10552085 -10414991 -5961273 -2403503 -1980797 -1444952 1671811 4272078 2114830 -3511807
8471c511807l527104J562255M478649L781989J467768o57379j626737n81594J793303
$$ -3511807 -7038911 -5476656 -998007 2783982 4251750 3594371 1967634 1386040 3179343
8462C179343K567639j44909m145011n487605l072626P39985L105366K766344L21993
$$ 3179343 5746982 5602073 1457062 -4030543 -7103169 -6363184 -3257818 -491474 -169481
8453a69481k009933k003993p8271J064440M35702R5359J017865P86850j757356
$$ -169481 -2179414 -4183407 -4261678 -3197238 -2761536 -2666177 -1648312 -861462 -2618818
8444b618818k725515J562039P514126P653141P24842o327538p111853k481448
$$ -2618818 -5344333 -3782294 3731832 11384973 12109815 5782277 -1329576 -3811024
8436c811024K396514L940059J809073k080753m491499l194590J92299J556254
$$ -3811024 -1414510 2525549 4334622 2253869 -2237630 -5432220 -5239921 -3683667
8428c683667o21082l393180l265111j35888L248779M090577J534702k415117m053751
$$ -3683667 -4304749 -7697929 -10963040 -11098928 -7850149 -3759572 -2224870 -4639987 -8693738
8419h693738j831668J483964K561712K195244L155364M656534L406726j27640
$$ -8693738 -10525406 -9041442 -6479730 -4284486 -1129122 3527412 6934138 6806498
8411F806498j543165M91800J911646k37760l330194l604264j408309N58372J233631
$$ 6806498 5263333 5755133 7666779 7429019 4098825 494561 -913748 -355376 878255
8402H78255J076554N18584L48025J163288J350888j241688m733647m403597J63328
$$ 878255 1954809 2473393 2821418 3984706 5335594 4093906 -639741 -5043338 -4880010
8393d880010L752053L295657J845502K029510J253416k257417m070214k56451
$$ -4880010 -1127957 2167700 4013202 6042712 7296128 5038711 968497 712046
8385G12046M499530K485997n320518r837929n931889J620738M866894J402995
$$ 712046 5211576 7697573 2377055 -7460874 -13392763 -11772025 -6905131 -5502136
8377e502136m258305n435145M57851Q560925J0758036M931587k307276m172753
$$ -5502136 -9760441 -15195586 -14737735 -6176810 4581226 9512813 7205537 3032784
8369C032784j572769O22555J166406J651737J525373n60882k660578k111057l10595
$$ 3032784 1460015 2082570 3248976 4900713 6426086 5865204 3204626 1093569 782974
8360G82974J263j64068J010207J015345k684575n897368k942327L172681M366126
$$ 782974 784237 620169 1630376 2645721 -38854 -5936222 -8878549 -5705868 -1339742
8351a339742M88348o22587L239438M816191n7179n317568m685954j011032j25668
$$ -1339742 -851394 -1473981 1765457 6581648 6524469 1206901 -3479053 -4490085 -4615753
8342d615753j716890k131493j226482o97428L43299K703972L567543Q95188j707062
$$ -4615753 -6332643 -8464136 -9690618 -10388046 -10044747 -7340775 -3773232 -2878044 -4585106
8333d585106R6544M030587M261216K83898k534862r12329K409086L182782P75495
$$ -4585106 -4488562 -457975 3803241 4087139 1552277 639948 3049034 6231816 7007311
8324G007311k114546k896517j575766l94681p46687q49641J662393N155485N259557
$$ 7007311 4892765 1996248 420482 25801 -720886 -1570527 91866 5247351 10506908
8315A0506908J301740k368754k906807k610738l670025l652368j4658M350679
$$ 10506908 11808648 9439894 6533087 3922349 252324 -3400044 -3414702 935977
8307I35977M590348Q18224k494250k555466k03661K602575L835236J529038l547349
$$ 935977 5526325 6344549 3850299 1294833 1091172 3693747 7528983 9058021 5510672
8298E510672o651365m095387J457359M111229K201911p80078j829494j222987
$$ 5510672 -1140693 -5236080 -3778721 332508 2534419 1754341 -75153 -1298140
8290a298140J0889J655645K848030K159033k6153j466632j010846J68768N09165
$$ -1298140 -1287251 368394 3216424 5375457 5349304 3882672 2871826 3040594 3549759
8281C549759l38817j807863k923795k828198j993209k053171l044790k272387
$$ 3549759 3210942 1403079 -1520716 -4348914 -6342123 -8395294 -11440084 -13712471
8273a3712471J869337O278418O314055K002064j977394k486259j043713j53631
$$ -13712471 -11843134 -5564716 749339 2751403 774009 -1712250 -2755963 -2909594
8265b909594L74873J662561K581222J071773j935703k638902M60750L458103J768876
$$ -2909594 -2534721 -872160 1709062 2780835 845132 -1793770 -1333020 2125083 3893959
8256C893959k648794k783496K996143O459405L42032r423033r821671R55938R775278
$$ 3893959 1245165 -1538331 1457812 7917217 8259249 -1163784 -10985455 -10029517 -254239
8247b54239O366578k884324n103381J008066N559458K986806j729103k653029
$$ -254239 6112339 3228015 -1875366 -867300 4692158 7678964 5949861 3296832
8239C296832q95435l62666j178795j049320J97329R91922J272736K370067L952005
$$ 3296832 2401397 2038731 859936 -189384 7945 999867 2272603 4642670 8594675
8230H594675L254195j559575p746185r349293l892587L180115L914180j864125
$$ 8594675 11848870 10289295 2543110 -6806183 -10698770 -7518655 -3604475 -5468600
8222e468600n627472j541733N379570O383127R73447l351352j751421K817716
$$ -5468600 -11096072 -12637805 -7258235 -875108 98339 -3253013 -5004434 -2186718
8214b186718M937331K737506j780309m812022k998867L011217P355044M871524
$$ -2186718 2750613 5488119 3707810 -1104212 -4103079 -1091862 6263182 11134706
8206A1134706j850008n194235k476203J082613L13314l223867m661008k585588
$$ 11134706 9284698 4090463 1614260 2696873 3010187 -213680 -4874688 -7460276
8198g460276L99660J910201J892880J167346j04050j926009l101076j524658K913823
$$ -7460276 -7060616 -5150415 -3257535 -2090189 -2194239 -4120248 -7221324 -8745982 -5832159
8189e832159O403906M886047p963k307631l53018N43314k899679n521776j823064
$$ -5832159 571747 5457794 5449831 3142200 2789182 3332496 432817 -5088959 -6912023
8180f912023L970869L573130k173134m440060l51877L087501P67031k967789k106211
$$ -6912023 -2941154 631976 -1541158 -5981218 -6333095 -3245594 -2478563 -5446352 -7552563
8171g552563K115742M360715K644822j066299m115573m204366n92279L637886
$$ -7552563 -5436821 -1076106 1568716 502417 -3613156 -7817522 -8409801 -4771915
8163d771915M054022J083619l94387J240836K319846J077394N93165J917331J022329
$$ -4771915 -717893 365726 -28661 1212175 3532021 4609415 5202580 7119911 8142240
8154H142240l380009n627104j993879K300135J234240k314856k179167N20420
$$ 8142240 4762231 -864873 -2858752 -558617 675623 -1639233 -3818400 -3297980
8146c297980N73976j117890M01816L829238K800472k533225m237118J098805O695534
$$ -3297980 -2724004 -3841894 -3440078 389160 3189632 656407 -3580711 -2481906 4213628
8137D213628N567205j56689l817037l278413j278846j94173m10554j769395l338608
$$ 4213628 9780833 9624144 5807107 2528694 1249848 1055675 645121 -1124274 -4462882
8128d462882l079493k79472K659741K867896O88492r57729m12386J015298J268159
$$ -4462882 -7542375 -7821847 -5162106 -2294210 -1605718 -2563447 -2975833 -1960535 -692376
8119f92376L33264p3785N80734M99657j464594l032650j375043J838437K037273
$$ -692376 -359112 -432897 147837 647494 -817100 -3849750 -5224793 -3386356 -1349083
8110a349083j121699k700957k56686K244769J394933K32776K409788M839468K386462
$$ -1349083 -2470782 -5171739 -5428425 -3183656 -1788723 -1555947 853841 5693309 8079771
8101H079771l124040n372523l210275j005399l96627J135070L506297L037928
$$ 8079771 4955731 -416792 -3627067 -4632466 -5029093 -3894023 -387726 2650202
8093B650202o41189l131702k195768l20762Q35929K439182L613254J319638k869596
$$ 2650202 2009013 -1122689 -3318457 -3639219 -2803290 -364108 3249146 4568784 1699188
8084A699188k916506J832848M105391k6260m464349k954867J034898R70640j819509
$$ 1699188 -1217318 615530 4720921 4694661 230312 -2724555 -1689657 -719017 -2538526
8075b538526j621532J317439K152787P12592J213082L631869L076666j795436
$$ -2538526 -4160058 -2842619 -689832 22760 1235842 4867711 7944377 6148941
8067F148941o349861o961079m814934j837608J779145M767292M598224J806144
$$ 6148941 -200920 -7161999 -11976933 -13814541 -12035396 -7268104 -2669880 -863736
8059h63736J05281O46205M55546j762286k831524o11246J869755J167151q99547
$$ -863736 -758455 -112250 343296 -1418990 -4250514 -4861760 -2992005 -1824854 -2724401
8050b724401k67957K577443K957957j024271n142038l943159K438817P811056
$$ -2724401 -2992358 -414915 2543042 1518771 -3623267 -7566426 -5127609 2683447
8042B683447O520469j55789n424318m913805j267289M35247n13063j058787r3429
$$ 2683447 9203916 9048127 3623809 -1289996 -2557285 -2122038 -2635101 -3693888 -3787317
8033c787317M80062L4803M07203K046735K731499J400462j49332q72359k281942
$$ -3787317 -3307255 -3272452 -2865249 -818514 1912985 3313447 3164115 2291756 9814
8024I814m600026m583450k50052M900869N924594K960600K40181k61404m93361
$$ 9814 -4590212 -9173662 -9423714 -4522845 1401749 4362349 4602530 4341126 3847765
8015C847765j930879l108010k405463n94543P08224J286139J696224J649788L87518
$$ 3847765 1916886 -1191124 -3596587 -4191130 -3482906 -2196767 -500543 1149245 1536763
8006A536763j818924l464683l000533j7949M133787O578722M790247n62754n132747
$$ 1536763 -282161 -3746844 -6747377 -6765326 -2631539 3947183 8737430 8174676 3041929
7997C041929m904100r72299J415289m73175l121672j825666K191288L267759m48889
$$ 3041929 -1862171 -2834470 -1419181 -1892356 -5014028 -6839694 -4648406 -1380647 -1829536
7988a829536m386958m246473j256863J335369L069305M414001L717794J91467
$$ -1829536 -6216494 -10462967 -11719830 -10384461 -7315156 -2901155 816639 1008106
7980A008106k810554j999477N99017J174582M63150J209818J811742q12309l848003
$$ 1008106 -1802448 -3801925 -3202908 -2028326 -1565176 -355358 1456384 644075 -3203928
7971c203928k027721K278598J403461m422668n983352J63813N831208M667369
$$ -3203928 -5231649 -2953051 -1549590 -5972258 -11955610 -11791797 -5960589 -1293220
7963a293220J604757K321609K794216j667467n153618j24599Q071076P862712
$$ -1293220 311537 2633146 5427362 3759895 -1393723 -1518322 6552754 14415466
7955A4415466m88149n682547l077293M11645k06416j214583L78227R90690j744198
$$ 14415466 13927317 8244770 5167477 5579122 5372706 4158123 4536350 5527040 3782842
7946C782842l912790k574573q58893j463585j659212P59909K549562P40679j790501
$$ 3782842 -129948 -2704521 -3563414 -5026999 -6686211 -5926302 -3376740 -2636061 -4426562
7937d426562r70399K401252M819804M433226Q31933m866961p953384m054578L028062
$$ -4426562 -5396961 -2995709 1824095 6257321 7089254 2222293 -5731091 -9785669 -6757607
7928f757607M615902M63070l12738M800036N922271k144391q583433l106522O065997
$$ -6757607 -2141705 -1678635 -1991373 2808663 8730934 6586543 -1996890 -5103412 962585
7919I62585M651003m477261o470089J040440N690241K176259o99491K175138L301411
$$ 962585 5613588 1136327 -5333762 -4293322 1396919 3573178 2873687 5048825 8350236
7910H350236k484156p886567n801811o47521J251164K362607N985843O932516
$$ 8350236 5866080 -2020487 -7822298 -8469819 -7218655 -4856048 1129795 8062311
7902H062311O59535n799434l364837M035879N307048o74031n006554l578917q52764
$$ 8062311 8721846 2922412 -442425 3593454 8900502 8226471 3219917 -359000 -1211764
7893a211764L53775K152192M004084J848869l306936m856128j153762J509901
$$ -1211764 -857989 1294203 5298287 7147156 3840220 -1015908 -2169670 -659769
7885f59769n72098k739368m90821L064295K897045j31454j676518k06597K614159
$$ -659769 -1231867 -3971235 -4462056 -1397761 1499284 1367830 -308688 -515285 2098874
$$ [...]
##END NTUPLES=NMR SPECTRUM
##END=
