##TITLE=31Pdec_SR36_oil2
 CDCl3, 84 sc
 12.05.2021
##JCAMPDX= 6.0         $$ Bruker NMR JCAMP-DX V2.0
##DATA TYPE= NMR SPECTRUM
##DATA CLASS= NTUPLES
##ORIGIN= UXNMR, Bruker Analytische Messtechnik GmbH
##OWNER= root
$$ XWIN-NMR		Version 3.5
$$ Wed May 12 13:26:00 2021 Russian Standard Time (UT+4h)  she@DPX200
##.OBSERVE FREQUENCY= 81.013821
##.OBSERVE NUCLEUS= ^31P
##.ACQUISITION MODE= SIMULTANEOUS
##.ACQUISITION SCHEME= undefined
##.AVERAGES= 84
##.DIGITISER RES= 16
##SPECTROMETER/DATA SYSTEM= spect
##.PULSE SEQUENCE= zgpg30
##.SOLVENT NAME= CDCl3
##.SHIFT REFERENCE= (INTERNAL, CDCl3, 0, 248.564)
##AUDIT TRAIL= $$ (NUMBER, WHEN, WHO, WHERE, WHAT)
$$ ##TITLE= Audit trail, XWIN-NMR		Version 3.5
$$ ##JCAMPDX= 5.01
$$ ##ORIGIN= Bruker BioSpin GmbH
$$ ##OWNER= she
$$ F:/spectra/data/she/nmr/P31/1/pdata/1/auditp.txt
$$ ##AUDIT TRAIL=  $$ (NUMBER, WHEN, WHO, WHERE, WHAT)
(   1,<2021-05-12 13:24:58.26 +0400>,<she>,<DPX200>,
      <continue with go, POWCHK disabled, PULCHK disabled
       configuration hash MD5:
       00 E9 B6 7A A2 85 ED C7 34 08 36 98 17 FE 4E 26
       data hash MD5: 32K
       B5 73 4F B1 8B 4D 98 AA E6 60 22 69 30 1E 8F 61>)
(   2,<2021-05-12 13:25:00.53 +0400>,<she>,<DPX200>,
      <Start of raw data processing
       efp BC_mod = 2 LB = 1 FT_mod = 6 PKNL = 1 PHC0 = -6308.633 PHC1 = 335.0007 SI = 64K 
       data hash MD5: 64K
       F0 E9 46 B7 72 F6 BC 6C 6D C2 A6 E9 52 E8 2B FD>)
(   3,<2021-05-12 13:25:28.64 +0400>,<she>,<DPX200>,
      <pk PHC0 = -106.511 PHC1 = 250.7999 
       data hash MD5: 64K
       DB 69 F3 78 E0 69 8D 66 97 D0 B5 E6 21 93 DD 60>)
(   4,<2021-05-12 13:25:32.81 +0400>,<she>,<DPX200>,
      <abs ABSG = 5 
       data hash MD5: 64K
       6B 6C 49 06 5D 76 B5 62 FA BD 1B 3D D2 C2 6B 92>)
$$ ##END=
$$ 
$$ hash MD5
$$ 37 83 89 98 C5 61 96 6E 95 7A 4E E4 66 D2 17 7A
##$RELAX= 
##$RELAX= 
##$RELAX= 
##$RELAX= 
##$RELAX= 
##$RELAX= 
##$RELAX= 
##$RELAX= 
$$ Bruker specific parameters
$$ --------------------------
##$DU= <F:/spectra>
##$EXPNO= 1
##$NAME= <P31>
##$PROCNO= 1
##$TYPE= <nmr>
##$USER= <she>
##$AMP= (0..31)
100 100 100 100 100 100 100 100 100 100 100 100 100 100 100 100 100 100 
100 100 100 100 100 100 100 100 100 100 100 100 100 100 
##$AQSEQ= 0
##$AQ_mod= 1
##$AUNM= <au_zg>
##$AUTOPOS= <>
##$BF1= 81.014009
##$BF2= 200.13
##$BF3= 200.13
##$BF4= 200.13
##$BF5= 200.13
##$BF6= 200.13
##$BF7= 200.13
##$BF8= 200.13
##$BYTORDA= 1
##$CFDGTYP= 0
##$CFRGTYP= 5
##$CHEMSTR= <none>
##$CNST= (0..31)
1 1 145 1 1 1 1 1 1 1 1 1 1 1 1 1 1 1 1 1 1 1 1 1 1 1 1 1 1 1 1 1 
##$CPDPRG= <waltz16>
##$CPDPRG1= <>
##$CPDPRG2= <waltz16>
##$CPDPRG3= <>
##$CPDPRG4= <mlev>
##$CPDPRG5= <mlev>
##$CPDPRG6= <mlev>
##$CPDPRG7= <mlev>
##$CPDPRG8= <mlev>
##$CPDPRGB= <>
##$CPDPRGT= <>
##$D= (0..31)
0 1 0 0 0 0 0 0 0 0 0 0.03 2e-05 3e-06 0 0 0 0 0 0 0 0 0 0 0 0 0 0 0 0 
0 0 
##$DATE= 1620811385
##$DBL= (0..7)
120 120 120 11 120 120 24 19 
##$DBP= (0..7)
150 150 150 150 150 150 150 150 
##$DBP07= 0
##$DBPNAM0= <>
##$DBPNAM1= <>
$$ [...]
##$SUBNAM3= <"">
##$SUBNAM4= <"">
##$SUBNAM5= <"">
##$SUBNAM6= <"">
##$SUBNAM7= <"">
##$SUBNAM8= <"">
##$SUBNAM9= <"">
##$SW= 501.771253377433
##$SWIBOX= (0..15)
0 1 3 0 0 0 0 0 0 0 0 0 0 0 0 0 
##$SW_h= 40650.406504065
##$TD= 32768
##$TD0= 1
##$TE= 0
##$TE2= 300
##$TE3= 300
##$TEG= 300
##$TL= (0..7)
0 120 53 12 22 120 120 120 
##$TP= (0..7)
150 150 150 150 150 150 150 150 
##$TP07= 0
##$TPNAME0= <>
##$TPNAME1= <>
##$TPNAME2= <>
##$TPNAME3= <>
##$TPNAME4= <>
##$TPNAME5= <>
##$TPNAME6= <>
##$TPNAME7= <>
##$TPOAL= (0..7)
0.5 0.5 0.5 0.5 0.5 0.5 0.5 0.5 
##$TPOFFS= (0..7)
0 0 0 0 0 0 0 0 
##$TUNHIN= 0
##$TUNHOUT= 0
##$TUNXOUT= 0
##$USERA1= <user>
##$USERA2= <user>
##$USERA3= <user>
##$USERA4= <user>
##$USERA5= <user>
##$V9= 5
##$VALIST= <valist>
##$VCLIST= <CCCCCCCCCCCCCCC>
##$VD= 0
##$VDLIST= <DDDDDDDDDDDDDDD>
##$VPLIST= <PPPPPPPPPPPPPPP>
##$VTLIST= <TTTTTTTTTTTTTTT>
##$WBST= 1024
##$WBSW= 4
##$XGAIN= (0..3)
0 0 0 0 
##$XL= 0
##$YL= 0
##$YMAX_a= 18880
##$YMIN_a= -19671
##$ZGOPTNS= <>
##$ZL1= 120
##$ZL2= 120
##$ZL3= 120
##$ZL4= 120
##$ABSF1= 248.5645
##$ABSF2= -253.2056
##$ABSG= 5
##$ABSL= 3
##$ALPHA= 0
##$AQORDER= 0
##$ASSFAC= 0
##$ASSFACI= 0
##$ASSFACX= 0
##$ASSWID= 0
##$AUNMP= <proc_1d>
##$AZFE= 0.1
##$AZFW= 0.5
##$BCFW= 0
##$BC_mod= 2
##$BYTORDP= 0
##$COROFFS= 0
##$CY= -3
##$DATMOD= 1
##$DC= 0
##$DFILT= <>
##$DTYPP= 0
##$F1P= 0
##$F2P= 0
##$FCOR= 1
##$FTSIZE= 65536
##$FT_mod= 6
##$GAMMA= 0
##$GB= 0
##$INTBC= 1
##$INTSCL= 5.30512e-09
##$ISEN= 30
##$LB= 1
##$LEV0= 0
##$LPBIN= 0
##$MAXI= 10000
##$MC2= 0
##$MEAN= 0
##$ME_mod= 0
##$MI= 50
##$NCOEF= 0
##$NC_proc= -6
##$NLEV= 6
##$NOISF1= 182.463
##$NOISF2= 159.3651
##$NSP= 0
##$NTH_PI= 0
##$NZP= 0
##$OFFSET= 248.5645
##$PC= 4
##$PHC0= -6415.144
##$PHC1= 585.8006
##$PH_mod= 1
##$PKNL= yes
##$PPARMOD= 0
##$PSCAL= 0
##$PSIGN= 0
##$REVERSE= no
##$SF= 81.014009
##$SI= 65536
##$SIGF1= 159.3651
##$SIGF2= -187.1042
##$SINO= 113.3802
##$SIOLD= 16384
##$SREGLST= <1H.CDCl3>
##$SSB= 0
##$STSI= 65536
##$STSR= 0
##$SW_p= 40650.406504065
##$SYMM= 0
##$S_DEV= 0
##$TDeff= 32768
##$TDoff= 0
##$TI= <>
##$TILT= no
##$TM1= 0
##$TM2= 0
##$TOPLEV= 0
##$USERP1= <user>
##$USERP2= <user>
##$USERP3= <user>
##$USERP4= <user>
##$USERP5= <user>
##$WDW= 1
##$XDIM= 65536
##$YMAX_p= 404825852
##$YMIN_p= -22918607
$$ End of Bruker specific parameters
$$ ---------------------------------
##NTUPLES= NMR SPECTRUM
##VAR_NAME=  FREQUENCY,     SPECTRUM/REAL,   SPECTRUM/IMAG
##SYMBOL=    X,             R,               I
##VAR_TYPE=  INDEPENDENT,   DEPENDENT,       DEPENDENT
##VAR_FORM=  AFFN,          ASDF,            ASDF
##VAR_DIM=   65536,         65536,           65536
##UNITS=     HZ,            ARBITRARY UNITS, ARBITRARY UNITS
##FACTOR=    0.620285442955139, 1,           1
##FIRST=     20137.2065510759, 0,            0
##LAST=      -20513.1999529892, 0,           0
##MIN=       -20513.1999529892, -22918607,   0
##MAX=       20137.2065510759, 404825852,    0
$$ Real data points
##PAGE= N=1
##DATA TABLE= (X++(R..R)), XYDATA
$$ [...]
42078c291750K028631J912934m06615k503358j643142J101531K626505J712048
42070A536784o66536k878706k978808P9048M048094M894320K203393o1830J84630
42061F360389J85973j861805k698368K05913K988920J025045k975999k846293
42053C83775R78761K087286j607616m847691l426313J77160J690724J046412Q81403
42044b636099K028035K753331J061918k898446n674547l103232L646156P006420
42036B183536K097932n378992o003190K01549M486872K824737L90076J103656
42028A906176J352414j974249m895569l241653Q9255P26666L62076K306349M184048
42019H15513K185595j025804k98705K586612J433851l557643n439893j377636
$$ y = [-3291750, -1263119, 649815, 243200, -2260158, -3903300, -2801769, -175264, 1536784, 870248, -2008458, -4987266, -4908218, -860124, 4034196, 6237589, 6175759, 6360389, 6546362, 4684557, 1986189, 2192102, 5181022, 6206067, 3230068, 383775, 1362536, 3449822, 1842206, -3005485, -6431798, -6254638, -4563914, -3517502, -2636099, -608064, 2145267, 3207185, 308739, -5365808, -8469040, -4822884, 2183536, 4281468, -1097524, -7100714, -6899165, -2412293, 412444, 802520, 1906176, 3258590, 1284341, -3611228, -6852881, -6763626, -6036960, -5674884, -3368535, 815513, 3001108, 1975304, 1676599, 4263211, 5697062, 2139419, -3300474, -4678110]
42011d678110L357426L692767Q19918j904863l573779m032206k440611R3945O63273
42002h002240n31935L91902M383322O583078L127154k914992n877826m720525
41994g562062k325677k28641J891158L134269J939734o66284j626035J77656K671484
41985b594398L277592J350313j595552k958508j392643R38208K88218l185016
41977e871786m571361j170211K825172K397662l86659Q5483L309275L263422j178727
41968a297730l682277o64623K701375J007246k559582j776539K312373L535392
41960d24365Q85618m72975J697767L273936R18791k761496l530878r83692K451197
41951A053903M695457M421357J288519k602359m210237l536366l097512l009250
$$ y = [-4678110, -1320684, 2372083, 3192001, 1287138, -2286641, -6318847, -8759458, -8665513, -8002240, -8534175, -8142273, -3758951, 2824127, 5951281, 3036289, -2841537, -7562062, -9887739, -10116380, -8225222, -5090953, -3151219, -3817503, -5443538, -5265882, -2594398, 683194, 2033507, 437955, -2520553, -3913196, -2974988, -2686770, -5871786, -10443147, -11613358, -8788186, -6390524, -6777183, -6691700, -3382425, -119003, -1297730, -4980007, -5644630, -2943255, -1936009, -4495591, -6272130, -3959757, -424365, 461253, -11722, 1686045, 4959981, 5878772, 3117276, -413602, -1397294, 1053903, 5749360, 10170717, 11459236, 8856877, 4646640, 1110274, -1987238, -4996488]
41943d996488q71891K515758K671878j130970l512286j382091R20285p04422k918825
41934i409052j221632J750252J364394O1085K770363O445502L937270l037120
41926B661062n224498q00812J554338k607747n814893r67750P093617R062406
41918D955723M061952j811780n238670p004442o636937k552786L382535O607121
41910d237284N130553J074690k194455k501352j82771J547551O5270k081447k06364
41901c585609M054485L604836k326099m915486P30678O513184L418722l962198
41893C532513m756277J041548L854429O47213j845426j97643O06687k355213m226422
41884c698591j155241L158658M053714K519788J207123k36045j910959j362694
$$ y = [-4996488, -5868379, -3352621, -680743, -1811713, -5323999, -6706090, -5785805, -6490227, -9409052, -10630684, -8880432, -7516038, -7454953, -4684590, 1760912, 5698182, 2661062, -2563436, -3364248, -1809910, -4417657, -10232550, -11200300, -4106683, 4955723, 9017675, 7205895, 1967225, -5037217, -11674154, -14226940, -10844405, -4237284, 893269, 1967959, -226496, -2727848, -2910619, -1363068, -1297798, -3379245, -3585609, 468876, 4073712, 1747613, -3167873, -2437195, 4075989, 7494711, 3532513, -1223764, -182216, 3672213, 4319426, 2474000, 2276357, 2883044, 527831, -3698591, -4853832, -1695174, 2358540, 4878328, 6085451, 5849406, 3938447, 2575753]
41876B575753J411478J889855j845006m881857k842179J222064K164797P68624
41868D63529J089342L123751L575101J639583p52728k465159k802220j86686M356083
41859H040596N171544j152953q909086r155978j594858N103671M678025l77444
41851A803517m199312m088028n73042M280333O856674M258661j407865m267396
41843B663542k022573J025156L31488k533620k772643M02394K758446R76475k942806
41834b114141m175398j063014K606883K160001j572482k699889J578526N945502
41826F65988L596369l659755o916567k263845L841203L810664q56092k729178
41818d511213Q51004M960347M293713p68763n624870o154906j727401M082618
$$ y = [2575753, 3987231, 5877086, 4032080, -849777, -3691956, -2469892, -305095, 463529, 1552871, 4676622, 8251723, 9891306, 9138578, 6673419, 3871199, 3684513, 8040596, 13212140, 12059187, 3150101, -6005877, -7600735, -2497064, 2180961, 1803517, -2395795, -6483823, -7056865, -2776532, 4080142, 8338803, 6930938, 2663542, 640969, 1666125, 1997613, -536007, -3308650, -2906256, -147810, 828665, -2114141, -6289539, -7352553, -4745670, -2585669, -4158151, -6858040, -5279514, 665988, 4262357, 602602, -6313965, -8577810, -4736607, -925943, -1782035, -4511213, -3660209, 1300138, 5593851, 4825088, -799782, -6954688, -8682089, -4599471]
41810d599471N747671J253979m603999n058641K76862M914988M013561p4687k411217
41801e40954k164777j761436j923295j269549L49364J595461K242334K997952
41793d74900L086997J110469j685430k142607K99750K653485K562912P67170j169401
41784E008445k675800k936991r56407J925360K629678Q88023O8785J826935L300558
41775I078586J735396j550675m240130o278440p136910m197842J876289M585986
41767f127740K71188m431253j194609O562356P757204N61184m601272j142259
41759b345201M162351K761204k508895l092535J654932M527685J915831k065312
41751E010060k818094r37627M58206J41894r28886j536068j422895j328865j581451
$$ y = [-4599471, 1148200, 2402179, -2201820, -7260461, -6983599, -2068611, 1944950, 1870263, -540954, -2705731, -4467167, -6390462, -7660011, -7310647, -5715186, -3472852, -474900, 2612097, 3722566, 2037136, -105471, 194279, 2847764, 5410676, 6177846, 5008445, 2332645, -604346, -1560753, 364607, 2994285, 3882308, 3951093, 5778028, 9078586, 10813982, 9263307, 5023177, -1255263, -8392173, -12590015, -10713726, -6127740, -5856552, -10287805, -11482414, -4920058, 2837146, 3398330, -1202942, -2345201, 1817150, 4578354, 2069459, -1023076, 631856, 5159541, 7075372, 5010060, 2191966, 1254339, 1712545, 1854439, 925553, -610515, -2033410, -3362275, -4943726]
41742d943726p14803K468597N154280K593383m151446o972126j214857O490195
41734a290503O581265K9559l586531n77110K219051q88568n522955m489944J309969
41725f215767M991768L887117J762212J608020J694407K3360j609735o86013J467784
41716F923153J400846j038269k164181J6773K408569R62251l345732n455393k971093
41707c263076Q64751J960200O64289K19955J538395K185054K90915k800476m305210
41698b645203k987836O4339K553590K515362j51452l084242l203292J05185L864754
41689b968795M343440J103388k438863k921089q51060M87250n46838k448752l582640
41680i823959m005542l038608J576989Q808979J1619305M597196o729551j0452449
$$ y = [-4943726, -5658529, -3189932, 1964348, 4557731, 406285, -6565841, -7780698, -1290503, 5290762, 5320321, 1733790, 1156680, 3375731, 2487163, -3035792, -7525736, -6215767, -1223999, 2663118, 4425330, 6033350, 7727757, 7751117, 6141382, 5455369, 6923153, 8323999, 7285730, 5121549, 5138322, 7546891, 8509142, 5163410, -291983, -3263076, -2398325, -438125, 226164, 446119, 1984514, 4169568, 4460483, 1660007, -2645203, -5633039, -5568700, -3015110, -499748, -651200, -3735442, -6938734, -6833549, -2968795, 1374645, 2478033, 39170, -2881919, -3732979, -3245729, -3792567, -6241319, -9823959, -13829501, -16868109, -15291120, -6482141, 5137164, 9734360, 3004809, -7447640]
41672g447640l083135O150091P807626L009105j604291l580907m003298k057903
41664d810352K892550O673750M645455p28529l050205j740929j929399m755443
41656b803102n012542j48471M863376M700949P95760j988955j913031m61321J000380
41647i66957J695495Q63853r22568j775932j294364j051157j259601l5951K637992
41638b109190L726080J907814Q7254O91515J746455M62696k265940l945777m245615
41629c944708l593817r44464L459035N823945L468153m46045j156881O61557Q66957
41620D193732p03073k66280K757496M169296J498543k631960m973082n247816
41612a203144l834794j97635M108043M840629O54438l727391l375523O6538J218310
$$ y = [-7447640, -10530775, -4380684, 3426942, 6436047, 4831756, 1250849, -2752449, -4810352, -1917802, 4755948, 9401403, 8672874, 5622669, 3881740, 1952341, -2803102, -7815644, -7964115, -3100739, 1600210, 2395970, 407015, -1506016, -1967337, -966957, 728538, 1592391, 669823, -1106109, -2400473, -3451630, -4711231, -4747182, -2109190, 1616890, 3524704, 3611958, 4303473, 6049928, 6512624, 4246684, 300907, -3944708, -7538525, -8482989, -5023954, 799991, 4268144, 3822099, 2665218, 3326775, 4193732, 3490659, 3224379, 5981875, 10151171, 11649714, 9017754, 4044672, -1203144, -5037938, -5235573, -1127530, 3713099, 4367537, 640146, -2735377, -2668839, -1450529]
41603a450529r06531j886642R16162M163779L341719p97309l153266q64892L247672
41594B610163M286689R43612l445814m979363l240442j069630r36958k052760
41586g884503j269708K878783P283521O836939Q73623m684875m074643N99086
41578E58223K131209j423045m091561j540803K017347Q64686k520356j298215
41570e302515M186436O094621R90816m804528m485474R5204K425943N55010j994780
41561b239267k130683j9327K634237L854468K000584k004391m042206j265264
41553c211849L521063M736595R09935l891669n321845k989896O13137L093434
41545b541095L543025K631389J823108J621335R40345p87063j951054r71275Q60545
$$ y = [-1450529, -2357060, -4243702, -3327540, 836239, 4177958, 3380649, 227383, -637509, 2610163, 6896852, 7840464, 4394650, -584713, -3825155, -4894785, -5831743, -7884503, -9154211, -6275428, 1008093, 7845032, 8718655, 4033780, -40863, 558223, 2689432, 1266387, -2825174, -4365977, -2348630, -1483944, -4004300, -5302515, -1116079, 4978542, 5969358, 1164830, -3320644, -3225440, -799497, -244487, -2239267, -4369950, -4389277, -1755040, 2099428, 4100012, 2095621, -1946585, -3211849, 309214, 5045809, 5955744, 2064075, -3257770, -6247666, -5634529, -2541095, 1001930, 3633319, 5456427, 7077762, 8018107, 7231044, 5279990, 4308715, 5169260]
41536E169260J032201m46703j526819j721935k164778k339215m57724K309927
41528a45786K012137j883327m231350j146521L742523L854842j216610n337454
41520d351546m218321j79517K222763J855652N60897l73324r45867j022945l95616
41511f847824K79359L09072L92842J643701L363795L484682J513975m90202n56669
41502C092731Q00369J613825Q87374q44375k450178k849342j718924m35573r85293
41493b889386k727403k093089K245230N764613L338387k765727m783731m3133
41485c954239N191655M702928O51112q27919J116766K087344J3277k246405j827073
41476D907446M56162J914037R64641j719910l216331n74301M784858O787297J974259
$$ y = [5169260, 6201461, 5754758, 4227939, 2506004, 341226, -1997989, -2455713, -145786, 1866351, -16976, -4248326, -5394847, -1652324, 2202518, 985908, -4351546, -8569867, -8749384, -6526621, -4670969, -4110072, -4483396, -5429263, -6452208, -6847824, -6568465, -6259393, -5866551, -4222850, -859055, 2625627, 4139602, 3649400, 3092731, 3893100, 5506925, 6394299, 5549924, 3099746, 250404, -1468520, -1904093, -2889386, -5616789, -7709878, -5464648, 299965, 3638352, 872625, -3911106, -3954239, 1237416, 5940344, 6591456, 5763537, 6880303, 8967647, 8980924, 6734519, 4907446, 5363608, 7277645, 8242286, 6522376, 3306045, 2731744, 7516602, 14303899, 16278158]
41467A6278158m982732p045967m038406j088214J72271K191708M086689J558874
41459G132381m448872o768564k563008K222684K592456J685630L454361M849153
41451H156221J653300l205675m109835j522639L67004J164735K589432K652379
41443G744922r90751m532154k703763K017498K969682M35499L89662K953690J884370
41434A0168655l495145n746170j455830L146536K609266Q3525R4163R93876k8151
41425F370725j104912n85102j583326n421664o347510q457P617859P637645J048118
41416G623376l782396l644685k162827q46665K350464N519108L077875m112846
41408D021404p028205r22738O871121O623280q11072o149134m258304P88640K697592
$$ y = [16278158, 11295426, 4249459, 211053, -877161, -704890, 1486818, 5573507, 7132381, 2683509, -4085055, -6648063, -4425379, -1832923, -147293, 3307068, 8156221, 9809521, 6603846, 2494011, 971372, 1338376, 2503111, 5092543, 7744922, 6754171, 2222017, -481746, 1535752, 4505434, 4940933, 5330595, 8284285, 10168655, 6673510, 927340, -528490, 2618046, 5227312, 5310837, 5405000, 6398876, 6370725, 5265813, 4680711, 3097385, -2324279, -8671789, -8680246, -1062387, 6575258, 7623376, 3840980, 196295, -1966532, -2813197, -462733, 5056375, 8134250, 4021404, -3006801, -3929539, 2941582, 9564862, 8753790, 2604656, -1653648, -865008, 1832584]
41399A832584N34113j858834j375433J222407K944734K047780n20308k655402
41391B171641l213282k382390r12819K60912L60660l53478n80536L46476J387904
41382b914912J159134k85046j656382j652031L41820L399418M572881J455697
41374D420579l717540n100348l69696N509835O328054K452741o40586k48845R08533
41365I542727l89692l706144o159696n349001r40749M429577O112809J964305
41357E504136m055099n562571j468735K668550J815654k547479n024533k996244
41349a1666321J071958L200042K270662O08907O77952J884694J576649r13772
41341a289229k919095j931387J167907L539605L542272J324826j917305l964558
$$ y = [1832584, 2366697, 507863, -867570, 354837, 3299571, 5347351, 4827043, 2171641, -1041641, -3424031, -4336850, -4075938, -3715278, -4068756, -4649292, -4302816, -2914912, -1755778, -2040824, -3697206, -5349237, -5007417, -1607999, 2964882, 4420579, 703039, -4397309, -4767005, 742830, 7070884, 9523625, 8883039, 8634194, 9542727, 9153035, 5446891, -712805, -6061806, -7002555, -2572978, 3539831, 5504136, 1449037, -4113534, -5582269, -2913719, -1098065, -3645544, -8670077, -11666321, -10594363, -7394321, -5123659, -4514752, -3836800, -1952106, -375457, -1289229, -4208324, -6139711, -4971804, -1432199, 2110073, 3434899, 1517594, -2446964]
41333b446964k989276m78737j79936k335781k380099J813680N318369L196656
41325d82088j392755j927654J284313K438364K43817q96779M48433O87500j018501
41316f15350p24283K116835K138161k384537m735867o6565N615010L685868m085129
41307I44143q235661n085159k85429O63262r73024j148428J174644L970632M904010
41298d071010L011161l18628j806623K83687L403099L569484O23160j753393j136434
41289A804503R45895J697581L44455j779568k895224k066951J44658K105246K671472
41280B972067J922040J11174k663696m939585m043716L40107M321774L859990
41272A880155k60662l650938l689445j522899N75815J549195J530757J382847
$$ y = [-2446964, -5436240, -5914977, -6094913, -8430694, -10810793, -8997113, -3678744, -482088, -1874843, -3802497, -2518184, -79820, 163997, -732782, -284349, 403151, -615350, -1339633, 777202, 2915363, 530826, -4205041, -4271606, 1343404, 5029272, 944143, -7291518, -12376677, -12662106, -11998844, -12971868, -14120296, -12945652, -8975020, -4071010, -1059849, -1378477, -3185100, -2901413, 501686, 4071170, 4694330, 2940937, 1804503, 2750398, 4447979, 4792434, 3012866, 117642, -1949309, -1804651, 300595, 2972067, 4894107, 5005281, 2341585, -2598000, -6641716, -6301609, -1979835, 1880155, 1619493, -2031445, -5720890, -7243789, -6667974, -5118779, -3588022, -2205175]
41264b205175K046337L025332K407179j44834j930531r30859N92294q18450m292410
41255b251117n650149l375423K7300K425176L899165L939711J211542k535210
41247b309005k707132J424913M097502P60960m501250l909911K893253P631189
41239C380519M184123l402944o180329j390783M691360M851935n84878m854096
41231F94907l317155J349616L429286J710353J64621J486439L191847J680062
41223A0389976k281195m706895l762983j287818N60440J505574J832252J323107
41215C572458K27895o25109j300931k543874l753367l426361k046377j615130
41207a1510796j462418J588144O750181P488625N06985p258262o717691O05261
$$ y = [-2205175, -158838, 2866494, 5273673, 5128839, 3198308, 2267449, 2859743, 2041293, -2251117, -7901266, -11276689, -11249389, -8824213, -4925048, -985337, 226205, -2309005, -5016137, -3591224, 506278, 1267238, -3234012, -7143923, -4250670, 3380519, 7564642, 4161698, -2018631, -3409414, 1281946, 6133881, 5549003, 694907, -2622248, -1272632, 2156654, 3867007, 4031628, 5518067, 8709914, 10389976, 8108781, 3401886, -361097, -1648915, -1088475, 417099, 2249351, 3572458, 3800353, 3175244, 1874313, -669561, -4422928, -7849289, -9895666, -11510796, -12973214, -11385070, -4634889, 2853736, 3360721, -3897541, -10615232, -10009971]
41199a0009971N036617L081743R71399K616731L047019j680118n929646k890818
41191e757044L855178N099121n98894n823780n292377j166351K215782L005676
41183d462689J187206j800839k927703j146626K26135r95169q45118M161934Q531754
41174A928885M537036m314737o763487q69065L442049R46431j461482J536045
41166a018325M124929P82497k902897j25198M592849L080725k509069m162954
41158A862557j753452j353648l086125j763287K118788K844215K94522o1514J995423
41149A097479R94940k928944k827513K696662N994865K727160j624781j900402
41141D229466j119969k892271l975427q53722K796306K046986r56049j211043
$$ y = [-10009971, -4973354, -1891611, -920212, 1696519, 4743538, 3063420, -2866226, -5757044, -1901866, 3197255, 2598361, -3225419, -8517796, -9684147, -7468365, -4462689, -3275483, -5076322, -8004025, -9150651, -8924516, -9919685, -10764803, -6602869, 1928885, 6465921, 2151184, -4612303, -5481368, -2039319, -1092888, -2554370, -1018325, 3106604, 3889101, 986204, 861006, 5453855, 8534580, 6025511, 1862557, 109105, -1244543, -4330668, -6093955, -3975167, -1130952, -836430, -897944, 1097479, 2092419, -836525, -3664038, -967376, 5027489, 7754649, 6129868, 4229466, 3109497, 217226, -3758201, -4611923, -1815617, 231369, -724680, -1935723]
41133a935723P17233Q55041q82143j559876q56424m71753j65411Q54773R72688
41124b471595r03469k078853k61144J890742J202564k13016R36105K404756K72422
41115G78512l091864k236659J835898L084961O68322l75162J034089J83925l530149
41106a648127l674978K274460O947943L720533k997047m765989j592701K8050
41098a707856j549397j668260J576439M226604L510231J902939J956935J964440
41090A0212075k05020k520040j667464J375979K215128p54138l843159k890740
41082A922621J000504K565734o02552m268981k967628J966126L573480p48058
41074B441246m877915k715034K571348L295297r30285k726485J510150O218292
$$ y = [-1935723, -1218490, -363449, -1245592, -2805468, -3661892, -4133645, -4299056, -3444283, -2471595, -3375064, -5453917, -5715061, -3824319, -2621755, -2834771, -1898666, 506090, 778512, -2313352, -4550011, -2714113, 370848, 1039170, 664008, 1698097, 1882022, -1648127, -5323105, -3048645, 3899298, 7619831, 4622784, -143205, -1735906, -1707856, -3257253, -4925513, -3349074, 877530, 4387761, 6290700, 8247635, 10212075, 10007055, 7487015, 5819551, 7195530, 9410658, 8656520, 4813361, 1922621, 2923125, 5488859, 4886307, 617326, -2350302, -384176, 3189304, 2441246, -2436669, -5151703, -2580355, 714942, -215343, -2941828, -1431678, 4786614]
41066D786614N222277J56499l267267l145015j444995M66894J960248J248883
41058E984138k194215n002873l775955j01986K094176K373799K581361J827946
41050C786391j723459n195082l530928K048808M550666J499528j527772M8569
41042d3279L233933L259488O18257j701935l391495m838638m063145m25524K037202
41033e315136j6183l409060l063902J72893J731319J098751J424186K766167K041760
41024b569205n83409j334008N67841J536596L5808q06714J200936L504666K763214
41015D315725o73595l924649m560467j699152K970152N121824K251538j958466
41007A842910k034256Q43064N59013l234606l430215K684183P287438L197710
$$ y = [4786614, 10008891, 10165390, 6898123, 3753108, 2308113, 2775007, 4735255, 5984138, 3789923, -1212950, -4988905, -5090891, -2996715, -622916, 1958445, 3786391, 2062932, -3132150, -6663078, -4614270, -63604, 1435924, -91848, -43279, 3190654, 6450142, 7068399, 5366464, 1974969, -2863669, -6926814, -7352338, -5315136, -5331319, -8740379, -11804281, -11631388, -9900069, -8801318, -7377132, -4610965, -2569205, -3152614, -4486622, -3918781, -2382185, -2346377, -3153091, -1952155, 1552511, 4315725, 3642130, -282519, -4842986, -6542138, -3571986, 1549838, 3801376, 1842910, -191346, 651718, 1210731, -2023875, -5454090, -2769907, 4517531, 7715241]
40999G715241m689869o194355l53399M399147K882627j269336k821572j393909
40991a725425O66621J952715J817732K38767q08160Q86891L670470L209746j004928
40982H904429m050991k445252Q20845R33084j773601k978764r98224J325346J111751
40973H48623j122489l006442l115216j489855J053623L272890M098678L447294
40965C987106J851108n70637l568959n345180l734866L50203K750310J106736
40957c174179j593727j020642K126719L107326M01904j903249m95784J970825
40949e80807J089667k308239l322351l80357K485560J586085j296232j576888
40941d303562K025319N993468O180136K154828k786232n252540m778902l142984
$$ y = [7715241, 3025372, -3168983, -3522382, 876765, 3759392, 2490056, -331516, -1725425, -1058804, 893911, 2711643, 2950410, 2142250, 3029141, 6699611, 9909357, 8904429, 4853438, 2408186, 3229031, 4162115, 2388514, -590250, -1588474, -263128, 848623, -273866, -3280308, -6395524, -7885379, -6831756, -3558866, 539812, 3987106, 5838214, 5267577, 1698618, -3646562, -7381428, -7031225, -4280915, -3174179, -4767906, -5788548, -3661829, -554503, -152599, -2055848, -2551632, -580807, 508860, -1799379, -5121730, -5502087, -3016527, -1430442, -2726674, -4303562, -2278243, 3715225, 9895361, 12050189, 9263957, 4011417, -767485, -3910469]
40933c910469j569626R3090J673486K118440J318674O21720M57383n41091k512667
40924b251060k714379O21592M582085M875436J806672l87190J83456Q73487q17401
40915F772698l308935l169528J96125L339654K234475k835382o263951l005102
40907f039946M280052P332424L019122k382928k655035l63043q53581k390881
40899e3816j43991L328390J378939m008043l635743L265675N959880r10216p777863
40890b596788m499012M286079O901153J655766l299291l426871j872422j613992
40882d465378j695174j227878p36562N13532L257382M853940K272057k292867
40874D79052l888694k099708o90243p89212k0037J900450K346731Q10906m64733
$$ y = [-3910469, -5480095, -5387005, -3713519, -1595079, -276405, 345315, 802698, 261607, -2251060, -4965439, -4343847, 238238, 5113674, 6920346, 6533156, 6716612, 7590099, 6772698, 3463763, 294235, 490360, 3830014, 6064489, 3229107, -3034844, -6039946, -1759894, 5572530, 8591652, 6208724, 3553689, 3190646, 2337065, -53816, -197807, 3130583, 4509522, 501479, -3134264, 131411, 6091291, 5181075, -2596788, -7095800, -2809721, 4091432, 5747198, 2447907, -978964, -2851386, -4465378, -6160552, -7388430, -8124992, -7611460, -4354078, 499862, 2771919, 479052, -3409642, -5509350, -6199593, -6988805, -7008842, -5108392, -2761661, -1950755, -2415488]
40865b415488j083397k572597l792426j819859K147294L519259J704317P72374
40857c540523J673892N32021l093850l365863K333946P374455M933975j650378
40849E197675l907391n48354J817810q51656m903732m999398p54806M051441N986570
40840A088159M282644M19840l376936n692968o233473m821214j392987K518779
40832a3208156M214997L180677K308511L826707N471337L341455k086540n738176
40824A310812m347269o60213M51769j307385j437092K403948N849517L141978
40816E406065l917313o665199r20596O518590O612341J81079m275202l180832
40808b41067j377979k436769k880018N38138M039200K643776j425246k116514
$$ y = [-2415488, -3498885, -6071482, -9863908, -11683767, -9536473, -6017214, -4312897, -3540523, -1866631, -1334610, -4428460, -7794323, -5460377, 1914078, 6848053, 5197675, 1290284, 741930, 2559740, 1708084, -3195648, -8195046, -8949852, -4898411, 1088159, 5370803, 5790643, 2413707, -3279261, -9512734, -14333948, -15726935, -13208156, -8993159, -5812482, -3503971, 322736, 5794073, 9135528, 7048988, 1310812, -3036457, -3696670, -3244901, -4552286, -5989378, -3585430, 2264087, 5406065, 1488752, -5176447, -6097043, 421547, 7033888, 7214967, 2939765, -241067, -1619046, -4055815, -6935833, -6397695, -2358495, 285281, -1139965, -3256479]
40800c256479J108269L200501J743441k91110j06160J407403K436129K423207
40792H665201O75377l235351o539047m811991J515131N865542L607342j534800
40784D207404k738974L86386J996633q33551l951015k698216J254133K862065
40776D84865J202882k3891J056347J789235m4372k337033k380438j528830k369597
40767d150832l184572q0780N622463P321871K149357m226530m658720O49247N391093
40758D832597M998580K90235m918085o947316m445534j17312J193669j394262
40750f507428k761428R86712N851621N233911j7396k911838j168184J18440k043666
40741c219256l560642j254499O77033k173514n702383k820169M961986Q946869
$$ y = [-3256479, -2148210, 1052291, 2795732, 2504622, 2398462, 3805865, 6241994, 8665201, 9340578, 6105227, -433820, -5245811, -3730680, 2134862, 5742204, 4207404, 1468430, 1854816, 3851449, 3017898, -933117, -3631333, -2377200, 484865, 1687747, 1663856, 2720203, 4509438, 4465066, 2128033, -252405, -1781235, -4150832, -7335404, -7416184, -1793721, 5528150, 7677507, 3450977, -1207743, -558496, 4832597, 9831177, 10121412, 5203327, -1743989, -6189523, -6306835, -5113166, -6507428, -9268856, -8282144, -2430523, 2803388, 2785992, -125846, -1294030, -1175590, -3219256, -6779898, -8034397, -7357364, -9530878, -15233261, -18053430, -13091444, -4144575]
40733d144575N718342J085688M45608J777317J041019r05439r05606O73948J095173
40724E881475J7519q34806j277212k213497k615690p27820K094455K464374J92994
40715B981792j102614L61853J563580p10293m680293n571363j765405L262154
40707e660589N117344L146225M49178j62310N85044k1913k161739k590260L18206
40698i80814K901910Q69463l633434m155646N28684M038637J627351k941053l451600
40689e196502l16988J337312J70827l70158J353737K973081K763955J733143M22631
40680D871038j734877k961172j08452M994329N365404j560208q648667p887840
40672g670445j144675L106676J570032j199786j125020N15411J547405K568857
$$ y = [-4144575, 1573767, 2659455, 3105063, 4882380, 5923399, 5017960, 4112354, 4786302, 5881475, 5898994, 5064188, 3786976, 1573479, -1042211, -1770031, 324424, 2788798, 2981792, 1879178, 2241031, 3804611, 3094318, -1585975, -7157338, -8922743, -5660589, -543245, 2602980, 3052158, 2889848, 3474892, 3452979, 1291240, -1299020, -980814, 1921096, 2790559, -842875, -4998521, -4469837, -431200, 1196151, -1744902, -5196502, -5513490, -4176178, -4005351, -4375509, -3021772, -48691, 2715264, 4448407, 4871038, 3136161, 174989, 66537, 5060866, 10426270, 8866062, 217395, -7670445, -8815120, -5708444, -4138412, -5338198, -6463218, -5947807, -4400402, -1831545]
40664a831545L503260J213689n267036j0137853o505873M016536J1838604J0355229
40656G185011K967066k308347k226564J99156J451288J096978q5899j984511l801257
40647B492921l515593q68514R69604n97073l045998j479439M044947P367174L949971
40638I318000k843591n619921j808874L756631M886951Q35089l379848k642021
40630B502416K564963O253889L414196l747731p695960m272737K494893N691865
40622G205794L555281j45490k154106k829585l489292l867228l115297j236565
40614f076488J242143L492807M109744K391993n8198j016636p94701j273426k015350
40605A888p43656J875605K039790j057475l134002j439158P04116l82675k435052
$$ y = [-1831545, 1671715, 2885404, -2381632, -12519485, -19025358, -15008822, -3170218, 7185011, 10152077, 7843730, 5617166, 5816322, 7267610, 8364588, 8278689, 6294178, 2492921, -1022672, -1891186, -921582, -1518655, -4564653, -6044092, -1999145, 5368029, 9318000, 6474409, 854488, -954386, 2802245, 7689196, 8524285, 5144437, 2502416, 5067379, 11321268, 14735464, 10987733, 3291773, -980964, 1513929, 7205794, 10761075, 10615585, 8461479, 5631894, 2142602, -1724626, -4839923, -6076488, -4834345, -1341538, 2768206, 5160199, 5102001, 4085365, 3290664, 2017238, 1888, -741768, 1133837, 3173627, 2116152, -1017850, -2457008, -1752892, -2135567, -4570619]
40596d570619j554220N40597k59891k204762Q6832N679310P297664K587787j970839
40587E631859j219107J434386R36450j441363k232970k492328m145716m015426
40579g544215J237093P091077N929666j338966o040369m149081n43687K40507
40571e117975J60257J903010L459800K364633M24127J54193L67143q09774j845966
40562A059448o30639J371649J538504L27001l76674q02999j665209j411215Q78500
40553B88366K056666r65627n187604m731749M24261M069743K598531o58091j342372
40544c447876J28775J068309J283499K196574L354858K949323R41154p91462j168789
40535F514365r50827j097648j548040j887370k162280k507944k517142j564840
$$ y = [-4570619, -6124839, -5584242, -5844133, -8048895, -7962063, -2282753, 5014911, 7602698, 5631859, 4412752, 5847138, 6783588, 5342225, 3109255, 616927, -3528789, -7544215, -6307122, 783955, 6713621, 5374655, -665714, -4814795, -5358482, -5117975, -4957718, -3054708, 405092, 2769725, 3193852, 3348045, 3715188, 2905414, 1059448, 428809, 1800458, 3338962, 3665963, 3289289, 2486290, 821081, -590134, 288366, 2345032, 1379405, -3808199, -8539948, -8115687, -4045944, -1447413, -2105504, -3447876, -3319101, -2250792, -967293, 1229281, 4584139, 7533462, 8474616, 7683154, 6514365, 5563538, 4465890, 2917850, 1030480, -1131800, -3639744, -6156886, -7721726]
40527g721726K77443K008948K539937J624826k9660j161298m22706K509246N556514
40518E181524N230571P02807m010222m320333j131812L61046j780008l556146
40510c322573j534829J589906J196204j929499k568772J235706N183235M247287
40502D096665j153516n734180n127507l33195L574268L153358L12971q23188K47066
40493a787258N37663p21789p16190J280818J512172j894409m442067j712416L071951
40484d871525L544612M6685j363567J014808K135796j027803m430447l358508
40476h309949P00985K909331J795127n087l2673J361877J915227o1075l268471
40467b994708l723134N75720N666814N400958m27204n210373m071369J30041J519408
$$ y = [-7721726, -7444283, -5435335, -2895398, -1270572, -1300232, -2461530, -2884236, -374990, 5181524, 10412095, 11114902, 7104680, 2784347, 1652535, 2013581, 233573, -3322573, -4857402, -3267496, -2071292, -4000791, -6569563, -5333857, -150622, 4096665, 2943149, -2791031, -7918538, -8251733, -4677465, -1524107, -1211136, -2034324, -1787258, -1249595, -1971384, -2687574, -1406756, 105416, -1788993, -6231060, -7943476, -4871525, -1326913, -1280228, -2643795, -1628987, 506809, -520994, -4951441, -8309949, -7608964, -4699633, -2904506, -2909593, -2942266, -1580389, 334838, 273763, -2994708, -6717842, -6142122, -475308, 4925650, 4498446, -711927, -4783296, -4653255, -3133847]
40458c133847q82895k889446j184048L116481O333072N692914J320131l741822
40450D630540n734913l473757P01772L637598M269100L272921R96942k683178
40442E617025o517247p495882l745063K314750N348011K869896j503938k483505
40434e595953J29700J917113O52320j191678j377218r90065p88234J041084M498624
40425a704307N388914J292710l651493m270386j451892P50684J726756K861681
40417I42667K748085j71093k822556j611113J039212O39894j389283p28322J463216
40408A10707J162343M4489K286601M807482J227228n459780n988851q81824l05021
40399b996626n716879n943232L295450J0233136N733654j804251r61161M274881
$$ y = [-3133847, -4016742, -6906188, -8090236, -4973755, 1359317, 7052231, 8372362, 4630540, -1104373, -4578130, -3876358, -238760, 4030340, 7303261, 8300203, 5617025, -900222, -8396104, -12141167, -9826417, -4478406, -1608510, -3112448, -5595953, -5466253, -3549140, -2896820, -4088498, -5465716, -6455781, -7244015, -6202931, -1704307, 3684607, 4977317, 1325824, -2944562, -4396454, -3645770, -1919014, 942667, 3690752, 3519659, 697103, -914010, 125202, 765096, -624187, -1352509, 110707, 1273050, 1317539, 3604140, 8411622, 9638850, 4179070, -1809781, -2691605, -2996626, -8713505, -14656737, -11361287, -1128151, 4605503, 2801252, 1840091, 6114972]
40391F114972L243951k731385m234954p00307L02654k348407k416434J162508
40383a607402K526023k22980k547803k328345k064757j965852L95981L201801
40375d613334J827465k249859k572239J396201L182436N78538q05198K228204
40367a027786N013220L254370o27017l039510m408927n096214k670956K448636
40359f154184M698803J525453j654150R7397K957386Q42116l913681l940888J019679
40350d522069L268761p67495m629421j344862O023023Q318104K752802l773093
40342E325750m314038j94236K832255K912881K170968Q95160k361872n277420
40334A989448k968043L634105O945298L296362j631484j898413J47253k75852
$$ y = [6114972, 9358923, 6627538, 2392584, 1692277, 1994931, -353476, -2769910, -1607402, 918621, 695641, -1852162, -4180507, -6245264, -8211116, -7815135, -4613334, -2785869, -5035728, -7607967, -6211766, -3029330, -2450792, -3255990, -1027786, 3985434, 7239804, 6612787, 3573277, -835650, -5931864, -8602820, -6154184, -1455381, 70072, -1584078, -1486681, 1470705, 2312821, -1600860, -5541748, -4522069, -1253308, -2020803, -6650224, -7995086, -1972063, 6346041, 9098843, 5325750, 1011712, 817476, 3649731, 6562612, 8733580, 9628740, 7266868, 1989448, -978595, 2655510, 9600808, 12897170, 11265686, 9367273, 9514526, 9238674]
40326I238674j636893j08102K136070M85158l221847l352620j41903J087743q18044
40317C668236j926289p99925L39095J344183L547984M090664r69835p842862p922375
40308f471124n81869N419911N008200K712967K978041L115227p6721m063771n455543
40299B585318n047728m045107j073542L288530M782521K124870j50995Q23279
40291C287146J693634k85702j879060j9570K244618J154080j258019j270608K51837
40282C918356P15932Q03737J687688J350415j209906k148234J303059M738046
40274A1159093K442929l415623n570570j937076K421913K746544n49217l930224
40266C367769m283686j145303K379021K481499j35704r38749J087068J396780
$$ y = [9238674, 7601781, 7493679, 9629749, 10114907, 6893060, 3540440, 3398537, 4486280, 3668236, 1741947, 942022, 1281117, 2625300, 6173284, 10263948, 9294113, 1451251, -6471124, -7052993, -1633082, 3375118, 6088085, 9066126, 12181353, 12104632, 8040861, 2585318, -2462410, -6507517, -7581059, -4292529, 489992, 2614862, 2463867, 3287146, 4980780, 4695078, 2816018, 2796448, 5041066, 6195146, 4937127, 3666519, 3918356, 4634288, 5438025, 7125713, 8476128, 7266222, 5117988, 6421047, 11159093, 13602022, 10186399, 4615829, 2678753, 5100666, 7847210, 7297993, 3367769, -915917, -2061220, 317801, 2799300, 2663596, 1724847, 2811915, 4208695]
40258D208695k119151m462562j208709M003269M999209K049030l40626j089825
40250F039330j980326k266720p3465K683188K472943j10564j681676j504031j023631
40241B555048q79K145359L211941J234828j418474j575072l98078l12258N5284
40232E497699K352666L260186o65398n740829n914539k401295q91183j207726
40224e710419J516445O278715O280374M58675m046329l099691r56181j499003
40216g77414j978213L28467K062193l39206l771800k920726J660867M711118L540926
40207B516212L65836j476318q66131R36318J883735J241240K65435O0079j79124
40198D747282j133589j387499j88019K3073k311159l554733J66766N508469N680594
$$ y = [4208695, 2089544, -2373018, -3581727, 421542, 5420751, 7469781, 7129155, 6039330, 4059004, 1792284, 1718819, 4402007, 6874950, 6764386, 5082710, 3578679, 2555048, 2554169, 4699528, 7911469, 9146297, 7727823, 6152751, 5754673, 5442415, 5497699, 7850365, 11110551, 10445153, 4704324, -1210215, -3611510, -4502693, -5710419, -4193974, 2084741, 8365115, 8823790, 4777461, 1677770, 721589, -777414, -2755627, -2427160, -364967, -704173, -4475973, -7396699, -5735832, -1024714, 2516212, 2882048, 1405730, 539599, 1475917, 3359652, 4600892, 4866327, 4926406, 4747282, 3613693, 2226194, 2038175, 2061248, -249911, -3804644, -3637878, 1870591, 7551185]
40189G551185P78504k575161j862517j388600l234839l432071M2821K840344J761824
40180D81490J88332J430841K585935L30796k322611j163230J321138j96036m534249
40171a877594n122551J43844N827043O449920K870429k12606m18888L33907q06905
40162G186599l394865l819712l88521L262147K407006k065568m830272l752854
40154e396040j950007j629314q04414J979093M257188L690690J676345K80979
40146B104520q17223j755072o66331K560892M298645K175603j210387k607235
40138D083412k607122k598038j154099K398002M440471K020587j454913o89613
40130D438687L279030M494605O41207m523943o787137n472074k152393J075471
$$ y = [7551185, 8329689, 5754528, 3892011, 2503411, -731428, -4163499, -4120678, -1280334, 481490, 669822, 2100663, 4686598, 5017394, 2694783, 1531553, 2852691, 2656655, -1877594, -7000145, -6856301, -1029258, 5420662, 8291091, 8078485, 7659597, 7993504, 7186599, 3791734, -27978, -416499, 2845648, 5252654, 3187086, -1643186, -5396040, -7346047, -8975361, -9779775, -7800682, -3543494, 147196, 1823541, 2104520, 1287297, -467775, -1134106, 1426786, 5725431, 7901034, 6690647, 4083412, 1476290, -1121748, -2275847, 122155, 4562626, 6583213, 5128300, 4438687, 7717717, 12212322, 12853529, 8329586, 1542449, -3929625, -6082018, -5006547]
40122e006547K170030P95096q80837q90435K39717J431691K852383L745220J800751
40113F257069k336882l662551R9297L772848K081336j962641k188369M14425K3653
40104B498185l324751l773086j45407K038440L68983p34802J238164K012279j541818
40095a363813n033667l234763J684214L931328K640465J408177J576603R84677
40087B593221j461064l918237m199313j827158J926406M444067L575147O10670
40079A743739n03670J287108J987088j369235n177831l879717J533466M443104
40071F4052J916172j659241j557284R20465J764627P63366Q54264K443075K551263
40062H060759k3322k392891k043306o11518p02493j354440j33284J866032J447828
$$ y = [-5006547, -2836517, -2041421, -2922258, -3812693, -3572976, -2141285, 711098, 4456318, 6257069, 3920187, 257636, 356933, 4129781, 6211117, 4248476, 2060107, 2474532, 2498185, -826566, -4599652, -4745059, -2706619, -2337636, -3072438, -1834274, 178005, -1363813, -6397480, -9632243, -7948029, -4016701, -1376236, 31941, 1608544, 2593221, 1132157, -2786080, -6985393, -8812551, -6886145, -2442078, 1133069, 1743739, 1240069, 2527177, 4514265, 3145030, -2032801, -5912518, -4379052, 64052, 1980224, 320983, -1236301, -315836, 1448791, 2212157, 3066421, 5509496, 8060759, 8037437, 5644546, 3601240, 2989722, 2287229, 932789, 799505, 2665537, 4113365]
40053D113365p50159o54456K145641K875397p25916m234044l390410m30547O71122
40044c80007P44371J829556J363549l021202o247226j912281N978044O877749
40036E232553l48631n157233j425142L862569K708857j806120k228444J220095
40028B058504K946151J721841O31739L88431m84869j152406k91098j01115k537320
40019C179858m106267r41268L377337K481004k084154l038399M51572J718390
40011A038073j380911k620037J422772M883137K158401l038902m003904j060629
40003b602000R06073R23218J555616K625290J487442j515427l117403k241476
39995a978667p62952M22043K057003L385820K214495j343500m221273m159447
$$ y = [4113365, 3363206, 2708750, 4854391, 7729788, 7003872, 2769828, -620582, -1051129, -380007, 364364, 2193920, 3557469, 536267, -5710959, -7623240, -1645196, 5232553, 4883922, -273311, -1698453, 2164116, 4872973, 3066853, 838409, 2058504, 5004655, 6726496, 7358235, 7746666, 7261797, 6109391, 5818293, 5717178, 3179858, -926409, -1867677, 1509660, 3990664, 1906510, -1131889, -680317, 1038073, -342838, -2962875, -1540103, 3343034, 5501435, 2462533, -1541371, -2602000, -1695927, -772709, 782907, 3408197, 4895639, 3380212, 262809, -1978667, -2741619, -2319576, -262573, 3123247, 5337742, 3994242, -227031, -4386478]
39987d386478j911390M87623J639408J069442l89561o22192J495377M062004M123314
39978E567547J352639j766384k842360j309340J599220L101503Q07373l608641
39970B901557m848049q28042L384430K249067k031712k981674K48592K601522
39962F95691K039230J715306K399551K45407n075203p075657j865600M888187
39954b033088N766167J762432r89696p24055j35719o6745M45914M4645k596091
39945A473764m145766j047728L049585J825901k676801k176770M097879P066627
39937G466691J926464m345864m256867n19719N40967o61721m40580R0232j526599
39928a726996k062188K248739O880087M716902j550045k841593J198371J509989
$$ y = [-4386478, -6297868, -5810245, -4170837, -3101395, -3490956, -4113148, -2617771, 1444233, 5567547, 6920186, 5153802, 2311442, 1002102, 2601322, 5702825, 6510198, 2901557, -1946492, -2774534, 609896, 2858963, 827251, -2154423, -1905831, 695691, 2734921, 4450227, 6849778, 7095185, 2019982, -5055675, -6921275, -2033088, 3733079, 5495511, 4505815, 3781760, 3646041, 3579296, 4025210, 4069855, 1473764, -2672002, -3719730, -670145, 1155756, -1521045, -3697815, 400064, 7466691, 9393155, 5047291, 790424, 270705, 811672, 149951, -290629, -200397, -1726996, -3789184, -1540445, 5339642, 10056544, 8506499, 5664906, 6863277, 8373266]
39920H373266m458167p519232j882781M835478L583844k613295n298642l919700
39912h899229l217111k426012K429184Q220776P484622J071630k196873L88429
39904B855416J703122k111827m699741p35778M491630L783980l51967r32315J431962
39895E434482O74059l081692l333130J326327M125875P14016m131164l867236
39887b138463Q57140M450202M012362J062435j895898l147400j643193J954011
39879C511196M754964M162468N62644l341239m935650l097145R49618L493838
39871F060694J374072l616882n719992k241334K766898L971219J618515R2107
39863D305297J283105K776153K153434N8343j495432j795753j679440k082101
$$ y = [8373266, 3915099, -3604133, -5486914, -651436, 2932408, 319113, -4979529, -8899229, -12116340, -14542352, -12113168, -3892392, 3592230, 4663860, 2466987, 2855416, 4558538, 2446711, -2253030, -2988808, 1502822, 5286802, 4934835, 4002520, 5434482, 6108541, 3026849, -306281, 1020046, 5145921, 5859937, 1728773, -2138463, -1281323, 3168879, 7181241, 8243676, 6347778, 3200378, 1557185, 3511196, 8266160, 12428628, 12991272, 9650033, 4714383, 1617238, 2566856, 6060694, 7434766, 3817884, -1902108, -4143442, -1376544, 2594675, 4213190, 4305297, 5588402, 8364555, 10517989, 10576332, 9080900, 7285147, 5605707, 3523606]
39855C523606k692696k030077M31795K477330J469383j324151j666180J324153
39847A513163L418870K042968O68992K631144M477423J199367m549052n409413
39839E993462p13071K333586j43884l259443j788191K046882L130882J230269
39831H830492j43835L96716J353072J499683P72459m67341j144990m12314O4622
39822A0748564k075607m744396k727698L671856O800924K314773l721130l697109
39814F570177N11712K073423N88812P79370K396834N70571m226161n503942j341210
39805B419586K422661J771354p1266M01314J452879R34170M90854J351600J508591
39796A2681743M10407O51483J773133p81934o408037o879680P14540O548782K126119
$$ y = [3523606, 830910, -1199167, -767372, 1709958, 3179341, 1855190, 189010, 1513163, 4932033, 6975001, 7643993, 10275137, 14752560, 15951927, 11402875, 5993462, 5280391, 7613977, 7470093, 4210650, 2422459, 4469341, 7600223, 8830492, 8686657, 9083373, 10436445, 11936128, 12708587, 12241246, 11096256, 10683942, 10748564, 8672957, 3928561, 1200863, 4872719, 11673643, 13988416, 10267286, 6570177, 7081889, 9155312, 9744124, 10523494, 12920328, 13490899, 9264738, 3760796, 2419586, 4842247, 6613601, 6542335, 6943649, 8396528, 9330698, 9821552, 11173152, 12681743, 13092150, 13743633, 15516766, 14734832, 8326795, 1447115, 2161655, 8710437, 10836556]
39787A0836556n381722l897532L861701M894541k165610m524048L448566J0667664
39779A7740116O955880j781554m312634p73565J027840n02411p52549R27674P77047
39770A9305844j183817j030323J356096J994293M81123R12234M095079N416869
39762C1347398K421653j278047k167841j780444k408890k367684N29182L939305
39754B8234632L706665L9120k653752j471910K244499N588263P019553O412548
39746D9119618M233560J650498M00671J307537K910535K648821L11819n74929
39738F2008130L135945Q850823J0110098N156015J80390J161717N707890P346158
39730A03657166N299985M240650N665879O228255M996354N590467R278049J2236038
$$ y = [10836556, 5454834, 1557302, 5419003, 10313544, 8147934, 3623886, 7072452, 17740116, 24695996, 22914442, 18601808, 17828243, 18856083, 18353672, 17601123, 18528797, 19305844, 18122027, 17091704, 18447800, 20442093, 20923216, 21835450, 25930529, 31347398, 33769051, 32491004, 30323163, 28542719, 26133829, 23766145, 24295327, 28234632, 31941297, 31980417, 29326665, 27854755, 30099254, 35687517, 42707070, 49119618, 53353178, 55003676, 55404347, 56711884, 59622419, 62271240, 62583059, 62008130, 65144075, 73994898, 84104996, 89261011, 89441401, 90603118, 96311008, 103657166, 108957151, 113197801, 118863680, 125091935, 130088289, 135678756, 144956805, 157192843]
39722A57192843J2208242J1771112J1959654R235738L112892J09066M051616Q388714
39714B18029877N535352j191778l550505k098532l805475q453855q948545n268338
39706A90248201o091145j3501916j7496190j1455789l234989l041899q182012
39699A27244261r230802n846733n883409j1038278j3648181q768533j341692J279930
39691G2766563j653033n443677o295656m232973k070105k675553n567394o511354
39683C8316818k824498J917575J941164k584874n641337l748007J18199J955323
39675B9450363J762363J235593J86514k093899m419536n032196l647928q03060
39667A6638214K722926M679693K377999l109248o374569l742728K042642N420512
$$ y = [157192843, 169401085, 181172197, 193131851, 202367589, 205480481, 205589547, 209641163, 218029877, 223565229, 222373451, 218822946, 216724414, 212918939, 204465084, 195516539, 190248201, 184157056, 170655140, 153158950, 141703161, 138468172, 135426273, 127244261, 118013459, 112166726, 106283317, 95245039, 81596858, 72828325, 71486633, 72766563, 71113530, 65669853, 59374197, 55141224, 53071119, 50395566, 44828172, 38316818, 35492320, 37409895, 39351059, 36766185, 31124848, 27376841, 27495040, 29450363, 31212726, 32448319, 32634833, 30540934, 26121398, 21089202, 17441274, 16638214, 19361140, 24040833, 26418832, 23309584, 16935015, 13192287, 15234929, 20655441]
39659B0655441M410394J195528j680946l036250k542433j206035j156660k639555
39651A3999484k799629l5861K416098Q06538k815663l060533O25377L116302J598073
39642A3850186m20926Q61100L534547L127861q00899m452586m938531l039845
39634G720907j284788j029264j344056j82827K802607M899903L519545L72086
39626A5474113n60053N52937p03642m942550n887108N30508Q161461P784426L4765
39617B0444857n490001l609515P07325J224074j309481k666694j789784k50466
39609G260315J227568K243811J745958N46545J528090M258588L353722l471427
39601A8693170r535056p230277P01866M684895J837370j289555J58117K930655
$$ y = [20655441, 25065835, 26261363, 24580417, 21544167, 19001734, 17795699, 16639039, 13999484, 11199855, 11163994, 13580092, 14386630, 11570967, 8510434, 9135811, 12252113, 13850186, 13429260, 14290360, 17824907, 20952768, 20151869, 15699283, 10760752, 7720907, 6436119, 5406855, 4062799, 3879972, 6682579, 11582482, 15102027, 15474113, 14914060, 15466997, 14763355, 9820805, 3933697, 4464205, 12625666, 20410092, 20444857, 14954856, 11345341, 12052666, 13276740, 11967259, 9300565, 7510781, 7260315, 8487883, 10731694, 12477652, 13024197, 14552287, 18810875, 22164597, 18693170, 9158114, 1927837, 2629703, 7314598, 9151968, 7862413, 8020530, 10951185]
39593A0951185K709262Q92262N16873O13598r16591k669920k374042j045330l61083
39584H316214J087617M370275N928943K202586l426088m362083o07844J510715
39576A5020335l66627j398593J523614M259667K717725R4629J318443M164170
39568B7333363K591403k737347m352293P85357O366790O093169K887870L839336
39560D2807648Q809541J0207434M386909k288995j713392N226766J0349561R009575
39552H6795047M663131K461503K878964L747557M801038O686349P908652O892100
39544A26834341N909512Q765059J4899334K0090123K3326611K8187326L5713616
39537B63725922M0641686L7990732K9734014K0899807J1833691q13975j6717694
$$ y = [10951185, 13660447, 14552709, 15069582, 15683180, 14766589, 12096669, 9722627, 8677297, 8316214, 9403831, 13774106, 19703049, 21905635, 18479547, 14117464, 13509620, 15020335, 14653708, 13255115, 14778729, 19038396, 21756121, 21850750, 23169193, 27333363, 29924766, 27187419, 22835126, 23620483, 29987273, 36080442, 38968312, 42807648, 51617189, 61824623, 66211532, 63922537, 62209145, 67435911, 77785472, 86795047, 91458178, 93919681, 96798645, 100546202, 105347240, 112033589, 119942241, 126834341, 132743853, 141508912, 156408246, 176498369, 199824980, 228012306, 263725922, 304367608, 342358340, 372092354, 392992161, 404825852, 404011877, 387294183]
39530C87294183l0399875l7356329l7935963l4869552l0450398k6640097k4511604
39523A65130365k2595293j8625376j3572903j0858198j0910735j0204960p093753
39516G1269147m730836n807601p872979p113294m113277k278619k401918k437793
39508C4512830j542887q89233r69920j011766p50593m56435J46078Q21239r3891
39499B9765422k994569m915158l384924r42358j759375m711939m567476q6829
39491F402794L977120L861076J072970j608299l544824l663519L53877O863118
39483A3714313Q802529K184161p036768r546532m168564K085226M127128L647353
39475A3808846L767338L995610K494112r5505j643191j637070j270671j179893
$$ y = [387294183, 356894308, 319537979, 281602016, 246732464, 216282066, 189641969, 165130365, 142535072, 123909696, 110336793, 99478595, 88567860, 78362900, 71269147, 66538311, 60730710, 52857731, 45744437, 41631160, 39352541, 36950623, 34512830, 32969943, 32080710, 31110790, 30099024, 29348431, 28891996, 29038074, 29859313, 29765422, 26770853, 21855695, 18470771, 17528413, 15769038, 11057099, 6489623, 6402794, 10379914, 14240990, 15313960, 13705661, 10160837, 6497318, 6851195, 13714313, 22516842, 24701003, 17664235, 8117703, 3949139, 6034365, 10161493, 13808846, 17576184, 21571794, 24065906, 23970401, 22327210, 20690140, 19419469, 18239576]
39467A8239576o00597J190298L383165M145861K781627Q01158L1506K55252K03891
39458C0431737K45326J582548K959461J620943j620362k205699J336766M391735
39450C8742455L119351M00485O32819K004204k99341n133279o154452j596613
39442C1715629K762533K021248j398423k260152Q8669J780193P7863l382420m644271
39433B6760869j908636K136198L287066J318742J14384J172737Q40218k880743
39425C0840835n179139j652278K969642R06255n865140p676861j957157L319697
39417A5705854K682381K91960N36265O57184j840563k759940P81331K977288j777567
39408A7254193q126405o901084P40675N524075M101114J731465J860936K029650
$$ y = [18239576, 17638979, 18829277, 22212442, 26358303, 29139930, 29941088, 29972594, 30227846, 30431737, 30677063, 32259611, 35219072, 36840015, 35219653, 33013954, 34350720, 38742455, 41861806, 42262291, 42895110, 44899314, 44599973, 39466694, 33312242, 31715629, 34478162, 36499410, 35100987, 32840835, 32929504, 34709697, 34787560, 31405140, 26760869, 24852233, 26988431, 30275497, 31594239, 31708623, 32881360, 33721578, 30840835, 25661696, 24009418, 26979060, 27885315, 22020175, 14343314, 12386157, 15705854, 18388235, 18680195, 19216460, 19873644, 18033081, 15273141, 16054472, 19031760, 17254193, 9127788, 2226704, 2967379, 8491454, 12592568, 14324033, 16184969, 18214619]
39400A8214619Q46321Q79772K762909L272685J392611L59137J643498K360677
39392C1732229O99313j185336j646897j904116j988849M91037N183500P595742
39384C8976623N516931K099881L1747k094942m549526l534722J898657N480100
39376D3824749K203548l278978l528806m9162l15946n079530p204809l456485
39368B3114581P07480K58912k520645l503499k996697k470471k03568M674280
39360A7060373P657079M232461k396274m801746j716746Q19606q32530k784678
39352A7237545o41592K985876K234524l020812o525173m078855J096583L099469
39344A2387565J019469r09390o1600J033081o55715l205304k346348J522901L254689
$$ y = [18214619, 19060940, 19940712, 22703621, 25976306, 27368917, 27728054, 29371552, 31732229, 32431542, 31246206, 29599309, 27695193, 25706344, 26197381, 31380881, 38976623, 44493554, 46593435, 46625182, 44530240, 39980714, 36445992, 38344649, 43824749, 46028297, 42749319, 39220513, 39171351, 38855405, 33775875, 26571066, 23114581, 23822061, 24080973, 21560328, 18056829, 15060132, 12589661, 12386093, 17060373, 24717452, 28949913, 26553639, 21751893, 20035147, 20854753, 20022223, 17237545, 16595953, 19581829, 21816353, 18795541, 12270368, 8191513, 9288096, 12387565, 13407034, 12497644, 12436044, 13469125, 12813410, 9608106, 7261758, 8784659, 12039348]
39335A2039348P40882j642742L1099K914175K177648j063023k127336j033320
39327A2036731j783679l939808k310479L510084O662348L307732j315694j523346
39319A4643889L54653k61452j605700L43986L660801M012047K904772M186069
39311B8239065N224095R86299m741869k819963O047131J0383778M918440j829866
39303D6407110j508172K038881J164382l040022m361822k023713N7726O72589
39295C9406959J102362O93834j082150j126060K693611O353016N254517K251591
39287E5547680L525765Q658051J1737793J1080988J0988413J4090493J8043830
39280A33673013K0032433J9461886J6466412J2471840J1140839J3419084J3028614
$$ y = [12039348, 12780230, 11137488, 11168587, 14082762, 16260410, 15197387, 13070051, 12036731, 10253052, 6313244, 4002765, 7512849, 14175197, 17482929, 16167235, 14643889, 14998542, 14737090, 13131390, 13475376, 17136177, 21148224, 24052996, 28239065, 33463160, 34449459, 29707590, 26887627, 32934758, 43318536, 48236976, 46407110, 44898938, 46937819, 48102201, 45062179, 40700357, 38676644, 38734370, 39406959, 40509321, 41203155, 40121005, 38994945, 41688556, 48041572, 53296089, 55547680, 59073445, 67731496, 79469289, 90550277, 101538690, 115629183, 133673013, 153705446, 173167332, 189633744, 202105584, 213246423, 226665507, 239694121]
39273B39694121L337846j1908955k1641111k1499523j7870787j7005862j7511996
39266A35593733j6138466j4155996j3874903j3731772j1030103o460958k857019
39259E7344516j855804l469464o171331o498997k195637L334843L907730r28580
39251D3467276m856764l840257j235881j539565l963908n391548n335927m446470
39243A2856956j944231J782410L474605J639561j97332J351417L967447L187137
39235B6117970q50482m262312n171093m609368l029557Q6134L513988M492208
39227A6287488K011315j926870m308430l529124p27222P93851r36216l419763
39219D245029k563593J087992K652639L77724j658951l79655J500849Q17490l98545
$$ y = [239694121, 243031967, 231123012, 209481901, 187982378, 170111591, 153105729, 135593733, 119455267, 105299271, 91424368, 77692596, 66662493, 60201535, 57344516, 55488712, 52019248, 45847917, 39348920, 37153283, 40488126, 44395856, 43467276, 38610512, 34770255, 33534374, 31994809, 28030901, 22639353, 17303426, 12856956, 10912725, 12695135, 16169740, 17809301, 17611969, 18963386, 22930833, 26117970, 25267488, 21005176, 15834083, 11224715, 8195158, 8281292, 11795280, 16287488, 18298803, 16371933, 12063503, 8534379, 7807157, 8601008, 7664792, 4245029, 1681436, 2769428, 5422067, 5799791, 4140840, 3761185, 5262034, 6079524, 5680979]
39210E680979R00455K617423Q14092l211904m438392j437091K417491M156243
39202G499296L641440J752893j87742l19779J064820N21845l168608n136304r12330
39193D755531N454844O075888R25490k183922K32409K515478l82680m890741m747129
39184G755168k60782L095183K576170L27866q97414o03682L43189R07941L51930
39175A3595569r35658j481868o52575K06757m54074k175406k931661j367320J787260
39166E591024M108110L471140L61356k377306k996951k785006k991634j846521
39158E34212K160774N712768M145838q79853k719254K48428J943314j412147m659265
39149E074815j864228L863805N142731J656593n41307M38427K40739k771398m079204
$$ y = [5680979, 6581434, 9198857, 10012949, 6801045, 2362653, 925562, 3343053, 7499296, 11140736, 12893629, 12705887, 12386108, 13450928, 13972773, 10804165, 5667861, 4755531, 10210375, 16286263, 17211753, 15027831, 15260240, 17775718, 17393038, 12502297, 7755168, 7494386, 10589569, 13165739, 13493605, 12596191, 11992509, 12335698, 13243639, 13595569, 12659911, 11178043, 10525468, 10732225, 10278151, 8102745, 5171084, 3803764, 5591024, 9699134, 13170274, 13531630, 11154324, 8157373, 5372367, 2380733, 534212, 2694986, 8407754, 12553592, 11673739, 8954485, 9202913, 11146227, 9734080, 5074815, 3210587, 7074392, 12217123, 13873716, 13332409, 13770836, 14011575, 11240177, 7160973]
39140G160973j102091J853859P30842j503132q0261L629956M877839L412128K776808
39131B1756921L277346J633369k411514m638248k613758J038593K936915K673053
39123B3652677J068220j443288l236134k088491R07668J687975p07365k268672
39115A7572590l96323K020461J740216J21457o49615j984124m953705n958404
39107G512553k043284K682757K360396j347492k273996j69925j52389k462032
39099D106588j690312K546030L290429j975533n675542j675327M489828L808874
39091G225035k674023n996458k309450L278063N093724L202212R12381M25348
39083I156832J757117L121330K208044r05523l020151k102917n74149j386684
$$ y = [7160973, 6058882, 7912741, 8643583, 7140451, 7060190, 10690146, 15567985, 18980113, 21756921, 25034267, 26667636, 24256122, 19617874, 17004116, 18042709, 20979624, 23652677, 24720897, 23277609, 20041475, 17952984, 18860652, 20548627, 19841262, 17572590, 17176267, 19196728, 20936944, 21058401, 20408786, 18424662, 13470957, 7512553, 5469269, 8152026, 10512422, 9164930, 6890934, 6721009, 6568620, 4106588, 2416276, 4962306, 8252735, 6277202, 601660, -1073667, 3416161, 7225035, 4551012, -1445446, -3754896, -476833, 4616891, 7819103, 8731484, 9156832, 10913949, 14035279, 16243323, 15337800, 12317649, 10214732, 9640583, 8253899]
39075H253899k774705j052500K482999K414929k507826o559846m470966J737722
39067b476294N858623N082321J662012j587621m102170n558968m106216J060637
39059d167676O535277P022751J577029m557653n689157j742660K754719M034876
39051E767506J653685k464931n126645l594254J130600M315341L406838J568765
39043F656905J915379J578175k900391p275317m598692K696958M815394m32740
39035B455671m166758p52705L909575L246701K73345L13360J153069j430326m415532
39026E86400k766772N20350j059148n685189n224692J814981P851649P231861
39018C269440K505814j316856k712125k462365j371995n46676o28035m34728R55556
$$ y = [8253899, 5479194, 4426694, 6909693, 9324622, 6816796, 256950, -4214016, -2476294, 3382329, 8464650, 10126662, 8539041, 4436871, -1122097, -5228313, -4167676, 2367601, 9390352, 10967381, 6409728, 720571, -1022089, 1732630, 5767506, 7421191, 4956260, -170385, -3764639, -2634039, 1681302, 5088140, 6656905, 8572284, 10150459, 7250068, -25249, -4623941, -1926983, 2888411, 2455671, -1711087, -2463792, 1445783, 4692484, 4965829, 5279189, 6432258, 5001932, 586400, -2180372, -1660022, -2719170, -8404359, -13629051, -11814070, -3962421, 3269440, 5775254, 4458398, 1746273, -716092, -2088087, -2634763, -3262798, -3697526, -2741970]
39009b741970J764836J39351k428713l527644l458696k966788l79399M562148
39001i036875P234451L890663j823483l618825j100219J973273M463872O346469
38993H329326M311374k921528q147744m057395M102220M667252k655629o467944
38985b840068j783391L415883K569625m957R20149K196965l68728l452185k178669
38976a525376J257287J659216q69615k463162j856165n03406O59134J048514Q0279
38967b513294p20236R15650L062659J329371k915855k910133K192040M224679
38959B664881j174065o478077l594072L434595N035139M71211k953295j992165
38951d585848l43229o44592j053179m8472J148242J586207J794978J783390J106672
$$ y = [-2741970, -977134, -837783, -3266496, -6794140, -10252836, -13219624, -13599023, -9036875, -1802424, 2088239, 264756, -3354069, -4454288, -2481015, 1982857, 8329326, 12640700, 9719172, 1571428, -2485967, 1616253, 6283505, 3627876, -2840068, -4623459, -1207576, 1362049, 1357092, 2277241, 4474206, 4105478, 653293, -1525376, -268089, 1391127, 521512, -1941650, -3797815, -4301221, -3642087, -2593573, -2513294, -3233530, -2317880, 744779, 2074150, -841705, -3751838, -1559798, 2664881, 1490816, -4987261, -8581333, -5146738, -111599, 359612, -2593683, -4585848, -4929077, -5573669, -6626848, -6675320, -5527078, -3940871, -2145893, -362503, 744169]
38942G44169N43539R29890J242448L87486m55979K16269J485111J566510M55273
38933G114716j000005k594830l509825k138500Q91276K391778J234925Q9901O90313
38924C169749J190710L84196K04972J365967J125582j430314k662317n80195J105157
38915C873507p10613l037183k261575l15400k48569l21768J815338L434673J352338
38906C580748j638179j215724J076415J100466n37239o05631N11065P06817Q34954
38897C813692J586371j20597n161975p475822k888937K413559J101844k738778
38889i470643p95838M344356L781046j111623p97629M614917M703938k385398
38881B883126n500018N27009N659807J502874n124175m369934J139276K914156
$$ y = [744169, 1287708, 2217598, 3460046, 3847532, 3391553, 3607822, 5092933, 6659443, 7114716, 6114711, 3519881, 10056, -2128444, -1237168, 1154610, 2389535, 2479436, 3169749, 4360459, 4744655, 4949627, 6315594, 7441176, 6010862, 3348545, 2768350, 3873507, 3162894, 125711, -2135864, -2451264, -2699833, -3021601, -1206263, 2228410, 3580748, 1942569, 726845, 1803260, 2903726, 2366487, 1760856, 2271921, 2978738, 3813692, 5400063, 5279466, 117491, -7358331, -10247268, -7833709, -6731865, -9470643, -10266481, -5922125, -2141079, -3252702, -4050331, 564586, 5268524, 2883126, -2616892, -2089883, 3569924, 5072798, -51377, -4421311, -3282035, -367879]
38873c67879Q32693N33762K219194J864181j27496l13591L13389j814413n187593
38864b047753m578184O40543N405019N950421L376990O08597o78658n50323n01812
38855G624840j565030j884012Q24812L736193J047106o304327r426345l925873
38847i872636K932953L147281j75290O95327M991538N844303K505474N21846J003569
38838A1594365p06322n134440o425347k096734K658134L284567J855898J549544
38830F579665J142597j101404l084272k681712j901241k923321l317671R0759
38822g196600M889923N611761J772989j258356R753K494867J422257k685526m726909
38813C34159k111373J666925J854700j014814k081654P20423L850136L737858
$$ y = [-367879, 464814, 998576, 3217770, 5081951, 4954455, 4640864, 4954253, 3139840, -2047753, -6625937, -5985394, -580375, 5370046, 8747036, 9355633, 8676975, 8126652, 7624840, 6059810, 4175798, 5000610, 8736803, 9783909, 3479582, -5946763, -9872636, -6939683, -3792402, -3967692, -3272365, 1719173, 7563476, 10068950, 10590796, 11594365, 10888043, 5753603, -671744, -2768478, -110344, 3174223, 5030121, 6579665, 7722262, 6620858, 3536586, 854874, -1046367, -3969688, -7287359, -7196600, -2306677, 3305084, 5078073, 3819717, 3829470, 6324337, 7746594, 5061068, 334159, -1777214, -110289, 1744411, 729597, -1352057, -631634, 3218502, 6956360]
38805F956360J864237J383845J316683j541426n940252o269842l02461O968036
38797D435180Q990056M623196j888767n608771m416841j73285K373448L0349m479770
38788C884795n169348q37010K924343J743483j289623q77703K259343L266141
38780E904421J269157L666P57940M28874k266613l933321k188641K52289J89491
38771D17263j153347j300409j222084k687865l688762j431866J889048J710607
38763g467415j232730j471483K508541N611779L757156p08514l398216l308455
38755e709337j392111J964441M916886L722795j744363n516530k943293K355832
38747d345680L676691P88561j073055P2236J182670M85972l42830n99915j661440
$$ y = [6956360, 8820597, 10204442, 11521125, 9979699, 4039447, -2230395, -2532856, 4435180, 13425236, 18048432, 16159665, 10550894, 6134053, 5960768, 8334216, 8364565, 3884795, -1284553, -2121563, 802780, 2546263, 1256640, 378937, 2638280, 5904421, 7173578, 7177244, 7935184, 8364058, 6097445, 2164124, -24517, 227772, 417263, -736084, -2036493, -3258577, -5946442, -9635204, -11067070, -9178022, -7467415, -8700145, -10171628, -7663087, -2051308, 1705848, 997334, -2400882, -5709337, -7101448, -5137007, -220121, 3502674, 1758311, -3758219, -6701512, -4345680, -668989, 119572, -953483, -881247, 301423, 787395, 444565, -155350, -1816790]
38738a816790k819092j245263K488336L785698P63554k882058l691281k697413
38730h114309j716325j7390K385608K541011o04921k886655n43256L855323N264688
38721A63774L254608Q39686j272702m047031n331960j646139N010351P558328
38713D528915K845762l759584n111263q58951L199798K742718n90207k242725
38705G54463o03024J396639O75385j390151q97930K209059K988508j454204o686811
38696c008066o085678K99317N707338N171222P78210j986983n52785K855620L993386
38687G171581Q71561l793713n053728j720032J781133J446950p52071o87944Q69154
38678A32891Q1527k270050j335723K815678L596334j666574n902015k062634N817551
$$ y = [-1816790, -4635882, -5881145, -3392809, 392889, 1156443, -1725615, -5416896, -8114309, -9830634, -9848024, -7462416, -4921405, -5526326, -8412981, -8956237, -5100914, 163774, 3418382, 4258068, 2985366, -1061665, -6393625, -8039764, -3029413, 4528915, 7374677, 3615093, -1496170, -2355121, 844677, 3587395, 2997188, 754463, 151439, 1548078, 2223463, 833312, -64618, 2144441, 5132949, 3678745, -3008066, -9093744, -8794427, -3087089, 2084133, 2862343, 875360, 322575, 3178195, 7171581, 8043142, 4249429, -804299, -2524331, -743198, 703752, -48319, -736263, 132891, 214418, -2055632, -3391355, -575677, 3020657, 1354083, -4547932, -6610566, -793015]
38669g93015P818483K029320l605051l142178J77153N57131j857685k804419j054264
38660b674525M98200l5656j005081n45830J61536j141856l595388l294422J633070
38651i999952P532017Q632138L668075k743151n640517m669618k531320n66803
38643f319131J866871M541703N399021K967365j548974n070740n085572j631980
38635d881437K469810L865434J942994o09061j060954M94090K202439K888771
38627G312086K204220l979k672507l474559j977012j156005l028502m615862k065956
38618i478076K583811L605257K57592k035066j14152K603878K300104L34919k19188
38609a60921O57040J820563L609115N130907L041358k702695n826536j814713
$$ y = [-793015, 7025468, 9054788, 5449737, 2307559, 2484712, 3041843, 1184158, -1620261, -2674525, -2176325, -2211981, -3217062, -3762892, -3601356, -4743212, -8338600, -11633022, -9999952, -2467935, 6164203, 9832278, 7089127, 1448610, -3221008, -5752328, -6319131, -4452260, 89443, 5488464, 8455829, 6906855, 1836115, -3249457, -4881437, -2411627, 1453807, 3396801, 2787740, 1726786, 2220876, 4423315, 7312086, 9516306, 9512327, 6839820, 3365261, 1388249, 232244, -2796258, -7412120, -9478076, -6894265, -3289008, -3031416, -5066482, -5180634, -2576756, -276652, 58267, -160921, 496119, 2316682, 5925797, 11056704, 14098062, 11395367, 5568831, 3754118]
38601C754118M205753L832129k484901o329831l494088J438978L127431J794880
38593E844469o3797j829803l196040k673758k09582J685842J334139K8272l55563
38584E64179M31109J737015K550111J338405j894839l907768j984884J252519
38576H5847R42011k579477m148042j506519K321290M516418N060831L655482j95481
38567H152360l578767k779746N6526l43352k716924p28553M809307N310932q23290
38558G358493l768551J736751O731401K449415n312485o244432j780143m8061
38550A122388j107469O44586M060838L556919N39267M76110J273021k945315q474040
38541h53695n937465K861031N947049M62763k999098J343629N518428K584930
$$ y = [3754118, 7959871, 11792000, 9307099, 2977268, -516820, 922158, 4049589, 5844469, 5780672, 3950869, 754829, -1918929, -2128511, -442669, 891470, 919742, 564179, 995288, 2732303, 5282414, 6620819, 4725980, 818212, -1166672, 85847, 1027858, -1551619, -5699661, -7206180, -4884890, -368472, 4692359, 8347841, 8152360, 4573593, 1793847, 1850373, 1507021, -1209903, -1938456, 2870851, 8181783, 7358493, 3589942, 5326693, 12058094, 14507509, 9195024, 2950592, 1170449, 1122388, 14919, 659505, 4720343, 8277262, 8816529, 9292639, 10565660, 7620345, -853695, -6791160, -3930129, 2016920, 2479683, -519415, 824214, 6342642, 8927572]
38533H927572k131281j833652M31438n47882k109963O9K582568Q50231k433128
38524C735972j856648J347617K500590J693963J525088O07639l160065o136530
38516B57626l416204K381248M023734J26548l761302l707357j101556J749276
38508c447987M171895M999401K665619j613116m035638k395665J735273M698302
38500F778084L470812j728451o300507n233136J24164K465696j865913p212526
38492i501777o000077J230090P231233P329174L336025l86626j298281J14613
38484B054374J194015N7574j440184k7160L195593L374496k69656k333724L09155
38475F114483L292846K027938q64477n39056J870770J852678o92499j939605m26955
$$ y = [8927572, 6796291, 4962639, 5394077, 4846195, 2736232, 2736301, 5318869, 6169100, 3735972, 1879324, 3226941, 5727531, 7421494, 8946582, 9554221, 6394156, 257626, -3158578, -777330, 3246404, 3372952, -388350, -4095707, -5197263, -3447987, 723908, 5723309, 8388928, 6775812, 2740174, 344509, 2079782, 6778084, 10248896, 8520445, 2219938, -3013198, -2889034, -423338, -2289251, -9501777, -15501854, -14271764, -7040531, 288643, 3624668, 3238042, 1939761, 2054374, 3248389, 3305963, 1865779, 1838619, 5034212, 8408708, 8139052, 5805328, 6114483, 9407329, 11435267, 10570790, 10031734, 11902504, 13755182, 13062683, 11123078, 10696123]
38466A0696123J962015L543541L482157J181843j587657j119010K268414K868567
38458B3295993j709324n391744k533314K920076L593870l17841l217203l397154
38450A3243359k818693j191380J974645K791110j310183m554271m42762O547821
38442A4239646O761679O17400k682081n13049N56185k164959l445453j116427
38434A2252941k3620j915672j731162K219768M109161R50267k119714j616434
38426A2125535j764013n370693p253312l104413K614196M160140L122681L125055
38418G655176K478411j002414l825333k608397p08734j970598l053858L74748
38410b660999M594924L409684r85267j578756J489383J561499k850824n586399
$$ y = [10696123, 12658138, 16201679, 19683836, 20865679, 19278022, 18159012, 20427426, 23295993, 21586669, 16194925, 13661611, 16581687, 20175557, 19857716, 16640513, 13243359, 10424666, 9233286, 11207931, 13999041, 12688858, 8134587, 7691825, 14239646, 21001325, 21618725, 18936644, 18423595, 18979780, 16814821, 13369368, 12252941, 12229321, 10313649, 8582487, 10802255, 14911416, 15861683, 13741969, 12125535, 10361522, 4990829, -2262483, -5366896, -2752700, 1407440, 4530121, 7655176, 10133587, 9131173, 5305840, 2697443, 1988709, 18111, -3035747, -2660999, 1933925, 5343609, 4358342, 2779586, 4268969, 5830468, 2979644, -2606755]
38402b606755k725953K254948M649228M039238K167884K6397j493873j636261
38394D674853j282647j576055j344358R07693L197086K156089j349416k704199
38386B679046o5289L089808K760861q70219m294755m438667j257891K258901K970353
38377B832148J022672q63430j707245k986977m253395k311060K781631N430259
38369e5397K210558k103275j171837L425628M872330J050119l734045n422749
38361i28668l491149R35556N206240N013963o06455n795162m810062m84848L88684
38352d571901k033531j906236J502217K927269J110844O45109K411494J419160
38344A504425k942338l674996K223455P308024M766256j222738k891387n64273
$$ y = [-2606755, -5332708, -3077760, 1571468, 5610706, 7778590, 7804987, 6311114, 4674853, 3392206, 1816151, 471793, 1379486, 4576572, 6732661, 5383245, 2679046, 2613757, 5703565, 8464426, 7594207, 3299452, -1139215, -2397106, -138205, 2832148, 3854820, 2991390, 1284145, -1702832, -5956227, -8267287, -5485656, -55397, 2155161, 51886, -1119951, 2305677, 7178007, 8228126, 4494081, -928668, -4419817, -3484261, 1721979, 6735942, 6129487, 334325, -4475737, -4960585, -4571901, -6605432, -8511668, -7009451, -4082182, -2971338, -2326229, 85265, 1504425, -1437913, -5112909, -2889454, 4418570, 9184826, 7962088, 5070701, 4506428]
38336D506428L16589j086317j788391j683974k121262j017087L261087O127102
38328F514175K755245k688717k447302J883314J500585m569459p013443j262959
38320e328561M915220L622550j783669l754704k249748k015033k925416r45641
38312a0465002L623762N998325M230603R51005j669522l610411m151829k293492
38304g386561J13244K42226r04898j99113J541057O71530j873604o58612N035047
38295c419684Q433753N037045n37650j984799o54590j686015m475478l983446
38287c270864m2872J761067p83619k766068Q1217M699142N260053J348981k203467
38278D083570k323999r79052j160805k305855j505957J606805L364686N85331
$$ y = [4506428, 4823017, 3736700, 1948309, 264335, -1856927, -2874014, 387073, 6514175, 9269420, 6580703, 4133401, 6016715, 7517300, 2947841, -4065602, -5328561, -413341, 3209209, 1425540, -2329164, -4578912, -6593945, -9519361, -10465002, -6841240, -842915, 3387688, 4338693, 2669171, -941240, -5093069, -7386561, -7273317, -7031091, -7935989, -8135102, -6594045, -5922515, -7796119, -8454731, -3419684, 5014069, 10051114, 9513464, 7528665, 6874075, 5188060, 712582, -3270864, -3313736, -1552669, -2336288, -5102356, -5021139, -321997, 4938056, 6287037, 4083570, 1759571, 780519, -380286, -2686141, -4192098, -2585293, 779393, 1364724]
38270A364724m583495o473442k713825K844513M956662K895965J32293l86168
38262a962773J134302K597657K479279J315070J045567K078930J773793j726196
38254H735629m993100l023065K358660L735071l21702j957469L279502P786872
38246A5600398L300108n237208o948570j959126K86081k417220k729831J349360
38238A243992K359226k267891m216454J127405N388635R72249n448143l574037
38230d415018L588269M957260q84459m795005k174721J735323J974642J67781
38222A54072p78872r56531p08610N97479J850213J147392k07911N27263K191626
38213C816121J490456n44377q619K293439J589330k106095l305627n98560O16382
$$ y = [1364724, -3218771, -9692213, -12406038, -9561525, -4604863, -1708898, -1576605, -1962773, -828471, 1769186, 4248465, 5563535, 6609102, 8688032, 10461825, 8735629, 3742529, 719464, 3078124, 6813195, 6491493, 4534024, 7813526, 15600398, 18900506, 13663298, 6714728, 4755602, 5041683, 2624463, -105368, 1243992, 3603218, 1335327, -2881127, -1753722, 3634913, 4607162, -840981, -4415018, -826749, 4130511, 3246052, -1548953, -3723674, -1988351, -13709, 154072, -624800, -1581331, -2289941, -1692462, 157751, 1305143, 1097232, 1624495, 3816121, 5306577, 4762200, 4753581, 7047020, 8636350, 6530255, 3224628, 2626068, 3242450]
38204C242450k272540l984148j32339M937279M430579r76981m714620l184950
38196b655270J202626M049657K909271j136235l894602k219373J293330J268429
38188H17833j975339k219996K319788M918880Q56935m254144k980901K160142
38180c56802L165342o60047k826330q50498J306248J754103L008681M597648J843161
38171A0981506n015417q229508l467100L203899M398269J734528R94284J878894
38163F479355P7334l534077l922959j145778o04734l386953l986590k2537K829215
38154g217724j94561m695606l370732L081761P109380M644806q40802l962373
38146e445851k753324J357400N065723M776779J12448m306850l792275K65393
$$ y = [3242450, 969910, -3014238, -3146577, 1790702, 6221281, 5244300, 529680, -2655270, -1452644, 2597013, 5506284, 4370049, 475447, -1743926, -450596, 817833, -1157506, -3377502, -1057714, 3861166, 4718101, 463957, -2516944, -356802, 2808540, 2148493, -677837, -1528335, -222087, 1532016, 4540697, 9138345, 10981506, 5966089, -2263419, -5730519, -2526620, 1871649, 3606177, 4600461, 6479355, 6556689, 3022612, -900347, -2046125, -2650859, -6037812, -10024402, -10046939, -7217724, -7412285, -12107891, -15478623, -12396862, -5287482, -642676, -1483478, -5445851, -8199175, -6841775, -1776052, 3000727, 3113175, -1193675, -4985950, -4720557]
38138d720557K726462K228364J741676K145256J025680j375318j188612K069580
38130D652531L524851Q98536j550180p89196m68335l431780m956443n74678M508885
38121A814191K534595l798245n087411j35509L215735J987275J778706M439243
38113F748580L232201m484609r602356m025715O091760Q566748K014218m117268
38105D423559l647920L50205K742805K339710L20392j804521k082739j20682J061578
38096C582387r92169l476398k095452J736685K775341K10647j800135j608513
38088a667607j638735j904028R53980O097002P093830J779435l005926j552038
38080F155913J631929o14884n912592n727589J046810O124344L970693j262531
$$ y = [-4720557, -1994095, 234269, 1975945, 4121201, 5146881, 3771563, 2582951, 4652531, 8177382, 9075918, 7525738, 6736542, 6268207, 2836427, -2120016, -2694694, 1814191, 4348786, 550541, -4536870, -4672379, -1456644, 530631, 2309337, 6748580, 9980781, 5496172, -4106184, -8131899, -2040139, 6526609, 8540827, 4423559, 775639, 1125844, 3868649, 6208359, 6528751, 4724230, 2641491, 2520809, 3582387, 2590218, -886180, -2981632, -1244947, 1530394, 1741041, -59094, -1667607, -3306342, -5210370, -4256390, 1840612, 8934442, 10713877, 7707951, 6155913, 7787842, 7172958, 1260366, -4467223, -3420413, 2703931, 6674624, 5412093]
38072E412093l096366j153479R50356J675380J706662Q98871j178076l053767
38064B161674k682077l04068J937390K507188J287380r20398k413719j609538
38056c6168N48894R94270r97980j985548N30778L493616K417917j508372k940542
38047E16865m34032J870814J143038n27156r81390j463288k439388p52982M688892
38038A621373Q247861M271778l713932o709515k534192J785505P61466k492379
38030A237965k512066L41889J926398J058638q9348l17558j48019N43100K010155
38021D051154K525056L24564k650539k540790O07535K322985P4595l075257l050690
38012a411387l95383J182680K47901j147122j103150j99391J63271j15252j66984
$$ y = [5412093, 2315727, 1162248, 2112604, 3787984, 5494646, 6393517, 5215441, 2161674, -520403, -824471, 1112919, 3620107, 4907487, 3987089, 1573370, -36168, 512726, 1506996, 509016, -1476532, -945754, 2547862, 4965779, 3457407, 516865, 82833, 1953647, 3096685, 2569529, 1588139, 124851, -2314537, -3067519, 1621373, 9869234, 14141012, 10427080, 3717565, 1183373, 2968878, 3730344, 1237965, -1274101, -932212, 994186, 2052824, 1963476, 1645918, 1497899, 2040999, 4051154, 6576210, 6900774, 4250235, 1709445, 2316980, 4639965, 4714560, 1639303, -1411387, -1806770, -624090, -376189, -1523311, -2626461, -2825852, -2662581, -2777833, -2944817]
38003b944817M56887J428015K009198J307111j132144m259009n570794l336501
37995a2042054J072928M095519L877087K357465K220434K561578Q4403m898498
37987f71138o820505j892617N404176O989853J800880k954072k147477O93980
37979D03080J70322k235899j395615K270261L225950l1919k529354q14686K128272
37970A190412K354598N94952o06469j238459j837074r35420J542005J906138j573306
37961A397377l883995o9557N701699M975088j963147n648419j229183M783557
37953D063420M711874J92433k250104j259010n93404j715191j982245K96048L019414
37944D483235K899655j084228o470412q570632m553536K607158O534649N068790
$$ y = [-2944817, -2487930, -1059915, 949283, 2256394, 1124250, -3134759, -8705553, -12042054, -10969126, -6873607, -2996520, -639055, 1581379, 4142957, 4227360, -671138, -7491643, -9384260, -3980084, 3009769, 4810649, 1856577, -290900, 403080, 573402, -1662497, -3058112, -787851, 2438099, 2406180, -123174, -937860, 1190412, 3545010, 4139962, 3533493, 2295034, 457960, -477460, 1064545, 2970683, 1397377, -2486618, -2556175, 3145524, 8120612, 6157465, 509046, -720137, 4063420, 8775294, 8967727, 6717623, 5458613, 4865209, 3150018, 1167773, 1463821, 4483235, 7382890, 6298662, -171750, -8742382, -13295918, -10688760, -4154111, 914679]
37936I14679K495236K511718K953475N83634k880838l955274l294653l281191
37928c953214k462107J654031O150471N669643J113666j355864j78772k24637
37920F413217l438927m907829j371014K796635K564048q451k08455J161584n4337
37911B946471l454817m353090j330152J754520J884298P49231J143976K713755
37903B054192L172224J852641J92415n81626q25707j367368j807541q98661J100455
37894B891024J729541m43993k767209j261943L430065N796200K365315l665730
37886H073270o494117m382086l39688K174254K145010P62331J52486J587900L788749
37877G468109M057472J806371q00772k358223l661252m479776k514256J912322
$$ y = [914679, 3409915, 5921633, 8875108, 9458742, 6577904, 2622630, -672023, -3953214, -6415321, -4761290, 1389181, 7058824, 8172490, 6816626, 6637854, 6413217, 2974290, -1933539, -3304553, -507918, 2056130, 2047679, 1839224, 3000808, 2946471, -508346, -4861436, -6191588, -4437068, -2552770, -1803539, -659563, 2054192, 5226416, 7079057, 7271472, 6689846, 5864139, 4496771, 2689230, 1790569, 2891024, 4620565, 4176572, 1409363, 147420, 3577485, 9373685, 11739000, 8073270, 1579153, -2802933, -3142621, -968367, 1176643, 1938974, 2091460, 3679360, 7468109, 11525581, 13331952, 12531180, 10172957, 6511705, 2031929, -482327, 1429995]
37869A429995L844857L26800m032405l072658J539413K707417j331771m824984
37861c413336l505733J52852K214895K388549J567022p73832l661947l373398
37853h404928J297724N820036N526272J680209j356073k226944k291890j918472
37845a874066j059775j196699k504274j411618M105645Q848341O020797k294371
37837H633980o733389l227648K389675L923745K559171J966289J458821j253214
37829I717430m483530m797784k505220o00654J06154J028249K355099K939901
37821C759645K467783J054416j606870m135685l092068J862544N154113J992835
37813G456713m396184o969620m148787K86899M201345P421860O903791j41799
$$ y = [1429995, 5274852, 5601652, 1569247, -1503411, 36002, 2743419, 1411648, -3413336, -6919069, -6766217, -4551322, -2162773, -595751, -1369583, -5031530, -8404928, -7107204, -1287168, 4239104, 5919313, 4563240, 2336296, 44406, -1874066, -2933841, -4130540, -6634814, -8046432, -3940787, 4907554, 10928351, 8633980, 1900591, -1327057, 1062618, 4986363, 7545534, 9511823, 10970644, 9717430, 5233900, 436116, -2069104, -2669758, -2563604, -1535355, 819744, 3759645, 6227428, 7281844, 5674974, 1539289, -1552779, 309765, 5463878, 7456713, 3060529, -3909091, -8057878, -7770979, -3569634, 3852226, 10756017, 10614218]
37805A0614218q211498p511494J730448P426505K084334o568139o877535J180897
37797f132264Q182320Q269437L408109k058563m902313l319409R02713K478857
37789F828887p08491l728122j853515J794031J416022j996587k977420q01566
37781b026761P70150J186784K958475M636021J755981m770161q468996o533716
37773a0492223k607460N40322M125859P646740P220141K254223k421532l679877
37765B586193l510889l170361n49705L713797M473028M30357k409048l74368J434406
37756B623410j755983n254727k533571K989639K778539k905379n103034J48791
37748i012315O490238P007657K584521j714980l234802k152738N02856K604404
$$ y = [10614218, 2402720, -5108774, -3378326, 4048179, 6132513, -435626, -7313161, -6132264, 2050056, 10319493, 13727602, 11669039, 6766726, 3447317, 4350030, 6828887, 6120396, 2392274, 538759, 2332790, 3748812, 1752225, -1225195, -2026761, -1256611, -69827, 2888648, 7524669, 9280650, 4510489, -3958507, -10492223, -13099683, -12559361, -8433502, -786762, 6433379, 8687602, 6266070, 2586193, -924696, -4095057, -4644762, -930965, 3542063, 3972420, 1563372, 1189004, 2623410, 867427, -4387300, -6920871, -3931232, -1152693, -4058072, -9161106, -9012315, -2522077, 4485580, 7070101, 5355121, 2120319, -32419, 470437, 3074841]
37740C074841J676342j809386m059022k606680N75755K108279J520763P99668
37732A280560R00325P03339p18883k327546k383899r34259J33099j11668j20453
37723c579385J472017K898287J469506j777161k837824o28114J203045l00065
37715b079694l171551l640761j019524K483689M695770M412376J499535k123177
37707A056663l491673k038749k2861J329064L079761M802691L501584j249798
37699F966682m790367l230171J116326L298636K050833l85246j983546j643405
37691A399742Q53191K922730P85684m253280n678191j416292J890193p08353l764399
37682g968975l73550N448255M660843j884104m766036j010455K611844J824805
$$ y = [3074841, 4751183, 2941797, -1117225, -3723905, -3148150, -1039871, 480892, 1280560, 2180885, 2884224, 2165341, -162205, -2546104, -3480363, -3347264, -3458932, -3579385, -2107368, 790919, 2260425, 483264, -2354560, -2982674, -1779629, -2079694, -5251245, -8892006, -9911530, -7427841, -2732071, 1680305, 3179840, 1056663, -2435010, -4473759, -4496620, -3167556, -87795, 4714896, 8216480, 6966682, 2176315, -1053856, 62470, 3361106, 5411939, 5026693, 3043147, 1399742, 2252933, 5175663, 5961347, 1708067, -3970124, -5386416, -3496223, -4204576, -7968975, -8342525, -2894270, 1766573, -117531, -4883567, -5894022, -3282178, -1457373]
37674a457373L26380J003810J080863p20301o76029K305443L257693j86459k891866
37665B042161r92052J197843j041935m135659k223464K693046M079936J494671
37657C114547M87682K988269M527884J651921l102925n126686l311689l23046
37649I05957R06426J05320m18290R75892K459429J041491k497023m097811k449898
37640c068507p65277j193804j636173l20078P54107l909k83282J690233L089696
37631a736994J225883j149376k16653K257623K071784q5485l80918Q31487k69789
37622B547562l630519m911518k614728J12928J322063K318545L072591J389621
37614c93455j716181j537605K905820O166505M224354L09639q17394m7132q46656
$$ y = [-1457373, -1130993, -127183, 953680, 233379, -442650, 1862793, 5120486, 4934027, 2042161, 1050109, 2247952, 1206017, -2929642, -5153106, -2460060, 1619876, 3114547, 3602229, 6590498, 11118382, 12770303, 9667378, 4540692, 1229003, 905957, 1812383, 1917703, 1499413, 2475305, 4934734, 5976225, 3479202, -618609, -3068507, -3833784, -5027588, -6663761, -6983839, -6229732, -6233641, -6516923, -4826690, -1736994, -511111, -1660487, -1877140, 380483, 2452267, 2366782, 1985864, 2817351, 2547562, -1082957, -5994475, -8609203, -8496275, -7174212, -4855667, -1783076, -393455, -2109636, -3647241, -741421, 5425084, 9649438, 9959077, 9141683, 9094551, 8247895]
37605H247895k584777k248674n41643p63919k712253l040572j454543j216105
37597f314591k765266k165279K092604N613303M662037K090160K311258L489744
37589I013970N01047n529162p093846j073870N963835O370507J094554l211403
37581F035632l549774k232938j148582J97875J231079J02227k173364k013052
37573c550897Q11664J979805m74658k369403K59810M578820M802254K31896m578057
37564A691234o033136m092202j07935L963735N209259K572562o30950p31389P60405
37555B601583o0846k268095j316296K515961L416539n27418l719978k123499K90856
37546a191193j064170l178339j104416K492740J356698l139961l389936J987456
$$ y = [8247895, 5663118, 3414444, 2872801, 2108882, -603371, -3643943, -5098486, -6314591, -9079857, -11245136, -9152532, -3539229, 1122808, 3212968, 5524226, 9013970, 9515017, 3985855, -3107991, -4181861, 1781974, 8152481, 9247035, 6035632, 2485858, 252920, -895662, -697787, 533292, 635519, -1537845, -3550897, -2739233, -759428, -1234086, -3603489, -3343679, 1235141, 6037395, 6269291, 1691234, -4341902, -8434104, -8542039, -4578304, 630955, 3203517, 2572567, 1841178, 2601583, 2540737, 272642, -1043654, 1472307, 4888846, 4361428, 641450, -1482049, -1191193, -2255363, -5433702, -6538118, -4045378, -2688680, -5828641, -9218577, -7231121]
37538g231121N536564K607274k153928l190063j927099j786907j387948J534012
37530g999216M058344K288072j494779k054968O59104K482410K146375J406774
37522A492116n4637l176149m422875K83412P050255P612994J953612j445552M66361
37513I759537R10203l542920n639821Q1082O514128M602922k190509m079521o22178
37504E792923N66343k231488l195713m21127J353729O7574r44076o45509j844691
37495a502035l617725j148899M634624O117161P91354m409262m118931j502890
37487d756603j38405K228919O274095O110211r13214o837374l922493L235354
37479A280490N324824K796898K754568N183687L340186l272485o889046l589145
$$ y = [-7231121, -1694557, 912717, -1241211, -4431274, -6358373, -8145280, -9533228, -7999216, -3940872, -1652800, -3147579, -5202547, -4543443, -2061033, 85342, 1492116, 1437479, -1738670, -6161545, -5878133, 1172122, 8785116, 10738728, 9293176, 9759537, 10669740, 7126820, 1486999, 1568081, 8082209, 12685131, 10494622, 6415101, 5792923, 6359266, 4127778, 932065, 510938, 1864667, 1932241, 988165, 342656, -1502035, -5119760, -6268659, -1634035, 4483126, 5274480, 865218, -3253713, -4756603, -4895008, -2666089, 3608006, 9718217, 8805003, 1967629, -1954864, 1280490, 6605314, 9402212, 12156780, 17340467, 20680653, 17408168, 10519122, 6929977]
37471F929977J400371K456074K15178k512823m767539n162582j784708L111525
37463a14527L875509m52404l961626k466114P56295J047885m91516q2334K005359
37454A16527K287618j99922k746692k763189k13158L072053M723722L167452j010343
37445F434068n323769p296368n593070k57600O235904R185536N969486j48706
37437I205481l624232l559955l264062l495037j502155K418061L462955O3033
37429b95911k503109j77188L073864J592141k699803l422324J52695K505869Q47460
37420i26306j258319k23404K442175L179354J145228j857806l795075l414214
37412d708367q90061J545796J518903k16586m80717J602880K963506J060737k150101
$$ y = [6929977, 8330348, 10786422, 11001600, 8488777, 3721238, -1441344, -3226052, -114527, 3760982, 3308578, -653048, -3119162, -2362867, -1314982, -1806498, -1888832, 116527, 2404145, 2204223, -542469, -3305658, -3518816, -446763, 4276959, 7444411, 6434068, 1110299, -6186069, -11779139, -12036739, -5800835, 3384701, 9354187, 9205481, 5581249, 2021294, -1242768, -4737805, -6239960, -3821899, -358944, -295911, -2799020, -2976208, 97656, 1689797, -1010006, -4432330, -4279635, -1773766, -926306, -2184625, -2408029, 34146, 3213500, 4358728, 2500922, -1294153, -4708367, -5598428, -4052632, -2533729, -2750315, -3231032, -1628152, 1335354, 2396091, 245990]
37403B45990k781208j98746K463370K330072m88636l810037n255071l347167J298234
37394i543199N314524M935609L59748l485799k344036J955159L809014J494478
37386B495498n66726J404091M663733M196242P55259j72097K685083L833587m26492
37377A8868178n650421n528043j199761R35632r09663k117575n9843J583189o34192
37368E287501l846269l306398K61491K281955J528107Q82392J375877M73013k554570
37359B383099m081283j530266K118350K539043L68325m23973J075754K076146
37351D525195J272866M09339J67659j254504l922333m485338j338482J777625
37343b847973O82285l078620m585049k392354P43021K749295L678630K895924
$$ y = [245990, -2535218, -2733964, -270594, 2059478, 1570842, -2239195, -7494266, -10841433, -9543199, -4228675, 706934, 1066682, -2419117, -4763153, -2807994, 1001020, 2495498, 1928772, 3332863, 7996596, 12192838, 12948097, 12776000, 15461083, 19294670, 18868178, 13217757, 7689714, 6489953, 7425585, 6515922, 4398347, 4338504, 5921693, 5287501, 1441232, -1865166, -1603675, 678280, 2206387, 3088779, 4464656, 4937669, 2383099, -1698184, -3228450, -1110100, 1428943, 1797268, 1373295, 2449049, 4525195, 5798061, 6207400, 6375059, 5120555, 1198222, -3287116, -4625598, -2847973, -2165688, -5244308, -9829357, -12221711, -11478690, -8729395, -5050765, -2154841]
37335b154841m78581l868855k785036K281223M925063J420699l628926l740320
37327h029574M74074L066242J463030j284859k173393j508518j91111J920938
37319f263171L676522K460720j596248m245118k368978J655543L295097J659495
37311a726138o48174j822166j896754n85072K387674M950922M241796J169372
37303F071460N8739K351708L867411O35705n164345q031882o035122j688582K569851
37294e365057N919513O814249L566192j802850m274706k253858R1957q12726k576823
37285f94109j206396J861472J768976j707429l110019P03548N619816N598450
37277H834309L47809m800629n319221j707034K043503K632105L03612j723779
$$ y = [-2154841, -2633422, -6502277, -9287313, -7006090, -2081027, -660328, -4289254, -8029574, -7555500, -4489258, -3026228, -4311087, -6484480, -7992998, -8184109, -6263171, -2586649, -125929, -1722177, -5967295, -8336273, -6680730, -3385633, -1726138, -2374312, -4196478, -6093232, -6678304, -4290630, 660292, 4902088, 6071460, 6130199, 8481907, 12349318, 12985023, 7820678, -211204, -6246326, -7934908, -5365057, 554456, 7368705, 10934897, 9132047, 4857341, 2603483, 2695440, 1882714, -694109, -1900505, -39033, 1729943, 22514, -3087505, -2383957, 3235859, 8834309, 9182118, 4381489, -937732, -2644766, -601263, 2030842, 2334454, 610675]
37269F10675r85910J161548J500868j25607l72147K129183L850954J471559k636628
37260F604495l752397j985409j446306k741742j797966K507446N088777K242104
37252D719002k227921k938663j077340j005030j794734P40887N013301M801105
37244F230607J42404j370315K901138N119687p31304q289947q002650j472699
37236e473079K118793N17071k47102K211054L097010K2655k638866j661664K00902
37227a853226L71302O33687J780505P24402k978391m152134m48171K322043p91052
37218d391035m958856k678404M384246Q202680O264354L104065J622309K64074
37210A1813433j596457k184525j566230j721771k254882j205783K29802o89571
$$ y = [610675, -375235, 786313, 2287181, 2161574, 1789427, 3918610, 7769564, 9241123, 6604495, 2852098, 866689, -579617, -3321359, -5119325, -2611879, 2476898, 4719002, 2491081, -447582, -1524922, -2529952, -4324686, -3583799, 1429502, 6230607, 6373011, 5002696, 7903834, 13023521, 12292217, 4002270, -4000380, -5473079, -3354286, -2837215, -3084317, -873263, 2223747, 2246402, -392464, -2054128, -1853226, -1481924, -848237, 932268, 1656670, -1321721, -5473855, -5922026, -3599983, -4391035, -9349891, -12028295, -7644049, 558631, 6822985, 9927050, 11549359, 11813433, 10216976, 8032451, 6466221, 4744450, 2489568, 1283785, 1513587, 824016]
37202H24016k376814p72175K963245L269612n42280k813525j098164j30379l063735
37193c740199n277785j624539M988113P377676L499898k153724m507756k063886
37185c502202K935809N964941L783255j532642m325263k421962N13266R33505
37177B348707j73567p36445j224111k094225j665408L26025R30300r40847j729356
37168d958927O76748K401684p4611l128572j433096L081894M308746J754166K59869
37159B887901J146365Q93382j291065j710064P12681K024530M1948k192380k240873
37150B72425k132379l276560k653408J712384N625471M089239q82714k965864
37142b11406o48888J380422p4377k259860j157611K661456N040784L416944q16223
$$ y = [824016, -1552798, -2324973, 638272, 3907884, 3365604, 552079, -546085, -676464, -3740199, -9017984, -10642523, -5654410, 1723266, 5223164, 3069440, -1438316, -3502202, -566393, 5398548, 9181803, 7649161, 3323898, 901936, 1415202, 2348707, 2175140, 1438695, 214584, -1879641, -3545049, -3219024, -2288724, -3229571, -4958927, -4282179, -1880495, -1955106, -5083678, -6516774, -3434880, 873866, 2628032, 2887901, 4034266, 4927648, 3636583, 1926519, 2639200, 4663730, 4705678, 2513298, 272425, -1859954, -5136514, -7789922, -6077538, -452067, 3637172, 2754458, -211406, -860294, 520128, 445751, -1814109, -2971720, -310264, 4730520, 8147464, 7331241]
37133G331241m253290m389739j186184K811217L976857P48548l996392m900794
37125c858536N1458O198862O642311L31036o384856p345316l486818n1702R81288
37116f922273J932444L608655L201594l59144l077630j354202J964012J452777
37108D46233k244944k913406J407215M585934J522109l461520k597022L598195
37100C42794P016019L940525m87755j409851j061930k708119l926676j731891
37092b6884M15265k095397n994252m509602J032607K865933k33251j246407K196063
37083g595925L420654o90796k713430K807591Q502971N098730l204365n007958
37075F17472M18039K983593j441091n293946k367884K985659L686904j58834l575662
$$ y = [7331241, 3077951, -1311788, -2497972, 313245, 4290102, 5038650, 1042258, -3858536, -3807078, 2391784, 9034095, 9365131, 2980275, -4365041, -7851859, -7903561, -6922273, -4989829, -1381174, 1820420, 1461276, -1616354, -2970556, -1006544, 446233, -1798711, -4712117, -3304902, 1281032, 2803141, -658379, -3255401, 342794, 7358813, 11299338, 10811583, 9401732, 8339802, 5631683, 1705007, -26884, 388381, -1707016, -7701268, -12210870, -11178263, -8312330, -8545581, -9791988, -7595925, -4175271, -4866067, -7579497, -4771906, 3731065, 8829795, 5625430, 617472, 1035511, 4019104, 2578013, -2715933, -5083817, -2098158, 1588746, 1429912, -2145750]
37066b145750l844662j440811K212289M683726L487006l65595k693851j737566
37058a845214p9298L31401Q84382K180934J787767j066611k799613r30089J484449
37049e1892P15307j484663q47308K512573M336868K141770k385522n803255n222756
37040f088878N9150O595103Q454805L800556k170979l849747k373672k414789
37032B011549m242745m092535j287589N16623m48918j513565l88815J641895K829030
37023d975070L523490L915227K654571j38102j535558O461J679513L68607k416073
37014C083066k897790r11857K49089n31457o19066J326577K336180k87434l803814
37005b056506l081124J860241N099825K532314k879131n488530l918635q64877
$$ y = [-2145750, -5990412, -7431223, -5218934, -535208, 2951798, 2586203, -107648, -1845214, -1924512, -1593111, -708729, 1472205, 3259972, 2193361, -606252, -1536341, -51892, 663415, -821248, -1668556, 844017, 5180885, 7322655, 4937133, -866122, -6088878, -6029728, 565375, 9020180, 12820736, 10649757, 6800010, 4426338, 2011549, -2231196, -6323731, -7611320, -7094697, -7543615, -9057180, -9445995, -7804100, -4975070, -1451580, 2463647, 5118218, 4980116, 3444558, 3451019, 5130532, 5499139, 3083066, 185276, -726581, -477492, -1008949, -1628015, -301438, 2034742, 1747308, -2056506, -5137630, -3277389, 1822436, 4354750, 1475619, -4012911, -7931546, -8796423]
36997h796423J841420M135435M798271K116731k151574l610263j224699J179920
$$ y = [-8796423, -6955003, -2819568, 1978703, 4095434, 1943860, -1666403, -2891102, -1711182]
$$ [...]
##END NTUPLES=NMR SPECTRUM
##END=
