##TITLE=31Pdec_SR36-oil
 CDCl3, 24 sc
 5.2.2021
##JCAMPDX= 6.0         $$ Bruker NMR JCAMP-DX V2.0
##DATA TYPE= NMR SPECTRUM
##DATA CLASS= NTUPLES
##ORIGIN= UXNMR, Bruker Analytische Messtechnik GmbH
##OWNER= root
$$ XWIN-NMR		Version 3.5
$$ Fri Feb  5 13:26:00 2021 Russian Standard Time (UT+4h)  she@DPX200
##.OBSERVE FREQUENCY= 81.013821
##.OBSERVE NUCLEUS= ^31P
##.ACQUISITION MODE= SIMULTANEOUS
##.ACQUISITION SCHEME= undefined
##.AVERAGES= 24
##.DIGITISER RES= 17
##SPECTROMETER/DATA SYSTEM= spect
##.PULSE SEQUENCE= zgpg30
##.SOLVENT NAME= CDCl3
##.SHIFT REFERENCE= (INTERNAL, CDCl3, 0, 182.463)
##AUDIT TRAIL= $$ (NUMBER, WHEN, WHO, WHERE, WHAT)
$$ ##TITLE= Audit trail, XWIN-NMR		Version 3.5
$$ ##JCAMPDX= 5.01
$$ ##ORIGIN= Bruker BioSpin GmbH
$$ ##OWNER= she
$$ F:/spectra/data/she/nmr/P31/1/pdata/1/auditp.txt
$$ ##AUDIT TRAIL=  $$ (NUMBER, WHEN, WHO, WHERE, WHAT)
(   1,<2021-02-05 13:24:56.54 +0400>,<she>,<DPX200>,
      <created by zg, POWCHK disabled, PULCHK disabled
       configuration hash MD5:
       00 E9 B6 7A A2 85 ED C7 34 08 36 98 17 FE 4E 26
       data hash MD5: 32K
       96 D6 1D 18 87 8A B2 F9 00 27 09 1E A5 42 C9 35>)
(   2,<2021-02-05 13:25:05.65 +0400>,<she>,<DPX200>,
      <Start of raw data processing
       efp BC_mod = 2 LB = 1 FT_mod = 6 PKNL = 1 PHC0 = -1706.696 PHC1 = 5.602172 SI = 64K 
       data hash MD5: 64K
       38 F6 75 67 4B 9C 1D F8 C0 EE 0C 41 BE 8D E6 2B>)
(   3,<2021-02-05 13:25:25.35 +0400>,<she>,<DPX200>,
      <pk PHC0 = -11.26414 PHC1 = 0 
       data hash MD5: 64K
       1C 58 57 5B C0 4F 3B F3 E8 CE C5 21 AD 85 66 F9>)
(   4,<2021-02-05 13:25:35.01 +0400>,<she>,<DPX200>,
      <abs ABSG = 5 
       data hash MD5: 64K
       3E 6F 7E A3 EE 07 D8 CF 63 7F FF DC BE 50 65 75>)
$$ ##END=
$$ 
$$ hash MD5
$$ 61 AC 8A AE 7D 42 16 B1 20 6A EA 21 37 9D 8C 2B
##$RELAX= 
##$RELAX= 
##$RELAX= 
##$RELAX= 
##$RELAX= 
##$RELAX= 
##$RELAX= 
##$RELAX= 
$$ Bruker specific parameters
$$ --------------------------
##$DU= <F:/spectra>
##$EXPNO= 1
##$NAME= <P31>
##$PROCNO= 1
##$TYPE= <nmr>
##$USER= <she>
##$AMP= (0..31)
100 100 100 100 100 100 100 100 100 100 100 100 100 100 100 100 100 100 
100 100 100 100 100 100 100 100 100 100 100 100 100 100 
##$AQSEQ= 0
##$AQ_mod= 1
##$AUNM= <au_zg>
##$AUTOPOS= <>
##$BF1= 81.014009
##$BF2= 200.13
##$BF3= 200.13
##$BF4= 200.13
##$BF5= 200.13
##$BF6= 200.13
##$BF7= 200.13
##$BF8= 200.13
##$BYTORDA= 1
##$CFDGTYP= 0
##$CFRGTYP= 5
##$CHEMSTR= <none>
##$CNST= (0..31)
1 1 145 1 1 1 1 1 1 1 1 1 1 1 1 1 1 1 1 1 1 1 1 1 1 1 1 1 1 1 1 1 
##$CPDPRG= <waltz16>
##$CPDPRG1= <>
##$CPDPRG2= <waltz16>
##$CPDPRG3= <>
##$CPDPRG4= <mlev>
##$CPDPRG5= <mlev>
##$CPDPRG6= <mlev>
##$CPDPRG7= <mlev>
##$CPDPRG8= <mlev>
##$CPDPRGB= <>
##$CPDPRGT= <>
##$D= (0..31)
0 1 0 0 0 0 0 0 0 0 0 0.03 2e-05 3e-06 0 0 0 0 0 0 0 0 0 0 0 0 0 0 0 0 
0 0 
##$DATE= 1612517096
##$DBL= (0..7)
120 120 120 11 120 120 24 19 
##$DBP= (0..7)
150 150 150 150 150 150 150 150 
##$DBP07= 0
##$DBPNAM0= <>
##$DBPNAM1= <>
##$DBPNAM2= <>
$$ [...]
##$SUBNAM3= <"">
##$SUBNAM4= <"">
##$SUBNAM5= <"">
##$SUBNAM6= <"">
##$SUBNAM7= <"">
##$SUBNAM8= <"">
##$SUBNAM9= <"">
##$SW= 369.568048894756
##$SWIBOX= (0..15)
0 1 3 0 0 0 0 0 0 0 0 0 0 0 0 0 
##$SW_h= 29940.119760479
##$TD= 32768
##$TD0= 1
##$TE= 0
##$TE2= 300
##$TE3= 300
##$TEG= 300
##$TL= (0..7)
0 120 53 12 22 120 120 120 
##$TP= (0..7)
150 150 150 150 150 150 150 150 
##$TP07= 0
##$TPNAME0= <>
##$TPNAME1= <>
##$TPNAME2= <>
##$TPNAME3= <>
##$TPNAME4= <>
##$TPNAME5= <>
##$TPNAME6= <>
##$TPNAME7= <>
##$TPOAL= (0..7)
0.5 0.5 0.5 0.5 0.5 0.5 0.5 0.5 
##$TPOFFS= (0..7)
0 0 0 0 0 0 0 0 
##$TUNHIN= 0
##$TUNHOUT= 0
##$TUNXOUT= 0
##$USERA1= <user>
##$USERA2= <user>
##$USERA3= <user>
##$USERA4= <user>
##$USERA5= <user>
##$V9= 5
##$VALIST= <valist>
##$VCLIST= <CCCCCCCCCCCCCCC>
##$VD= 0
##$VDLIST= <DDDDDDDDDDDDDDD>
##$VPLIST= <PPPPPPPPPPPPPPP>
##$VTLIST= <TTTTTTTTTTTTTTT>
##$WBST= 1024
##$WBSW= 4
##$XGAIN= (0..3)
0 0 0 0 
##$XL= 0
##$YL= 0
##$YMAX_a= 11601
##$YMIN_a= -5533
##$ZGOPTNS= <>
##$ZL1= 120
##$ZL2= 120
##$ZL3= 120
##$ZL4= 120
##$ABSF1= 182.463
##$ABSF2= -187.1042
##$ABSG= 5
##$ABSL= 3
##$ALPHA= 0
##$AQORDER= 0
##$ASSFAC= 0
##$ASSFACI= 0
##$ASSFACX= 0
##$ASSWID= 0
##$AUNMP= <proc_1d>
##$AZFE= 0.1
##$AZFW= 0.5
##$BCFW= 0
##$BC_mod= 2
##$BYTORDP= 0
##$COROFFS= 0
##$CY= -3
##$DATMOD= 1
##$DC= 0
##$DFILT= <>
##$DTYPP= 0
##$F1P= 0
##$F2P= 0
##$FCOR= 1
##$FTSIZE= 65536
##$FT_mod= 6
##$GAMMA= 0
##$GB= 0
##$INTBC= 1
##$INTSCL= 5.30512e-09
##$ISEN= 30
##$LB= 1
##$LEV0= 0
##$LPBIN= 0
##$MAXI= 10000
##$MC2= 0
##$MEAN= 0
##$ME_mod= 0
##$MI= 50
##$NCOEF= 0
##$NC_proc= -10
##$NLEV= 6
##$NOISF1= 182.463
##$NOISF2= 159.3651
##$NSP= 0
##$NTH_PI= 0
##$NZP= 0
##$OFFSET= 182.463
##$PC= 4
##$PHC0= -1717.96
##$PHC1= 5.602172
##$PH_mod= 1
##$PKNL= yes
##$PPARMOD= 0
##$PSCAL= 0
##$PSIGN= 0
##$REVERSE= no
##$SF= 81.014009
##$SI= 65536
##$SIGF1= 159.3651
##$SIGF2= -187.1042
##$SINO= 113.3802
##$SIOLD= 16384
##$SREGLST= <1H.CDCl3>
##$SSB= 0
##$STSI= 65536
##$STSR= 0
##$SW_p= 29940.119760479
##$SYMM= 0
##$S_DEV= 0
##$TDeff= 32768
##$TDoff= 0
##$TI= <>
##$TILT= no
##$TM1= 0
##$TM2= 0
##$TOPLEV= 0
##$USERP1= <user>
##$USERP2= <user>
##$USERP3= <user>
##$USERP4= <user>
##$USERP5= <user>
##$WDW= 1
##$XDIM= 65536
##$YMAX_p= 545995772
##$YMIN_p= -186129332
$$ End of Bruker specific parameters
$$ ---------------------------------
##NTUPLES= NMR SPECTRUM
##VAR_NAME=  FREQUENCY,     SPECTRUM/REAL,   SPECTRUM/IMAG
##SYMBOL=    X,             R,               I
##VAR_TYPE=  INDEPENDENT,   DEPENDENT,       DEPENDENT
##VAR_FORM=  AFFN,          ASDF,            ASDF
##VAR_DIM=   65536,         65536,           65536
##UNITS=     HZ,            ARBITRARY UNITS, ARBITRARY UNITS
##FACTOR=    0.456856943014862, 1,           1
##FIRST=     14782.0589164895, 0,            0
##LAST=      -15158.0608439895, 0,           0
##MIN=       -15158.0608439895, -186129332,  0
##MAX=       14782.0589164895, 545995772,    0
$$ Real data points
##PAGE= N=1
##DATA TABLE= (X++(R..R)), XYDATA
$$ [...]
43846a7586848L288811P162381J4865255J9857865J0283558r635988j9827087
43839H407947r632649O626909O481859j1708644k4469411j1254179J8457448L4863793
43831A7773073K4223390L509769o300159o972819j0113846j1276365J070960J7639655
43823B9553658J5603489n195734j8958206j2571563k359131k583328k652488R017206
43815I853903K1277352J9373190Q472113j492750j5257866l4176912l8236291
43808c0187261j4277574J3670078J4255827k911761l865787J3354122J8870494
43801H908138N549549l63878R251044O635256j9810862l6610991j6548835J4389616
43793b8600963J5975908n091862j1340655L977042J2033791k92897j2912809j0239060
$$ plain form
43846 -17586848 -14298037 -7135656 7729599 27587464 37871022 28235034 8407947
43839 8407947 -1224702 5402207 11884066 175422 -24293989 -35548168 -17090720 17773073
43831 17773073 41996463 45506232 39206073 32233254 22119408 10843043 11914003 29553658
43823 29553658 45157147 39961413 21003207 8431644 6072513 3489185 836697 9853903
43815 9853903 31131255 50504445 58976558 57483808 42225942 8049030 -30187261
43808 -30187261 -44464835 -30794757 -16538930 -19450691 -23316478 -9962356 8908138
43801 8908138 14457687 14093809 23344853 29980109 10169247 -26441744 -42990579 -28600963
43793 -28600963 -12625055 -17716917 -29057572 -25080530 -13046739 -13339636 -26252445 -36491505
43785c6491505k984062k106719J306623J5218291K6537393J9565319K031706l994600
43777A9082446Q170654K1911023J8252129k615969k1548895k0502816l029453
43770A9719119Q044442j853146j8340452j5211810R488631K8206043J8463241
43763D8516068r633768k7830655k2406907l882339R390652Q486247j566898p245233
43755f172833R06325J5876079J8599506J268484j8724878j8001600K106799J6266102
43747A2123984Q377548q744107j3951635o271160P8924J081424M855143R636073
43739G186194J978304j5296729j5736444J2231562L7743774K5322276j0546136
43732D2882801k1770539L901267K6852795J8484168J669401N398749J3411554
$$ plain form
43785 -36491505 -39475567 -41582286 -40275663 -25057372 1480021 21045340 23077046 19082446
43777 19082446 27253100 49164123 67416252 64800283 43251388 22748572 19719119
43770 19719119 27763561 25910415 7569963 -7641847 1846784 30052827 48516068
43763 48516068 38882300 11051645 -11355262 -15237601 -5846949 2639298 1072400 -6172833
43755 -6172833 -5266508 10609571 29209077 30477561 11752683 -6248917 -4142118 12123984
43747 12123984 20501532 11757425 -2194210 -8465370 -8386446 -7305022 -2449879 7186194
43739 7186194 9164498 -6132231 -21868675 -9637113 28106661 53428937 42882801
43732 42882801 21112262 25013529 51866324 70350492 72019893 77418642 90830196
43725I0830196n306631l7510874m1087352j1222491J1861600L792765j4844398
43718c487185j9980727j8032342k0884026j8012143K047447K3904644K4393180
43711c0051152O601000o711787m565804N442137J3522293J4346208M942167q582525
43703e057463r792531P310957K4065592J9906316J699627q051335o104445r883195
43695A4093523k5056064l3940567k2204873J20287J3016480J0194581O46785m836470
43687d7966318j531364Q944407K0094114K5029912K2356728J5553939P051103
43680D9532521k634808j0168562r471154J157809J4399993J8138966N922132j3962107
43672E2914790k2208098r082118R371165P693913j4084401k7891578j7420881
$$ plain form
43725 90830196 85523565 48012691 6925339 -4297152 7564448 11357213 -3487185
43718 -3487185 -23467912 -41500254 -62384280 -80396423 -78348976 -54444332 -30051152
43711 -30051152 -23450152 -30161939 -34727743 -29285606 -15763313 -1417105 3525062 -5057463
43703 -5057463 -14849994 -7539037 16526555 36432871 38132498 30081163 23976718 14093523
43695 14093523 -10962541 -44903108 -67107981 -66987694 -53971214 -43776633 -43129848 -47966318
43687 -47966318 -49497682 -40553275 -20459161 4570751 26927479 42481418 49532521
43680 49532521 46897713 36729151 27257997 28415806 42815799 60954765 66876897 52914790
43672 52914790 30706692 21624574 30995739 38689652 24605251 -3286327 -20707208
43665b0707208j663266l406272j2549548n144151J3512981J5408037l768700j6057855
43657c4375982m356009J4131360J8134659J1408514P426436N813931O44333m265032
43649A4562210m989084q235019j6097525j4339461N086896K2793531J6211004
43642A4992552m199185r446332J284547j353800k6490871m0693770j4415709L0157218
43634e0165350M3521289J3250254k1283734k1042264P245183K8199086K4790583
43627B4515047J1511423O844473J0443989J0878243L208529q039191j5896889
43620D3465624j5104176n140191O106485P750602n62135p442905o313691l681209
43612A9078404m622728k124103P987984J3316227K068235j4996355j8318277q774230
$$ plain form
43665 -20707208 -22370474 -25776746 -38326294 -43470445 -29957464 -14549427 -18318127 -34375982
43657 -34375982 -38731991 -24600631 -6465972 4942542 12368978 18182909 18827242 14562210
43649 14562210 9573126 1338107 -14759418 -29098879 -24011983 -1218452 14992552
43642 14992552 10793367 1347035 2631582 1277782 -25213089 -65906859 -80322568 -50165350
43634 -50165350 -6644061 6606193 -14677541 -35719805 -28474622 -275536 24515047
43627 24515047 36026470 42870943 53314932 64193175 67401704 59362513 43465624
43620 43465624 28361448 23221257 29327742 37078344 36516209 29073304 22759613 19078404
43612 19078404 14455676 12331573 20319557 33635784 35704019 20707664 2389387 -6384843
43604f384843k699036k387737M516146J6756472J6835793J980345p589333j133313
43596A9894494N373262k323557j2622561q959311L285648Q975123P438236O102370
43588B7163704K997147n078810q105593K711298J4128671N930835j7057328k8280008
43580e590084j5251702M624977P613007p807351j9848724p439400K4022311M3037687
43572B3360721K7495880l085909j0008781Q744511J3608100j4639334m1532946
43565C942242l1689554l485151M329535n219652k929475O875268n501099l2912694
43557f6590580l1857660P222188M0030451L4374577J1678173L017034M967968
43550B842151L550079M675755J2391086R423065j0691307k1773625o276358J0722016
$$ plain form
43604 -6384843 -9083879 -11471616 -6955470 9801002 26636795 28617140 21027807 19894494
43596 19894494 25267756 22944199 10321638 1362327 4647975 13623098 21061334 27163704
43588 27163704 30160851 25082041 16976448 19687746 33816417 39747252 22689924 -5590084
43580 -5590084 -20841786 -16216809 -8603802 -16411153 -36259877 -43699277 -19676966 23360721
43572 23360721 50856601 47770692 37761911 46506422 60114522 45475188 3942242
43565 3942242 -27747312 -31232463 -26902928 -32122580 -35052055 -28176787 -33677886 -66590580
43557 -66590580 -98448240 -91226052 -51195601 -16821024 -5142851 -2125817 2842151
43550 2842151 6392230 11067985 23459071 32882136 22190829 417204 -5859154 4862862
43542D862862L171848r303125K104921J8267531K537855k8688174k4382517J4941296
43534a6487503K9974224n230811l9914795k3398022K0788856L6404963J7515107
43527A9652019M373899J2854687J5218212o874548k9972299k5268016j710153
43520a1726199Q135660o858058k4841233k2416805l058298J0327915L757088j2892048
43512e9571978j8150972l154010J7925058K3132439Q615811n779238k307566Q848713
43504c0441743L294740j7868483k2438607O619233L9087247L6020627P340940
43497B1613954k585871J5684596K1458464r607568m2354121l2815101O810952
43490b1794695K9038763J8792922K386654k059386m210333j1025787j2993210
$$ plain form
43542 4862862 8034710 -1268415 836506 19104037 21641892 -7046282 -31428799 -16487503
43534 -16487503 13486721 8255910 -31658885 -55056907 -34268051 2136912 19652019
43527 19652019 24025918 36880605 52098817 45224269 15251970 -10016046 -11726199
43520 -11726199 -3590539 -10448597 -35289830 -57706635 -60764933 -50437018 -46679930 -59571978
43512 -59571978 -77722950 -80876960 -62951902 -39819463 -31203652 -36982890 -39290456 -30441743
43504 -30441743 -27147003 -45015486 -67454093 -60834860 -21747613 14273014 21613954
43497 21613954 19028083 34712679 56171143 46563575 4209454 -28605647 -21794695
43490 -21794695 7244068 26036990 28423644 26364258 22153925 11128138 -1865072
43483a865072q917805j3082704k5348172k1552868R721021M2616311M4775824
43476B6346535J7551362j0613535j8584780o430077J2884219K1749497R146700
43469E2049921j2902165j6146233N827279K0182114l356095m3642256m8786098
43462d6773533n383395M0654422M2258594P492393j9184642j5926807q16923M228386
43454F548495J862120M168012Q179399K617583j0006847j5493671j0087556m058506
43446a6270971j518389N937221J8628516J9485873o23080k1725486j7642943P194386
43438f534873K3323039J5955503j27747o517448l341168J96650K013651N099989
43430C0067596Q659048Q129631r76203j9880791m0199584m4103783k2967564O601399
$$ plain form
43483 -1865072 -10782877 -23865581 -49213753 -70766621 -61045600 -18429289 26346535
43476 26346535 43897897 33284362 14699582 8269505 21153724 42903221 52049921
43469 52049921 39147756 23001523 28828802 49010916 45654821 2012565 -46773533
43462 -46773533 -52156928 -11502506 30756088 38248481 19063839 3137032 2320109 6548495
43454 6548495 8410615 12578627 20758026 23375609 13368762 -2124909 -12212465 -16270971
43446 -16270971 -17789360 -11852139 6776377 26262250 25639170 3913684 -13729259 -6534873
43438 -6534873 16788166 32743669 32615922 26098474 22757306 22953956 24967607 30067596
43430 30067596 38726644 46856275 45880072 25999281 -14200303 -58304086 -81271650 -74670251
43422g4670251K0049324J5678170R894940M463737j4856024m1974968m3584431
43415a24999503o197582L4690249L6461461L844626k2342660j8223465N462377
43408i1304497K8236682L6146518J9583371j7214997m4971607l4148728N062070
43401i8611188L0989866K4082769Q631977J1886032K5175962K2351668n16597
43394B3990489k3606949l1253421k3000922l531976J9867652L2414493K2834970
43387A7714336J785073o354260M961226J5508181Q807098k791859J911565J7570666
43379E9112026J7206938p549019l0931175k6031079J292147K2915280K2274601
43372E8289719N168209j4688253k6231778k2398215o132029O728408L566571p974432
$$ plain form
43422 -74670251 -54620927 -38942757 -29047817 -24584080 -39440104 -81415072 -124999503
43415 -124999503 -131197085 -96506836 -60045375 -56200749 -78543409 -96766874 -91304497
43408 -91304497 -63067815 -26921297 -7337926 -24552923 -69524530 -103673258 -98611188
43401 -98611188 -67621322 -43538553 -34906576 -23020544 2155418 24507086 23990489
43394 23990489 383540 -30869881 -53870803 -57402779 -37535127 -5120634 17714336
43387 17714336 19499409 13145149 18106375 33614556 42421654 39629795 41541360 59112026
43379 59112026 76318964 68769945 37838770 11807691 13099838 36015118 58289719
43372 58289719 63457928 48769675 22537897 139682 -5992347 736061 4302632 -3671800
43364c671800j1057935l287476N207049J1287122J6925510J2794368j0680921
43357A7515917l5776542l0455069L773234K6596296J4770370n751013k927191
43350a2253998J3428592J3809071j693793p793130L346137J3124535O221068j3033830
43342A5154652l0713845l3489230j6265718O261458Q800825q508149j2716912
43335g1476919J2482995L4372700J9397337j0171666r894109J4501016J8999445
43328H210799l471641j5496515m279642m04057j5147324j5894348J2960512L6780411
43320C258195K8391546J1632488J2409797J1447872j1687724k8648252q076192
43313A8727730K1279149J1395977k3233963k6869085N181771J9883311n289270
$$ plain form
43364 -3671800 -14729735 -18017211 -12810162 -1523040 15402470 28196838 17515917
43357 17515917 -18260625 -48715694 -44942460 -18346164 -3575794 -9326807 -12253998
43350 -12253998 1174594 14983665 13289872 5496742 8842879 21967414 28188482 15154652
43342 15154652 -15559193 -49048423 -65314141 -59052683 -50251858 -58760007 -71476919
43335 -71476919 -58993924 -24621224 -5223887 -15395553 -25289662 -10788646 8210799
43328 8210799 4739158 -10757357 -15036999 -15441056 -30588380 -46482728 -33522216 3258195
43320 3258195 31649741 43282229 55692026 67139898 55452174 26803922 18727730
43313 18727730 40006879 51402856 28168893 1299808 6481579 26364890 21075620
43306B1075620k9938641k2567326q181213j5764242k4694896k088826L7030808
43299d5128716M7656670J8569166j5804875k2414814l079204J7922561K1356787
43292A9077575P568393n465582o82209J5181943J5612009j0279144l7739655l5589403
43284c2316073o518673J8484065K0716588J0524011M163033K734962K40408k530706
43276A5497615k905497n774704j6098748k6363545k3484102p898990N538717Q478918
43268e3010336R269989J5147597J5846721o06108k2364921k3450472m17515K0049056
43260c9535989J7759895N252592M923343J6117616K2516816J9554534J3258909
43253E9847716J128279k0598287l5099572j9654360J4274526K5450538o84778
$$ plain form
43306 21075620 -8863021 -31430347 -39611560 -55375802 -80070698 -82159524 -45128716
43299 -45128716 2527954 21097120 5292245 -17122569 -20201773 -2279212 19077575
43292 19077575 26645968 21180386 20498177 35680120 51292129 41012985 3273330 -32316073
43284 -32316073 -38834746 -20350681 365907 10889918 15052951 17787913 18028321 15497615
43276 15497615 12592118 6817414 -9281334 -35644879 -59128981 -67027971 -61489254 -53010336
43268 -53010336 -43740347 -28592750 -12746029 -13352137 -35717058 -59167530 -59585045 -39535989
43260 -39535989 -21776094 -16523502 -11600159 4517457 27034273 46588807 59847716
43253 59847716 60975995 40377708 5278136 -14376224 -101698 25348840 24664062
43246B4664062k7580383j9136444Q461784J4530835l623050j2024434J115195
43239a3592435P303737j1269389k8575396j6425470P682674Q233293q245377j866035
43231e6754398L2326918M8251926J7863595k2004175k3269865J673048M634549
43224B721598j7858523k0128582J4204953M1023242K3493834j2092701k0131476
43217A1232345k434350P259905K262427L455923J3291996J2950831K578148K606255
43209E3203480J0970385l77984l4573955n3070587k9350236J1163906K7944839
43202a4090152J7455288L577351l507762j0201537j3993515m462371J3266294
43195a1956404J9265969M229354k1128822m0235237m1058379j7933690J9978030
$$ plain form
43246 24664062 -2916321 -22052765 -13590981 939854 -2683196 -14707630 -13592435
43239 -13592435 -6288698 -17558087 -46133483 -62558953 -54876279 -46642986 -54888363 -56754398
43231 -56754398 -24427480 23824446 41688041 19683866 -3585999 -1912951 2721598
43224 2721598 -15136925 -35265507 -21060554 19962688 43456522 31363821 11232345
43217 11232345 8797995 16057900 18320327 21776250 35068246 48019077 50597225 53203480
43209 53203480 64173865 63795881 29221926 -23848661 -53198897 -42034991 -14090152
43202 -14090152 3365136 6942487 3434725 -6766812 -20760327 -25222698 -11956404
43195 -11956404 7309565 11538919 -9589903 -49825140 -90883519 -108817209 -88839179
43188h8839179M5170312L5485846L310445j4690233o76839K5090514L2560045
43181C7410911J6607298m110982j3391298j2357358j1267972j4946897j8833466
43174b0889764j6579054p913432K569422J1189090J4719387P021327j3811818
43167b3694842l3797177l1268561l564069K5678109L5050683K9913677K6059362
43160B4377182K0990482J692342k4748625l2524316j3241186R645811J1715243
43153b093067k509698j1251423m873840Q527289J8158693J8533182P687748j0729205
43145B1449679k5673500k8239218k1457882j3518308m856809Q996063K4742672
43138c8557303L2431815K8785682J9019730N610717j2267699k6118354k0224169
$$ plain form
43188 -88839179 -43668867 -8183021 -4872576 -19562809 -20239648 4850866 37410911
43181 37410911 54018209 49907227 36515929 24158571 12890599 -2056298 -20889764
43174 -20889764 -37468818 -45382250 -42812828 -31623738 -16904351 -9883024 -23694842
43167 -23694842 -57492019 -88760580 -92324649 -66646540 -31595857 -1682180 24377182
43160 24377182 45367664 47060006 22311381 -10212935 -23454121 -13808310 -2093067
43153 -2093067 -4602765 -15854188 -20728028 -12200739 5957954 24491136 32178884 21449679
43145 21449679 -4223821 -32463039 -53920921 -67439229 -72296038 -63299975 -38557303
43138 -38557303 -6125488 22660194 41679924 47290641 35022942 8904588 -11319581
43131a1319581N103094K5218020J8931607m054280j7583143j4193111q760085
43124f657479j0060482q893743J185936R839354O591925k382161n741886m496087
43116b0614623n628261o899880k001389M402672R83551j2074916k0709388j3672697
43108g6214931N622766K3049353K4567121P453401j3389943j6680747O33563J8026899
43100b6932518J8880978J2035911J3066489J6531915O760407j1903266j9037124
43093I402792r824459q5209Q33869K10171K616557K019310k618773m306541m939214
43084f691497j4357351k7653287k5704672n308589J3493783J8137524J8490392
43077b9593697K1972890J8798570M955211m533422q36518L260737p76844j39663
$$ plain form
43131 -11319581 -6216487 19001533 37933140 33878860 16295717 2102606 -6657479
43124 -6657479 -16717961 -25611704 -24425768 -14586414 -7994489 -10376650 -16118536 -20614623
43116 -20614623 -26242884 -33142764 -35144153 -30741481 -29757930 -41832846 -62542234 -76214931
43108 -76214931 -70592165 -47542812 -22975691 -15522290 -28912233 -45592980 -44959417 -26932518
43100 -26932518 -8051540 3984371 17050860 33582775 40343182 28439916 9402792
43093 9402792 -421667 -506876 326993 537164 3153721 5173031 2554258 -1752283 -6691497
43084 -6691497 -21048848 -48702135 -74406807 -79715396 -66221613 -48084089 -29593697
43077 -29593697 -7620807 11177763 16132974 11599552 10763034 14023771 13246927 13107264
43069A3107264J1890737J6283834j002032k1313477k1408675q424286r22358L760340
43061h028653J4621377K0490910J0760242L203979J5581187K7416391R806884
43054I3852317k1898606k9130128j2624283o711325j7841130j9519341p663161
43047b1535657p248481j7303660m974982K9842563L9080447J905302l4285162
43040a4519630k2645112J5449987L0560393J8036390P660204O895905k09229j3182878
43032B8046030j6209228j0825999j1457280j3978953j615402K0998353K9648045
43025B4605566J5838041n089009j9610852k6014403k0910374q63519K0849839
43018a1194711K1938129P97136j8556600j5917920L454648J9180764J7829266
$$ plain form
43069 13107264 24998001 41281835 40279803 18966326 -2442349 -10866635 -11788993 -8028653
43061 -8028653 6592724 27083634 37843876 41047855 56629042 84045433 93852317
43054 93852317 71953711 42823583 30199300 23487975 5646845 -13872496 -21535657
43047 -21535657 -28784138 -46087798 -51062780 -21220217 17860230 19765532 -14519630
43040 -14519630 -37164742 -21714755 8845638 26882028 34542232 41438137 41228908 28046030
43032 28046030 11836802 1010803 -10446477 -24425430 -26040832 -5042479 24605566
43025 24605566 40443607 35354598 15743746 -10270657 -31181031 -32044550 -11194711
43018 -11194711 10743418 11540554 -7016046 -22933966 -19479318 -298554 17530712
43011A7530712L877157n082549K682848J5334733R206072j6105394l0963542j5748952
43003a9268915J0333391J7388024M367830r773800j7045533j8036513n019083
42996c7054599K2965206M0562310K3814927j0595824k5589561j6229719q497871
42989a0625131j1338707p809791O195937J3399659J0518504J4733952K6427099
42982D1501522K2104203l927102k6015669k8484822k5588176k5849161j3983556
42975f0242761J2203065K4975303J2135008K816894J7355518K6993824J900376
42968C8137227l1967711l0030087j64393J3252496J875234k162331J1270588J6228248
42960A6439271L532347k544326O467230L322979k4472911m3853709k3635153J7032229
$$ plain form
43011 17530712 21407869 16325320 19008168 34342901 43548973 27443579 -3519963 -19268915
43003 -19268915 -8935524 8452500 12820330 3046530 -13999003 -32035516 -37054599
42996 -37054599 -14089393 26472917 50287844 39692020 14102459 -2127260 -10625131
42989 -10625131 -21963838 -29773629 -23577692 -10178033 340471 15074423 41501522
42982 41501522 63605725 59678623 33662954 5178132 -20410044 -46259205 -60242761
42975 -60242761 -48039696 -23064393 -10929385 -8112491 9243027 36236851 38137227
42968 38137227 6169516 -23860571 -24024964 -10772468 -8897234 -11059565 211023 16439271
42960 16439271 19971618 17427292 23894522 27217501 2744590 -41109119 -64744272 -47712043
42952d7712043L7034768K8739362J6959062J7653224K3657848K2107473N320164
42945A03759858k6744568n7438640n8350187k2510920J8182936K9059845J5515377
42938A473701P140493R854659L841879j3723872j6963906Q191598L7371015L6724899
42930G3910466L126182l6157549n1861682l2890333P879539L8442480L1682950
42923C4132053m292226l0770335k3035955J945452J3119509N951797q28694K879329
42915h99070J0271324J5081482J7631486J6062935Q759410K809288L400912m12447
42907G2705320j9065415l6415782k6907538J087288J0166976j0090049k4834312
42900c3353512q238498J5956262J4572306j910636j927922J1056483P687236j0321276
$$ plain form
42952 -47712043 -10677275 18062087 35021149 52674373 76332221 98439694 103759858
42945 103759858 77015290 19576650 -38773537 -61284457 -43101521 -14041676 1473701
42938 1473701 8614194 18468853 22310732 8586860 -8377046 -185448 37185567 73910466
42930 73910466 77036648 40879099 -10982583 -43872916 -35993377 2449103 34132053
42923 34132053 29839827 -930508 -23966463 -22021011 -8901502 -2949705 -3778399 -899070
42915 -899070 9372254 24453736 42085222 58148157 66907567 69716855 73117767 72705320
42907 72705320 53639905 17224123 -9683415 -8596127 1570849 -8519200 -33353512
42900 -33353512 -41592010 -25635748 -11063442 -12974078 -14902000 -3845517 3841719 -6479557
42892f479557q721681J8270175K9967477J195494l4256895l0691309M264582K4253460
42884b198254J0224536j1241902j2943717p85202M829317K53557j339820Q775685
42876d425800K3914857L0021231K0608588M194953m159486m19032L512813l291934
42868F9956190j4789181j7169822r699883n004960r172832j3472298r069322N58548
42860g863560P691821J1826412J4602513J0229094o783312k5821963k5731422
42853b1850417k193741K0514858J6211747r056929k2461074n254683K4616362
42846E26123L7383878K7730659J4096557Q420236K837652j1447923k5833121k3772989
42838B9941072l339492J7456095J9051071J997562j2298836n935105J2000731
$$ plain form
42892 -6479557 -15201238 3068937 33036414 34231908 -24987 -30716296 -26451714 -2198254
42884 -2198254 8026282 -3215620 -16159337 -16944539 -12115222 -11861665 -13201485 -4425800
42876 -4425800 19489057 49510288 70118876 74313829 70154343 69735311 73248124 69956190
42868 69956190 55167009 37997187 28297304 23292344 14119512 647214 -8422108 -7863560
42860 -7863560 -171739 11654673 26257186 36486280 29702968 3881005 -21850417
42853 -21850417 -24044158 -3529300 12682447 3625518 -18835556 -24090239 526123
42846 526123 37910001 65640660 79737217 88157453 90995105 79547182 53714061 29941072
42838 29941072 26601580 44057675 63108746 65106308 52807472 46872367 58873098
42831E8873098J5552100j913008j5727012m799493J6125694J8396891K524470
42824H9032740p227146o118142j4020033l2961273l5051705q678287J5599902
42817E76056J0035007o616359j817634J5755036J2351530j1673974k0962417l181000
42809e533755J2480229M419806r494193o204994N656076N537227l597581m057029
42801g94214N288514R651080L951230j875931j134509J628937J073444j907492
42793A5881059m445771n479197n539942p339141j3643867k0687569j9045085o051916
42785f6351429Q764625J6162568J7839219J7897191J2510927r94753j1392951
42778e564603m054050J6646772K7898565J4847550j1372993k5809908j5848717
$$ plain form
42831 58873098 74425198 72512190 56785178 51985685 68111379 86508270 89032740
42824 89032740 81805594 75687452 61667419 28706146 -6345559 -15023846 576056
42817 576056 10611063 3994704 2177070 17932106 30283636 18609662 -2352755 -5533755
42809 -5533755 6946474 11366280 1872087 -4332907 1323169 6860396 3262815 -794214
42801 -794214 4494300 14145380 18096610 16220679 15086170 16715107 17788551 15881059
42793 15881059 11435288 5956091 416149 -6922992 -20566859 -41254428 -60299513 -66351429
42785 -66351429 -57586804 -41424236 -23585017 -5687826 6823101 5828348 -5564603
42778 -5564603 -9618653 7028119 34926684 49774234 38401241 12591333 -3257384
42771c257384P251083K1207928J5726129J372635o056334n817409q776581j6134822
42763E515245j5819175m263079L607292l279301j2795848p351776Q357193J4272285
42755a1757164M418767p593990j0435604o285025j95211O732586J1835894J1399624
42747a880123P967621N924903J556492q727237j3506647R49368K2869906K2900200
42739C8054483l666698k5456273j7792257L974995J0442867l57642q084897l976682
42731f862104K942471O792698J0662907J3796829J1049638M576424J342083Q99191
42723D5200137n18272J900455J2692118J9683735O971655j6604063k4590537j1784248
42715C2950980k438711j1476811k0878575r428508J3485713K3009862J4183065
$$ plain form
42771 -3257384 3993699 25201627 40927756 42300391 36244057 30426648 21650067 5515245
42763 5515245 -10303930 -14567009 -10959717 -14239018 -27034866 -34386642 -26029449 -11757164
42755 -11757164 -7338397 -14932387 -25367991 -31653016 -31848227 -25115641 -13279747 -1880123
42747 -1880123 6087498 12012401 13568893 4841656 -8664991 -7715623 15154283 38054483
42739 38054483 34387785 8931512 -8860745 -4885750 5557117 5199475 -2885422 -6862104
42731 -6862104 -3919633 2873065 13535972 27332801 38382439 42958863 44300946 45200137
42723 45200137 44681865 46582320 59274438 78958173 85929828 69325765 44735228 32950980
42715 32950980 30512269 19035458 -1843117 -11271625 2214088 25223950 39407015
42708C9407015J898447n486365j1682914j6056180j2176785l189925n40464m276284
42700a2103455j247728J1216167J5707237k37039k1339979k2138057k662413R772829
42692b3032438k313383k1778806k0034778L046877J8462716Q319737r919389r707077
42684e6956541O892862J5435230P771295L332096J7138192L4750534L1010182
42677E9373850L373100k5331232l2558848j6221158P092411J8217427J2469364
42670B6414914K338520j033458m908091k0546057l5125062k1163621J9648858
42663c4373997M7457470L4926962M389994p042962J022873L342348m992636p663301
42655C7066751l482952p799046j8992345j8166855n330410k198783j2361566j2328090
$$ plain form
42708 39407015 41305462 35819097 24136183 8080003 -4096782 -7286707 -7827171 -12103455
42700 -12103455 -13351183 -2135016 13572221 13335182 -8004797 -30142854 -32805267 -23032438
42692 -23032438 -25345821 -47124627 -67159405 -64112528 -45649812 -37330075 -47249464 -56956541
42684 -56956541 -50063679 -34628449 -26857154 -23525058 -6386866 28363668 59373850
42677 59373850 62746950 37415718 4856870 -11364288 -4271877 13945550 26414914
42670 26414914 28753434 27719976 22811885 2265828 -32859234 -54022855 -34373997
42663 -34373997 13083473 48010435 52400429 45357467 46380340 49722688 44730052 37066751
42655 37066751 33583799 25784753 6792408 -11374447 -16704857 -18903640 -31265206 -43593296
42647d3593296O690676K0649591J1607159n150122j0529562r902031j2393586
42640d2621171r380642M268178J3865102J3307127K1741496M4030851M5038637
42633I0249578J510984m6492024m3274233K24701K3230802N882078j1965897n046292
42625A4319697J065915j5233124l0992755j9901894N542696K1713087L0171845
42618F685467L7251657K9038721L15220j9056578m727330J6734554M034724l2719294
42610C7557141m5752008k1174961Q233964K0583301K8380589L6167414K1643758
42603H5639198j8998427m6101357k8271774Q184353J5247702r626208k6836899
42596b0763412j4951313O911183J5514763J0879778K149721p178780j1197843
$$ plain form
42647 -43593296 -36902620 -16253029 -4645870 -9795992 -20325554 -30227585 -42621171
42640 -42621171 -52001813 -47733635 -33868533 -20561406 1180090 45210941 90249578
42633 90249578 91760562 45268538 1994305 2219006 25449808 31331886 19365989 14319697
42625 14319697 15385612 152488 -30840267 -50742161 -45199465 -23486378 6685467
42618 6685467 43937124 72975845 73291065 54234487 49507157 66241711 70276435 37557141
42610 37557141 -8194867 -29369828 -21135864 -552563 27828026 63995440 85639198
42603 85639198 66640771 20539414 -7732360 451993 15699695 6073487 -20763412
42596 -20763412 -35714725 -28803542 -13288779 -2409001 -259280 -7438060 -18635903
42589a8635903j330620J5545573J8824335N367916j166687J2955662K5626293
42582E7186569J1319470j6482629k3001833m248172Q748716j829572j7727164
42575A3965385j8313409j0632220j0503553j4155932p931275O875340J7283146
42568b3412518J8065107J2074222o00013j7333897k3769294q039502J8751426
42561b4264469L2504690K4910413P845943p629170j9360915k2323324q490618
42554a6807450J6378632L1621583K4531074L561361j5251950k3746121k0378908
42547i1779o668458R088141J5116570R017402n33464o692044q811554l936456
42539F488358J0963737K5300871K0742953j885062j8016082j1802088J883762
$$ plain form
42589 -18635903 -19966523 -4420950 14403385 19771301 18604614 31560276 57186569
42582 57186569 68506039 52023410 29021577 24773405 33522121 31692549 13965385
42575 13965385 -4348024 -14980244 -25483797 -39639729 -47571004 -40695664 -23412518
42568 -23412518 -5347411 6726811 6126798 -11207099 -34976393 -43015895 -24264469
42561 -24264469 8240221 33150634 40996577 33367407 14006492 -8316832 -16807450
42554 -16807450 -428818 31192765 55723839 59285200 44033250 20287129 -91779
42547 -91779 -6760237 2327904 17444474 26461876 25928412 19236368 10424814 6488358
42539 6488358 17452095 42752966 63495919 61610857 43594775 31792687 33676449
42532C3676449L72029j4745205k2647419j1343546J1546880K8338558K2594353
42525D7792099q129722m0987030m3026111j0907279J8835580J5526098m784560
42518b5680925n785043J5416972K9469042K2430049J0501013O135569P31466j0148008
42510D3070135j2080521K797306J6896989J0615448j0076591k4308259k2521143
42503D393364r290746P882152J9559467J5966319J413762m325610O407129J3109920
42495E5115757k515451k2507603j4979320J5376009K9510735J0649909j1215278
42488E9434758m977771J6929030K1039964K306668j4920783j6476803j2117651
42481E1217412j0614670o645263J399120K795412n379765q252615K265447R036613
$$ plain form
42532 33676449 34048478 19303273 -3344146 -14687692 -3140812 25197746 47792099
42525 47792099 39662377 -1324653 -44350764 -55258043 -36422463 -20896365 -25680925
42518 -25680925 -31465968 -16048996 13420046 35850095 46351108 52486677 53218143 43070135
42510 43070135 30989614 33786920 50683909 61299357 51222766 26914507 4393364
42503 4393364 -4897382 2984770 22544237 38510556 39924318 35598708 42005837 55115757
42495 55115757 52600306 30092703 15113383 30489392 60000127 70650036 59434758
42488 59434758 54456987 71386017 92425981 94732649 79811866 63335063 51217412
42481 51217412 40602742 33957479 35356599 38152011 32772246 24519631 26785078 35821691
42473C5821691n015139k4914793k0797362O934650K4638733J1864752j1796494
42466A6736038j6927079k767300J0280876J3405294J4596570J6161138P855417
42459E9340954j2840343k9151732k4339268m864678P479028N000809L626375J7293498
42451B1544643L2436259K1904461j6308474m9659389m8135642j8812389P992976
42444d9037555J6770571J5328002J2709669Q702954M288630L378817K347155m419377
42436A0068866p709358O593240K7970556K7221730P01377j8438358q593831P241039
42428D5055261o99935k1377172k2429076q42279J7844833K1624392K1726325K4242608
42420H5144957K1637186J2357270K967306q483323k5734127l3408568j2711282
$$ plain form
42473 35821691 30806552 5891759 -14905603 -7970953 16667780 28532532 16736038
42466 16736038 -191041 -2958341 7322535 20727829 35324399 51485537 59340954
42459 59340954 46500611 17348879 -6990389 -11855067 -4376039 624770 4251145 21544643
42451 21544643 53980902 75885363 59576889 9917500 -38218142 -57030531 -49037555
42444 -49037555 -32266984 -16938982 -4229313 4473641 8762271 12141088 14488243 10068866
42436 10068866 2359508 8952748 36923304 64145034 64846411 46408053 37814222 45055261
42428 45055261 44355326 22978154 549078 -293201 17551632 39176024 60902349 85144957
42420 85144957 106782143 119139413 122106719 113623396 87889269 54480701 41769419
42413D1769419K0802732K7565766q25831k8131684k6282671j0997528q300258
42406A5599945j3708118p244276J1640819K7074869L0436322K2287439L938928
42399I0025928j6218754k1773759j0356622k823216j3573839k6491676j9849153
42392b1061091j409739L777594q976988k0613977j6427621J404869K3066821L5572628
42384d667504K6150166o10667j7670632o559403J6362051K4919721K1319657K2646906
42376H1890295K1933709j236121l5754752m4707658k1613417k524797r650765
42369a1663506j9868060q834839Q066625O591518k769632M077272J9627318J7582034
42361A2808730L22675l983555R714476J3429792p037985k6645278j8261130P679646
$$ plain form
42413 41769419 62572151 90137917 89312086 61180402 34897731 23900203 15599945
42406 15599945 1891827 -5352449 6288370 33363239 63799561 86087000 90025928
42399 90025928 73807174 52033415 41676793 38853577 25279738 -1211938 -21061091
42392 -21061091 -22470830 -18693236 -27670224 -48284201 -64711822 -63306953 -40240132 -4667504
42384 -4667504 21482662 20871995 3201363 -3358040 13004011 37923732 59243389 81890295
42376 81890295 103824004 102587883 66833131 22125473 512056 -2012741 -11663506
42369 -11663506 -31531566 -40366405 -32299780 -25708262 -28477894 -24400622 -4773304 12808730
42361 12808730 13131405 9147850 18862326 32292118 25254133 -1391145 -19652275 -11972629
42353a1972629K0156500R785998n730580j1058671r012565o483058P2848J7328657
42345C086500L9107463M5853710K3823784j5685328m1239718l1264509J857672
42338B5539574K4266056J7768233k986740j2580113m932118N071493L252542r028222
42330D6370705j8619925j2738318R284905L0823372L0311633P090829j1804349
42323H0718852l608128J6635290J3115106j9521779m4042579k9639206O640193
42316B0297749K4914063J4784796L96510K32478O463024O413781K944911M714944
42308H1162256J0946679J5106905J3533803L777351j5018889l2949446l1587799
42301D4970860n383488K7107406M2986034L9145224K7128598J1778512j0217036
$$ plain form
42353 -11972629 8183871 17969869 12239289 1180618 -7831947 -14315005 -14242157 3086500
42345 3086500 42193963 88047673 111871457 96186129 54946411 23681902 25539574
42338 25539574 49805630 67573863 64587123 52007010 47074892 52146385 55398927 46370705
42330 46370705 27750780 15012462 24297367 55120739 85432372 92523201 80718852
42323 80718852 77110724 93746014 106861120 87339341 43296762 13657556 20297749
42316 20297749 45211812 59996608 60393118 60625596 67088620 73502401 76447312 81162256
42308 81162256 92108935 107215840 120749643 124526994 109508105 76558659 44970860
42301 44970860 39587372 66694778 109680812 148826036 175954634 187733146 177516110
42294A77516110l2391102l5516940j0984436K0727171K6639341j050252l1488704
42287A13451188k8350187N366800K8992306J6086113j0995564j3760500Q729821
42280A19519977K4089925J8293872J1104257J5538302J5864735J224697j0116936
42273A95518829l496544K573152j0325095k0727741J575631L9708763M7416438
42266B52243433J7459061j0238909j1025833l431351n024176l000213J1693662
42259B48675674J8966433N160989p778040L07515Q973068p200655k6286635p617118
42251B33201231L7053928M9407334P145718m2622368m9281226k2423461n063990
42244B07417166r919693j4140531m537310M253028j916343j4419475j6608222
$$ plain form
42294 177516110 145125008 109608068 98623632 119350803 145990144 144939892 113451188
42287 113451188 85101001 90467801 119460107 135546220 124550656 110790156 119519977
42280 119519977 143609902 161903774 173008031 188546333 204411068 205635765 195518829
42273 195518829 192022285 194595437 184270342 163542601 165118232 204826995 252243433
42266 252243433 269702494 259463585 248437752 245006401 239982225 236982012 248675674
42259 248675674 267642107 272803096 265025056 265332571 274305639 267104984 240818349 233201231
42251 233201231 270255159 319662493 326808211 284185843 234904617 212481156 207417166
42244 207417166 197497473 183356942 178819632 183072660 181156317 166736842 150128620
42237A50128620o683050L734478O856262O184287P957319J0317814M326550j2901448
42229A69920832k9079986k8044373j1902226k483175j3301210k8605206k3265977
42222C3238679J090230J6687412Q144324p177333o236906P144000J1493643K93706
42214F4677755j1756973j2230399m840663J229937K324222j761665q430635q119358
42206B1092221P138214K6197603K4438502l663309l0308423k6261936J310409
42199A9943281J8127440O657888j4185039j5482481O671996K8434523K5848133
42192G6015741K81386k4609439l0072539k1404068j4525113r649029O402738L0901571
42184A3341248L8620114J6263386j3246498j8880012k750333P108417j328728
$$ plain form
42237 150128620 143445570 147180048 154036310 160220597 168177916 178495730 182822280 169920832
42229 169920832 140840846 112796473 100894247 98411072 85109862 56504656 33238679
42222 33238679 34328909 51016321 59160645 51983312 45746406 52890406 64384049 64677755
42214 64677755 52920782 40690383 35849720 37079657 39403879 37642214 29211579 21092221
42206 21092221 28230435 54428038 78866540 75203231 44894808 18632872 19943281
42199 19943281 38070721 44728609 30543570 15061089 21733085 50167608 76015741
42192 76015741 76297127 51687688 21615149 211081 -14314032 -23963061 -17560323 13341248
42184 13341248 51961362 68224748 54978250 36098238 33347905 40456322 39127594
42177C9127594j1584191p946184L166712O417283k274539j4133174j6706456l421799
42169g354754J7053370K3577261O582872j4227450j1673089J1548000K5047061
42162E0553271J0837991j6740189l3346988k9112333q453509J5408414K2437040
42155A1583697L433814j8950272j0154073K6650502M6289213K1567485j7500284
42148F2920082k5835695l272471J4845997J1943238L803508L681762M340866j652014
42140G0775273p891104p723790m448434j460075L214548O603883j009306j9400388
42132C8660607l1314699k2411238j376310J0189084M712595m680014n145541j619092
42124a2984608o012732j5078247j2097682P295273K4445556K1772946O639669
$$ plain form
42177 39127594 27543403 19597219 22763931 29181214 26906675 12773501 -3932955 -7354754
42169 -7354754 9698616 33275877 39858749 25631299 13958210 25506210 50553271
42162 50553271 61391262 44651073 11304085 -17808248 -26261757 -10853343 11583697
42155 11583697 15017511 -3932761 -14086834 12563668 58852881 80420366 62920082
42148 62920082 37084387 33811916 48657913 60601151 64404659 68086421 72427287 70775273
42140 70775273 62884169 55160379 50711945 49251870 52466418 59070301 58060995 38660607
42132 38660607 7345908 -15065330 -16441640 -6252556 -1539961 -6219975 -11365516 -12984608
42124 -12984608 -18997340 -34075587 -46173269 -38877996 -14432440 7340506 13980175
42117A3980175j592150R94546M795514P999815J4593354J5635040j804440k5969269
42109B8632585k7871035l602305J7563795J6491511P755257P153613N452864n936639
42101D5639646j1566095k67587P381762r876752l4611027l4588480j1726021N142506
42093d4472048N358709J860033l2190o183785j0884856k503220J0531741R513270
42085c6812346j005353N26353J4854091K1590523J6180419J4960745K1228385
42078E1522817J8021858j061756k3200994m0506329n2258465m3853325j407327
42071i2743521M8914169N8261689K2519531r276098q087980j874190j7635117
42064G8483l2107736j4722322J7028771K5357850R315677m301138o709649p039397
$$ plain form
42117 13980175 12388025 13382571 18178085 26177900 40771254 56406294 54601854 28632585
42109 28632585 761550 -2840755 14723040 31214551 38969808 46123421 51576285 45639646
42101 45639646 34073551 33805964 41187726 31310974 -3300053 -37888533 -49614554 -44472048
42093 -44472048 -39113339 -37253306 -37285496 -43469281 -54354137 -56857357 -46325616 -36812346
42085 -36812346 -37817699 -37291346 -22437255 -846732 15333687 30294432 51522817
42078 51522817 69544675 68482919 45281925 4775596 -47482869 -91336194 -92743521
42071 -92743521 -43829352 14432337 36951868 27675770 19587790 17713600 78483
42064 78483 -32029253 -46751575 -29722804 -4364954 4950723 649585 -6060064 -13099461
42056a3099461l559807R062329J7518533Q851199j185121P679985K0734339R369968
42048E5371964j8586631k8373827j2742008J808462J886100J775362Q062678P351810
42040A6553910k486396l560261P648858Q766646j0349323k5823140j4610703J0944506
42032a2915903K2726045J4771196L684281K519590R224593J3759483P254922q782366
42024E2241841j8376701p514970J2893000J7037838J948147n803566P758789J7457947
42016G7642325m363396m0209664m4359958m728002L7672910L8908958M236228
42009F4799401k2941251j5473650R031068J5134421o870128l3132565l7120552
42002b6573256j7036809Q901911K3794346K3069489J2939323N491834Q959978
$$ plain form
42056 -13099461 -16659268 -7596939 9921594 18772793 17587672 25267657 46001996 55371964
42048 55371964 36785333 8411506 -4330502 -2522040 -635940 1139422 9202100 16553910
42040 16553910 14067514 10507253 18156111 26922757 16573434 -9249706 -23860409 -12915903
42032 -12915903 9810142 24581338 28265619 30785209 40009802 53769285 61024207 52241841
42024 52241841 33865140 26350170 39243170 56281008 58229155 52425589 60184378 77642325
42016 77642325 73278929 33069265 -11290693 -16018695 21654215 60563173 64799401
42009 64799401 41858150 26384500 35415568 50549989 43679861 10547296 -26573256
42002 -26573256 -43610065 -34708154 -10913808 12155681 25095004 30586838 39546816
41995C9546816J6293783J0848055r633605k4629059j6757475L713754J3612174
41988C2994443P633702r18088l054128p16806M540925J2084494J4780269P490554
41980G4835365j235701k776803o813246k4420707l9194788k3731924J4646419
41973h691385L4918672J7067516j1452056j6010209K259381J8548654J9298916
41966E5939489Q520708n807965j6177788j6475253r151658k744271K153004J1630464
41958B7886730K1455296J9661743Q924791M445832O091481m66838r393680M178424
41950H2783779L5267460L9777652o40565m0180249k9948920J2440926L5277263
41943A34777346L0523224L1336570M6737195N0977764L6158530K6026739K9675199
$$ plain form
41995 39546816 55840599 66688654 57055049 32425990 15668515 19382269 32994443
41988 32994443 40628145 39710057 36655929 35939123 40480048 52564542 67344811 74835365
41980 74835365 73599664 70822861 64009615 39588908 394120 -23337804 -8691385
41973 -8691385 26227287 43294803 31842747 15832538 18091919 36640573 55939489
41966 55939489 64460197 58652232 42474444 25999191 16847533 14103262 16256266 27886730
41958 27886730 49342026 69003769 77928560 82374392 88465873 87999035 78605355 82783779
41950 82783779 118051239 157828891 157188326 117008077 87059157 99500083 134777346
41943 134777346 165300570 196637140 243374335 294352099 330510629 356537368 386212567
41936C86212567K4912097M46210k3567527l2556931m0499152n7465365o5180712
41929A92301187m6988805j7425992o8418L508511K490018n097284k0523322k7883304
41921H0312591j4067276O757859J1514487J587361l928232k500K114944q23081
41913H3466153p18912K133714k260411j2934469j5462714m857400N782889N302264
41905F0451114j833939q268570j5004673k0585772j3525772R824622K9578311
41898D0635321K2286376o262604k5167191j7070838K963798J2157099P694119
41891C7236080l26613q772864j7760531j7419786L07035K0505823J8828880j984217
41883C0613807j2108598K574976K0898295K0463047Q154012O00256l972976j3127585
$$ plain form
41936 386212567 411124664 411570874 388003347 355446416 314947264 257481899 192301187
41929 192301187 145312382 127886390 127817972 131326483 133816501 128719217 108195895 80312591
41921 80312591 66245315 73003174 84517661 86105022 82176790 82174290 84289234 83466153
41913 83466153 82747241 84880955 82620544 69686075 54223361 49365961 55148850 60451114
41905 60451114 58617175 50348605 35343932 14758160 1232388 11057010 40635321
41898 40635321 62921697 56659093 31491902 14421064 17384862 29541961 37236080
41891 37236080 36909467 28136603 10376072 -7043714 -6736679 13769144 32598024 30613807
41883 30613807 18505209 21080185 41978480 62441527 70595539 71195795 67222819 54095234
41875E4095234j8336308j0420082q87585j318209K596788K4770219M1393222J9954092
41867A11847371k2551686l6218649j3740336r9103j6044460k3472086P561421
41860G282472M3903641L9486147N512041j3214703q235208p478181j8257934j6659249
41852C2339026N980448K5168465J9852818j480203j8885180k3005590j3925689
41845B6044095K216559J1294888L586843r319309p207145P884459J2310921m300552
41837D2510759k3415205k3388103n930029J0358521J1881362l8308j2927574j3937207
41829a4885784l065807N340100N83794r498516r811333K258283J7456918K6121202
41821A4498857J9058286r106523m2184375m4662387m912977L8132461L9857775
$$ plain form
41875 54095234 35758926 25338844 24451259 23133050 25729838 50500057 91893279 111847371
41867 111847371 89295685 53077036 39336700 39237597 23193137 -278949 7282472
41860 7282472 51186113 90672260 96184301 82969598 74734390 67256209 48998275 32339026
41852 32339026 38319474 63487939 83340757 81860554 62975374 39969784 26044095
41845 26044095 28260654 39555542 43142385 33823076 26615931 34500390 46811311 42510759
41837 42510759 19095554 -4292549 -10222578 135943 12017305 11978997 -948577 -14885784
41829 -14885784 -17951591 -12611491 -12027697 -21526213 -31337546 -29079263 -11622345 14498857
41821 14498857 33557143 24450620 -17733755 -62396142 -67309119 -29176658 10681117
41814A0681117R764341o529736M224811J2280244J005816r672203m342219L492004
41806B0904175K352544K607568R296077Q062411n152247j2466537q601079j2898667
41798D104245k8401117k6814357J006983J8704600J170451j9345968l825281K9680583
41790b3719861L8934709K6337311K2515230K2457150k808485m0625096m4229097
41783a138139r226551J4429644n06768k0480149r253328J9912067L4236240K8473645
41775E6446661J7385261Q104370J158032k587311j0425072l0445712m6235998
41768f599769k8519333J5896341M0737775K3520466k914219n426577n51986j5841924
41760B0300774l3425929j6983791K3262608L9273965J4661509j5180650j6649233
$$ plain form
41814 10681117 20445458 13915722 18140533 30420777 31426593 21754390 17412171 20904175
41806 20904175 23256719 25864287 35160364 43222775 38070528 25603991 17002912 4104245
41798 4104245 -24296872 -51111229 -50104246 -31399646 -30229195 -49575163 -53400444 -23719861
41790 -23719861 15214848 41552159 64067389 86524539 83716054 43090958 -1138139
41783 -1138139 -10364690 4064954 3558186 -16921963 -26175291 -6263224 27973016 56446661
41775 56446661 73831922 81936292 83094324 80507013 70081941 39636229 -6599769
41768 -6599769 -35119102 -19222761 21515014 45035480 42121261 36694684 36142698 20300774
41760 20300774 -13125155 -30108946 -6846338 32427627 47089136 31908486 15259253
41753A5259253J128459Q280042o150372k6728244l0621371r295121K0986495L3120571
41745E979712K0938000P498483J1370375J9445587J0344534j0388376k1417116
41738D3771199j9193002j4295456n237051J3896239K7338321J3218074j6622560
41731D2875764k6960319j1702119q63114q851320j3299900O89849J2010819J908585
41723d191755j0605625q47939J7830932J5242362n627129j3033040M786030K4646842
41715B8200678K3065272L078669j6316852k0322791o464815J2778566J5477109
41708C9495836p551742l6478259m2116671k0979052L404031J2870024J1885502
41701c9470331J1353842J2834050J4438842J7365456J9314713J4043865M357572
$$ plain form
41753 15259253 16387712 24667754 18517382 -8210862 -38832233 -48127354 -27140859 5979712
41745 5979712 26917712 34416195 45786570 65232157 75576691 65188315 43771199
41738 43771199 24578197 10282741 5045690 18941929 46280250 59498324 42875764
41731 42875764 15915445 4213326 3350212 -5501108 -18801008 -18111159 -6100340 -4191755
41723 -4191755 -14797380 -15645319 2185613 17427975 11800846 -1232194 3553836 28200678
41715 28200678 51265950 54344619 38027767 17704976 11240161 24018727 39495836
41708 39495836 31944094 -4534165 -46650836 -67629888 -64225857 -51355833 -39470331
41701 -39470331 -28116489 -15282439 -843597 16521859 35836572 49880437 54238009
41694E4238009K765016J1079909J2712081l198696k1913048k2384889p661472
41687B5636910J666864l33117P85047J2188067K0298793J2817006k140422j0552139
41679F0367009j3298870j8021010j9836914q265866J0243382J5421347J306245
41672B7915323j4695880j6289432p905982k341981j340368J050569N000392O108878
41664b498481M121817P64084n529504j3758458j5868977q303123j038889l106552
41656d5218083o293336J604598J3399425J1444312k349700o805277N393101J6270165
41648a2554795J1756710K021092O49467J594494o539668j6688912j2969057L343761
41640b9386908J5584034J5960862J2013405J0298505Q391685L783037j910946
$$ plain form
41694 54238009 57003025 68082934 80795015 77596319 55683271 33298382 25636910
41687 25636910 27303774 26970657 27755704 39943771 60242564 73059570 70919148 60367009
41679 60367009 47068139 29047129 9210215 944349 11187731 26609078 27915323
41672 27915323 13219443 -3069989 -10975971 -13317952 -14658320 -13607751 -8607359 -2498481
41664 -2498481 1623336 2387420 -3142084 -16900542 -32769519 -41072642 -42111531 -45218083
41656 -45218083 -51511419 -49906821 -36507396 -25063084 -27412784 -34218061 -28824960 -12554795
41648 -12554795 -798085 1223007 1872474 3466968 -3072700 -19761612 -32730669 -29386908
41640 -29386908 -13802874 2157988 14171393 24469898 32861583 36644620 34733674
41633C4733674q900886j8282850k4245955j8557791m602483M599116N643199J0165752
41625a9448224K4730024L5877099K5633094l218090k7546438k8962681j1140560
41618d075776Q601525J8145201J7002852Q655774m962017j8568535k0558471m581240
41610c40687J7201437K3721621J1494766J20628L800032R824365J04275j5774685
41602E0151752j1728507J1919145K3062626N184281j4376350l902450K2912368
41595H3222865K5370926l248934k5325958j4370721R712698J6390944R843677
41588A01595497J3791789K8257009L2001404K1245684J4599042J8168512J6699352
41581B46358289P373786J1277703L5072048N0767289L8613539K4260242L8545623
$$ plain form
41633 34733674 25832788 7549938 -16696017 -35253808 -39856291 -35257175 -29613976 -19448224
41625 -19448224 5281800 41158899 66791993 63573903 36027465 7064784 -4075776
41618 -4075776 4525749 22670950 39673802 48329576 43367559 24799024 4240553 -340687
41610 -340687 16860750 40582371 52077137 52197765 55997797 65822162 65926437 50151752
41602 50151752 38423245 50342390 73405016 78589297 64212947 60310497 83222865
41595 83222865 108593791 105344857 80018899 65648178 75360876 91751820 101595497
41588 101595497 115387286 143644295 175645699 196891383 211490425 229658937 246358289
41581 246358289 253732075 265009778 300081826 350849115 389462654 413722896 452268519
41574D52268519N8842226L4885027l1356868p8898075p1534411m4744198m5451020
41567B74011200o2334073n2827329j6257576L500524j5690569m2945808l8296186
41560D9160183k336370L0540477L3119364Q754783j7159073k1438136l845803
41553G6795425J3114928Q956976j1459685k5550433k1192201p778911L05583J076876
41545C4268558L021672J2306507K4405317K6466193J1350250p511537m160851
41538A00146109K6901783N4003504M1149909m568028l6265001k2078164J8239181
41531A77529293L9423968K2956580o472445j2666052J1363936L6464593L1466802
41524C00066675J606940j6366749q77390K6515089L1841859J4085693j23568J763581
$$ plain form
41574 452268519 511110745 545995772 514638904 435740829 364206418 319462220 274011200
41567 274011200 211677127 158849798 142592222 146092746 130402177 87456369 49160183
41560 49160183 46823813 77364290 110483654 119238437 102079364 80641228 76795425
41553 76795425 89910353 98867329 87407644 61857211 40665010 32886099 33191682 34268558
41545 34268558 37290230 49596737 74002054 100468247 111818497 104306960 100146109
41538 100146109 127047892 181051396 222201305 217633277 181368276 159290112 177529293
41531 177529293 216953261 239909841 233437396 220771344 232135280 268599873 300066675
41524 300066675 301673615 285306866 284429476 310944565 342786424 356872117 356748549 358512130
41516C58512130P139236O753039P557489J2835171J3974348Q555590L294640p027411
41508D11594232l6045648p1292713p4988213l8430122n136784j2665615l8447942
41501A34587195l7819885j3341105l618798j6612227k2039474q702364j126636
41494C1326706r511346q696014J3303752K6187573N236585k3926081k2531373
41487A1389802K349933J2592337j409845j3093954o431181M277069L591706m701301
41479H564566j1420941j2802973l986601J5676088K8497083J4996939j1486130
41472B8038031j5808216N046042J2420240j2222458l0901392n755885L6019514
41465A6835876L6779937o392553l8146895k6029486R48100O837158n97498J988866
$$ plain form
41516 358512130 365651366 372404405 379961894 392797065 406771413 415327003 418621643 411594232
41508 411594232 375548584 304255871 229267658 190837536 185700752 173035137 134587195
41501 134587195 96767310 83426205 79807407 63195180 41155706 32453342 31326706
41494 31326706 21815360 13119346 26423098 52610671 57847256 33921175 11389802
41487 11389802 13739735 26332072 24922227 11828273 5397092 9674161 13265867 8564566
41479 8564566 -2856375 -15659348 -19645949 -3969861 24527222 39524161 28038031
41472 28038031 12229815 17275857 29696097 17473639 -13427753 -19183638 16835876
41465 16835876 53615813 47223260 9076365 -16953121 -16005021 -9167863 -9765361 -7776495
41457g776495Q439911m05420j5736517j2105112Q439057J6445754P4355j8064413
41449b0688880j5977292j267221O680336O297773R423270J6065160J1701704p808148
41441D426702k2518754j1315305J6156553K6453549O623941j5087537q369461
41434c630312J3871113J5931933k794344o847045J3936962K3448695r25841k7087214
41426B5903947j9315306K875818k03348j9948834j7414564N158739P897208j3804453
41418b8850793j8477483Q856012K9062762J4800037o287134k583952J1781627
41411H301076J1755212O794282J3863988J8735088M665979r653875l487808J888647
41403E2862589j9539842m0751234j7275562L3120228M6958611J0182210k3130074
$$ plain form
41457 -7776495 663416 257996 -15478521 -27583633 -19144576 -2698822 -2624467 -20688880
41449 -20688880 -36666172 -37933393 -31253057 -24955284 -15532014 533146 12234850 4426702
41441 4426702 -18092052 -29407357 -13250804 13202745 19826686 4739149 -3630312
41434 -3630312 10240801 26172734 23378390 16531345 30468307 53917002 52991161 25903947
41426 25903947 6588641 9464459 9261111 -10687723 -28102287 -22943548 -15046340 -28850793
41418 -28850793 -47328276 -38472264 -9409502 5390535 -896599 -3480551 8301076
41411 8301076 20056288 26850570 40714558 59449646 64115625 54461750 50973942 52862589
41403 52862589 33322747 -7428487 -24704049 8416179 55374790 65557000 42426926
41396D2426926j7055705j057644q781754k0997275m104253L1200515M7400285
41389F9031095L3842880J0460279o923893j7382011k1775210k1468476k1859945
41382B3924719k1198099p882284J6271823K6603998R027837j2947655q776448
41375B5023891J3590711J9959012J099114j7059780j5124012m774510l151098
41368A9563328m810774N766315K5995777L5361711K1665980l204798j6738008
41361H3599531j1050586k88109j608394j3247044j7893674o143157J2275088K1541324
41353F7184979J4624599o170925l1495742m4100183k9903424J923848K2747606
41346e189242J7903793L352111j871420l662448j5524645k7632542j8744424O861334
$$ plain form
41396 42426926 25371221 24313577 15531823 -5465452 -9569705 21630810 69031095
41389 69031095 102873975 113334254 106410361 89028350 67253140 45784664 23924719
41382 23924719 2726620 -5155664 11116159 37720157 46747994 33800339 25023891
41375 25023891 38614602 58573614 59672728 42612948 27488936 22714426 19563328
41368 19563328 14752554 20518869 46514646 81876357 103542337 100337539 83599531
41361 83599531 72548945 72260836 70652442 57405398 39511724 33368567 45643655 67184979
41353 67184979 81809578 75638653 44142911 42728 -29860696 -27936848 -5189242
41346 -5189242 12714551 16066662 14195242 10532794 -4991851 -32624393 -51368817 -44507483
41338d4507483K0850978J0593344o199729j1256824q000163o127121m600479j435384
41330e0682861k588955p788303l678977J3373993K2921534Q683194j1281174p636729
41322c8678278J3584880J6758481q120855k6295380q791875K3163270K8496088
41315A16331N327854j0093695M75906J2795698M98967k4671630l0395761p266471
41307e3212801K3384082L7817167K9947346P567988j5421275k3698562j1908323
41300e524378O337044J1738264K543346o414937p564682q724720j4088301j3583542
41292c5281906p53527J2467025J2504757O051591Q923963J8013292J3197249r993147
41284B5129297k7253713j6417395R374859J5742982p276789l0348891k3073242
$$ plain form
41338 -44507483 -23656505 -13063161 -19262890 -30519714 -38519877 -44646998 -49247477 -50682861
41330 -50682861 -53271816 -61060119 -64739096 -51365103 -28443569 -19760375 -31041549 -38678278
41322 -38678278 -25093398 -8334917 -16455772 -42751152 -51543027 -28379757 116331
41315 116331 5444185 -4649510 -4173604 8622094 9121061 -15550569 -45946330 -53212801
41307 -53212801 -29828719 7988448 37935794 45503782 30082507 6383945 -5524378
41300 -5524378 812666 12550930 15094276 8679339 1114657 -7610063 -21698364 -35281906
41292 -35281906 -36035433 -23568408 -11063651 -5012060 3911903 21925195 35122444 25129297
41284 25129297 -2124416 -18541811 -9166952 6576030 -700759 -31049650 -54122892
41277e4122892O382664K5049087K0897025J3268146J6046033J5129949l515609
41270C9134403k4181671k3021688o643079j871493j2266178j3996186L000413
41263c9845479J9062834J8989531J4897751J9737362K1605094N165863j8549643
41256D1063313k6318196j5831355l926814L88855J593103J985085r89881m877559
41248f913449n426878n920083q778671m023121J6380280L7860726L7150573J4876554
41240G5205931o080297j4156686j8699726k3729621j7534991J472510J1789902
41233H267022j138422j8915692j4647187P253410J7628988M937716j0641365q401058
41225a5656588O381802J5320859J1431769q50796j8150539l4450899l2781131
$$ plain form
41277 -54122892 -47740228 -22691141 -1794116 11474030 27520063 42650012 39134403
41270 39134403 14952732 -8068956 -14712035 -16583528 -28849706 -42845892 -39845479
41263 -39845479 -20782645 -1793114 13104637 32841999 54447093 59612956 41063313
41256 41063313 14745117 -1086238 -5013052 -4624197 -3031094 -1046009 -2035890 -6913449
41248 -6913449 -12340327 -18260410 -27039081 -31062202 -14681922 23178804 60329377 75205931
41240 75205931 69125634 54968948 36269222 12539601 -4995390 -3522880 8267022
41233 8267022 7128600 -11787092 -26434279 -19180869 -1551881 3385835 -7255530 -15656588
41225 -15656588 -9274786 6046073 17477842 16627046 -1523493 -35974392 -68755523
41218f8755523k467813L4641875L9067543M979093k5434040j6642361J1158388
41211b3452838J4375488p727964j5775835M537016K1276601J0231103q617651
41204e154080q999983N5395k366957j0288899o558359K034539k416857j4601732
41196d8296933j5440574n278488J855253O771480J7323294K2190815O275393j4996587
41188b9596347j2738425P931803J4463908m53146j1429068p260964m746658r811937
41180e3640834o398892N846925N207686o712952K416764L6684942N0023001J3503956
41172D6930596l4732351m3149583j7706199J94278p15422m98137P398001J2679097
41164b9599720J5920623K1496396J5446888j1801496l3238597j6689141K0798295
$$ plain form
41218 -68755523 -71223336 -36581461 2486082 7465175 -17968865 -34611226 -23452838
41211 -23452838 -9077350 -16805314 -32581149 -28044133 -6767532 3463571 -5154080
41204 -5154080 -14154063 -14098668 -16465625 -26754524 -33312883 -31278344 -33695201 -48296933
41196 -48296933 -63737507 -69015995 -67160742 -60389262 -43065968 -20875153 -14599760 -29596347
41188 -29596347 -42334772 -34402969 -19939061 -20392207 -31821275 -39082239 -43828897 -53640834
41180 -53640834 -60039726 -54192801 -48985115 -55698067 -53281303 -16596361 33426640 46930596
41172 46930596 12198245 -30951338 -48657537 -48463259 -49178681 -49676818 -42278817 -29599720
41164 -29599720 -13679097 7817299 23264187 11462691 -21775906 -38465047 -17666752
41157a7666752L2714865J1800498n470205j821464R18255q329164p552456J3744457
41149A8338034K8429404J3220580j5640024l0684646k9804306k2907450q210642
41142d7259050J3581920K3595876R912477q003678n415524J0171876J2540427
41135I124324k064547j2627542p739103Q71118n9634p939236j1640248n321127
41127c7395995N872815P826707r662186l4906983l8726715r106643K6979883L2488055
41119e6631062O352030j6636808j1248045J0295182K0319680J0944722j996497
41112c8600798k151840J0183627K2473331K4577962J6715790N735634k484203
41105C6449503n829954n223673n149953j1305666k1557066k3284208r572770N214852
$$ plain form
41157 -17666752 15048113 26848611 21378406 19556942 20475197 12146033 4593577 18338034
41149 18338034 46767438 59988018 44347994 13663348 -16140958 -39048408 -47259050
41142 -47259050 -33677130 -10081254 -168777 -8172455 -13587979 -3416103 9124324
41135 9124324 7059777 -5567765 -13306868 -12435750 -12495384 -20434620 -32074868 -37395995
41127 -37395995 -31523180 -23696473 -33358659 -68265642 -106992357 -116099000 -89119117 -56631062
41119 -56631062 -50279032 -66915840 -78163885 -67868703 -47549023 -36604301 -38600798
41112 -38600798 -40752638 -30569011 -8095680 16482282 33198072 38933706 36449503
41105 36449503 30619549 25395876 20245923 8940257 -12616809 -35901017 -45473787 -40258935
41097d0258935P27054j7848941k1589174J944036K8587582L0876437J5376402
41090b185539P851763J2767745J1372429l524959j5304495j0683967R80004M672729
41082E945710R50528o54234J623869L479443N598248J0608393J2351789N37714
41074D0441460k2238026l7742522l1759131j1458558L086259L074384l30384O095008
41066e0831510J7917098J9476552P527967k986597o02304O156458L405395m834247
41058d771188k166803J3105792K1643264Q751859j5586353l0605517k9616868
41051c9245814k0438412p804329R744936K5639401K4096754J991406j8697855
41044b4713913j3700965J1753905K7416196J5704013p971906j8275195j1048433
$$ plain form
41097 -40258935 -39531881 -57380822 -78969996 -77025960 -48438378 -17561941 -2185539
41090 -2185539 5666224 18433969 29806398 26281439 10976944 292977 1272981 5945710
41082 5945710 6896238 6242004 7865873 11345316 16943564 27551957 39903746 40441460
41074 40441460 18203434 -19539088 -51298219 -62756777 -59670518 -56596134 -56926518 -50831510
41066 -50831510 -32914412 -13437860 -5909893 -8896490 -9498794 -3342336 63059 -4771188
41058 -4771188 -6937991 6167801 27811065 36562924 20976571 -9628946 -39245814
41051 -39245814 -59684226 -67488555 -57743619 -32104218 -8007464 -6016058 -24713913
41044 -24713913 -38414878 -26660973 755223 16459236 8487330 -9787865 -20836298
41037b0836298j24187P484505J5905172K2123369J3172634j0848393k6695707
41030A81095j4780431J2675575K5172470J1566290j0744124k2938542k3871305
41023b2738972j7897869k396697J8949987K4983201J270023k9506257k6972346
41016e4308930J1202947L7778598J6634116k5302941l3049511J106752L0263126
41009a5675843K1208708m878862j3183531m905828j467522k776360O467045K1538191
41001F325998K2361522R214631J819101K403506p605614k7824145k9553876j486020
40993b4344897K4902998J8192803p360201j5003685J599770J6330824J2699848
40986B7017460Q45814n778262p387390q762318j0886254j5070949k2046581k5284704
$$ plain form
41037 -20836298 -20960485 -13475980 2429192 24552561 37725195 26876802 181095
41030 181095 -14599336 -1923761 23248709 34814999 24070875 1132333 -22738972
41023 -22738972 -40636841 -43033538 -24083551 899650 2169673 -27336584 -54308930
41016 -54308930 -43105983 -5327385 11306731 -13996210 -47045721 -45938969 -15675843
41009 -15675843 5532865 654003 -12529528 -17435356 -18902878 -21679238 -15212193 6325998
41001 6325998 28687520 37902151 39721252 42124758 34519144 6694999 -22858877 -24344897
40993 -24344897 558101 18750904 11390703 -3612982 -2013212 14317612 27017460
40986 27017460 27863274 22085012 14697622 5935304 -4950950 -20021899 -42068480 -67353184
40978f7353184j6978112q92935J1778394J7829819K1414867K0941558J1594507
40971a665086M3079O1260J0924610J5626167N067787j0097169j7141617j7141637
40963a4322606j6045851j2347316l184731O364012R802174R155141J0297538J2623798
40955B342159J0371449K076125n870590m532470Q698941K4096560K5771857J0135405
40947G3089436o068081o074410L152758K073545r794349j3790663n539777m069851
40939C2978608j7574239k4542926p480536J5195708J5705565K08613l845553M972344
40931A5617584R75760k1297745l2434528j2949207J5249711K1248549Q384780
40924e205096K366863R381132J1124141k176670j6344294j4683640R22405J6122156
$$ plain form
40978 -67353184 -84331296 -85224231 -73445837 -55616018 -34201151 -13259593 -1665086
40971 -1665086 -1622007 -1560747 9363863 24990030 30057817 19960648 2819031 -14322606
40963 -14322606 -30368457 -42715773 -45900504 -39536492 -29734318 -20579177 -10281639 2342159
40955 2342159 12713608 14789733 8919143 4386673 13085614 37182174 62954031 73089436
40947 73089436 67021355 60946945 64099703 66173248 56378899 42588236 37048459 32978608
40939 32978608 15404369 -9138557 -16619093 -1423385 14282180 14490793 10645240 15617584
40931 15617584 16593344 -4704401 -37138929 -50088136 -34838425 -13589876 -5205096
40924 -5205096 -2838233 6542899 17667040 15490370 -853924 -15537564 -14615159 1506997
40916A506997K0777444J4274013J663001j0527965j8535021k3401927k5853201
40909d0096659k0980603m480770J6805873K8781325K5847641J5753053P709899
40902B9339759L297572L64732k911597j0157811k2981838l1272069j9281958J0634229
40894d2968981L1700027K2557693m309284j8224607r631560K300197P36983p293201
40886b5132733o275246M558523J3443751J3793678R327757M246800k879493j3588949
40878b505912k2627319k0859739o362487R820681J4037430O829036K671379R655710
40870i341221J7712478J3878253P95243r947810j4646612j4739880n664143J3850806
40862h102886K7496816J8399915j611082m212508J2268906J9305930M512353q736948
$$ plain form
40916 1506997 22284441 36558454 38221455 27693490 9158469 -14243458 -40096659
40909 -40096659 -61077262 -65558032 -48752159 -19970834 5876807 21629860 29339759
40902 29339759 32637331 33002063 30090466 19932655 -3049183 -34321252 -53603210 -42968981
40894 -42968981 -11268954 11288739 6979455 -11245152 -20876712 -18576515 -17839532 -25132733
40886 -25132733 -31407979 -26849456 -13405705 387973 9715730 13962530 11083037 -2505912
40878 -2505912 -25133231 -45992970 -52355457 -42534776 -28497346 -21668310 -18996931 -9341221
40870 -9341221 8371257 22249510 23044753 13096943 -1549669 -16289549 -21953692 -8102886
40862 -8102886 19393930 37793845 36182763 31970255 44239161 63545091 68057444 59320496
40854E9320496k912059K486602j4210434l5589198l0288024l018049J4342186
40847i868480J2249334R285340J1554370K600206j9518889k8072628o453289K2506433
40839e717603K5036888M36447k0373952j3832540J0758235K2909194L438224l2877688
40831a0222795m9140689k6855281J0631682K6431010J5569867M245695O852924
40824b2487587Q045205o143772k2659432k1750949o818839L553836M246320O844419
40816e7170799J6657324K1872044J1223849n391263m355928J9701713L7734870
40809D0271810J7652473k7384329m4651209r949363L2566518K6085308j9507942
40802A5083266m2042310j6265274J5063392J0002549j4021940j5843527N609519
$$ plain form
40854 59320496 56408437 58895039 44684605 9095407 -21192617 -24210666 -9868480
40847 -9868480 2380854 11666194 23220564 25820770 6301881 -21770747 -28224036 -5717603
40839 -5717603 19319285 19755732 -618220 -14450760 -3692525 19216669 22654893 -10222795
40831 -10222795 -59363484 -86218765 -75587083 -49156073 -33586206 -29340511 -22487587
40824 -22487587 -14442382 -20586154 -43245586 -64996535 -71815374 -68261538 -64015218 -57170799
40816 -57170799 -40513475 -18641431 -7417582 -12808845 -17164773 2536940 40271810
40809 40271810 57924283 30539954 -14111255 -24060618 8505900 34591208 15083266
40802 15083266 -26959044 -43224318 -28160926 -18158377 -32180317 -48023844 -42414325
40795d2414325J6155089l1281k2232751k5327094q407847J0195996J4503581O629246
40787e0929386M475825J9375494L7523285L5643021J3660083n777661r959034
40780D4011627o028592K110421J7582540K6365521M818915l5334830m7127306
40773F398296j5032188J5755050N885668j8806229j3051449J4912367K3629876
40766A9691391Q479245m59429L185552j442026j3243507q342463J0271095J1727287
40758B9867145p631015j4963109K823312J7988420J1060009r42930k000356k701678
40750C3499798r143662n227309J0958965J0505096j8443702l9763505j9246378
40743c6860697K1497427L5617458J5091606r631936j8307075j5753491q429234
$$ plain form
40795 -42414325 -26259236 -26290517 -48523268 -73850362 -82258209 -72062213 -57558632 -50929386
40787 -50929386 -46453561 -27078067 10445218 46088239 59748322 53970661 44011627
40780 44011627 37983035 40093456 57675996 84041517 88860432 53525602 6398296
40773 6398296 -8633892 7121158 13006826 -5799403 -18850852 -3938485 19691391
40766 19691391 28170636 27711207 30896759 29454733 16211226 7868763 18139858 29867145
40758 29867145 22236130 7273021 10096333 28084753 39144762 38201832 36201476 33499798
40750 33499798 24356136 19128827 30087792 40592888 22149186 -17614319 -36860697
40743 -36860697 -15363270 20254188 35345794 25713858 7406783 -8346708 -16775942
40736a6775942K513637R863742P695781N156184J1151389J3630157j760236k0668994
40728A0805718j6261071O492471J2928329r823218l1026393j9373551J2314819
40721c3942896K4617985N016994j6179826p890522J8059131K1518240r048820
40714B150286l5295580j9354436K1124837L5029085Q068428k1499344k0829458
40707c0606182k059087R003473J1107512J3011458Q676903n770132j2121735L248563
40699e509227J9649313R916834j4417009j7717784P031402L0564223K9492633
40692E9010385Q954011j5035707l0497887k8214894r879097L829017l211552j4067964
40684b9113688j46876L1275376M1691667J7007517j2324544j5919722j64609J2086059
$$ plain form
40736 -16775942 -14262305 -4398563 3297218 8453402 19604791 33234948 31474712 10805718
40728 10805718 -5455353 1037118 13965447 4142229 -26884164 -46257715 -33942896
40721 -33942896 -9324911 -4307917 -20487743 -28378265 -10319134 11199106 2150286
40714 2150286 -33145294 -52499730 -31374893 3654192 11722620 -9776724 -30606182
40707 -30606182 -32665269 -23661796 -12554284 457174 9134077 3363945 -8757790 -5509227
40699 -5509227 14140086 24056920 9639911 -8077873 -1046471 29517752 59010385
40692 59010385 67964396 52928689 22430802 -5784092 -15663189 -11834172 -15045724 -29113688
40684 -29113688 -29260564 2014812 43706479 60713996 48389452 32469730 32305121 44391180
40676D4391180J3097967O100666q371527k3816323k2732409N74817K3991853K1876010
40668E5112234k637514k4049792k6369194j5318000l993117R56689O52437O00231
40660a5046026N447541J2591129J3974935P535471J759983M338552J0740644R135383
40652E0477612n188438k2930762k7808430j2331087J0752873J7282319j695356
40645H558731k6305374k9025797n741169K3129489L7471522L2282244J3326833
40638E3696479o955825j2583117K3962J0410818l582150l1561467l9128020j4796738
40630d4476058J3282477J7056809M789286K199826J2729799J6389960K170595
40623B4142694j6271226j9404058n956222O422415K265596j2848757j8491045
$$ plain form
40676 44391180 57489147 63589813 55218286 31401963 8669554 9244371 33236224 55112234
40668 55112234 52474720 28424928 2055734 -13262266 -17255383 -16298694 -15646257 -15046026
40660 -15046026 -9598485 2992644 16967579 24503050 26263033 30601585 41342229 50477612
40652 50477612 45289174 22358412 -5450018 -17781105 -7028232 10254087 8558731
40645 8558731 -17746643 -46772440 -52513609 -29384120 8087402 40369646 53696479
40638 53696479 46740654 34157537 34181499 44592317 41010167 9448700 -29679320 -44476058
40630 -44476058 -31193581 -14136772 -9347486 -7147660 5582139 21972099 24142694
40623 24142694 7871468 -11532590 -17488812 -11066397 -8800801 -21649558 -40140603
40616d0140603o159545Q006160N881900m956016j448060J9974911L6457466K9699180
40608D7315393Q354151o022003l248223J0157683J9716323J3719493n775570k2169982
40600F2047265k3672841j9568230k3906344k9183091j6789481R004365K2174934
40593a9893423J3023169R17927K781739J1808453J5260997J1399096Q80055j6211878
40585A9966135k7176483j5324425R180290J4158435p251369k2959465j0554634
40578c9961516J0965135J7542770J6779963K2823262K4187966P978046q747296
40571E1568330n740214L177290n841276k4272144k8774254k3358924k5195150
40564e8436342k4180137J66238L2547693L7994398J8001833N013730M618796p580582
$$ plain form
40616 -40140603 -46300148 -38293988 -32412088 -37368104 -38816164 -18841253 17616213 47315393
40608 47315393 55669544 49647541 46399318 56557001 76273324 89992817 84217247 62047265
40600 62047265 38374424 18806194 -5100150 -34283241 -51072722 -42068357 -19893423
40593 -19893423 -6870254 -5952327 -3170588 8637865 23898862 35297958 36178013 19966135
40585 19966135 -7210348 -22534773 -13354483 803952 -6447417 -29406882 -39961516
40578 -39961516 -28996381 -11453611 5326352 28149614 52337580 60315626 51568330
40571 51568330 45828116 49005406 43164130 18891986 -9882268 -33241192 -58436342
40564 -58436342 -82616479 -82450241 -49902548 -11908150 6093683 11107413 15726209 8145627
40556H145627k9859445k8063487L244695K4304207J3779771J269264J1425711
40549D246343K0860858L825606j8423055j3981242M091256J826572j6827249j9532494
40541c3913405k188533P364720l15639k241628J4944212L2621337L1241489J7344756
40533F4857309N938646l261932j5836613k3569547j3821942P641802J9230585
40526D1178308J0142252o977117j4438041j1741866j0612121j3137372r025484
40519a4611441L210812Q171290l159452j5557455j0503837N482377J2476933Q770135
40511e720638P806460R098148m0138j4094805j1514055O939915J3906440J040948
40503G422275m146455J3718232K5385175J829502l3955808l6506256m588322J8814143
$$ plain form
40556 8145627 -21713818 -49777305 -46532610 -22228403 -8448632 -7179368 4246343
40549 4246343 25107201 28932807 10509752 -3471490 619766 2446338 -14380911 -33913405
40541 -33913405 -36101938 -28737218 -29052857 -31294485 -16350273 16271064 47512553 64857309
40533 64857309 70795955 67534023 51697410 28127863 14305921 21947723 41178308
40526 41178308 51320560 44343443 29905402 18163536 7551415 -5585957 -14611441
40519 -14611441 -11400629 -3229339 -6388791 -21946246 -32450083 -26967706 -14490773 -5720638
40511 -5720638 2085822 11183970 11143832 -2950973 -14465028 -7525113 6381327 7422275
40503 7422275 3275820 16994052 42379227 44208729 10252921 -26253335 -30841657 -12027514
40495a2027514Q057865j7515327k8690508j9740604j412778J5287741K1335162
40488c4705963J4283007N751702Q919231J7415845J3765198j458266r559159m576402
40480I835193j160956n968866n416880O784571J2847368j126418j8845084j6656959
40472a9708031L6299O288770l475809j0310974m131273J592975m305466j0579555
40464d4593064l007520J0590814J2267925K328153l962755m701664j3266160k7284971
40456g1629242k0649341J7246293N4502864N3863577K4364992O214070R969535
40449G3882748O282421j9028903l7928043k6653467n629885l876925r704488N807022
40441a6849520L2301157L0175001n220539l1224524j9730025M067653L129857
$$ plain form
40495 -12027514 -3969649 -21484976 -50175484 -69916088 -71328866 -56041125 -34705963
40488 -34705963 -20422956 -14671254 -5752023 11663822 25429020 23970754 14411595 9835193
40480 9835193 8674237 2705371 -2711509 4073062 16920430 15794012 -3051072 -19708031
40472 -19708031 -19671732 -13382962 -16858771 -27169745 -31301018 -29708043 -34013509 -44593064
40464 -44593064 -47600584 -37009770 -24741845 -22413692 -26376447 -31078111 -44344271 -71629242
40456 -71629242 -92278583 -75032290 -20529426 33334151 57699143 63913213 73882748
40449 73882748 80165169 61136266 23208223 -3445244 -9075129 -12952054 -22656542 -16849520
40441 -16849520 15451637 45626638 40406099 9181575 -10548450 -6480797 -3350940
40434c350940j8433319k7453576r996916J6052635K9142290K5583373J5153090
40427B6696637Q602125R196030R499034L6864j4099014j4296058M879763K0227392
40419E0742773P135398k2651737l0527047k554470K7257533J9140051j8954507
40412B9587994m0856009k3578378M596230Q693511k123618N912895L2144490L7860496
40404E2237611P437422k2739953j7301931N792441P488246r275760r143430J2407659
40396B6902305K0067222k283301k5196223k1460592m533327K118608L358848J3218884
40388A2192424K1939729J2971505m184844r259795o814489j4462870k4426431
40381a2044771j2648678J4829890K1646071l676042k5425231j1301282K0375408
$$ plain form
40434 -3350940 -21784259 -49237835 -59234751 -43182116 -14039826 11543547 26696637
40427 26696637 35298762 44494792 53993826 54030690 39931676 25635618 30515381 50742773
40419 50742773 57878171 35226434 4699387 2144917 29402450 48542501 29587994
40412 29587994 -11268015 -34846393 -30250163 -21556652 -23680270 -17767375 14377115 52237611
40404 52237611 59675033 36935080 19633149 25425590 32913836 23638076 14494646 26902305
40396 26902305 46969527 44686226 19490003 -1970589 -6503916 -4385308 -1026460 12192424
40388 12192424 34132153 47103658 42918814 33659019 26844530 12381660 -12044771
40381 -12044771 -24693449 -9863559 11782512 8106470 -17318761 -28620043 -8244635
40374h244635K7387265J783358k3191479j8937493O026276K1449399J0936321
40367A7209012j1684572j7499474N643384L6102810L9910039J1279224j9132859
40360F1827564k2567733n915120M828427K529535O55468L040169l631233k2658162
40352A8108915l4806937k5357696p407148k153600p182383l255634J2698721K1562087
40344b7793675J0614164r296695k0893289k0482894j3240184j267132J3057255
40337f9302450K1436794J9384282J5194195J7623857K0107161J0259732q405207
40330B6298364j8891657j4931166q500384r987358j4080725j1589039m418402
40323e6100367n60565j465497k107363J166163Q488558J7478310K2048433J6017980
$$ plain form
40374 -8244635 19142630 20925988 -2265491 -21202984 -15176708 6272691 17209012
40367 17209012 5524440 -11975034 -6331650 29771160 69681199 80960423 61827564
40360 61827564 39259831 33344711 38173138 40702673 41358141 44398310 40767077 18108915
40352 18108915 -16698022 -42055718 -49462866 -51616466 -58798849 -62054483 -49355762 -27793675
40344 -27793675 -17179511 -26476206 -47369495 -67852389 -81092573 -82359705 -69302450
40337 -69302450 -47865656 -28481374 -13287179 4336678 24443839 34703571 26298364
40330 26298364 7406707 -7524459 -16024843 -26012201 -40092926 -51681965 -56100367
40323 -56100367 -56660932 -58126429 -60233792 -59067629 -50579071 -33100761 -11052328 4965652
40315D965652K583386o058332l557421K920374N155916N291919O789508L395543
40307B1486545j0104432k2229779j5232124R626261L0634554L0782358J3088520
40300E8051903r562357k6791284l0527146j7015490L766076J2381254K412505
40293g284539j0574267j1014050m450973n337426j2234457j0333580M614794J9935479
40285c6679019K4441321K0512255J5372510J1586693R717107J0263644Q962619
40278F4177130o8407j2209994j4206356m531499l38390j3550959k9621170k4569170
40270c4918815J499933K3197756K2517817R248834M507361J3517155K0954982
40263F0525023R697714j8448913l9653239k9321997Q670916L9872840L5889984
$$ plain form
40315 4965652 7549038 1490706 -2066715 853659 6009575 11301494 18091002 21486545
40307 21486545 11382113 -10847666 -26079790 -16453529 14181025 44963383 58051903
40300 58051903 48489546 21698262 -8828884 -25844374 -22078298 -9697044 -7284539
40293 -7284539 -17858806 -28872856 -33323829 -38661255 -50895712 -61229292 -56614498 -36679019
40285 -36679019 -12237698 8274557 23647067 35233760 44950867 55214511 64177130
40278 64177130 64108723 51898729 37692373 33160874 32822484 19271525 -10349645 -34918815
40270 -34918815 -33418882 -10221126 12296691 21545525 26052886 39570041 60525023
40263 60525023 70222737 51773824 12120585 -17201412 -8530496 31342344 67232328
40256F7232328P870035r936226n600696R39395n190526j1387387m072434L345078
40248D3199567r462826l2991014l5854459r312639J7226864J3397922j2598336
40241b6394921k3582843P71257L7694053M6443535J7001045j6122688j5620871
40234B0188567J1630768K4790872L555469k8044009l7614543k3038323k821080
40227c1352279J2906862K3431030K4451519J5582498J0721106J9221324K4783647
40220I9745707O288883k6021720m0337134k7393831r214523k107647K784006J4916591
40212A8660332K4522552J9643223N065150p985595j7343901k4592015k6015885
40205h046139j8632355o612860M634233J2798483J4554776P351632l161980q499968
$$ plain form
40256 67232328 75102363 65166137 59565441 60504836 55314310 43926923 39854489 43199567
40248 43199567 33736741 745727 -35108732 -44421371 -27194507 -13796585 -26394921
40241 -26394921 -49977764 -49206507 -11512454 34931081 51932126 35809438 20188567
40234 20188567 31819335 56610207 60165676 32121667 -5492876 -28531199 -31352279
40227 -31352279 -18445417 4985613 29437132 45019630 55740736 74962060 99745707
40220 99745707 106034590 80012870 39675736 12281905 3067382 959735 3743741 18660332
40212 18660332 43182884 62826107 67891257 59905662 42561761 17969746 -8046139
40205 -8046139 -26678494 -33291354 -28657121 -15858638 -1303862 6047770 2885790 -5614178
40197e614178r579120j1063053p438089P346591K0487778J4315608j955874k790759
40189C708904R769923O445331j7039125k5509858j40025K6996882K0726186n052755
40181A9905463j4492035m783697L98001n545308r872647r357972r133485l110036
40173c5991716J3979362K5891041J7403801N498150J2880536K1968035j741895
40166E9887314m4831364n3064142j1871886K6417590J6250545j8237767k2566201
40159d8015911J1811874M2099018L3296951l616011l1487532k8739322p889205
40152c2540138K912925n490789j3317108j924403J7544370K0685803M976893j2467850
40144a9620297k3946747l1982712k7044608L332941M1988567N1992294K6435623
$$ plain form
40197 -5614178 -15193298 -26256351 -33694440 -26347849 -5860071 8455537 6499663 3708904
40189 3708904 13478827 19924158 2885033 -22624825 -22764850 4232032 24958218 19905463
40181 19905463 5413428 629731 1027732 -4517576 -14390223 -23748195 -32881680 -35991716
40173 -35991716 -22012354 3878687 21282488 26780638 39661174 61629209 59887314
40166 59887314 15055950 -38008192 -49880078 -23462488 -7211943 -25449710 -48015911
40159 -48015911 -36204037 5894981 39191932 35575921 4088389 -24650933 -32540138
40152 -32540138 -29627213 -35118002 -48435110 -50359513 -32815143 -12129340 -7152447 -19620297
40144 -19620297 -43567044 -75549756 -102594364 -99261423 -57272856 -5280562 21155061
40137B1155061k243634j0876943j1189460j5848436j4472950k483101l97010j8535528
40129e4892001l0473375j0957735K1838516L1985191J6388680N26680k256966
40122b7841010J181514M904243O284180k175509j7934799j7365771J2507445M3015948
40114B576241L6787062L483285j2859152O50734J1101979l595405k0811358j2457000
40106D876386J1121141J9135562M239975j3648761j8321912j3309277q895806
40099a4802692o577412n30691R721631J3272932M20192j8059653j5961624J4311130
40091a8206187M3558473L8019561L277342k3483689k2517636j0842868r346162
40084D58834j3179671o856295P406531J2863673L328202q640593q955177P36751
$$ plain form
40137 21155061 18911427 8034484 -3154976 -19003412 -33476362 -35959463 -36356473 -54892001
40129 -54892001 -85365376 -96323111 -74484595 -42499404 -26110724 -25584044 -27841010
40122 -27841010 -26659496 -21755253 -15471073 -17646582 -35581381 -52947152 -40439707 2576241
40114 2576241 39363303 42846588 29987436 30638170 41740149 38144744 17333386 4876386
40106 4876386 15997527 35133089 39373064 25724303 7402391 -5906886 -14802692
40099 -14802692 -21380104 -21910795 -12189164 1083768 1503960 -16555693 -32517317 -18206187
40091 -18206187 25352286 63371847 66649189 43165500 20647864 9804996 458834
40084 458834 -12720837 -19577132 -12170601 693072 4021274 -4619319 -13574496 -12837745
40076a2837745O618321J334274o011745l309617M577147R78520j5361513k3420251
40068d7432609r058082J3645211K3263680J9222782J2932775N312276n519623
40061A2366410p455506P901844K0760763P411826j7135578j6057609J0556291
40054A8348441K3106456N597986r843510J389726J5348311J593334k5099919k8788249
40046A652576o966313J2595208J5895370J1953200O963515j258745p851000n784068
40038B7199743k591400r495414j8816917j4920361j759165M797149N972400J3961588
40030D347623K1529095R528039j4841794k0911275j681845J5145721J3107165
40023B6222729R155930J3988504O734098k3682405m4231530k2815634J4532352
$$ plain form
40076 -12837745 -6219424 -4885150 -10896895 -14206512 -9629365 -8650845 -24012358 -47432609
40068 -47432609 -56490691 -42845480 -19581800 -359018 12573757 17886033 12366410
40061 12366410 4910904 12812748 33573511 40985337 23849759 7792150 18348441
40054 18348441 41454897 47052883 37209373 38599099 53947410 55540744 30440825 1652576
40046 1652576 -5313737 7281471 23176841 35130041 42093556 40834811 32983811 27199743
40038 27199743 24608343 15112929 -3703988 -18624349 -20383514 -15586365 -9613965 4347623
40030 4347623 25876718 35404757 20562963 -348312 -2030157 13115564 26222729
40023 26222729 35378659 49367163 56101261 32418856 -11812674 -34628308 -20095956
40016b0095956J5931497j6851910k8606176N676644M3080291L7109257K078806
40009C8322453j5981753o756661J411437o407401j3003961l933969R002064R467357
40001A2119566L25908o858728j0051039j1065909m755099J0387473K0159981J0924061
39993B1186214p009774j0863183Q87119O241910n082713j5275327q387275K611584
39985a5691445k336301j5066737j0499511J1782346K4283161J4077477K594484
39978I143474J0066623K2199023J3016122j3430206k8902806k2536777j1485272
39971b1929819r019218o290039N917222J8214548J9115426J4659781J5019435
39964C5687336J3080888m108771k8052788l3401262j1894334J4397034J9201908
$$ plain form
40016 -20095956 -4164459 -21016369 -49622545 -43945901 -865610 36243647 38322453
40009 38322453 22340700 15584039 16995476 10588075 -2415886 -6349855 2652209 12119566
40001 12119566 12445474 5586746 -4464293 -15530202 -20285301 -9897828 10262153 21186214
39993 21186214 14176440 3313257 4200376 10442286 5359573 -9915754 -18303029 -15691445
39985 -15691445 -18027746 -33094483 -43593994 -31811648 -7528487 6548990 9143474
39978 9143474 19210097 41409120 54425242 40995036 12092230 -10444547 -21929819
39971 -21929819 -30949037 -37239076 -31321854 -13107306 6008120 20667901 35687336
39964 35687336 48768224 44659453 16606665 -16794597 -28688931 -14291897 4910011
39957D910011L58363k2479677k8733027j1221626K0502507M4499663M1497807
39950D9334021J3219438j7602096k9618634k1528920o479815M657289Q676722
39943F58005M911648o295119k0214738k8357711k4628475j0850018L120192O651041
39935g5005175n20088n980025J358898J6870181K6630251K5552795J9275781J0346216
39927A8528834l318956j5398370j3587362n96121M261754o702587j6706097j1487353
39919d5006258j086461J761381O658171K5113025L9634573K4376164r089818k0497880
39911B1862897M30494J6362706l009344l5670297l8064467m420515K8058258K7234850
39903A2784582J32957k1667433j7989232K619557J6384922J1607728Q5648q43395
$$ plain form
39957 4910011 5268374 -17211303 -45944330 -57165956 -36663449 7836214 49334021
39950 49334021 62553459 44951363 15332729 -6196191 -12676006 -8018717 658005
39943 658005 5569653 -725466 -20940204 -49297915 -73926390 -84776408 -81656216 -75005175
39935 -75005175 -75525263 -81505288 -80146390 -63276209 -36645958 -11093163 8182618 18528834
39927 18528834 15209878 -188492 -13775854 -14371975 -10110221 -16812808 -33518905 -45006258
39919 -45006258 -46092719 -44331338 -37673167 -12560142 27074431 51450595 42360777 21862897
39911 21862897 22293391 38656097 35646753 -23544 -38088011 -42508526 -14450268 12784582
39903 12784582 12917539 -8749894 -26739126 -24119569 -7734647 3873081 3958729 3115334
39895C115334P930475J0936496K339439p233578r247472q101762q711568o835662
39887a5808298R92290Q959428J0409661N491399l727046j4013156j3763729P872891
39879a3586560L7307622M1603925J1080998k1371434k2255800k808591J330314
39872C1300474j6059638k7203164j6051060J082890N898851L299660M830581O965672
39864e935734O15263j0843085j7028519j5629415j0689295l092281O623084J2472546
39856d3507436J1296903J1657510K1879423L1932742K1880903q557609l2120360
39849A4462076k4541673M906019K4259774J7000765k188992j0671313m812123
39842A8414533K640843K421385m418303j3847077k1523092k1216943j2477229
$$ plain form
39895 3115334 11045809 21982305 24321744 17088166 7840694 -261068 -8972636 -15808298
39887 -15808298 -14816008 -5856580 4553081 10044480 6317434 -7695722 -21459451 -13586560
39879 -13586560 23721062 65324987 76405985 55034551 32778751 29970160 31300474
39872 31300474 15240836 -11962328 -28013388 -26930498 -21031647 -17731987 -12901406 -5935734
39864 -5935734 -5320471 -16163556 -33192075 -48821490 -59510785 -62603066 -55979982 -43507436
39856 -43507436 -32210533 -20553023 1326400 33259142 55140045 46582436 14462076
39849 14462076 -10079597 -5173578 19086196 36086961 33897969 23226656 18414533
39842 18414533 21055376 23476761 19058458 5211381 -16311711 -37528654 -50005883
39835e0005883p576221j6660474k6876680j4670071J6965148L4491273J8893956
39828d5438952m949930l371321J6935534K1179381J080326j2675429K318254K6585115
39820A662978K6984591J876633j9226382j4021434Q825124K2979429J2716769
39813D1797708j2304207k6754471j5740951P891358J7753810O533609n227416
39806A3949440J400524J6336826J5173462m835749k0109428j3848370J773776
39799I840481N155575m316332q754493J02269R759855N749756j0272874k5919526
39791a8655289l1941786k4954170n954452J5231353K2429439J1143227k326742
39784c5028420j605088O941216P222884J905208N832523J3943278M397536j9641356
$$ plain form
39835 -50005883 -57582104 -74242578 -101119258 -115789329 -98824181 -64332908 -45438952
39828 -45438952 -50388882 -53760203 -36824669 -15645288 -14564962 -27240391 -24922137 1662978
39820 1662978 28647569 30524202 11297820 -2723614 6101510 29080939 41797708
39813 41797708 29493501 2739030 -13001921 -5110563 12643247 19176856 13949440
39806 13949440 15349964 31686790 46860252 42024503 21915075 8066705 9840481
39799 9840481 14996056 10679724 1925231 2027500 11787355 17537111 7264237 -18655289
39791 -18655289 -50597075 -75551245 -81505697 -66274344 -43844905 -32701678 -35028420
39784 -35028420 -36633508 -29692292 -22469408 -20564200 -14731677 -788399 3609137 -16032219
39776a6032219k2344886J1880777M4636287L1816223j1974349l2231926j0941838
39769e191931J2915759M515209j9682133k3504391m578013Q732180J842060r512986
39761c4464246o952304N657109J2393709R118061N980105Q373105O396639r900251
39753c398073l0532799l2702745r517465J9668169L2762557K7779377J4983866
39746A9042887m00002j4206931j4062277N921349K6845787K2767250l671989k3359383
39738A8876691k0269827q699108o279525j0076639q525632J74124J1740581K2576586
39730d82749K3631528M858248k2073945k4437392R411032M3995838L6541926o653316
39722F4791170l9133279l4985373j3063559J133560Q026835J5945400J6471041
$$ plain form
39776 -16032219 -38377105 -26496328 18139959 49956182 37981833 5749907 -5191931
39769 -5191931 7723828 12239037 -7443096 -30947487 -35525500 -26793320 -24951260 -34464246
39761 -34464246 -41416550 -35759441 -23365732 -14247671 -8267566 105539 6502178 -3398073
39753 -3398073 -33930872 -66633617 -76151082 -56482913 -23720356 4059021 19042887
39746 19042887 18642885 4435954 -9626323 -3704974 23140813 45908063 42236074 18876691
39738 18876691 -1393136 -10092244 -16371769 -26448408 -34974040 -34799916 -23059335 -482749
39730 -482749 23148779 28007027 5933082 -18504310 -9093278 34902560 71444486 64791170
39722 64791170 25657891 -9327482 -22391041 -21257481 -13230646 2714754 19185795
39715A9185795N57143j6193292j0901602Q998502J1609724j2469497l2973368
39708c2186595k1310995J0257066K8401194K3951149J4909296J1191987K769767
39701C7982869j3690355k1211789q000800J1173344J4076442m57611j6546880
39694C325220k2960715j7277957L54152K1200793K5092568K472734k6209552l1083778
39686d5086535q923960J7558296L0342501K7298328R898717j5684724k7942616
39679a2539993q179661K6837583L6587517Q891645k3795780k9702837j5392113
39672a7293639n117364n260523p103467p525097p979440m686826M270433J1649770
39664c9046153J2592746J2144341J1435321J597159j6354318k2592848n685039
$$ plain form
39715 19185795 19742938 3549646 -7351956 1646546 13256270 786773 -32186595
39708 -32186595 -53497590 -43240524 -14839330 9111819 24021115 35213102 37982869
39701 37982869 24292514 3080725 -4920075 6253269 20329711 19872100 3325220
39694 3325220 -19635495 -36913452 -36559300 -15358507 9734061 12206795 -14002757 -45086535
39686 -45086535 -54010495 -36452199 -6109698 21188630 31087347 15402623 -12539993
39679 -12539993 -20719654 6117929 42705446 51597091 27801311 -1901526 -17293639
39672 -17293639 -22411003 -27671526 -34774993 -42300090 -50279530 -54966356 -50695923 -39046153
39664 -39046153 -26453407 -14309066 -2873745 -1276586 -17630904 -40223752 -45908791
39657d5908791J6522565K1018129J0666585K596432j89473m107031m624838M891485
39649H65063J3002379M103710j3251015j6648048m574905L792748J366212K31495
39641a1112361N225477N882998p41672k675310M593604R089018L563498k932317
39633A0892935k784389j679269m318840m942943j214649j498043q015326q113833
39625b1674357N353594J8144684J2795702p200914k4083977k8302163k2326377
39618f7293808j0153645L667287J0506622O886324L757438J3368208K8739766
39611a0521808K9896480J1647829q168873j2871220p613545p536325j4143326
39604a9310788j5621103p206141J955296M096622K934312L102653N61012p665164
$$ plain form
39657 -45908791 -29386226 -8368097 2298488 4894920 4705447 598416 -4026422 865063
39649 865063 13867442 17971152 4720137 -11927911 -16502816 -12710068 -11343856 -11112361
39641 -11112361 -5886884 -3886 -745558 -3420868 1172736 10261754 13825252 10892935
39633 10892935 8108546 6429277 2110437 -2832506 -4047155 -5545198 -13560524 -21674357
39625 -21674357 -16320763 1823921 14619623 7418709 -16665268 -44967431 -67293808
39618 -67293808 -77447453 -73780166 -63273544 -56387220 -52629782 -39261574 -10521808
39611 -10521808 19374672 31022501 22853628 9982408 2368863 -5167462 -19310788
39604 -19310788 -34931891 -42138032 -40182736 -36086114 -33151802 -30049149 -29488137 -37153301
39596c7153301j3875709j1435800p489676r552826p940096Q772400K6833816K1278048
39588c0563144l459239j5204076k016624J1402540O839450Q37076J0480912K0373854
39580a309251J0387618p889830j2127530o285313n970067o231229K624774O308363
39572b0492465q269317j7528485M241726L0591060J6687832k1375821k2991153
39565c9136623J7942300L7055435J764769l5192330j9501163K2908437L3705504
39558A9546329R142470j1255643j2465240r888651p762663J117153P301125j756926
39550f022046j1354106j722292J1647289Q79713k1654139j8611772R179724K1965968
39542a5691661O480910m682140Q720442K0216304K574453k5472911k6447687J916313
$$ plain form
39596 -37153301 -51029010 -62464810 -69954486 -79507312 -87447408 -78675008 -51841192 -30563144
39588 -30563144 -34022383 -49226459 -51243083 -39840543 -33001093 -32164017 -21683105 -1309251
39580 -1309251 9078367 1188537 -10938993 -17224306 -23194373 -29425602 -26800828 -20492465
39572 -20492465 -28761782 -46290267 -42048541 -11457481 5230351 -16145470 -39136623
39565 -39136623 -21194323 15861112 17625881 -17566449 -37067612 -14159175 19546329
39558 19546329 28688799 17433156 4967916 -4920735 -12683398 -11566245 -4265120 -6022046
39550 -6022046 -17376152 -19098444 -7451155 -6571442 -28225581 -46837353 -37657629 -15691661
39542 -15691661 -9210751 -13892891 -5172449 15043855 17618308 -7854603 -34302290 -32385977
39534c2385977K5911920K0595242l209964j5031909O01651K5743415K7488999
39527D9713377p63364k6267355j8178224R722613J9464962L532279r716229l534072
39519B3973987N890872K027423p356444j0179552j0202828j3073105j2092940
39512b1012587j963089Q904527J0904482M087622j0109875l0676069m4358108
39505h4223097l1928809L403068L3368792L9348177K9524693J4725742n992378
39498a773812k4139868j7154551J4643135L4818631K0146836k413743K110751
39491B6237379K0920071J5978688j4437647l6035076l1416983j4801201J383065
39484c2171704J7108889K3182289P006032j6476171j6159755O235130J4849369
$$ plain form
39534 -32385977 -6474057 14121185 10911221 -4120688 -3519037 22224378 49713377
39527 49713377 48950013 22682658 4504434 14227047 33692009 37224288 27508059 23973987
39519 23973987 29864859 31892282 24535838 14356286 4153458 -8919647 -21012587
39512 -21012587 -22975676 -14071149 -3166667 920955 -9188920 -39864989 -84223097
39505 -84223097 -116151906 -112748838 -79380046 -40031869 -10507176 4218566 -1773812
39498 -1773812 -25913680 -43068231 -28425096 6393535 26540371 24126628 26237379
39491 26237379 47157450 63136138 48698491 12663415 -18753568 -33554769 -32171704
39484 -32171704 -15062815 8119474 15125506 -1350665 -17510420 -11275290 3574079
39477C574079k978860j5990606j642580J7920125J6208659M978260O140121R514009
39469C7723207m927949k3277863j6532099Q030494J5045136k226297j2867015
39462I67614q47522J0510666m99180k0113942k4557796j4537757l828234O672199
39454d6233952K0823911K8164270J7569846J324676J319292J4664229J6142185
39447E3774457l867760k5340840k8195935j7605183j0444488j0729303j0113593
39440e2522645l635888O200218J5794987K2091707K1646052J4725062O409381
39433C0708874j488467j3445945k8552823l3259663j6674357J0891393K6340860
39426b5480128K0023096L546333p915392r932174m232582P705433K0357070K2720025
$$ plain form
39477 3574079 595219 -15395387 -17037967 882158 17090817 22069077 28209198 37723207
39469 37723207 32795258 9517395 -7014704 1015790 16060926 13834629 967614
39462 967614 120092 10630758 10131578 -9982364 -34540160 -49077917 -52906151 -46233952
39454 -46233952 -25410041 2754229 20324075 21648751 22968043 37632272 53774457
39447 53774457 49906697 24565857 -3630078 -21235261 -31679749 -42409052 -52522645
39440 -52522645 -56158533 -49958315 -34163328 -12071621 9574431 24299493 30708874
39433 30708874 29220407 15774462 -12778361 -46038024 -62712381 -51820988 -25480128
39426 -25480128 -5457032 -1910699 -9826091 -19758265 -23990847 -16285414 4071656 26791681
39418B6791681R841929q199985j5435906o759139P580011J2271598O19979j8384984
39410H325184k6040791j2399000J0134788J8438706N768543j1139187j5379516
39403b2291273r794424o159707m750825K560982J4234357J8261712R653838k288400
39395e73740o149822j44691Q879307J1201817O3949j9922253l1530335k2311874
39387f0487642k839577M427683m283655q911801L998561K0816139K1422322Q151975
39379a7705995l38834L044607P485151L326767o500358j4712935j7476406j2174866
39371e5052869J813126J6680899J9713380P977572o877115j1942608n414148O433051
39363b6668712J7080864K0913908J4357413J861814n413672l552882l035737j3737767
$$ plain form
39418 26791681 36633610 28433625 12997719 6238580 13818591 26090189 26710168 8325184
39410 8325184 -17715607 -30114607 -19979819 -1541113 4227430 -6911757 -22291273
39403 -22291273 -32085697 -38245404 -42996229 -40435247 -26200890 -7939178 1714660 -573740
39395 -573740 -6723562 -6868253 2011054 13212871 13276820 -6645433 -38175768 -60487642
39387 -60487642 -63327219 -58899536 -63183191 -72094992 -68096431 -47280292 -25857970 -17705995
39379 -17705995 -18044829 -15000222 -7515071 -4188304 -10688662 -25401597 -42878003 -55052869
39371 -55052869 -53239743 -36558844 -16845464 -8867892 -15745007 -27687615 -33101763 -26668712
39363 -26668712 -9587848 11326060 25683473 27545287 22131615 18578733 15542996 1805229
39355A805229k7003324k3756271j205964J9001439J5148837p936335k3821471
39348d7767860j4328316J1931151L1570125L0673432J3110051r747523k8468591
39341a3027531l5045563k4025724j275769J5341044J3952391M535488O848080
39334c2697584K3264397L4566484K5318763L017989j3630902j6978803j3229506
39327I630838q938333m088840K726779R741301J4303572J6004841J5761889J2911755
39319F8053802M933712p786144j7360848j4666360l846517k282353j6963695k9424436
39311a9342839j9806877L39897J815684j5789554j8875916R119389L8389720L3738172
39303I587676L570254j6207016j1877668N55529P050148P974677M739727q91992
$$ plain form
39355 1805229 -25198095 -48954366 -50160330 -31158891 -16010054 -23946389 -47767860
39348 -47767860 -62096176 -50165025 -18594900 12078532 25188583 15441060 -13027531
39341 -13027531 -48073094 -72098818 -73374587 -58033543 -44081152 -39545664 -32697584
39334 -32697584 -9433187 25133297 50452060 53470049 39839147 22860344 9630838
39327 9630838 692505 -3396335 -669556 9071745 23375317 39380158 55142047 68053802
39319 68053802 72987514 65201370 47840522 33174162 29327645 27045292 10081597 -19342839
39311 -19342839 -39149716 -38809819 -36994135 -52783689 -71659605 -62540216 -24150496 9587676
39303 9587676 13157930 -3049086 -14926754 -14371225 -7321077 653600 5393327 4501335
39295D501335J719375J7154557K5243677M108210l0981009m1215957j7605202
$$ plain form
39295 4501335 6220710 23375267 48618944 52727154 21746145 -19469812 -37075014
$$ [...]
##END NTUPLES=NMR SPECTRUM
##END=
