##TITLE=31Pdec_SR35
 CDCl3, 24 sc
 3.03.2021
##JCAMPDX= 6.0         $$ Bruker NMR JCAMP-DX V2.0
##DATA TYPE= NMR SPECTRUM
##DATA CLASS= NTUPLES
##ORIGIN= UXNMR, Bruker Analytische Messtechnik GmbH
##OWNER= root
$$ XWIN-NMR		Version 3.5
$$ Wed Mar  3 13:01:35 2021 Russian Standard Time (UT+4h)  she@DPX200
##.OBSERVE FREQUENCY= 81.013821
##.OBSERVE NUCLEUS= ^31P
##.ACQUISITION MODE= SIMULTANEOUS
##.ACQUISITION SCHEME= undefined
##.AVERAGES= 124
##.DIGITISER RES= 16
##SPECTROMETER/DATA SYSTEM= spect
##.PULSE SEQUENCE= zgpg30
##.SOLVENT NAME= CDCl3
##.SHIFT REFERENCE= (INTERNAL, CDCl3, 0, 248.564)
##AUDIT TRAIL= $$ (NUMBER, WHEN, WHO, WHERE, WHAT)
$$ ##TITLE= Audit trail, XWIN-NMR		Version 3.5
$$ ##JCAMPDX= 5.01
$$ ##ORIGIN= Bruker BioSpin GmbH
$$ ##OWNER= she
$$ F:/spectra/data/she/nmr/P31/1/pdata/1/auditp.txt
$$ ##AUDIT TRAIL=  $$ (NUMBER, WHEN, WHO, WHERE, WHAT)
(   1,<2021-03-03 12:27:55.46 +0400>,<she>,<DPX200>,
      <continue with go, POWCHK disabled, PULCHK disabled
       configuration hash MD5:
       00 E9 B6 7A A2 85 ED C7 34 08 36 98 17 FE 4E 26
       data hash MD5: 32K
       0F 7D 3B C9 09 84 1B 1A 70 DD 01 4D 8C 3D 7C AC>)
(   2,<2021-03-03 13:00:00.29 +0400>,<she>,<DPX200>,
      <Start of raw data processing
       efp BC_mod = 2 LB = 1 FT_mod = 6 PKNL = 1 PHC0 = -2771.405 PHC1 = -593.5972 SI = 64K 
       data hash MD5: 64K
       D6 81 7D B4 90 01 AC 4C DE 94 AE 89 8B F1 9F 10>)
(   3,<2021-03-03 13:00:03.95 +0400>,<she>,<DPX200>,
      <abs ABSG = 5 
       data hash MD5: 64K
       3C B7 43 F3 23 88 F3 8F 6C F6 45 D6 CE C7 F1 9B>)
(   4,<2021-03-03 13:00:15.79 +0400>,<she>,<DPX200>,
      <pk PHC0 = -70.43163 PHC1 = 0 
       data hash MD5: 64K
       7E 6A 37 5D 6D 50 49 90 E1 62 D6 01 8F AA D6 3A>)
(   5,<2021-03-03 13:00:20.76 +0400>,<she>,<DPX200>,
      <abs ABSG = 5 
       data hash MD5: 64K
       E7 43 DE DF F7 1E BA 2B 75 E0 AB 84 D6 C3 E9 39>)
$$ ##END=
$$ 
$$ hash MD5
$$ 99 B9 2C AD D3 AA 5D B8 83 CA 96 46 64 85 3C A7
##$RELAX= 
##$RELAX= 
##$RELAX= 
##$RELAX= 
##$RELAX= 
##$RELAX= 
##$RELAX= 
##$RELAX= 
$$ Bruker specific parameters
$$ --------------------------
##$DU= <F:/spectra>
##$EXPNO= 1
##$NAME= <P31>
##$PROCNO= 1
##$TYPE= <nmr>
##$USER= <she>
##$AMP= (0..31)
100 100 100 100 100 100 100 100 100 100 100 100 100 100 100 100 100 100 
100 100 100 100 100 100 100 100 100 100 100 100 100 100 
##$AQSEQ= 0
##$AQ_mod= 1
##$AUNM= <au_zg>
##$AUTOPOS= <>
##$BF1= 81.014009
##$BF2= 200.13
##$BF3= 200.13
##$BF4= 200.13
##$BF5= 200.13
##$BF6= 200.13
##$BF7= 200.13
##$BF8= 200.13
##$BYTORDA= 1
##$CFDGTYP= 0
##$CFRGTYP= 5
##$CHEMSTR= <none>
##$CNST= (0..31)
1 1 145 1 1 1 1 1 1 1 1 1 1 1 1 1 1 1 1 1 1 1 1 1 1 1 1 1 1 1 1 1 
##$CPDPRG= <waltz16>
##$CPDPRG1= <>
##$CPDPRG2= <waltz16>
##$CPDPRG3= <>
##$CPDPRG4= <mlev>
##$CPDPRG5= <mlev>
##$CPDPRG6= <mlev>
##$CPDPRG7= <mlev>
##$CPDPRG8= <mlev>
##$CPDPRGB= <>
##$CPDPRGT= <>
##$D= (0..31)
0 1 0 0 0 0 0 0 0 0 0 0.03 2e-05 3e-06 0 0 0 0 0 0 0 0 0 0 0 0 0 0 0 0 
0 0 
$$ [...]
##$SUBNAM3= <"">
##$SUBNAM4= <"">
##$SUBNAM5= <"">
##$SUBNAM6= <"">
##$SUBNAM7= <"">
##$SUBNAM8= <"">
##$SUBNAM9= <"">
##$SW= 501.771253377433
##$SWIBOX= (0..15)
0 1 3 0 0 0 0 0 0 0 0 0 0 0 0 0 
##$SW_h= 40650.406504065
##$TD= 32768
##$TD0= 1
##$TE= 0
##$TE2= 300
##$TE3= 300
##$TEG= 300
##$TL= (0..7)
0 120 53 12 22 120 120 120 
##$TP= (0..7)
150 150 150 150 150 150 150 150 
##$TP07= 0
##$TPNAME0= <>
##$TPNAME1= <>
##$TPNAME2= <>
##$TPNAME3= <>
##$TPNAME4= <>
##$TPNAME5= <>
##$TPNAME6= <>
##$TPNAME7= <>
##$TPOAL= (0..7)
0.5 0.5 0.5 0.5 0.5 0.5 0.5 0.5 
##$TPOFFS= (0..7)
0 0 0 0 0 0 0 0 
##$TUNHIN= 0
##$TUNHOUT= 0
##$TUNXOUT= 0
##$USERA1= <user>
##$USERA2= <user>
##$USERA3= <user>
##$USERA4= <user>
##$USERA5= <user>
##$V9= 5
##$VALIST= <valist>
##$VCLIST= <CCCCCCCCCCCCCCC>
##$VD= 0
##$VDLIST= <DDDDDDDDDDDDDDD>
##$VPLIST= <PPPPPPPPPPPPPPP>
##$VTLIST= <TTTTTTTTTTTTTTT>
##$WBST= 1024
##$WBSW= 4
##$XGAIN= (0..3)
0 0 0 0 
##$XL= 0
##$YL= 0
##$YMAX_a= 20293
##$YMIN_a= -18191
##$ZGOPTNS= <>
##$ZL1= 120
##$ZL2= 120
##$ZL3= 120
##$ZL4= 120
##$ABSF1= 248.5645
##$ABSF2= -253.2056
##$ABSG= 5
##$ABSL= 3
##$ALPHA= 0
##$AQORDER= 0
##$ASSFAC= 0
##$ASSFACI= 0
##$ASSFACX= 0
##$ASSWID= 0
##$AUNMP= <proc_1d>
##$AZFE= 0.1
##$AZFW= 0.5
##$BCFW= 0
##$BC_mod= 2
##$BYTORDP= 0
##$COROFFS= 0
##$CY= -3
##$DATMOD= 1
##$DC= 0
##$DFILT= <>
##$DTYPP= 0
##$F1P= 0
##$F2P= 0
##$FCOR= 1
##$FTSIZE= 65536
##$FT_mod= 6
##$GAMMA= 0
##$GB= 0
##$INTBC= 1
##$INTSCL= 5.30512e-09
##$ISEN= 30
##$LB= 1
##$LEV0= 0
##$LPBIN= 0
##$MAXI= 10000
##$MC2= 0
##$MEAN= 0
##$ME_mod= 0
##$MI= 50
##$NCOEF= 0
##$NC_proc= -7
##$NLEV= 6
##$NOISF1= 182.463
##$NOISF2= 159.3651
##$NSP= 0
##$NTH_PI= 0
##$NZP= 0
##$OFFSET= 248.5645
##$PC= 4
##$PHC0= -2841.837
##$PHC1= -593.5972
##$PH_mod= 1
##$PKNL= yes
##$PPARMOD= 0
##$PSCAL= 0
##$PSIGN= 0
##$REVERSE= no
##$SF= 81.014009
##$SI= 65536
##$SIGF1= 159.3651
##$SIGF2= -187.1042
##$SINO= 113.3802
##$SIOLD= 16384
##$SREGLST= <1H.CDCl3>
##$SSB= 0
##$STSI= 65536
##$STSR= 0
##$SW_p= 40650.406504065
##$SYMM= 0
##$S_DEV= 0
##$TDeff= 32768
##$TDoff= 0
##$TI= <>
##$TILT= no
##$TM1= 0
##$TM2= 0
##$TOPLEV= 0
##$USERP1= <user>
##$USERP2= <user>
##$USERP3= <user>
##$USERP4= <user>
##$USERP5= <user>
##$WDW= 1
##$XDIM= 65536
##$YMAX_p= 411481695
##$YMIN_p= -179444222
$$ End of Bruker specific parameters
$$ ---------------------------------
##NTUPLES= NMR SPECTRUM
##VAR_NAME=  FREQUENCY,     SPECTRUM/REAL,   SPECTRUM/IMAG
##SYMBOL=    X,             R,               I
##VAR_TYPE=  INDEPENDENT,   DEPENDENT,       DEPENDENT
##VAR_FORM=  AFFN,          ASDF,            ASDF
##VAR_DIM=   65536,         65536,           65536
##UNITS=     HZ,            ARBITRARY UNITS, ARBITRARY UNITS
##FACTOR=    0.620285442955139, 1,           1
##FIRST=     20137.2065510759, 0,            0
##LAST=      -20513.1999529892, 0,           0
##MIN=       -20513.1999529892, -179444222,  0
##MAX=       20137.2065510759, 411481695,    0
$$ Real data points
##PAGE= N=1
##DATA TABLE= (X++(R..R)), XYDATA
$$ [...]
##PAGE= N=2
##DATA TABLE= (X++(I..I)), XYDATA
$$ plain form
12897 -21170656 -8729293 -7594094 -8288703 -2288271 1863531 -5842447 -16439618 -14435859
12889 -14435859 -3555261 -975435 -9480520 -15566445 -14797162 -17228093 -23776371 -19899855
12881 -19899855 -2244634 9750242 3466452 -4085025 7764039 28391990 29544520
12874 29544520 6751004 -15468847 -18116447 -6811705 5369207 14714005 20306636
12867 20306636 16758434 3412710 -9092984 -10386822 -2720023 4069997 4761095 1181658
12859 1181658 -2974625 -5412771 -6143744 -7444106 -10510142 -12139340 -8326577 -248796
12851 -248796 7737388 14077026 18258349 16146774 5730075 -4249458 -1884953 11075060
12843 11075060 20219973 17783665 10492669 5875178 2331261 -2289863 -3038448 4050286
$$ packed form
12897b1170656J2441363J135199o94609O000432M151802p705978j0597171K003759
12889a4435859J0880598K579826q505085o085925P69283k430931o548278L876516
12881a9899855J7655221J1994876o283790p551477J1849064K0627951J152530
12874B9544520k2793516k2219851k647600J1304742J2180912R344798N592631
12867B0306636l548202j3345724j2505694j293838P666799O790020O91098l579437
12859A181658m156283k438146p30973j300362l066036j629198L812763Q077781
12851b48796P986184O339638M181323k111575j0416699r979533K364505J2960013
12843A1075060R144913k436308p290996m617491l543917m621124p48585P088734
$$ plain form
12835 4050286 14206478 20688029 22438036 20009390 11882716 525565 -6250661 -6532205
12827 -6532205 -8491453 -16060060 -19484990 -9854277 4871824 9957947 4530889 160614
12819 160614 2301082 5088776 3361078 -985220 -4666069 -5718012 -518202 12976076
12811 12976076 28490603 36204560 34870431 31333268 27986776 20261922 8626088 3058506
12803 3058506 9882544 21035993 23129586 13589817 2253979 -1016724 4543831 13144636
12795 13144636 19685902 22858351 23205162 20935026 16628385 12442807 10256203 9117848
12787 9117848 7109729 5042141 4508653 2963642 -3122965 -9103012 -4131469 12811519
12779 12811519 25882126 19311386 -2413835 -19483881 -20158166 -11108189 -4109456 -627604
$$ packed form
12835D050286J0156192O481551J750007k428646q126674j1357151o776226k81544
12827f532205j959248p568607l424930R630713J4726101N086123n427058m370275
12819A60614K140468K787694j727698m346298l680849j051943N199810J3494278
12811A2976076J5514527P713957j334129l537163l346492p724854j1635834n567582
12803C058506O824038J1153449K093593r539769j1335838l270703N560555Q600805
12795A3144636O541266L172449L46811k270136m306641m185578k186604j138355
12787I117848k008119k067588n33488j545011o086607n980047M971543J6942988
12779A2811519J3070607o570740k1725221j7070046o74285R049977O998733L481852
$$ plain form
12771 -627604 5874476 16574032 22586137 15770225 1474605 -4970338 3216454 14841246
12763 14841246 16095375 10253279 11302303 20465130 23603818 14191854 3258266 -16080
12755 -16080 -2215093 -10004700 -15011778 -8477329 650269 -1521393 -11584204 -15787894
12747 -15787894 -12197572 -9131822 -7753738 -4097249 -3063104 -10832452 -17229641 -7101744
12739 -7101744 12196137 17476138 5148352 -3823235 1051400 4419857 -5959339 -18201261
12731 -18201261 -18028590 -11641923 -10533153 -9769740 597608 14669048 19167032 14375505
12723 14375505 10707209 11133776 11337745 11119834 12061280 9616402 686480 -6466116 -3033570
12714 -3033570 4763822 4384970 -3249566 -6769465 -3970723 -3747768 -9034581 -11451450
$$ packed form
12771f27604O502080J0699556O012105o815912j4295620o444943Q186792J1624792
12763A4841246J254129n842096J049024R162827L138688r411964j0933588l274346
12755a6080k199013p789607n007078O534449R127598k171662j0062811m203690
12747a5787894L590322L065750J378084L656489J034145p769348o397189J0127897
12739g101744J9297881N280001j2327786q971587M874635L368457j0379196j2241922
12731a8201261J72671O386667J108770P63413J0367348J4071440M497984m791527
12723A4375505l668296M26567K03969k17911R41446k444878q929922p152596L432546
12714c033570P797392l78852p634536l519899K798742K22955n286813k416869
$$ plain form
12706 -11451450 -4816991 6513911 14489276 14512329 6107769 -5531436 -9890857 -1528866
12698 -1528866 10918910 14086915 6402153 -2773934 -7342083 -7818964 -3329446 7457591
12690 7457591 17355315 14784042 -212802 -13564549 -13841636 -3805687 6479351 10530860
12682 10530860 7673828 1498958 -2071464 -1035681 -1756328 -10545737 -21571852 -21604647
12674 -21604647 -7385937 10130419 19930007 21040115 17510415 12476484 9445363 10478443
12666 10478443 10064023 -280620 -17472160 -26101488 -17959960 -4270353 -1115989 -8849629
12658 -8849629 -14303757 -9686881 -570145 4331974 3897196 2950360 4561747 7505572
12650 7505572 9955071 12395158 15629334 18063305 17851166 16564213 16443348 14412211
$$ packed form
12706a1451450O634459J1330902P975365K3053q404560j1639205m359421Q361991
12698a528866J2447776L168005p684762r176087m568149m76881M489518J0787037
12690G457591R897724k571273j4996844j3351747k77087J0035949J0285038M051509
12682A0530860k857032o174870l570422J035783p20647q789409j1026115l2795
12674b1604647J4218710J7516356R799588J110108l529700n033931l031121J033080
12666A0478443m14420j0344643j7191540q629328Q141528J3689607L154364p733640
12658h849629n454128M616876R116736M902119m34778r46836J611387K943825
12650G505572K449499K440087L234176K433971k12139j286953j20865k031137
$$ plain form
12642 14412211 5236566 -7615749 -11965779 -2473271 10879166 16130891 14355510 13529472
12634 13529472 14196475 11606692 7228142 6639693 8769586 8140555 5362358 4427648 2308501
12625 2308501 -6571829 -17632879 -20939407 -17106557 -14649227 -13283387 -5961937 3259500
12617 3259500 2334890 -5863800 -4545143 7813020 11552309 -1122481 -9980560 683311
12609 683311 14065913 6830685 -12790782 -17916675 -4442937 6366251 2921316 -4172904
12601 -4172904 -5923681 -8055902 -14330375 -16385778 -9420141 -3057363 -6656376 -14929062
12593 -14929062 -17475634 -13720282 -9280144 -4412566 4630982 16586301 25261926 27064096
12585 27064096 23472407 17545826 11515477 6420340 1822833 -2700367 -5151480 -2994132
$$ packed form
12642A4412211r175645j2852315m350030R492508J3352437N251725j775381q26038
12634A3529472O67003k589783m378550n88449K129893o29031k778197r34710k119147
12625B308501q880330j1061050l306528L832850K457330J365840P321450R221437
12617C259500r24610q198690J318657J2358163L739289j2674790q858079J0663871
12609F83311J3382602p235228j9621467n125893J3473738J0809188l444935p094220
12601d172904j750777k132221o274473k055403O965637O362778l599013q272686
12593a4929062k546572L755352M440138M867578R043548J1955319Q675625J802170
12585B7064096l591689n926581o030349n095137m597507m523200k451113K157348
$$ plain form
12577 -2994132 2167696 5700552 6653767 8961235 14232247 17722837 14243704 4957197
12569 4957197 -4127642 -8081783 -6067512 -1139913 1786189 533290 -1194580 1349933
12561 1349933 5929341 5234665 -2113871 -8830550 -10205240 -11147762 -16215064 -18922188
12553 -18922188 -10511987 3413147 6565805 -5212904 -15134686 -6510074 14236507 25238010
12545 25238010 17223888 3347488 -681337 3890514 5606612 1557945 -855451 1366155
12537 1366155 1202529 -6312964 -14634650 -14266810 -6339765 -1363886 -5759687 -14540550
12529 -14540550 -17645294 -10259912 3747284 16342618 22272283 22496813 21430369 21115896
12521 21115896 19005750 11858526 938923 -7476749 -7125912 1870145 11410679 12005712
$$ packed form
12577b994132N161828L532856R53215K307468N271012L490590l479133r286507
12569D957197r084839l954141K014271M927599K926102j252899j727870K544513
12561A349933M579408o94676p348536o716679j374690r42522n067302k707124
12553a8922188Q410201J3925134L152658j1778709r921782Q624612K0746581J1001503
12545B5238010q014122j3876400m028825M571851J716098m048667k413396K221606
12537A366155j63626p515493q321686L67840P927045M975879m395801q780863
12529a4540550l104744P385382J4007196J2595334N929665K24530j066444l14473
12521B1115896k110146p147224j0919603q415672L50837Q996057R540534N95033
$$ plain form
12513 12005712 2205021 -10478097 -19051358 -23565588 -25737890 -23179603 -15550864 -10929393
12505 -10929393 -15543732 -20195629 -10387181 9295186 16373940 2246725 -11954374 -3060570
12497 -3060570 21329467 32776173 19230344 -3197318 -14925219 -14663682 -12304934 -11470880
12489 -11470880 -7542841 1297903 8549422 6653214 -2508713 -7957715 -3309739 2702089
12481 2702089 -3407187 -19283238 -27110121 -18693690 -8359146 -11619113 -21486708 -19625864
12473 -19625864 -4068603 9978776 13827890 13706074 15428803 16090674 13627355 10778089
12465 10778089 6035636 -5916131 -20288317 -22477419 -9127514 3610043 1466564
12458 1466564 -9035447 -12426856 -5489086 3904888 11282645 17311190 20051232 16397199
$$ packed form
12513A2005712r800691j2683118q573261m514230k172302K558287P628739M621471
12505a0929393m614339m651897R808448J9682367P078754j4127215j4201099Q893804
12497c060570K4390037J1446706j3545829k2427662j1727901K61537K358748Q34054
12489a1470880L928039Q840744P251519j896208r161927n449002M647976O011828
12481B702089o109276j5876051p826883Q416431J0334544l259967r867595J860844
12473a9625864J5557261J4047379L849114j21816J722729O61871k463319k849266
12465A0778089m742453j1951767j4372186k189102J3349905J2737557k143479
12458A466564j0502011l391409O937770R393974P377757O028545K740042l654033
$$ plain form
12450 16397199 8669669 1322211 -6050594 -15063499 -21823630 -21811007 -17753836 -14625816
12442 -14625816 -10807321 -2963776 4463151 4945392 1848833 3385948 7770194 6253737
12434 6253737 806090 4378429 19752195 31704708 27746682 15816573 11736309 16792685
12426 16792685 18425871 8955282 -6464054 -18952662 -24226179 -21855783 -13915770 -5986983
12418 -5986983 -3581923 -5261970 -3642427 4519679 12959811 13594225 7202471 2896071
12410 2896071 6966485 14701701 14916919 2489710 -14941693 -24159201 -19940244 -9548703
12402 -9548703 -3249625 -3049062 -3100762 802099 6014258 7381042 3356716 -3686152 -10798403
12393 -10798403 -15699638 -15730396 -8641384 3644886 12850188 9136944 -8654359 -28045507
$$ packed form
12450A6397199p727530p347458p372805r012905o760131J2623M057171L128020
12442a4625816L818495P843545P426927M82241l096559J537115M384246j516457
12434F253737n447647L572339J5373766J1952513l958026j1930109m080264N056376
12426A6792685J633186r470589j5419336j2488608n273517K370396P940013P928787
12418e986983K405060j680047J619543Q162106Q440132O34414o391754m306400
12410B896071M070414P735216K15218j2427209j7431403r217508M218957J0391541
12402i548703O299078K00563n1700L902861N212159J366784m024326p042868p112251
12393a0798403m901235l0758P089012J2286270R205302l713244j7791303j9391148
$$ plain form
12385 -28045507 -32637178 -19367015 -2706084 2126216 -3214260 -5433615 -24230 3200246
12377 3200246 -2854850 -10059982 -6794495 4916715 13585570 15476990 16703897 19121547
12369 19121547 15895613 4327224 -7005203 -9849524 -7601018 -8330868 -12185904 -13112492
12361 -13112492 -9271052 -4191588 250495 4809229 7765689 5598443 -809185 -5870317
12353 -5870317 -5587564 -109509 8746941 17145228 17773027 6282889 -9725074 -15553796
12345 -15553796 -6347804 6807728 11276938 7709361 5714634 9444283 13883202 13566819
12337 13566819 9145629 4905221 3266006 2232095 -3135845 -15346030 -28999173 -33608806
12329 -33608806 -25338729 -13412691 -10079727 -15694988 -19444199 -14782245 -7646485 -6911354
$$ packed form
12385b8045507m591671J3270163J6660931M832300n340476k219355N409385L224476
12377C200246o055096p205132L265487J1711210Q668855J891420J226907K417650
12369A9121547l225934j1568389j1332427k844321K248506p29850l855036r26588
12361a3112492L841440N079464M442083M558734K956460k167246o407628n061132
12353e870317K82753N478055Q856450Q398287O27799j1490138j6007963n828722
12345a5553796R205992J3155532M469210l567577j994727L729649M438919l16383
12337A3566819m421190m240408j639215j033911n367940j2210185j3653143m609633
12329c3608806Q270077J1926038L332964n615261l749211M661954P135760P35131
$$ plain form
12321 -6911354 -12478563 -17569879 -19027930 -19318817 -19561352 -16662964 -8761620 977426
12313 977426 8339156 12702236 15310220 15706975 13192432 10174154 10406964 13994478 16854163
12304 16854163 15517959 10845005 7175268 8884602 16298739 23287512 21381478 9565961
12296 9565961 -2429657 -5101580 -1049286 201281 -2842169 -2525347 4010259 9995351
12288 9995351 11210854 12548795 16614707 15982547 5639027 -5646493 -7573263 -4963965
12280 -4963965 -9093657 -17329339 -16593611 -5575958 2263151 -345021 -5376827 -5069429
12272 -5069429 -2056865 1561010 10590836 23859366 28899765 20613982 12671676 16770733
12264 16770733 21956982 11632976 -7603208 -14618468 -6974313 -2846532 -8501641 -7663492
$$ packed form
12321f911354n567209n091316j458051k90887k42535K898388P901344R739046
12313I77426P361730M363080K607984L96755k514543l018278K32810L587514K859685
12304A6854163j336204m672954l669737J709334P414137O988773j906034j1815517
12296I565961j1995618k671923M052294J250567l043450L16822O535606N985092
12288I995351J215503J337941M065912o32160j0343520j1285520j926770K609298
12280d963965m129692q235682P35728J1017653P839109k608172n031806L07398
12272e069429L012564L617875R029826J3268530N040399q285783p942306M099057
12264A6770733N186249j0324006j9236184p015260P644155M127781n655109Q38149
$$ plain form
12256 -7663492 8105876 20285868 10490734 -9365098 -13893703 -1774245 5121497 -2756921
12248 -2756921 -9739104 -1883686 11918991 15915621 11219552 10671556 17632499 23076363
12240 23076363 21140782 16161465 13848585 14581700 17179087 21762992 26167277 25533413
12232 25533413 18673430 10404749 5178982 2839294 2742066 6334484 11818719 12144556
12224 12144556 4736211 -974770 5859903 20500337 25164169 11285107 -7979967 -12935175
12216 -12935175 -857050 12216280 12225225 3031049 -1124847 5328066 13135744 10694439
12208 10694439 -2126617 -14874119 -18340825 -12875309 -6925322 -9839409 -23617198 -38140074
12200 -38140074 -37114640 -14328868 16808379 35552857 35356307 27225478 22316365 19897300
$$ packed form
12256g663492J5769368J2179992r795134j9855832m528605J2119458O895742p878418
12248b756921o982183P855418J3802677L996630m696069n47996O960943N443864
12240B3076363j935581m979317k312880P33115K597387M583905M404285o33864
12232B5533413o859983q268681n225767k339688r7228L592418N484235L25837
12224A2144556p408345n710981O834673J4640434M663832j3879062j9265074m955208
12216a2935175J2078125J3073330Q945r194176m155896O452913P807678k441305
12208A0694439j2821056j2747502l466706N465516N949987k914087j3777789j4522876
12200c8140074J025434K2785772L1137247J8744478j96550q130829m909113k419065
$$ plain form
12192 19897300 14930676 8490715 4811497 4318473 5483236 8703406 13372192 16068474
12184 16068474 15958986 16011457 14847935 5924223 -9085844 -16274735 -8597002 612019
12176 612019 -4113244 -16880805 -20397821 -12895163 -7565027 -9084567 -9821567 -8123544
12168 -8123544 -10073946 -11660502 -722092 18519665 24752990 11641999 -1025447 402361
12160 402361 2205805 -9250772 -20000590 -11521316 4814240 3919619 -11467135 -14541763
12152 -14541763 2074417 14666707 5326068 -13513008 -20783251 -13955664 -3585695
12145 -3585695 4156092 7927379 5819330 689857 1968855 12235828 19957675 15142834
12137 15142834 4646913 1472006 5382620 6129811 1825774 1055100 7029188 11919146
$$ packed form
12192A9897300m966624o439961l679218m93024J164763L220170M668786K696282
12184A6068474j09488N2471j163522q923712j5010067p188891P677733R209021
12176F12019m725263j2767561l517016P502658N330136j519540p37000J698023
12168h123544j950402j586556J0938410J9241757O233325j3110991j2667446J427808
12160D02361J803444j1456577j0749818Q479274J6335556q94621j5386754l074628
12152a4541763J6616180J2592290r340639j8839076p270243O827587J0369969
12145c585695P741787L771287k108049n129473J278998J0266973P721847m814841
12137A5142834j0495921l174907L910614P47191m304037p70674N974088M889958
$$ plain form
12129 11919146 10271635 8085320 12516972 19365485 18538066 9203111 1921128 4797336
12121 4797336 13316166 16952218 11888565 2883061 -4957583 -10633897 -14038509 -14466158
12113 -14466158 -13793533 -15210568 -16155509 -8816537 7867584 22792078 25620129 19969992
12105 19969992 16005197 14520030 8489189 -1977908 -7914922 -5701409 -1965134 -1070611
12097 -1070611 2041887 11093257 19378554 18917744 12581592 9297722 11192314 13189746
12089 13189746 13077736 14186819 17844339 19740287 16380591 11323361 11559749 18443006
12081 18443006 25060765 24577685 19913091 20825476 29863087 36867247 32781254 23711901
12073 23711901 22028771 26447262 23523857 10285041 1594554 8636906 22259626 27546196
$$ packed form
12129A1919146j647511k186315M431652O848513q27419r334955p281983K876208
12121D797336Q518830L636052n063653r005504p840644n676314l404612m27649
12113a4466158O72625j417035r44941P338972J6684121J4924494K828051n650137
12105A9969992l964795j485167o030841j0467097n937014K213513L736275Q94523
12097a070611L112498R051370Q285297m60810o336152l283870J894592J997432
12089A3189746j12010J109083L657520J895948l359696n057230K36388O883257
12081A8443006O617759m83080m664594R12385R037611P004160m085993r069353
12073B3711901j683130M418491k923405j3238816q690487P042352J3622720N286570
$$ plain form
12065 27546196 24972672 24511729 25938896 20063435 6861642 -2564071 -3252621 -2469065
12057 -2469065 -5561578 -7888663 -5913912 -5555707 -12229834 -20701502 -22649095 -18485579
12049 -18485579 -14386487 -12359648 -10441401 -8932440 -9390757 -10247036 -9601653 -9191349 -9388895
12040 -9388895 -4693971 7159284 15247126 6102013 -15794858 -29811088 -24148893 -8108901
12032 -8108901 4922474 14928622 27086855 36253808 33024978 21149908 15427072 21575190
12024 21575190 29270783 27867130 19574725 12858410 10755034 11241625 12917120 14051424
12016 14051424 10534724 1214710 -7787705 -10059249 -7524665 -6004747 -4999457 104381
12008 104381 6891294 6721481 -1271153 -6632059 -3240364 307863 -5275756 -12146560
$$ packed form
12065B7546196k573524m60943J427167n875461j3201793r425713o88550P83556
12057b469065l092513k327085J974751L58205o674127q471668j947593M163516
12049a8485579M099092K026839J918247J508961m58317q56279O45383M10304j97546
12040i388895M694924J1853255Q087842r145113k1896871j4016230N662195J6039992
12032h108901J3031375J0006148J2158233R166953l228830j1875070n722836O148118
12024B1575190P695593j403653q292405o716315k103376M86591J675495J134304
12016A4051424l516700r320014r002415k271544K534584J519918J005290N103838
12008A04381O786913j69813p992634n360906L391695L548227n583619o870804
$$ plain form
12000 -12146560 -4053891 18418872 34501609 29191083 11677119 696821 235404 -158169
11992 -158169 -6433608 -13426857 -16005424 -15660893 -14233045 -10446133 -5499482 -3762516
11984 -3762516 -4753346 -2680874 2458364 2494627 -4938627 -9629098 -3770956 5081067 5936356
11975 5936356 1524257 1460695 4310097 885257 -7283392 -7891954 2963804 15419052
11967 15419052 22149692 26901743 32451480 32376730 21497011 5252690 -7415605 -12958708
11959 -12958708 -10907167 -1695806 8415346 9640480 1743794 -3812617 -145416 6175728
11951 6175728 8269884 9674416 13685455 13441236 3921426 -5883406 -5729076 -1198702
11943 -1198702 -4210724 -12690485 -14442081 -7136916 448075 4708515 9857112 15023099
$$ packed form
12000a2146560Q092669K2472763J6082737n310526j7513964j0980298m61417l93573
11992a58169o275439o993249k578567L44531J427848L786912M946651J736966
11984c762516r90830K072472N139238L6263p433254m690471N858142Q852023Q55289
11975E936356m412099o3562K849402l424840q168649o08562J0855758J2455248
11967A5419052O730640M752051N549737p4750j0879719j6244321j2668295n543103
11959a2958708K051541R211361J0111152J225134p896686n556411L667201O321144
11951F175728K094156J404532M011039k44219r519810r804832J54330M530374
11943a198702l012022q479761j751596P305165P584991M260440N148597N165987
$$ plain form
11935 15023099 13274459 4711322 -2552066 -5907091 -10073496 -14000043 -9726653 2198215
11927 2198215 9576568 6256092 977094 2402003 6758347 7813498 8208173 11072170
11919 11072170 9235466 -5246952 -25539232 -35572996 -30281474 -21111094 -20172459 -25859842
11911 -25859842 -27242790 -18895798 -7420372 -2840913 -5867654 -7455542 -2201675 2801504
11903 2801504 -2044059 -13120592 -15893041 -3522846 13748877 20072586 9884494 -9272972
11895 -9272972 -25058574 -29474021 -23354553 -13715361 -5700302 1095384 6898343 8084254
11887 8084254 4516683 4058422 11007576 16101908 9823440 402964 3175396 14749293
11879 14749293 16213743 3459388 -5478225 583820 8821436 4569737 -6334658 -10671990
$$ packed form
11935A5023099j748640q563137p263388l355025m166405l926547M273390J1924868
11927B198215P378353l320476n278998J424909M356344J055151L94675K863997
11919A1072170j836704j4482418k0292280j0033764N291522R170380R38635n687383
11911b5859842j382948Q346992J1475426M579459l026741j587888N253867N003179
11903B801504m845563j1076533k772449J2370195J7271723O323709j0188092j9157466
11895i272972j5785602m415447O119468R639192Q015059O795686N802959J185911
11887H084254l567571m58261O949154N094332o278468r420476K772432J1573897
11879A4749293J464450j2754355q937613O062045Q237616m251699j0904395m337332
$$ plain form
11871 -10671990 -9065350 -9013869 -8400944 -2464787 1604869 -5679064 -17545690 -18873618
11863 -18873618 -9427544 -3404276 -7373193 -13625315 -15247559 -13547215 -9497647 -1603835
11855 -1603835 5096158 852780 -13352119 -22900374 -17492931 -3618883 5934971 7737984
11847 7737984 7444241 9377187 12050866 11639370 6459125 -905036 -5173485 -3635024
11839 -3635024 806705 3622565 3473760 690185 -5001063 -11105763 -11661557 -5989861
11831 -5989861 -2905896 -7876679 -10981716 890284 22282380 32698345 23276945 7978387
11823 7978387 4392973 13527557 23544370 25003748 16692423 3060130 -8124059 -9991455
11815 -9991455 -3393949 3134119 2780252 -2956015 -7802946 -6890510 652853 10201337
$$ packed form
11871a0671990J606640N1481O12925N936157M069656p283933j1866626j327928
11863a8873618R446074O023268l968917o252122j622244J700344M049568P893812
11855a603835O699993m243378j4204899r548255N407443J3874048R553854J803013
11847G737984k93743J932946K673679m11496n180245p364161m268449J538461
11839c635024M441729K815860j48805k783575n691248o104700n55794N671696
11831e989861L083965m970783l105037J1872000K1392096J0415965r421400j5298558
11823G978387l585414R134584J0016813J459378q311325j3632293j1184189j867396
11815i991455O597506O528068l53867n736267m846931R12436P543363R548484
$$ plain form
11807 10201337 12810543 3879301 -9223199 -14544029 -10269009 -4614655 -1690346 2501823
11799 2501823 8603576 9753411 3465909 -2143195 235794 7636993 13920195 17876079
11791 17876079 18710886 12565840 688631 -7386867 -6738807 -4957195 -8474537 -9731193
11783 -9731193 449310 14565231 16377271 4200239 -6877408 -5823385 2653010 8262646
11775 8262646 7161896 1981149 -2176614 -116844 8440738 15367364 11599921 -1745232
11767 -1745232 -14957947 -20773984 -17831917 -6385979 10744229 25099810 29918677 28920945
11759 28920945 28157210 22446369 3755343 -18221574 -21554180 -2657367 15423512 13632862
11751 13632862 721943 -4429273 -317610 1983373 443386 1630997 4305903 441705
$$ packed form
11807A0201337K609206q931242j3102500n320830M275020N654354K924309M192169
11799B501823O101753J149835o287502n609104K378989P401199O283202L955884
11791A7876079Q34807o145046j1877209q075498O48060J781612l517342j256656
11783i731193J0180503J4115921J812040j2177032j1077647J054023Q476395N609636
11775H262646j100750n180747m157763K059770Q557582O926626l767443j3345153
11767a745232j3212715n816037K942067J1445938J7130208J4355581M818867r97732
11759B8920945p63735n710841j8691026k1976917l332606J8896813J8080879j790650
11751A3632862j2910919n151216M111663K300983j539987J187611K674906l864198
$$ plain form
11743 441705 -8751955 -12465416 -6542446 2083396 7799226 11691206 13586123 10122152
11735 10122152 3074161 -423111 1668126 4700648 7485382 13587065 20341691 18148732
11727 18148732 5394801 -6302874 -7385403 -1465183 4519936 11128999 19566657 23330031
11719 23330031 16983212 7021142 3841645 7215284 9159579 7590603 7243744 9046569
11711 9046569 8386690 4209363 1648566 4070046 8587999 11278927 12659670 16236248
11703 16236248 23200386 28741701 24526192 8731700 -6821479 -7132558 6228467 15323427
11695 15323427 10615780 4149901 8793578 15979835 9250992 -7857947 -16027366 -9726182
11687 -9726182 -3585846 -7067858 -10869388 -5268910 3243840 3522370 -2932438 -6589299
$$ packed form
11743D41705r193660l713461N922970Q625842N715830L891980J894917l463971
11735A0122152p047991l497272K091237L032522K784734O101683O754626k192959
11727A8148732j2753931j1697675j082529N920220N985119O609063Q437658L763374
11719B3330031o346819r962070l179497L373639J944295j568976l46859J802825
11711I046569o59879m177327k560797K421480M517953K690928J380743L576578
11703A6236248O964138N541315m215509j5794492j5553179l11079J3361025R094960
11695A5323427m707647o465879M643677P186257o728843j7108939q169419O301184
11687i726182O140336l482012l801530N600478Q512750K78530o454808l656861
$$ plain form
11679 -6589299 -4789695 -2841848 -4568281 -8967615 -13398602 -15138521 -12479588 -7340810
11671 -7340810 -3543166 -1065322 3060944 7059536 4534439 -4912559 -11959782 -8651145
11663 -8651145 1753900 9436015 8587421 1611571 -3171103 1877975 14226113 20160768
11655 20160768 10872017 -3212943 -5083528 4131574 7705351 591359 -3747476 1875502
11647 1875502 6022709 516515 -3543233 4563518 15032638 13670915 5810386 5897816
11639 5897816 12513726 12913719 6306027 3298418 5258235 2908081 -4769573 -7398204
11631 -7398204 -946544 6113327 7186937 5571787 5383126 5465658 4831091 4654377 3368433
11622 3368433 -1432289 -5966293 -4217007 1504442 3438614 1047018 785775 4135738
$$ packed form
11679f589299J799604J947847j726433m399334m430987j739919K658933N138778
11671g340810L797644K477844M126266L998592k525097r446998p047223L308637
11663h651145J0405045P682115q48594o975850m782674N049078J2348138N934655
11655B0160768r288751j4084960j870585R215102L573777p113992m338835N622978
11647A875502M147207n506194m059748Q106751J0469120j361723p860529Q7430
11639E897816O615910L99993o607692l007609J959817k350154p677654k628631
11631g398204O451660P059871J073610j615150j88661Q2532o34567j76714j285944
11622C368433m800722m534004J749286N721449J934172k391596k61243L349963
$$ plain form
11614 4135738 6534389 7543384 10923954 15042424 14726638 12202415 13879398 16660668
11606 16660668 11287141 106991 -3514828 3587888 8783920 3973417 -2994338 -3443697
11598 -3443697 -458773 1559410 6973576 18628171 27883573 25424596 14605391 5114802
11590 5114802 -148097 -4060974 -7492222 -10146430 -13858326 -18519171 -19689591 -15470737
11582 -15470737 -10230765 -7192416 -4087038 -565280 -1776818 -8635442 -12474456 -6567944
11574 -6567944 3751248 9518805 10362830 11058539 11510201 7713142 -1163259 -12414110
11566 -12414110 -22571324 -26399470 -18764166 -2397602 11517349 15020679 10794400 5613351
11558 5613351 3496154 7262497 16902845 22894347 12918030 -8971315 -22243118 -16659006
$$ packed form
11614D135738K398651J008995L380570M118470l15786k524223J676983K781270
11606A6660668n373527j1180150l621819P102716N196032m810503o967755m49359
11598c443697K984924K018183N414166J1654595R255402k458977j0819205r490589
11590E114802n262899l912877l431248k654208l711896m660845j170420M218854
11582a5470737N239972L038349L105378L521758j211538o858624l839014N906512
11574f567944J0319192N767557Q44025O95709M51662l797059q876401j1250851
11566a2414110j0157214l828146P635304J6366564J3914951L503330m226279n181049
11558E613351k117197L766343R640348N991502r976317k1889345j3271803N584112
$$ plain form
11550 -16659006 -6345132 -7299976 -14236770 -13378012 -6538012 -5617713 -11031558 -12991789
11542 -12991789 -9619293 -7425114 -6622027 -1213285 8161832 15581226 21823812 30568595
11534 30568595 34853396 23678416 2588856 -8544736 -1440356 11219498 16146964
11527 16146964 15423138 16533090 18723268 16971448 11060372 3906383 -3183929 -8704325
11519 -8704325 -9314191 -3475278 6749508 17992342 25683639 24320139 14413942 6260052
11511 6260052 7852308 11805274 5177719 -9959164 -18934605 -16841845 -13579829 -14477394
11503 -14477394 -11418069 1352504 16638309 26469173 32385902 36324921 33488391 22761792
11495 22761792 12797062 8419701 1837499 -12383605 -24175600 -21981812 -11143339 -5222726
$$ packed form
11550a6659006J0313874r54844o936794Q58758O840000R20299n413845j960231
11542a2991789L372496K194179Q03087N408742R375117P419394O242586Q744783
11534C0568595M284801j1174980k1089560j1133592P104380J2659854M927466
11527A6146964p23826J109952K190178j751820n911076p153989p090312n520396
11519h704325o09866N838913J0224786J1242834P691297j363500r906197q153890
11511F260052J592256L952966o627555j5136883q975441K092760L262016q97565
11503a4477394L059325J2770573J5285805R830864N916729L939019k836530j0726599
11495B2761792r964730m377361o582202j4221104j1791995K193788J0838473N920613
$$ plain form
11487 -5222726 -5998080 -5656777 -3324197 -4908259 -9597078 -10737521 -9194092 -12600900
11479 -12600900 -20972504 -25538230 -23426700 -21796528 -24746805 -27027974 -24377202 -20082580
11471 -20082580 -16828099 -11203764 -1575497 6966720 11578745 17870591 29720999 39221103
11463 39221103 35731499 21370854 8622002 4019026 2729408 -268871 -2002036 2071138
11455 2071138 9373582 12904911 9934404 3988909 -437434 -1732460 -386449 2382992
11447 2382992 4869654 6298310 8648955 14593398 22344911 25049545 18043503 5685100
11439 5685100 -2055746 -143703 6953577 12231412 14879806 18947549 24405684 24343502
11431 24343502 14068797 161341 -5124900 642333 5776136 -234878 -11508108 -12884632
$$ packed form
11487e222726p75354L41303K332580j584062m688819j140443J543429l406808
11479a2600900q371604m565726K111530J630172k950277k281169K650772M294622
11471b0082580L254481N624335R628267Q542217M612025O291846J1850408R500104
11463C9221103l489604j4360645j2748852m602976j289618k998279j733165M073174
11455B071138P302444L531329k970507n945495m426343j295026J346011K769441
11447B382992K486662J428656K350645N944443P751513K704634p006042j2358403
11439E685100p740846J912043P097280N277835K648394M067743N458135o2182
11431B4343502j0274705j3907456n286241N767233N133803o011014j1273230j376524
$$ plain form
11423 -12884632 -717531 12109979 14146104 9990196 11141506 18406088 21774034 15521203
11415 15521203 5334055 -324055 235225 2909181 3961955 2810785 967868 -99360
11407 -99360 -660111 -2065785 -4007176 -4393881 -3192227 -3464992 -6431873 -8912655 -8628378
11398 -8628378 -8167730 -9884931 -11156895 -9538406 -8084371 -9726817 -11289182 -10174595
11390 -10174595 -11504612 -19340036 -26136664 -22797471 -14997075 -15095489 -20194178 -15476931
11382 -15476931 -616484 6004383 -4594117 -17750706 -18765612 -14004188 -15151462 -17162944
11374 -17162944 -9122158 3490365 6545210 1398189 2176096 10952999 14143007 5544826
11366 5544826 -3871600 -4675435 -3594822 -11109957 -23699537 -27663971 -16985325 -951675
$$ packed form
11423a2884632J2167101J2827510K036125m155908J151310P264582L367946o252831
11415A5521203j0187148n658110N59280K673956J052774j151170j842917j067228
11407i9360n60751j405674j941391l86705J201654k72765k966881k480782K84277
11398h628378M60648j717201j271964J618489J454035j642446j562365J114587
11390a0174595j330017p835424o796628L339193P800396r8414n098689M717247
11382a5476931J4860447O620867j0598500j3156589j014906M761424j147274k011482
11374a7162944Q040786J2612523L054845n147021P77907Q776903L190008q598181
11366E544826r416426q03835J080613p515135j2589580l964434J0678646J6033650
$$ plain form
11358 -951675 5629007 -2486853 -15851844 -21266773 -17639846 -15812033 -20557338 -21702601
11350 -21702601 -10776136 2284906 1802073 -9789228 -15806775 -10627900 -4695470 -3505671
11342 -3505671 985063 13027370 23330833 24541167 22354342 22082412 17803128 6581395
11334 6581395 976726 12021252 28220446 28108710 9477290 -9443071 -15719919 -13109665
11326 -13109665 -7580194 2593214 17510831 29320373 32341335 30855747 30824934 31274039
11318 31274039 29307867 26134016 21825123 11592649 -4455455 -14274180 -7513381 7014846
11310 7014846 9597637 -4006325 -16277398 -12252483 785292 6260375 2565155 2040532
11302 2040532 8875338 11832110 2287146 -11716967 -16704383 -11999352 -8588698 -13454620
$$ packed form
11358i51675O580682q115860j3364991n414929L626927J827813m745305j145263
11350b1702601J0926465J3061042m82833j1591301o017547N178875N932430J189799
11342c505671M490734J2042307J0303463J210334k186825k71930m279284j1221733
11334F581395n604669J1044526J6199194j11736j8631420j8920361o276848K610254
11326a3109665N529471J0173408J4917617J1809542L020962j485588l0813M49105
11318C1274039j966172l173851m308893j0232474j6048104r818725O760799J4528227
11310G014846K582791j3603962j2271073M024915J3037775N475083l695220n24623
11302B040532O834806K956772r544964j4004113m987416M705031L410654m865922
$$ plain form
11294 -13454620 -22394039 -26780977 -21787735 -9459625 1715523 2933163 -4332480 -7748274
11286 -7748274 -302759 8296548 5984249 -952055 4114231 20214828 25542802 7454229
11278 7454229 -18951296 -31067260 -25633509 -14950604 -6621351 104358 4831830 6379199
11270 6379199 8985161 16285029 21840415 16975034 5750401 602342 4515854 9211411
11262 9211411 10051680 9882335 7600767 -2606783 -16548282 -18568877 -2932813 14185796
11254 14185796 14193961 326675 -8094705 -1639377 9408126 11216383 4148893 673058
11246 673058 8704586 20981879 23187479 12022895 377587 777094 8738085 10456577
11238 10456577 3581964 -1058527 1701152 4177564 1633347 1860818 10342152 17068489
$$ packed form
11294a3454620q939419m386938M993242J2328110J1175148J217640p265643l415794
11286g748274P445515Q599307k312299o936304N066286J6100597N327974j8088573
11278G454229k6405525j2115964N433751J0682905Q329253O725709M727472J547369
11270F379199K605962P299868N555386m865381j1224633n148059L913512M695557
11262I211411Q40269j69345k281568j0207550j3941499k020595J5636064J7118609
11254A4185796Q165j3867286q421380O455328J1047503J808257p067490l475835
11246F73058Q031528J2277293K205600j1164584j1645308L99507P960991J718492
11238A0456577o874613m640491K759679K476412k544217K27471Q481334O726337
$$ plain form
11230 17068489 10238471 -4202564 -9661692 -1562360 9578296 15830558 19917332 24438766
11222 24438766 24723615 17145000 6807761 1785781 3817635 7839733 7919149 2456059
11214 2456059 -3840453 -3728090 3352408 7880954 1690978 -9183757 -11073269 -1825372
11206 -1825372 6069695 3911819 -1543738 -704150 3083938 -386613 -10937969 -17032017
11198 -17032017 -11761558 -1289241 5019378 6419665 8513399 12916189 14546873 9415623
11190 9415623 1365781 -1853049 1158512 2156785 -7129199 -23215950 -32832893 -28256630
11182 -28256630 -16952826 -12207925 -16654509 -20603267 -16323586 -7130500 664202 8071017
11174 8071017 18529936 26666845 22159263 5911849 -7485103 -8202438 -3518985 -4457394
$$ packed form
11230A7068489o830018j4441035n459128Q099332J1140656O252262M086774M521434
11222B4438766K84849p578615j0337239n021980K031854M022098P9416n463090
11214B456059o296512J12363P080498M528546o189976j0874735j889512R247897
11206a825372P895067k157876n455557Q39588L788088l470551j0551356o094048
11198a7032017N270459J0472317O308619J400287K093734M402790J630684n131250
11190I415623q049842l218830L011561R98273r285984j6086751r616943M576263
11182b8256630J1303804M744901m446584l948758M279681R193086P794702P406815
11174H071017J0458919Q136909m507582j6247414j3396952p17335M683453r38409
$$ plain form
11166 -4457394 -7977813 -3749214 6347835 10069979 6080875 7767985 20357264 28522431
11158 28522431 17606295 -2897423 -10658140 -449744 10718408 7939616 -3978215
11151 -3978215 -10439007 -6312026 -326875 -3507639 -15992788 -25145751 -18449215 635337
11143 635337 14346351 11652052 1397925 -2179632 -394509 -5426622 -18423907 -26126157
11135 -26126157 -20643166 -9906164 -4036723 -1913171 2755753 10484603 17642116 22548947
11127 22548947 24172051 20514185 13524713 9640408 10032114 6828154 -4230368 -13862284
11119 -13862284 -11010057 6722 4660428 -841292 -4249439 5108033 21860778 31850041
11111 31850041 28376653 16963321 7283386 4365414 6325620 7532501 3767261 -4286799
$$ packed form
11166d457394l520419M228599J0097049L722144l989104J687110J2589279Q165167
11158B8522431j0916136k0503718p760717J0208396J1168152k778792j1917831
11151c978215o460792M126981N985151l180764j2485149r152963O696536J9084552
11143F35337J3711014k694299j0254127l577557J785123n032113j2997285p702250
11135b6126157N482991J0737002N869441K123552M668924P728850P157513M906831
11127B2548947J623104l657866o989472l884305L91706l203960j1058522r631916
11119a3862284K852227J1016779M653706n501720l408147R357472J6752745R989263
11111C1850041l473388j1413332r679935k917972J960206J206881l765240q054060
$$ plain form
11103 -4286799 -12138784 -15920844 -15305667 -12381362 -8968128 -5838441 -3950384 -4950287
11095 -4950287 -9218949 -13737094 -13895700 -8683458 -2459099 542194 2195395 7838444
11087 7838444 17695466 24433375 21264234 10963298 4764898 11561130 27899880 39217258
11079 39217258 33086007 12333512 -6945975 -11785484 -4445116 3153446 3020586 -4308413
11071 -4308413 -14564518 -23027003 -24808504 -18110356 -7610209 -557386 311649 -2639432
11063 -2639432 -5745140 -4722529 3995092 16270057 18929432 4195745 -17319795 -27711281
11055 -27711281 -23878532 -17776779 -16134632 -13420446 -6614538 -2426609 -3979652 -3083463
11047 -3083463 5794604 13949959 10271659 -2670633 -13296877 -16149340 -14095198 -9709867
$$ packed form
11103d286799p851985l782060O15177K924305L413234L129687J888057r99903
11095d950287m268662m518145j58606N212242O224359L001293J653201N643049
11087G838444R857022O737909l169141j0300936o198400O796232J6338750J1317378
11079C9217258o131251k0752495j9279487m839509P340368P598562j32860p328999
11071d308413j0256105q462485j781501O698148J0500147P052823Q69035k951081
11063b639432l105708J022611Q717621J2274965K659375j4733687k1515540j0391486
11055b7711281L832749O101753J642147K714186O805908M187929j553043Q96189
11047c083463Q878067Q155355l678300j2942292j0626244k852463K054142M385331
$$ plain form
11039 -9709867 -2158935 9282649 22947899 33567051 32492840 15728731 -6588704
11032 -6588704 -17528585 -13274831 -5936347 -3180796 1923470 13864261 21755501 15622341
11024 15622341 4595975 4791769 16757583 28489684 34170505 36003200 33019853 22732053
11016 22732053 10708060 5330107 5704882 6296051 8911953 17065432 23441121 18265366
11008 18265366 6824054 2850371 6913841 7909877 4224971 5139296 11017600 11668882
11000 11668882 7385565 11559197 25953990 32695802 20935027 4869481 3119166 13671957
10992 13671957 21965065 22577245 19670402 14731128 7344228 2421911 4673842 9502331
10984 9502331 8952515 3359078 -836473 -1055738 777289 3407109 5432644 3929554
$$ packed form
11039i709867P550932J1441584J3665250J0619152j074211j6764109k2317435
11032f588704j0939881M253754P338484K755551N104266J1940791P891240o133160
11024A5622341j1026366J95794J1965814J1732101N680821J832695k983347j0287800
11016B2732053j2023993n377953L74775N91169K615902Q153479O375689n175755
11008A8265366j1441312l973683M063470R96036l684906R14325N878304O51282
11000A1668882m283317M173632J4394793O741812j1760775j6065546j750315J0552791
10992A3671957Q293108O12180k906843m939274p386900m922317K251931M828489
10984I502331n49816n593437m195551k19265J833027K629820K025535j503090
$$ plain form
10976 3929554 311540 2362228 13505823 25236399 27418572 20962919 13036215 5762981
10968 5762981 -1342400 -3456023 3713548 13159902 13038159 3298549 -4260732 -2866387
10960 -2866387 2029698 3987885 4574503 7171505 9312187 7136731 3643389 6606825
10952 6606825 18173919 29871444 30335264 18398692 6351964 6948979 17914979 24312331
10944 24312331 17237667 4225307 -1813078 2021637 8770472 11649436 8380616 373766
10936 373766 -6345677 -4202916 5000393 7230166 -6905085 -26536344 -32339846 -21399892
10928 -21399892 -8239979 -1756252 4532961 15503104 22223723 16140532 4859728 1678205
10920 1678205 5568615 4244671 -5584734 -13787674 -13331518 -9288363 -7465316 -4484163
$$ packed form
10976C929554l618014K050688J1143595J1730576K182173o455653p926704p273234
10968E762981p105381k113623P169571R446354j21743r739610p559281J394345
10960b866387M896085J958187N86618K597002K140682k175456l493342K963436
10952F606825J1567094J1697525M63820j1936572j2046728N97015J0966000O397352
10944B4312331p074664j3012360o038385L834715O748835K878964l268820q006850
10936C73766o719443K142761R203309K229773j4135251j9631259n803502J0939954
10928b1399892J3159913O483727O289213J0970143O720619o083191j1280804l181523
10920A678205L890410j323944r829405q202940M56156M043155J823047K981153
$$ plain form
10912 -4484163 3952247 12628068 13243250 6902602 2043263 2656660 6301847 11318376
10904 11318376 16975459 17729601 8091871 -5255787 -7332946 4705921 15385674 11820123
10896 11820123 1116418 -2342751 1284814 267327 -8856746 -17289149 -18364944 -14353918
10888 -14353918 -8705811 -1749204 5085987 9743302 14194790 19531500 17969133 1920796
10880 1920796 -18972843 -24520308 -11274077 1507270 -484626 -7717929 -5555935 1707610
10872 1707610 81699 -9839827 -14065465 -7090579 1920952 4381751 1556406 -2357371
10864 -2357371 -6163267 -8950935 -9872453 -12075950 -19146059 -26444881 -24203777 -11714302
10856 -11714302 -622232 25572 -4448313 -2880286 6026469 12968236 11496398 6155608
$$ packed form
10912d484163Q436410Q675821O15182o340648m859339O13397L645187N016529
10904A1318376N657083P54142r637730j3347658k077159J2038867J0679753l565551
10896A1820123j0703705l459169L627565j017487r124073q432403j075795M011026
10888a4353918N648107O956607O835191M657315M451488N336710j562367j6048337
10880A920796k0893639n547465J3246231J2781347j991896p233303K161994P263545
10872A707610j625911r921526m225638O974886R011531K460799k825345l913777
10864b357371l805896k787668r21518k203497p070109p298822K241104J2489475
10856a1714302J1092070O47804m473885J568027Q906755O941767j471838n340790
$$ plain form
10848 6155608 5409846 10181493 13229810 9481009 2953662 811811 3361758 4628549
10840 4628549 1800178 -1670106 -2937479 -3250114 -2324713 3645844 13708050 18649385
10832 18649385 13158197 6588193 12236666 27601087 34873042 22793451 609659 -12816236
10824 -12816236 -8791914 4922875 13589115 8972870 -3330421 -8513569 2009725 18793804
10816 18793804 22872728 8183290 -10497815 -16472656 -11554453 -9103235 -11247319 -6647266
10808 -6647266 6975455 13079058 -327570 -18287222 -16079870 5338683 19240669
10801 19240669 10319861 -6485338 -11700422 -7730307 -6008666 -3651185 6746726 14069366
10793 14069366 138332 -27482033 -38390148 -20203812 4550644 11303787 4602137
$$ packed form
10848F155608p45762M771647L048317l748801o527347k141851K549947J266791
10840D628549k828371l470284j267373l12635R25401N970557J0062206M941335
10832A8649385n491188o570004N648473J5364421P271955j2079591k2183792j3425895
10824a2816236M024322J3714789Q666240m616245j2303291n183148J0523294J6784079
10816A8793804M078924j4689438j8681105n974841M918203K451218k144084M600053
10808f647266J3622721O103603j3406628j7959652K207352K1418553J3901986
10801A9240669q920808j6805199n215084L970115J721641K357481J0397911P322640
10793A4069366j3931034k7620365j0908115J8186336K4754456O753143o701650
$$ plain form
10786 4602137 3767102 12453500 18489174 15290215 8442308 5065516 7802970 15819827
10778 15819827 23041961 20306323 7917290 176308 7429383 19383545 18287418 4647939
10770 4647939 -3796465 2106225 11773684 12458669 6392216 4419775 10124154 16998142
10762 16998142 17985929 12774281 6576893 4442251 6669764 8997850 7472026 2902769
10754 2902769 21036 2482089 8697223 12408823 8809525 1001476 -2722327 -471794
10746 -471794 -721863 -9244095 -17748810 -14984276 -4679695 362651 -366608 4378746
10738 4378746 14657881 15326662 1437493 -9988785 -4555051 8066346 10517223 3120645
10730 3120645 -1885534 -1569035 -2225623 -5096338 -6716477 -8017353 -9983642 -6085172
$$ packed form
10786D602137q35035Q686398O035674l198959o847907l376792K737454Q016857
10778A5819827P222134k735638j2389033p740982P253075J1954162j096127j3639479
10770D647939q444404N902690R667459O84985o066453j972441N704379O873988
10762A6998142R87787n211648o197388k134642K227513K328086j525824m569257
10754B902769k881733K461053O215134L711600l599298p808049l723803K250533
10746d71794k50069q522232q504715K764534J0304581N042346p29259M745354
10738D378746J0279135O68781j3889169j1426278N433734J2621397K450877p396578
10730C120645n006179L16499o56588k870715j620139j300876j966289L898470
$$ plain form
10722 -6085172 7923002 22795125 27786778 27054487 29206971 27753853 10610897 -14831639
10714 -14831639 -26214372 -16497059 -2173849 948864 -5422219 -11675446 -11792409 -2654121
10706 -2654121 13862584 25562322 21078704 8936177 9896825 26062109 34286017 18440092
10698 18440092 -6788975 -15718207 -4141979 10636311 15339556 13539232 14474935 18988034
10690 18988034 19913931 13230845 5354069 6538861 17205489 26562386 27682486 26019572
10682 26019572 26625198 22648685 8196931 -5841144 -4783902 6132335 8644552 -422302
10674 -422302 -6567696 -2786749 2446401 4477827 9121971 15166221 11572657 470211
10666 470211 1455671 20067615 31785502 15118196 -14920312 -26870012 -15936133 -5407531
$$ packed form
10722f085172J4008174J4872123M991653p32291K152484j453118j7142956k5442536
10714a4831639j1382733R717313J4323210L122713o371083o253227j16963R138288
10706b654121J6516705J1699738m483618j2142527R60648J6165284Q223908j5845925
10698A8440092k5229067q929232J1576228J4778290M703245j800324R35703M513099
10690A8988034R25897o683086p876776J184792J0666628R356897J120100j662914
10682B6019572O05626l976513j4451754j4038075J057242J0916237K512217r066854
10674d22302o145394L780947N233150K031426M644144O044250l593564j1102446
10666D70211R85460J8611944J1717887j6667306l0038508j1949700J0933879J0528602
$$ plain form
10658 -5407531 -9637031 -16819482 -11091612 4670225 14871072 10750850 -2344234 -13242515
10650 -13242515 -16247139 -14202258 -11624912 -8197002 -2981180 -1271056 -7967329 -15063331
10642 -15063331 -7892642 13232537 30008569 30039250 21281038 15466643 10679785 1869165
10634 1869165 -3401206 4497938 18232866 21565960 13445022 8565415 14047129 20176755
10626 20176755 17417817 9789682 5048028 1123618 -8846853 -22385096 -27500723 -17980167
10618 -17980167 -3242626 1692836 -5307270 -10706189 -3230913 11373561 19591767 19137618
10610 19137618 18845792 21781430 20930314 13821686 8857509 11098869 12532127 4825524
10602 4825524 -6669834 -11120662 -8246987 -6385628 -8590256 -10375096 -9554382 -9491317
$$ packed form
10658e407531m229500p182451N727870J5761837J0200847m120222j3095084j0898281
10650a3242515l004624K044881K577346L427910N215822J710124o696273p096002
10642a5063331P170689K1125179J6776032L0681q758212n814395m786858q810620
10634A869165n270371P899144J3734928L333094q120938m879607N481714O129626
10626B0176755k758938p628135m741654l924410r970471j3538243n115627R520556
10618a7980167J4737541M935462p000106n398919P475276J4604474Q218206m54149
10610A9137618k91826K935638q51116p108628m964177K241360J433258p706603
10602D825524j1495358m450828K873675J861359k204628j784840Q20714O3065
$$ plain form
10594 -9491317 -12108286 -14465913 -13901020 -12135424 -12475276 -15076557 -16214961 -12061046
10586 -12061046 -3139595 6034281 12648538 18233036 23188187 23236763 17084986 13075516
10578 13075516 18991248 27775195 24704679 9043625 -3189631 -858798 8722975 12200648
10570 12200648 6735724 -756293 -3072240 2801389 13528688 18731225 10117049 -6299930
10562 -6299930 -15566062 -13371830 -10348825 -14054229 -17736287 -11867641 2994280 19763486
10554 19763486 32196044 34919673 26021734 13628749 9985765 15603036 19868281 19467534
10546 19467534 22411031 30103527 31564853 22780007 16220024 21223047 28621984 25798522
10538 25798522 15190923 7125708 4899845 6933791 13345470 20811850 21019706 13148096
$$ packed form
10594i491317k616969k357627N64893J765596l39852k601281j138404M153915
10586a2061046Q921451R173876O614257N584498M955151M8576o151777m009470
10578A3075516N915732Q783947l070516j5661054j2233256K330833R581773L477673
10570A2200648n464924p492017k315947N873629J0727299N202537q614176j6416979
10562f299930r266132K194232L023005l705404l682058N868646J4861921J6769206
10554A9763486J2432558K723629q897939j2392985l642984N617271M265245m00747
10546A9467534K943497P692496J461326q784846o559983N003023P398937k823462
10538B5798522j0607599q065215k225863K033946O411679P466380K07856p871610
$$ plain form
10530 13148096 7765643 10462167 12864161 7743899 992045 434093 4714608 10373652
10522 10373652 17016916 19777145 12189685 1908589 4827591 17716889 19445481 7453324
10514 7453324 6032373 25476752 42109270 37436198 28130889 33465040 40608488 30752668
10506 30752668 15530855 16603878 29420630 37376929 42448743 52313148 57827713 53185500
10498 53185500 55268732 72130516 80459071 69027449 68977511 96721940 109789961 81928611
10490 81928611 76518324 152720419 226720152 145749695 -87062001 -278629556 -281703156
10483 -281703156 -164746586 -84662762 -80872971 -83116144 -57292141 -37848327 -41326083
10476 -41326083 -42354037 -34444370 -40409043 -56971197 -51169741 -20489555 -2656255 -14473374
$$ packed form
10530A3148096n382453K696524K401994n120262o751854n57952M280515N659044
10522A0373652O643264K760229p587460j0281096K919002J2889298J728592j1992157
10514G453324j420951J9444379J6632518m673072r305309N334151P143448r855820
10506C0752668j5221813J073023J2816752P956299N071814R864405N514565m642213
10498E3185500K083232J6861784Q328555j1431622m9938K7744429J3068021k7861350
10490H1928611n410287P6202095P3999733q0970457k32811696j91567555l073600
10483b81703156J16956570Q0083824L789791k243173K5824003J9443814l477756
10476d1326083j027954P909667n964673j6562154N801456L0680186J7833300j1817119
$$ plain form
10468 -14473374 -28308422 -22467111 -12433823 -15768265 -22186654 -17201922 -7409967 -4935174
10460 -4935174 -8183404 -11481015 -15482141 -17625854 -9150685 9351717 23623697 23373849
10452 23373849 12423416 -367439 -7592434 -2887288 10161886 12338867 -8834973
10445 -8834973 -34750026 -36319762 -16450484 -5579005 -14155076 -19483972 -6935474 6034800
10437 6034800 1347926 -10473437 -11431959 -5664260 -7146816 -13331642 -12136299 -4578243
10429 -4578243 -795583 -1031649 1251901 2902630 -4498815 -16692623 -20201407 -13662189
10421 -13662189 -10053440 -14947735 -16790625 -5254863 11506524 16874265 6969836 -7182168
10413 -7182168 -15977119 -20139783 -21846028 -16358368 -50191 17842801 21225489 5597984
$$ packed form
10468a4473374j3835048N841311J0033288l334442o418389M984732R791955K474793
10460d935174l248230l297611m001126k143713Q475169J8502402J4271980k49848
10452B3373849j0950433j2790855p224995M705146J3049174K176981k1173840
10445h834973k5915053j569736J9869278J0871479q576071n328896J2548498J2970274
10437F034800m686874j1821363r58522N767699j482556o184826J195343P558056
10429d578243L782660k36066K283550J650729p401445j2193808l508784O539218
10421a3662189L608749m894295j842890J1535762J6761387N367741r904429j4152004
10413g182168q794951m162664j706245N487660J6308177J7892992L382688j5627505
$$ plain form
10405 5597984 -17003983 -32790357 -38266508 -36022291 -28622766 -21675429 -23107836 -31697183
10397 -31697183 -34732170 -25507947 -14454564 -12692584 -13882701 -6582540 2859788 -2039394
10389 -2039394 -19665352 -28532472 -16994358 1071226 6200721 -3401492 -15045044 -18211351
10381 -18211351 -11523714 -221857 7990649 9442427 8940803 12241114 14702241 6528369
10373 6528369 -10099015 -20289357 -16227153 -6867234 -2579888 -487611 6891085 16421727
10365 16421727 17855619 9207283 81497 -362917 6618278 12720408 13419895 13068233
10357 13068233 17365946 22151639 16414466 -123721 -10839929 -2634219 13948098 17410370
10349 17410370 4114048 -10263678 -16463946 -21461675 -29546436 -31572658 -21809185 -10815651
$$ packed form
10405E597984k2601967j5786374n476151K244217P399525O947337j432407q589347
10397c1697183l034987R224223J1053383J761980j190117P300161R442328m899182
10389b039394j7625958q867120J1538114J8065584N129495r602213j1643552l166307
10381a8211351O687637J1301857Q212506J451778n01624L300311K461127q173872
10373F528369j6627384j0190342M062204R359919M287346K092277P378696R530642
10365A6421727J433892q648336r125786m44414O981195O102130O99487l51662
10357A3068233M297713M785693n737173j6538187j0716208Q205710J6582317L462272
10349A7410370j3296322j4377726o200268m997729q084761k026222R763473J0993534
$$ plain form
10341 -10815651 -10001263 -14205235 -11537672 -2206044 4352023 4702207 2117807 -3033429
10333 -3033429 -11885552 -18972849 -16649844 -6762348 1187070 2724347 1043572 -1716490
10325 -1716490 -6640762 -11288831 -10093176 -4037080 -2039493 -8421836 -14873249 -10611436
10317 -10611436 2175266 8924908 -6712 -16084476 -20353626 -4918534 16844948
10310 16844948 24932923 15463600 3585442 3907702 14287932 21461274 17364554 5839344
10302 5839344 -3430297 -3879745 2935008 8990428 8445458 4907152 5940606 10627865
10294 10627865 10106394 2586362 -1652593 3672412 8807036 2004733 -10634213 -11930448
10286 -11930448 1862117 16189198 19630233 18228637 22644258 30179798 28689189 14713518
$$ packed form
10341a0815651Q14388m203972K667563R331628O558067L50184k584400n151236
10333c033429q852123p087297K323005R887496P949418J537277j680775k760062
10325a716490m924272m648069J195655O056096J997587o382343o451413M261813
10317a0611436J2786702O749642q931620j6077764m269150J5435092K1763482
10310A6844948Q087975r469323j1878158L22260J0380230P173342m096720j1525210
10302E839344r269641m49448O814753O055420n44970l538306J033454M687259
10294A0627865n21471p520032m238955N325005N134624o802303j2638946j296235
10286a1930448J3792565J4327081L441035j401596M415621P535540j490609j3975671
$$ plain form
10278 14713518 -794456 -5687702 -283498 4555757 394420 -10529855 -19574655 -21278048
10270 -21278048 -16812738 -10054067 -4211896 -2011876 -4088869 -5526249 532452 12296788
10262 12296788 18010480 11175947 2213452 6287387 22035283 32672087 28781106 19348662
10254 19348662 16536418 19699758 21316259 20100934 18589600 13862339 2547899 -7733464
10246 -7733464 -5069498 7432349 12144596 1831022 -8233924 -2453986 10806483 10914130
10238 10914130 -4265584 -15368421 -10080230 811116 1856548 -5761798 -11357509 -13386581
10230 -13386581 -18041615 -24126108 -22690914 -11530075 858944 6981442 6747281 1351554
10222 1351554 -8709161 -16657574 -11706707 5170399 17040163 11259418 -3100284 -7952002
$$ packed form
10278A4713518j5507974m893246N404204M839255m161337j0924275r044800j703393
10270b1278048M465310O758671N842171K200020k076993j437380O058701J1764336
10262A2296788N713692o834533q962495M073935J5747896J0636804l890981r432444
10254A9348662k812244L163340J616501j215325j511334m727261j1314440j0281363
10246g733464K663966J2501847M712247j0313574j0064946N779938J3260469J07647
10238A0914130j5179714j1102837N288191J0891346J045432p618346n595711k029072
10230a3386581m655034o084493J435194J1160839J2389019O122498k34161n395727
10222A351554j0060715p948413M950867J6877106J1869764n780745j4359702m851718
$$ plain form
10214 -7952002 -990398 3979231 -815997 -7717427 -8549889 -6903603 -9248952 -12762714
10206 -12762714 -10607069 -4024477 -110481 -613 1649479 5329950 3957727 -4859313
10198 -4859313 -11163501 -4113006 12117682 21149034 13622049 -1947962 -9987938 -5599377
10190 -5599377 2545326 5276230 3598086 4140037 7736923 7977103 1446160 -6166375
10182 -6166375 -8048131 -6210129 -7008229 -8903634 -3811834 7680623 12595516 3514284
10174 3514284 -8257631 -7565839 2320732 5063646 -3331045 -8987536 -2671551 6098495
10166 6098495 4436950 -5636072 -13576317 -16427825 -18034737 -18177970 -13766499 -7755659
10158 -7755659 -6313101 -8143420 -5659555 3698028 15204083 24843099 31304745 31067722
$$ packed form
10214g952002O961604M969629m795228o901430q32462J646286k345349l513762
10206a2762714K155645O582592L913996J09868J650092L680471j372223q817040
10198d859313o304188P050495J6230688R031352p526985j5570011q039976M388561
10190e599377Q144703K730904j678144N41951L596886K40180o530943p612535
10182f166375j881756J838002p98100j895405N091800J1492457M914893r081232
10174C514284j1771915O91792R886571K742914q394691n656491O315985Q770046
10166F098495j661545j0073022p940245k851508j606912j43233M411471O010840
10158g755659J442558j830319K483865R357583J1506055R639016O461646k37023
$$ plain form
10150 31067722 21043868 6887148 -536078 990848 2829778 -968279 -6350770 -8101820
10142 -8101820 -7399021 -6722715 -5125593 -2783550 -2553273 -2592554 4035467 16517369 22087938
10133 22087938 13229817 1177278 1367263 11342621 16010679 11664554 9996185 16843655
10125 16843655 21468033 13521021 -298632 -5647069 254469 8078194 10986804 10521271
10117 10521271 9425711 7479764 5663376 7150361 11383725 12721104 8217490 2191651
10109 2191651 -501661 -1359330 -3585355 -4335117 1415812 10277752 11264644 -331849
10101 -331849 -15223697 -19918549 -11138037 2528472 10785548 10346551 5249013 1387453
10093 1387453 226841 -2967035 -12855250 -25623708 -30723313 -23140425 -9955711 -1382879
$$ packed form
10150C1067722j0023854j4156720p423226J526926J838930l798057n382491j751050
10142h101820P02799O76306J597122K342043K30277l9281O628021J2481902N570569
10133B2087938q858121j2052539J89985R975358M668058m346125j668369O847470
10125A6843655M624378p947012j3819653n348437N901538P823725K908610m65533
10117A0521271j095560j945947j816388J486985M233364J337379m503614o025839
10109B191651k693312q57669k226025p49762N750929Q861940R86892j1596493
10101c31849j4891848m694852Q780512J3666509Q257076m38997n097538l861560
10093A387453j160612l193876r888215j2768458n099605P582888J3184714Q572832
$$ plain form
10085 -1382879 850323 1843934 4091227 5826432 6517811 7240669 6245382 721713 -6766162
10076 -6766162 -10179034 -9577642 -12201204 -21268225 -29624969 -28635649 -18949691 -8013835
10068 -8013835 -426682 4195979 6109570 4154108 8500 -1040611 3792629 9911573
10060 9911573 9246293 -724713 -13469551 -20164043 -19097966 -16084311 -15455100 -14283893
10052 -14283893 -8034030 1328790 7468679 8331922 7371647 6449620 3598770 -565163
10044 -565163 -579811 5387714 9636705 3808406 -8511194 -14823297 -9564864 -268695
10036 -268695 4646938 7722551 15936579 26516822 28633951 20048438 12576413 15546009
10028 15546009 21415107 16834435 3543338 -3009448 4541422 16436896 21299758 19861208
$$ packed form
10085a382879K233202R93611K247293J735205O91379P22858r95287n523669p487875
10076f766162l412872O01392k623562r067021q356744R89320R685958J0935856
10068h013835P587153M622661J913591j955462m145608j049111M833240O118944
10060I911573o65280r971006j2744838o694492J066077L013655O29211J171207
10052a4283893O249863R362820O139889Q63243r60275r22027k850850m163933
10044e65163j4648N967525M248991n828299j2319600o312103N258433R296169
10036b68695M915633L075613Q214028J0580243K117129q585513p472025K969596
10028A5546009N869098m580672j3291097o552786P550870J1895474M862862j438550
$$ plain form
10020 19861208 17620117 13612332 5160612 -3080386 -4547465 -1219132 234705 -229303
10012 -229303 2778569 9657673 15097010 16597774 15777080 12271682 4563623 -3644534
10004 -3644534 -6311602 -4628084 -5512413 -9754106 -9963576 -2147450 8402673 15104252
9996 15104252 16959928 15307038 10815801 6297489 5500888 6112916 962441 -9990943
9988 -9990943 -15635333 -6989188 10201623 21285622 18408979 7097382 -400870 3457410
9980 3457410 13872194 17016563 5032601 -12700714 -19354746 -11609907 -2622349 -2492664
9972 -2492664 -5759818 -3514907 1285339 -793150 -10646760 -19860871 -22148626 -18152750
9964 -18152750 -10771486 -2748912 1594321 -1569367 -10592743 -19033642 -21824606 -18548431
$$ packed form
10020A9861208k241091m007785q451720q240998j467079L328333J453837m64008
10012b29303L007872O879104N439337J500764q20694l505398p708059q208157
10004c644534k667068J683518q84329m241693k09470P816126J0550123O701579
9996A5104252J855676j652890m491237m518312p96601O12028n150475j0953384
9988i990943n644390Q646145J7190811J1083999k876643j1311597p498252L858280
9980C457410J0414784L144369j1983962j7733315o654032P744839Q987558J29685
9972b492664l267154K244911M800246k078489r853610r214111k287755L995876
9964a8152750P381264Q022574M343233l163688r023376q440899k790964L276175
$$ plain form
9956 -18548431 -11494489 -3425660 2896353 5453895 4125336 853639 -1138966 692553
9948 692553 5150787 7177728 3684729 -1591683 -3086923 -2211072 -5443452 -13492300 -19256592
9939 -19256592 -18773950 -17184002 -19356909 -20598956 -13387444 -195683 7714307 4757864
9931 4757864 -1238585 1193333 11949826 17896375 8269056 -11038786 -22960986 -18913641
9923 -18913641 -7507290 -1854439 -4765245 -10923049 -16930341 -21764316 -22316127 -17126297
9915 -17126297 -11330824 -9880168 -9297336 -4395217 1265989 1621913 437585 5470608
9907 5470608 13444164 13806454 5626760 -2386422 -7058561 -11857114 -14096085 -6602064
9899 -6602064 7280956 15517219 15056992 12845540 9612537 -575624 -14875593 -24079729
$$ packed form
9956a8548431P053942Q068829O322013K557542j328559l271697j992605J831519
9948F92553M458234K026941l492999n276412j495240Q75851l232380q048848n764292
9939a9256592M82642J589948k172907j242047P211512J3191761P909990k956443
9931D757864n996449K431918J0756493N946549r627319j9307842j1922200M047345
9923a8913641J1406351N652851k910806o157804o007292m833975n51811N189830
9915a7126297N795473J450656N82832M902119N661206L55924j184328N033023
9907E470608P973556L62290q179694q013182m672139m798553k238971P494021
9899f602064J3883020Q236263m60227k211452l233003j0188161j4299969r204136
$$ plain form
9891 -24079729 -30016954 -40497958 -48544974 -41051073 -27055036 -27971755 -39311210 -38302329
9883 -38302329 -33062306 -56862899 -97404855 -85938039 5940917 104706182 121224872
9876 121224872 66046088 22230494 26644531 42028243 37818581 31215280 37637934 38874343
9868 38874343 22469075 7788330 9683147 13036862 5375132 1528161 13473971 25894321
9860 25894321 24904828 23543688 34579238 43270009 33075290 16460949 13068150 15707061
9852 15707061 5856409 -11561904 -16567090 -6858283 3609029 10963378 22035555 33969949
9844 33969949 35702706 27127170 18252422 12756503 8973857 11482709 23205815 30784971
9836 30784971 17759397 -9417225 -27100205 -25829002 -18488417 -16559139 -15917028 -10345188
$$ packed form
9891b4079729n937225j0481004q047016P493901J3996037r16719j1339455J008881
9883c8302329N240023k3800593m0541956J1466816R1878956R8765265J6518690
9876A21224872n5178784m3815594M414037J5383712m209662o603301O422654J236409
9868C8874343j6405268j4680745J894817L353715p661730l846971J1945810J2420350
9860B5894321r89493j361140J1035550Q690771j0194719j6614341l392799K638911
9852A5707061r850652j7418313n005186R708807J0467312P354349J1072177J1934394
9844C3969949J732757q575536q874748n495919l782646K508852J1723106P579156
9836C0784971j3025574k7176622j7682980J271203P340585J929278O42111N571840
$$ plain form
9828 -10345188 -4245096 -5188274 -12991221 -20778254 -21170907 -10850069 5105225 14853909
9820 14853909 12019901 3466547 -1315700 -3201558 -7569641 -11997007 -11021989 -7887041
9812 -7887041 -9058869 -11260542 -7129374 -217395 -69472 -4695238 -3037044 5890415
9804 5890415 11798265 11768846 14358380 22377063 26931117 23308600 18614055 17783123 15400211
9795 15400211 8465030 4621339 8836407 12764552 7306858 -3037984 -8601283 -10046551
9787 -10046551 -14435848 -20598764 -19507799 -7780698 7852591 19079528 22468430 18601229
9779 18601229 11330052 7481479 11245711 18414927 21051741 17937024 15338517 17033710
9771 17033710 19406774 18621893 16911793 17069136 15097077 5687361 -6271061 -8568614
$$ packed form
9828a0345188O100092r43178p802947p787033l92653J0320838J5955294R748684
9820A4853909k834008q553354m782247j885858m368083m427366R75018L134948
9812g887041j171828k201673M131168O911979J47923m625766J658194Q927459
9804E890415N907850k9419K589534Q018683M554054l622517m694545q30932k382912
9795A5400211o935181l843691M215068L928145n457694j0344842n563299j445268
9787a0046551m389297o162916J090965J1727101J5633289J1226937L388902l867201
9779A8601229p271177l848573L764232P169216K636814l114717k598507J695193
9771A7033710K373064p84881j710100J57343j972059r409716j1958422k297553
$$ plain form
9763 -8568614 851644 7577274 -1104660 -17952112 -25502874 -20072473 -13454673 -11506531
9755 -11506531 -6227862 6367972 15578966 12522143 4518281 1067381 -2997515 -15181102
9747 -15181102 -25892195 -20501423 -5319885 -314319 -7057526 -6448754 8038945 18019924
9739 18019924 10641030 5506 3221462 12796013 12010458 4659499 7393006 19979650
9731 19979650 26250561 22391891 21471837 27276834 25778647 10451196 -3571595 -2693280
9723 -2693280 3932620 1314678 -6203675 -4715346 2958881 1354261 -9865406 -12919249
9715 -12919249 -170351 12725720 9553566 -4898169 -15052164 -14484295 -5984313 7419585
9707 7419585 20014428 21246534 9145333 -1168593 3946652 15793061 16323846 6674267
$$ packed form
9763h568614R420258O725630q681934j6847452p550762N430401O617800J948142
9755a1506531N278669J2595834R210994l056823q003862l450900m064896j2183587
9747a5181102j0711093N390772J5181538N005566o743207O08772J4487699R980979
9739A8019924p378894j0635524L215956R574551p85555p350959K733507J2586644
9731A9979650O270911l858670r20054N804997j498187j5327451j4022791Q78315
9723b693280O625900k617942p518353J488329P674227j604620j1219667l053843
9715a2919249J2748898J2896071l172154j4451735j0153995N67869Q499982J3403898
9707G419585J2594843J232106j2101201j0313926N115245J1846409N30785r649579
$$ plain form
9699 6674267 4022860 11742767 13934452 3585722 -4994698 -1310542 2738292 -6384241
9691 -6384241 -19517784 -18739711 -5879511 1273757 -3541681 -8872863 -6114424 -735050
9683 -735050 -378201 -3884428 -6117255 -5135877 -1398966 3618693 6200551 3644123 -459909
9674 -459909 17637 4667263 7546384 7169285 8156006 11834389 12837347 8164926 3327894
9665 3327894 4927539 10948353 12987898 6812754 -2690659 -7625233 -6409408 -4848422
9657 -4848422 -7124037 -8897892 -3878420 4814501 7433329 2363898 -858173 3387915
9649 3387915 7996429 5045754 -2417267 -7896830 -12021515 -16320997 -14776744 -3354661
9641 -3354661 8536959 9350449 3820526 6318276 18074899 24837225 17355082 2081310
$$ packed form
9699F674267k651407P719907K191685j0348730q580420L684156M048834r122533
9691f384241j3133543P78073J2860200P153268m815438n331182K758439N379374
9683g35050L56849l506227k232827R81378L736911N017659K581858k556428m104032
9674d59909M77546M649626K879121l77099R86721L678383J002958m672421m837032
9665C327894J599645O020814K039545o175144r503413m934574J215825J560986
9657d848422k275615j773855N019472Q692921K618828n069431l222071M246088
9649C387915M608514k950675p463021n479563m124685m299482J544253J1422083
9641c354661J1891620Q13490n529923K497750J1756623O762326p482143j5273772
$$ plain form
9633 2081310 -9339364 -10779448 -1981914 11349729 18212255 13175674 5302302 5993854
9625 5993854 11284766 9100356 475778 -2717521 695940 597126 -2952802 1782395 14252984
9616 14252984 17680448 7217335 1193288 12127967 25408817 22288076 8189031 392532
9608 392532 127034 -3636350 -10771646 -9896622 1496262 13060083 16788439 13580370
9600 13580370 6035740 -4205726 -13144215 -17477148 -18881474 -18254858 -11041590 3303967
9592 3303967 14191248 13148262 7547587 8506574 11659142 5639726 -4732210 -2484729
9584 -2484729 13443214 22401872 10467053 -9625760 -15707775 -3709676 10841575 13157181
9576 13157181 3314184 -7707917 -10751267 -6622283 -2655396 -2196885 -1028697 3878089
$$ packed form
9633B081310j1420674j440084Q797534J3331643O862526n036581p873372O91552
9625E993854N290912k184410q624578l193299L413461r8814l549928M735197J2470589
9616A4252984L427464j0463113o024047J0934679J3280850l120741j4099045p796499
9608C92532k65498l763384p135296Q75024J1392884J1563821L728356l208069
9600A3580370p544630j0241466q938489m332933j404326O26616P213268J4345557
9592C303967J0887281j042986n600675R58987L152568o019416j0371936K247481
9584b484729J5927943Q958658j1934819k0092813o082015J1998099J4551251K315606
9576A3157181r842997j1022101l043350M128984L966887M58511J168188M906786
$$ plain form
9568 3878089 7580257 4686514 -862218 -878662 5134493 10546188 11787881 10668809 8715913
9559 8715913 6666805 7504986 12446244 16080686 13119394 7207691 4767487 3646648
9551 3646648 -1899144 -8040454 -5561067 3721461 7648855 2024106 -4299574 -5251297
9543 -5251297 -6237604 -12568249 -20094465 -22872973 -20934580 -15220855 -3869956 10237491
9535 10237491 16372330 8011331 -7127423 -15379084 -11864201 -2678992 3618330 2688131
9527 2688131 -4078654 -11277329 -14488485 -14190199 -12342838 -7393048 1761230 9272750
9519 9272750 7995414 656303 -3516220 -2835194 -3846290 -7814122 -7932541 -2148985 2398769
9510 2398769 858292 -3856754 -9364146 -15988392 -18575175 -10341839 1163540 -1809554
$$ packed form
9568C878089L702168k893743n548732j6444O013155N411695J241693j119072j952896
9559H715913k049108Q38181M941258L634442k961292n911703k440204j120839
9551C646648n545792o141310K479387R282528L927394n624749o323680r51723
9543e251297r86307o330645p526216k778508J938393N713725J1350899J4107447
9535A0237491O134839q360999j5138754q251661L514883R185209O297322r30199
9527B688131o766785p198675l211156K98286J847361M949790R154278P511520
9519I272750j277336p339111m172523O81026j011096l967832j18419N783556M547754
9510B398769j540477m715046n507392o624246k586783Q233336J1505379k973094
$$ plain form
9502 -1809554 -19942762 -30468921 -18575539 1199972 8629660 6949282 10403656 16181716
9494 16181716 11268358 -568834 -2289082 8296521 16006039 14687278 14907316 21116078
9486 21116078 21228819 7436504 -8927103 -13701516 -8664518 -3725772 -682242 4227728
9478 4227728 9079831 8634006 3588332 -1669129 -6950143 -13370061 -15837118 -8200386
9470 -8200386 4804937 10495497 5394377 838201 6383624 14646781 11283268 -3160718
9462 -3160718 -12213487 -6323872 3838460 3822105 -3680990 -5560521 -358494 882755
9454 882755 -5075518 -8026114 -2422606 3629674 3720606 3295754 6041703 4504613 -3914028
9445 -3914028 -5346752 10304590 28575193 28581611 14446905 8366530 16167295 20748294
$$ packed form
9502a809554j8133208j0526159J1893382J9775511P429688j680378L454374N778060
9494A6181716m913358j1837192j720248J0585603P709518j318761K20038O208762
9486B1116078J12741j3792315j6363607m774413N036998M938746L043530M909970
9478D227728M852103m45825n045674n257461n281014o419918k467057P636732
9470h200386J3005323N690560n101120m556176N545423Q263157l363513j4443986
9462c160718r052769N889615J0162332j6355p503095j879531N202027J241249
9454H82755n958273k950596N603508O052280R0932m24852K745949j537090q418641
9445c914028j432724J5651342J8270603O418j4134706o080375P800765M580999
$$ plain form
9437 20748294 10238716 -6876320 -17964251 -20409840 -15776512 -5892164 1030922 -3931679
9429 -3931679 -13930720 -11317200 5499949 16711580 9954920 -2135838 -3175112 3576702
9421 3576702 5269586 83410 -4854223 -5512494 357156 15229318 30809072 27918843
9413 27918843 2442628 -20440550 -16283648 3396997 6584076 -13765456 -31877797
9406 -31877797 -26901900 -7485875 6138519 6666929 -1462830 -13321794 -23613639 -25197044
9398 -25197044 -17080540 -8541973 -8615551 -15680395 -21955899 -23341867 -19982936 -11617884
9390 -11617884 1610758 15252118 21882987 17021038 3111255 -11376648 -17360490 -12580501
9382 -12580501 -4347278 -2382384 -7792318 -10805350 -691239 22159568 44130348 49391240
$$ packed form
9437B0748294j0509578j7115036j1087931k445589M633328R884348O923086m962601
9429c931679r999041K613520J6817149J1211631o756660j2090758j039274O751814
9421C576702J692884n186176m937633o58271N869650J4872162J5579754k890229
9413B7918843k5476215k2883178M156902J9680645L187079k0349532j8112341
9406c1877797M975897J9416025J3624394N28410q129759j1858964j0291845j583405
9398b5197044Q116504Q538567p3578p064844o275504j385968L358931Q365052
9390a1617884J3228642J3641360O630869m861949j3909783j4487903n983842M779989
9382a2580501Q233223J964894n409934l013032J0114111K2850807K1970780N260892
$$ plain form
9374 49391240 35075472 14956902 5331384 8441224 14055783 15016169 12874272 8513143
9366 8513143 -1305069 -14016167 -19145974 -13093863 -6069894 -6206808 -6789331 762796
9358 762796 11262098 15677911 17664318 25056238 31919501 26422521 12719172 6943930
9350 6943930 12181514 14923815 7942274 -25159 -932443 1360227 1058536 -1725224 -7248196
9341 -7248196 -17381385 -26685185 -25328726 -15047528 -8829072 -10507760 -9461369 -1351850
9333 -1351850 2000079 -7130822 -16814404 -12329867 2354914 11951494 10276642 2818248
9325 2818248 -3483511 -3688919 4192575 12954337 9034813 -9559516 -26416493 -26506902
9317 -26506902 -14009148 -1602657 7564143 15996988 20061028 15775451 9011203 6696029
$$ packed form
9374D9391240j4315768k0118570r625518L109840N614559R60386k141897m361129
9366H513143r818212j2711098n129807O052111P023969j36914n82523P552127
9358G62796J0499302M415813J986407P391920O863263n496980j3703349n775242
9350F943930N237584K742301o981541p967433r07284K292670l01691k783760n522972
9341g248196j0133189r303800J356459J0281198O218456j678688J046391Q109519
9333a351850L351929r130901r683582M484537J4684781R596580j674852p458394
9325B818248o301759k05408P881494Q761762l919524j8594329j6856977r0409
9317b6506902J2497754J2406491R166800Q432845M064040m285577o764248k315174
$$ plain form
9309 6696029 4421298 -4268104 -13076005 -11637179 -3309194 384102 -1359970 143385
9301 143385 6712495 12707855 17307186 22415969 21709144 8401090 -7676160 -8414945
9293 -8414945 5977757 15543031 8667145 -4208484 -9248502 -6521337 -2445211 1851142
9285 1851142 6871163 9292388 7217184 3996947 2531090 1932170 1377039 82207 -6046194
9276 -6046194 -18287865 -26728060 -19993415 -3331950 6459197 5183070 5500516 14467869
9268 14467869 22812142 21806537 15370065 8643196 -522888 -10963866 -14004739 -8800719
9260 -8800719 -7118219 -12705018 -11184418 6690415 26084139 27773725 14929381 4255267
9252 4255267 1220656 1533998 7530816 22640562 35226933 29191678 9836342 225158
$$ packed form
9309F696029k274731q689402q807901J438826Q327985L693296j744072J503355
9301A43385O569110N995360M599331N108783p06825j3308054j6077250p38785
9293h414945J4392702R565274o875886j2875629n040018K727165M076126M296353
9285A851142N020021K421225k075204l220237j465857n98920n55131j294832o128401
9276f046194j2241671q440195O734645J6661465R791147j276127L17446Q967353
9268A4467869Q344273j005605o436472o726869r166084j0440978l040873N204020
9260h800719J682500n586799J520600J7874833J9393724J689586j2844344j0674114
9252D255267l034611L13342N996818J5109746J2586371o035255j9355336r611184
$$ plain form
9244 225158 10081338 24569452 26530795 15296008 270949 -10978521 -14358918 -10039145
9236 -10039145 -4949984 -5443031 -6761567 14226 11253029 14169329 7895111 6250691
9228 6250691 15338183 23058450 18256493 7497969 3310482 5735711 5858581 598208
9220 598208 -5778841 -10099967 -11881129 -10020651 -4758968 31638 1824485 3306869
9212 3306869 6880825 9741750 9170985 7812929 8130591 6356077 -1526187 -11476607 -15860215
9203 -15860215 -13738102 -10409476 -8452663 -5248388 1217540 8994516 14570052 15543095
9195 15543095 11818430 6419046 3288053 2483369 394370 -3809487 -6249557 -4529517
9187 -4529517 -64652 7732897 21045580 33118977 29188531 7420737 -11161204 -7593571
$$ packed form
9244B25158R856180J4488114J961343j1234787j5025059j1249470l380397M319773
9236a0039145N089161m93047j318536O775793J1238803K916300o274218j644420
9228F250691R087492P720267m801957j0758524m187487K425229J22870n260373
9220E98208o377049m321126j781162J860478N261683M790606J792847J482384
9212C306869L573956K860925n70765j358056L17662j774514p882264r950420m383608
9203a5860215K122113L328626J956813L204275O465928P776976N575536R73043
9195A5543095l724665n399384l130993q04684k088999m203857k440070J720040
9187d529517M464865P797549J3312683J2073397l930446k1767794j8581941L567633
$$ plain form
9179 -7593571 7540739 8617518 -7233584 -17274141 -9266993 1559015 -424414 -7808527
9171 -7808527 -7833085 -6375178 -14988917 -25493805 -19866624 -894438 9131429 1123518
9163 1123518 -9891185 -11075163 -9457723 -14259171 -18709619 -12963942 -2585078 1048728
9155 1048728 111622 4187482 10360399 6566325 -6461336 -13468515 -7978615 -2437792
9147 -2437792 -8756200 -20879125 -25278750 -19710213 -11908459 -5908255 -53050 4253574
9139 4253574 1778940 -7685500 -16682907 -18516139 -14294268 -9767394 -7528360 -4205387
9131 -4205387 4387628 15458012 18947128 8956052 -5662622 -8980912 1845690 11775663
9123 11775663 8012032 -2671945 -4634723 4791580 14777070 18740713 20172023 20772935
$$ packed form
9179g593571J5134310J076779j5851102j0040557Q007148J0826008j983429p384113
9171g808527k4558J457907q613739j0504888N627181J8972186J0025867q007911
9163A123518j1014703j183978J617440m801448m450448N745677J0378864L633806
9155A048728r37106M075860O172917l794074j3027661p007179N489900N540823
9147b437792o318408j2122925m399625N568537P801754O000204N855205M306624
9139D253574k474634r464440q997407j833232M221871M526874K239034L322973
9131d205387Q593015J1070384L489116r991076j4618674l318290J0826602R929973
9123A1775663l763631j0683977j962778R426303R985490L963643J431310O00912
$$ plain form
9115 20772935 15794748 5287843 -1353363 1130497 4983737 2168812 -1905158 2244728
9107 2244728 10748351 11064425 2415741 -1856831 4969585 12484860 10153893 4310189
9099 4310189 7444815 17329800 20292874 13459692 9359719 14996341 19929607 13690035
9091 13690035 3958536 4418938 11355967 8489120 -5991128 -14196726 -5404251 6789555
9083 6789555 4090115 -10757402 -20299880 -17320364 -9851780 -4636068 551775 7240243
9075 7240243 10817760 8254763 2883798 -1310406 -3063101 -118129 9418870 19671027
9067 19671027 19869993 8554286 -3394568 -8170266 -10497179 -15751631 -18177011 -10419483
9059 -10419483 2279413 8582903 7526906 7193045 9216910 6423224 -3622949 -13741271
$$ packed form
9115B0772935m978187j0506905o641206K483860L853240k814925m073970M149886
9107B244728Q503623L16074q648684m272572O826416P515275k330967n843704
9099D310189L134626R884985K963074o833182m099973N636622M933266o239572
9091A3690035r731499M60402O937029k866847j4480248q205598Q792475J2193806
9083F789555k699440j4847517r542478K979516P468584N215712N187843O688468
9075G240243L577517k562997n370965m194204j752695K944972R536999J0252157
9067A9671027J98966j1315707j1948854m775698k326913n254452k425380P757528
9059a0419483J2698896O303490j055997l33861K023865k793686j0046173j0118322
$$ plain form
9051 -13741271 -18427156 -20460936 -22556681 -21207162 -14209952 -7169152 -6038929 -8170079
9043 -8170079 -7037965 -2166889 1764517 2966113 3553273 4044798 2531558 -1148335 -5178898
9034 -5178898 -9412117 -14919680 -20145459 -21712981 -19059405 -14443997 -8931906 -2927853
9026 -2927853 47359 -3585792 -9836551 -9735046 -2469356 1304907 -5436384 -14327550
9018 -14327550 -13040290 -3860033 -374528 -6658742 -11103452 -4293048 6841868 9359672
9010 9359672 1919372 -5820474 -7110517 -3224746 2772398 8550482 9283267 1143153
9002 1143153 -9775181 -10710035 913186 11361757 8184573 -1992916 -2501364 9641009
8994 9641009 19955722 17455175 8656838 5634139 8858963 10245582 7905750 8003022
$$ packed form
9051a3741271m685885k033780k095745J349519O997210P040800J130223k131150
9043h170079J132114M871076L931406J201596N87160M91525j513240l679893m030563
9034e178898m233219n507563n225779j567522K653576M615408N512091O004053
9026b927853K975212l633151o250759J01505P265690L774263o741291q891166
9018a4327550J287260R180257L485505o284214m444710O810404J1134916K517804
9010I359672p440300p739846j290043L885771N997144N778084P32785q140114
9002A143153j0918334r34854J1623221J0448571l177184j0177489n08448J2142373
8994I641009J0314713k500547q798337l022699L224824J386619k339832R7272
$$ plain form
8986 8003022 13197630 18078431 17248621 11096570 2388686 -6108816 -9250143 -2511202
8978 -2511202 9581287 15725840 12881359 11123868 17650336 24615383 22022643 14819279
8970 14819279 14192371 16773173 8356445 -11714270 -25945229 -22912696 -11804101 -5547478
8962 -5547478 -2337464 5488620 14224206 13678253 4306854 -2796508 -1603851 2727170
8954 2727170 3062963 -1719905 -7389423 -7313173 3263497 20223938 30845880 27427410
8946 27427410 17212695 11665216 10260465 4404876 -6188366 -12891062 -12810455 -11760850
8938 -11760850 -11759994 -8117573 -1771159 -1569330 -8618950 -10638653 -673599 8861965 2527332
8929 2527332 -14226718 -20438766 -7253505 11573091 18886065 14428192 10568899 13374141
$$ packed form
8986H003022N194608M880801q29810o152051q707884q497502l141327O738941
8978b511202J2092489O144553k844481j757491O526468O965047k592740p203364
8970A4819279o26908K580802q416728k0070715j4230959L032533J1108595O256623
8962e547478L210014P826084Q735586n45953r371399p103362J192657M331021
8954B727170L35793m782868n669518P6250J0576670J6960441J0621942l418470
8946B7427410j0214715n547479j404751n855589j0593242o702696Q0607J049605
8938a1760850Q56L642421O346414K01829p049620k019703R965054R535564o334633
8929B527332j6754050o212048J3185261J8826596P312974m457873l859293K805242
$$ plain form
8921 13374141 15508483 8327523 -4917850 -12844510 -10914686 -6132173 -5414177 -6739091
8913 -6739091 -6812391 -9832464 -19206855 -26198754 -19775184 -5818792 -2150560 -12855126
8905 -12855126 -22241538 -18835929 -10398981 -7150758 -4759328 3538542 9885093 2836034
8897 2836034 -11822532 -17925753 -13392439 -11825050 -19658938 -26783463 -23397923 -13689705
8889 -13689705 -7107669 -5245581 -3547453 148364 4354025 7717994 10422774 13793330
8881 13793330 19479003 26593834 30491891 28167583 23515241 22348848 23747773 22404784
8873 22404784 18254440 16302121 16886092 14218054 6505143 147853 621898 4853210
8865 4853210 5867610 882534 -7118147 -11959554 -7963570 3956223 13794700 12106954
$$ packed form
8921A3374141K134342p180960j3245373p926660J929824M782513P17996j324914
8913f739091p3300l020073r374391o991899O423570J3956392L668232j0704566
8905a2855126r386412L405609Q436948L248223K391430Q297870O346551p049059
8897B836034j4658566o103221M533314J567389p833888p124525L385540R708218
8889a3689705O582036J862088J698128L695817M205661L363969K704780L370556
8881A3793330N685673P114831L898057k324308m652342j166393J398925j342989
8873B2404784m150344j952319N83971k668038p712911o357290M74045M231312
8865D853210J014400m985076q000681m841407L995984J1919793R838477j687746
$$ plain form
8857 12106954 2416590 -2897482 739130 6219783 8690421 12569970 20335700 25138554
8849 25138554 22144163 18120722 20277416 22814223 15546683 1003134 -8710613 -9324005
8841 -9324005 -6663487 -2474023 8436923 23281757 26258111 7725515 -18592519 -28036427
8833 -28036427 -13088622 9292297 19100374 14403631 7236078 4650475 2189306 -4433524
8825 -4433524 -10107034 -7951737 -648072 3309229 2292932 2369164 5678774 6912965 3892967
8816 3892967 2767536 7115713 9386142 1269037 -12289541 -18619663 -14875813 -11132657
8808 -11132657 -15485948 -23862837 -27009040 -21670051 -11762457 -2798894 1349229 -1252903
8800 -1252903 -9940353 -21025765 -29432853 -31687628 -28562479 -25075148 -25634277 -27875763
$$ packed form
8857A2106954r690364n314072L636612N480653K470638L879549P765730M802854
8849B5138554k994391m023441K156694K536807p267540j4543549r713747o13392
8841i324005K660518M189464J0910946J4844834K976354j8532596k6318034r443908
8833b8036427J4947805K2380919R808077m696743p167553k585603k461169o622830
8825d433524n673510K155297P303665L957301j016297P6232L309610J234191l019998
8816C892967j125431M348177K270429q117105j3558578o330122L743850L743156
8808a1132657m353291q376889l146203N338989R907594Q963563M148123k602132
8800a252903q687450j1085412q407088k254775L125149L487331n59129k241486
$$ plain form
8792 -27875763 -24188568 -11779892 1944039 7708924 5248179 1393341 30773 -226152
8784 -226152 -110281 1656301 3648254 2142899 -2355979 -4437318 -1288254 3748935 6312512
8775 6312512 4962490 -938625 -11532439 -22359015 -25259861 -16909306 -3214304 6963886
8767 6963886 9571231 6397901 2896983 5556783 15931879 26384126 27953445 22932405
8759 22932405 21108848 22218772 14334540 -4229274 -14407636 -265396 25209532 33464728
8751 33464728 16305346 -5981617 -12269837 -2849191 8419221 11992438 7451094 -638585
8743 -638585 -5906009 -4712178 -815594 -535112 -2457310 563776 7725582 8028488 -3992345
8734 -3992345 -18638222 -22803557 -14700449 -1710792 9509808 14702697 10425325 -1445933
$$ packed form
8792b7875763L687195J2408676J3723931N764885k460745l854838j362568k56925
8784b26152J15871J766582J991953j505355m498878k081339L149064N037189K563577
8775F312512j350022n901115j0593814j0826576k900846Q350555J3695002J0178190
8767F963886K607345l173330l500918K659800J0375096J0452247J569319n021040
8759B2932405j823557J109924p884232j8563814j0178362J4142240K5474928Q255196
8751C3464728j7159382k2286963o288220R420646J1268412L573217m541344q089679
8743f38585n267424J193831L896584K80482j922198L021086P161806L02906j2020833
8734c992345j4645877m165335Q103108J2989657J1220600N192889m277372j1871258
$$ plain form
8726 -1445933 -11631399 -12299993 -4937145 4678317 13891479 20698123 20811559 14391422
8718 14391422 9495004 10788869 10976258 2704334 -7317060 -7716694 -912098 1559229
8710 1559229 -763867 2751255 13236301 17826980 10323717 1859568 3317405 8925015
8702 8925015 6761341 -3180824 -11163515 -11763312 -6787235 1119374 9131683 11821396
8694 11821396 6327897 -1560677 -3228842 1726599 5650680 3077565 -3934885 -9942626
8686 -9942626 -11292263 -7271089 762813 10834726 21336055 29263766 28775900 16663518
8678 16663518 74948 -7633101 -1818323 8369900 12988562 12597512 11884337 9550399
8670 9550399 2454837 -5471499 -7448152 -4147526 -1679661 -1500503 -355751 1367533
$$ packed form
8726a445933j0185466o68594P362848R615462R213162O806644J13436o420137
8718A4391422m896418J293865J87389q271924j0021394l99634O804596K471327
8710A559229k323096L515122J0485046M590679p503263q464149J457837N607610
8702H925015k163674r942165p982691n99797M976077P906609Q012309K689713
8694A1821396n493499p888574j668165M955441L924081k573115p012450o007741
8686i942626j349637M021174Q033902J0071913J0501329P927711m87866j2112382
8678A6663518j6588570p708049N814778J0188223M618662l91050p13175k333938
8670I550399p095562p926336j976653L300626K467865J79158J144752J723284
$$ plain form
8662 1367533 -221487 -4157927 -4500262 168788 4035721 2761082 -815501 -1795156 524131
8653 524131 3586426 5415280 5853016 5965302 6651816 6884952 5081419 3410599 6599222
8644 6599222 13486731 15369241 8369988 1777630 5758584 15321547 16975998 8598526
8636 8598526 436593 -3511122 -11550610 -27654270 -40913104 -39319958 -25900887 -13099692
8628 -13099692 -6601973 -2301496 4271318 12677758 20385301 25423348 26230435 22037905
8620 22037905 13711596 3468997 -5390593 -9220732 -7163343 -2812471 578340 5039498
8612 5039498 13255458 20886733 20525423 12585145 4151018 -2909163 -12635569 -22135819
8604 -22135819 -20239279 -5025022 8385632 7001404 -1432684 -155042 11886395 19398976
$$ packed form
8662A367533j589020l936440l42335M669050L866933j274639l576583r79655K319287
8653E24131L062295J828854M37736J12286O86514K33136j803533j670820L188623
8644F599222O887509J882510o999253o592358L980954R562963J654451q377472
8636H598526q161933l947715q039488j6103660j3258834J593146J3419071J2801195
8628a3099692O497719M300477O572814Q406440P707543N038047Q07087m192530
8620B2037905q326309j0242599q859590l830139K057389M350872L390811M461158
8612E039498Q215960P631275l61310p940278q434127p060181r726406r500250
8604b2135819J896540J5214257J3410654j384228q434088J277642J2041437P512581
$$ plain form
8596 19398976 12970757 117514 -7552633 -8633618 -9298306 -12586934 -15039566 -11517845
8588 -11517845 -567927 13829951 24460393 25592728 16652570 2281103 -10120308
8581 -10120308 -14075981 -8545576 721066 7057704 10012565 13297871 16858408 16929482
8573 16929482 13906974 12530358 12606293 8136267 -900204 -5206478 -396479 4392917
8565 4392917 -169946 -10012986 -16742984 -22171330 -31468126 -38157235 -31246493 -15170369
8557 -15170369 -6845355 -11050937 -13447157 -2988799 11796693 16546733 10609690 3454606
8549 3454606 -1041826 -6369583 -13348427 -18111724 -19126981 -17925038 -12275753 3392477
8541 3392477 27126306 44859847 43320197 26454300 12793166 14124699 21962329 20675620
$$ packed form
8596A9398976o428219j2853243p670147j080985o64688l288628k452632L521721
8588a1517845J0949918J4397878J0630442J132335q940158j4371467j2401411
8581a0120308l955673N530405R266642O336638K954861L285306L560537P1074
8573A6929482l022508j376616P5935m470026r036471m306274M809999M789396
8565D392917m562863r843040o729998n428346r296796o689109O910742J6076124
8557a5170369Q325014m205582k396220J0458358J4785492M750040n937043p155084
8549C454606m496432n327757o978844m763297j015257J201943N649285J5668230
8541C392477K3733829J7733541j539650j6865897j3661134J331533P837630j286709
$$ plain form
8533 20675620 10439682 7479191 19811313 33242377 29508677 11672628 439561
8526 439561 6945528 20164302 23793027 16646191 10703530 14048341 21969744 24094789
8518 24094789 16512167 5658159 723136 3192349 6119249 4427038 1970429 4822798
8510 4822798 11008562 12592114 6478749 -2602366 -9341145 -12495280 -12467297 -10188791 -9334174
8501 -9334174 -13954382 -21828055 -24655800 -17278033 -3800213 6767126 8558647 2576037
8493 2576037 -4522479 -5595618 -193191 4160740 1047439 -6526449 -11273812 -12020995
8485 -12020995 -12070878 -9682620 161802 14048212 20399997 15019046 7757143 8701700
8477 8701700 14675207 15128560 6216039 -6419101 -14918132 -14640661 -5824220 5940615
$$ packed form
8533B0675620j0235938k960491J2332122J3431064l733700j7836049j1233067
8526D39561O505967J3218774L628725p146836n942661L344811P921403K125045
8518B4094789p582622j0854008m935023K469213K926900j692211k456609K852369
8510D822798O185764J583552o113365r081115o738779l154135K7983K278506Q54617
8501i334174m620208p873673k827745P377767J3477820J0567339J791521n982610
8493B576037p098516j073139N402427M353931l113301p573888m747363p47183
8485a2020995m9883K388258R844422J3886410O351785n380951p261903R44557
8477H701700N973507M53353q912521j2635140q499031K77471Q816441J1764835
$$ plain form
8469 5940615 13334280 13972444 10807380 5532736 -2745232 -10931729 -11694168 -3759421 4561414
8460 4561414 7106462 8137108 12541908 14617725 5647219 -11185806 -22520634 -20273113
8452 -20273113 -8412917 4421535 12466882 13802410 10169611 6389239 5784119 6703523
8444 6703523 6856721 8526547 14574812 21583182 22805907 16784441 7888180 -145110
8436 -145110 -5734940 -6317053 -218940 8834253 14985434 17344279 17937511 14215990 1967658
8427 1967658 -13804335 -20030154 -11124067 3736849 12816185 14674840 13961878 10889637
8419 10889637 2656089 -7850163 -12935319 -10104415 -5338297 -4971312 -8631965 -12102503
8411 -12102503 -13666855 -14782697 -16262160 -16531076 -13260201 -5055116 7648701 21263015
$$ packed form
8469E940615P393665O38164l165064n274644q277968q186497p62439P934747Q320835
8460D561414K545048J030646M404800K075817q970506j6833025j1334828K247521
8452b0273113J1860196J2834452Q045347J335528l632799l780372o05120R19404
8444F703523J53198J669826O048265P008370J222725o021466q896261q033290
8436a45110n589830n82113O098113R053193O151181K358845N93232l721521j2248332
8427A967658j5771993o225819Q906087J4860916R079336J858655p12962l072241
8419A0889637q233548j0506252n085156K830904M766118L66985l660653l470538
8411a2102503j564352j115842j479463k68916L270875Q205085J2703817J3614314
$$ plain form
8403 21263015 29503809 28650057 22829767 20131134 21911327 20889500 13329083 7014366
8395 7014366 9487182 13088457 3678494 -16050936 -25836530 -15458798 9582 2209733
8387 2209733 -4399774 -2561217 8745547 12566033 478755 -15658706 -22255914 -19883868
8379 -19883868 -14072011 -3415675 12425928 22398871 15377424 -1847529 -10589599 -4505157
8371 -4505157 3166063 -428655 -10034652 -10958266 411030 12992001 16774489 14646556
8363 14646556 15496618 20365840 21200083 13040098 2310821 -185361 7537532 15932032
8355 15932032 14627030 3729494 -6489498 -6525403 2195029 8495430 3832966 -6891775
8347 -6891775 -9817723 1081457 14914466 15426746 188750 -16245416 -18846338 -7983140
$$ packed form
8403B1263015Q240794q53752n820290k698633J780193j021827p560417o314717
8395G014366K472816L601275r409963j9729430r785594J0377732J5468380K200151
8387B209733o609507J838557J1306764L820486j2087278j6137461o597208K372046
8379a9883868N811857J0656336J5841603R972943p021447j7224953q742070O084442
8371d505157P671220l594718r605997r23614J1369296J2580971L782488k127933
8363A4646556Q50062M869222Q34243q159985j0729277k496182P722893Q394500
8355A5932032j305002j0897536j0218992l5905Q720432O300401m662464j0724741
8347f891775k925948J0899180J3833009N12280j5237996j6434166k600922J0863198
$$ plain form
8339 -7983140 2886598 2646224 -7039793 -15991459 -17775957 -16008648 -18337666 -26137988
8331 -26137988 -32846046 -32237583 -24959423 -15765192 -7782713 -1779924 1843757 3026072
8323 3026072 1823718 -3266033 -13114615 -22399171 -21985252 -10939164 -218313 1526084
8315 1526084 -196381 3941861 10770945 9895464 1728991 -3065930 -1867872 -3864483
8307 -3864483 -12483215 -17344132 -9835614 4284883 14747257 19461478 20116143 14881705
8299 14881705 4740549 -1122596 3288748 9953981 7339309 -3292933 -11522725 -12640275
8291 -12640275 -9177818 -3053300 2824234 502860 -12432342 -22529176 -15701200 -219556
8283 -219556 2576247 -9301194 -14422032 -1028207 14995244 15130152 4291044 -1971209
$$ packed form
8339g983140J0869738k40374r686017q951666j784498J767309k329018p800322
8331b6137988o708058O08463P278160R194231P982479O002789L623681J182315
8323C026072j202354n089751r848582r284556M13919J1046088J0720851J744397
8315A526084j722465M138242O829084q75481q166473m794921J198058j996611
8307c864483q618732m860917P508518J4120497J0462374M714221O54665n234438
8299A4881705j0141156n863145M411344O665233k614672j0632242q229792j117550
8291a2640275L462457O124518N877534k321374j2935202j0096834O827976J5481644
8283b19556K795803j1877441n120838J3393825J6023451J34908j0839108o262253
$$ plain form
8275 -1971209 -2651711 -6660076 -12255171 -9749491 -657651 3524403 812132 396273 3565386
8266 3565386 -129753 -12564933 -18767227 -8492027 6216916 7197736 -4187621 -10779600
8258 -10779600 -5056758 2319818 -139676 -10000890 -17048962 -16102227 -9075723 -47147
8250 -47147 6532719 6513069 413896 -4673018 -2519700 3552712 4180457 -3468380 -11431242
8241 -11431242 -11098498 -3260947 4922712 8712963 6939135 -1515215 -14739596 -22977974
8233 -22977974 -16386846 260691 9860332 4625919 -3470130 -1071093 6636417 5649924
8225 5649924 -3772968 -8710709 -6028824 -6479263 -13443557 -14315732 -1632931 11137167
8217 11137167 7523497 -7608725 -15577340 -10439874 -4029385 -5932712 -11234858 -10329471
$$ packed form
8275a971209o80502m008365n595095K505680R091840M182054k712271m15859L169113
8266C565386l695139j2435180o202294J0275200J4708943R80820j1385357o591979
8258a0779600N722842P376576k459494r861214p048072R46735P026504R028576
8250d7147O579866j9650o099173n086914K153318O072412O27745p648837p962862
8241a1431242L32744P837551Q183659L790251j773828q454350j3224381q238378
8233b2977974O591128J6647537R599641n234413q096049K399037P707510r86493
8225E649924r422892m937741K681885m50439o964294q72175J2682801J2770098
8217A1137167l613670j5132222p968615N137466O410489j903327n302146R05387
$$ plain form
8209 -10329471 -1663825 8278282 12054263 7253267 -383228 -1199763 6552311 12730721
8201 12730721 9253637 2820295 4507299 11839701 13839769 10514725 11803637 17470320
8193 17470320 15533414 4618827 166895 10017600 19871053 15049206 3552905 3006862
8185 3006862 14117005 22287614 19705089 11467450 3405731 -2869958 -4632601 505458
8177 505458 8521835 13481289 15847243 17928941 15820302 6623573 -1327404 1129836
8169 1129836 6981138 1832775 -11575109 -14395861 639343 18628559 24153761 18711243
8161 18711243 10675966 2493426 -3807555 -1600386 9128513 15862512 9806145 -306251
8153 -306251 -1376614 4748755 6977419 4016726 4729452 12233679 19910097 23062791 23952149
$$ packed form
8209a0329471Q665646R942107L775981m800996p636495q16535P752074O178410
8201A2730721l477084o433342J687004P332402K000068l325044J288912N666683
8193A7470320j936906j0914587m451932R850705R853453m821847j1496301n46043
8185C006862J1110143Q170609k582525q237639q061719o275689j762643N138059
8177E05458Q016377M959454K365954K081698k108639r196729p950977K457240
8169A129836N851302n148363j3407884k820752J5035204J7989216N525202n442518
8161A8711243q035277q182540o300981K207169J0728899O733999o056367j0112396
8153c06251j070363O125369K228664k960693P12726P504227P676418L152694Q89358
$$ plain form
8144 23952149 23959673 20025816 11814869 5317679 5459828 9554287 11611874 10725533 12101007
8135 12101007 19815745 29963828 32653488 22204176 4199622 -10133849 -15449665 -14867717
8127 -14867717 -13100578 -12672209 -15487239 -20510541 -20247437 -8604245 7196079 13390184
8119 13390184 10100663 11541553 21222364 22969348 7079693 -9725871 -6485371 10808663
8111 10808663 18650776 9852043 -1321928 -4418305 -3585794 -3008911 -439507 1645268
8103 1645268 -4356910 -15681962 -19082203 -11677159 -6571800 -11175144 -15629003 -11608531
8095 -11608531 -7037192 -9874173 -11058192 719450 17000619 19429775 6612736 -4839707
8087 -4839707 -4211443 2661070 6629631 6031750 2126949 -5011913 -12148489 -12745938 -5039855
$$ packed form
8144B3952149P524l933857q210947o497190J42149M094459K057587q86341J375474
8135A2101007P714738J0148083K689660j0449312j8004554j4333471n315816N81948
8127a4867717J767139M28369k815030n023302K63104J1643192J5800324O194105
8119A3390184l289521J440890R680811J746984j5889655j6805564L240500J7294034
8111A0808663P842113q798733j1173971l096377Q32511N76883K569404K084775
8103A645268o002178j1325052l400241P405044N105359m603344m453859M020472
8095a1608531M571339k836981j184019J1777642J6281169K429156j2817039j1452443
8087d839707O28264O872513L968561n97881l904801p138862p136576n97449P706083
$$ plain form
8078 -5039855 5599264 14327437 20576339 22452487 15070262 -903319 -14726706 -15808068
8070 -15808068 -6192958 2330839 3022008 1336980 5635743 14457877 17765503 10650047
8062 10650047 168069 -4869149 -5582325 -7577186 -8011790 598123 13703301 15419330
8054 15419330 1357939 -11925652 -9908223 -1597885 -4892580 -18746560 -26473621 -22935727
8046 -22935727 -20265362 -25058692 -27335637 -18611445 -6555540 -2319645 -3947515 -2687879
$$ packed form
8078e039855J0639119Q728173O248902J876148p382225j5973581j3823387j081362
8070a5808068R615110Q523797O91169j685028M298763Q822134L307626p115456
8062A0650047j0481978n037218p13176j994861m34604Q609913J3105178J716029
8054A5419330j4061391j3283591K017429Q310338l294695j3853980p727061L537894
8046b2935727K670365m793330k276945Q724192J2055905M235895j627870J259636
$$ [...]
##END NTUPLES=NMR SPECTRUM
##END=
