##TITLE=31Pdec_SR35
 , 24 sc
 10.03.2021
##JCAMPDX= 6.0         $$ Bruker NMR JCAMP-DX V2.0
##DATA TYPE= NMR SPECTRUM
##DATA CLASS= NTUPLES
##ORIGIN= UXNMR, Bruker Analytische Messtechnik GmbH
##OWNER= root
$$ XWIN-NMR		Version 3.5
$$ Wed Mar 10 12:14:45 2021 Russian Standard Time (UT+4h)  she@DPX200
##.OBSERVE FREQUENCY= 81.013821
##.OBSERVE NUCLEUS= ^31P
##.ACQUISITION MODE= SIMULTANEOUS
##.ACQUISITION SCHEME= undefined
##.AVERAGES= 24
##.DIGITISER RES= 16
##SPECTROMETER/DATA SYSTEM= spect
##.PULSE SEQUENCE= zgpg30
##.SOLVENT NAME= CDCl3
##.SHIFT REFERENCE= (INTERNAL, CDCl3, 0, 248.564)
##AUDIT TRAIL= $$ (NUMBER, WHEN, WHO, WHERE, WHAT)
$$ ##TITLE= Audit trail, XWIN-NMR		Version 3.5
$$ ##JCAMPDX= 5.01
$$ ##ORIGIN= Bruker BioSpin GmbH
$$ ##OWNER= she
$$ F:/spectra/data/she/nmr/P31/1/pdata/1/auditp.txt
$$ ##AUDIT TRAIL=  $$ (NUMBER, WHEN, WHO, WHERE, WHAT)
(   1,<2021-03-10 12:12:32.82 +0400>,<she>,<DPX200>,
      <created by zg, POWCHK disabled, PULCHK disabled
       configuration hash MD5:
       00 E9 B6 7A A2 85 ED C7 34 08 36 98 17 FE 4E 26
       data hash MD5: 32K
       15 62 2A B9 DB D6 FC 41 E7 62 39 59 3D EF 19 C0>)
(   2,<2021-03-10 12:12:53.79 +0400>,<she>,<DPX200>,
      <Start of raw data processing
       efp BC_mod = 2 LB = 1 FT_mod = 6 PKNL = 1 PHC0 = -3541.583 PHC1 = 504.0006 SI = 64K 
       data hash MD5: 64K
       71 73 9B 41 CE C9 7C A9 FA D8 23 28 66 0B 74 ED>)
(   3,<2021-03-10 12:13:26.10 +0400>,<she>,<DPX200>,
      <pk PHC0 = -256.602 PHC1 = 215.2001 
       data hash MD5: 64K
       34 44 5C 35 09 A1 2E 81 E6 CC 83 AB 18 85 C8 EF>)
$$ ##END=
$$ 
$$ hash MD5
$$ 0E 87 5C 1B 33 D7 E9 E0 B3 8F 93 7E 2A 5E CD 58
##$RELAX= 
##$RELAX= 
##$RELAX= 
##$RELAX= 
##$RELAX= 
##$RELAX= 
##$RELAX= 
##$RELAX= 
$$ Bruker specific parameters
$$ --------------------------
##$DU= <F:/spectra>
##$EXPNO= 1
##$NAME= <P31>
##$PROCNO= 1
##$TYPE= <nmr>
##$USER= <she>
##$AMP= (0..31)
100 100 100 100 100 100 100 100 100 100 100 100 100 100 100 100 100 100 
100 100 100 100 100 100 100 100 100 100 100 100 100 100 
##$AQSEQ= 0
##$AQ_mod= 1
##$AUNM= <au_zg>
##$AUTOPOS= <>
##$BF1= 81.014009
##$BF2= 200.13
##$BF3= 200.13
##$BF4= 200.13
##$BF5= 200.13
##$BF6= 200.13
##$BF7= 200.13
##$BF8= 200.13
##$BYTORDA= 1
##$CFDGTYP= 0
##$CFRGTYP= 5
##$CHEMSTR= <none>
##$CNST= (0..31)
1 1 145 1 1 1 1 1 1 1 1 1 1 1 1 1 1 1 1 1 1 1 1 1 1 1 1 1 1 1 1 1 
##$CPDPRG= <waltz16>
##$CPDPRG1= <>
##$CPDPRG2= <waltz16>
##$CPDPRG3= <>
##$CPDPRG4= <mlev>
##$CPDPRG5= <mlev>
##$CPDPRG6= <mlev>
##$CPDPRG7= <mlev>
##$CPDPRG8= <mlev>
##$CPDPRGB= <>
##$CPDPRGT= <>
##$D= (0..31)
0 1 0 0 0 0 0 0 0 0 0 0.03 2e-05 3e-06 0 0 0 0 0 0 0 0 0 0 0 0 0 0 0 0 
0 0 
##$DATE= 1615363952
##$DBL= (0..7)
120 120 120 11 120 120 24 19 
##$DBP= (0..7)
150 150 150 150 150 150 150 150 
##$DBP07= 0
##$DBPNAM0= <>
##$DBPNAM1= <>
##$DBPNAM2= <>
##$DBPNAM3= <>
##$DBPNAM4= <>
##$DBPNAM5= <>
##$DBPNAM6= <>
##$DBPNAM7= <>
##$DBPOAL= (0..7)
0.5 0.5 0.5 0.5 0.5 0.5 0.5 0.5 
##$DBPOFFS= (0..7)
0 0 0 0 0 0 0 0 
$$ [...]
##$SUBNAM2= <"">
##$SUBNAM3= <"">
##$SUBNAM4= <"">
##$SUBNAM5= <"">
##$SUBNAM6= <"">
##$SUBNAM7= <"">
##$SUBNAM8= <"">
##$SUBNAM9= <"">
##$SW= 501.771253377433
##$SWIBOX= (0..15)
0 1 3 0 0 0 0 0 0 0 0 0 0 0 0 0 
##$SW_h= 40650.406504065
##$TD= 32768
##$TD0= 1
##$TE= 0
##$TE2= 300
##$TE3= 300
##$TEG= 300
##$TL= (0..7)
0 120 53 12 22 120 120 120 
##$TP= (0..7)
150 150 150 150 150 150 150 150 
##$TP07= 0
##$TPNAME0= <>
##$TPNAME1= <>
##$TPNAME2= <>
##$TPNAME3= <>
##$TPNAME4= <>
##$TPNAME5= <>
##$TPNAME6= <>
##$TPNAME7= <>
##$TPOAL= (0..7)
0.5 0.5 0.5 0.5 0.5 0.5 0.5 0.5 
##$TPOFFS= (0..7)
0 0 0 0 0 0 0 0 
##$TUNHIN= 0
##$TUNHOUT= 0
##$TUNXOUT= 0
##$USERA1= <user>
##$USERA2= <user>
##$USERA3= <user>
##$USERA4= <user>
##$USERA5= <user>
##$V9= 5
##$VALIST= <valist>
##$VCLIST= <CCCCCCCCCCCCCCC>
##$VD= 0
##$VDLIST= <DDDDDDDDDDDDDDD>
##$VPLIST= <PPPPPPPPPPPPPPP>
##$VTLIST= <TTTTTTTTTTTTTTT>
##$WBST= 1024
##$WBSW= 4
##$XGAIN= (0..3)
0 0 0 0 
##$XL= 0
##$YL= 0
##$YMAX_a= 3921
##$YMIN_a= -2409
##$ZGOPTNS= <>
##$ZL1= 120
##$ZL2= 120
##$ZL3= 120
##$ZL4= 120
##$ABSF1= 0
##$ABSF2= 0
##$ABSG= 0
##$ABSL= 0
##$ALPHA= 0
##$AQORDER= 0
##$ASSFAC= 0
##$ASSFACI= 0
##$ASSFACX= 0
##$ASSWID= 0
##$AUNMP= <proc_1d>
##$AZFE= 0.1
##$AZFW= 0.5
##$BCFW= 0
##$BC_mod= 2
##$BYTORDP= 0
##$COROFFS= 0
##$CY= -3
##$DATMOD= 1
##$DC= 0
##$DFILT= <>
##$DTYPP= 0
##$F1P= 0
##$F2P= 0
##$FCOR= 1
##$FTSIZE= 65536
##$FT_mod= 6
##$GAMMA= 0
##$GB= 0
##$INTBC= 1
##$INTSCL= 5.30512e-09
##$ISEN= 30
##$LB= 1
##$LEV0= 0
##$LPBIN= 0
##$MAXI= 10000
##$MC2= 0
##$MEAN= 0
##$ME_mod= 0
##$MI= 50
##$NCOEF= 0
##$NC_proc= -7
##$NLEV= 6
##$NOISF1= 182.463
##$NOISF2= 159.3651
##$NSP= 0
##$NTH_PI= 0
##$NZP= 0
##$OFFSET= 248.5645
##$PC= 4
##$PHC0= -3798.185
##$PHC1= 719.2007
##$PH_mod= 1
##$PKNL= yes
##$PPARMOD= 0
##$PSCAL= 0
##$PSIGN= 0
##$REVERSE= no
##$SF= 81.014009
##$SI= 65536
##$SIGF1= 159.3651
##$SIGF2= -187.1042
##$SINO= 113.3802
##$SIOLD= 16384
##$SREGLST= <1H.CDCl3>
##$SSB= 0
##$STSI= 65536
##$STSR= 0
##$SW_p= 40650.406504065
##$SYMM= 0
##$S_DEV= 0
##$TDeff= 32768
##$TDoff= 0
##$TI= <>
##$TILT= no
##$TM1= 0
##$TM2= 0
##$TOPLEV= 0
##$USERP1= <user>
##$USERP2= <user>
##$USERP3= <user>
##$USERP4= <user>
##$USERP5= <user>
##$WDW= 1
##$XDIM= 65536
##$YMAX_p= 306394758
##$YMIN_p= -42725791
$$ End of Bruker specific parameters
$$ ---------------------------------
##NTUPLES= NMR SPECTRUM
##VAR_NAME=  FREQUENCY,     SPECTRUM/REAL,   SPECTRUM/IMAG
##SYMBOL=    X,             R,               I
##VAR_TYPE=  INDEPENDENT,   DEPENDENT,       DEPENDENT
##VAR_FORM=  AFFN,          ASDF,            ASDF
##VAR_DIM=   65536,         65536,           65536
##UNITS=     HZ,            ARBITRARY UNITS, ARBITRARY UNITS
##FACTOR=    0.620285442955139, 1,           1
##FIRST=     20137.2065510759, 0,            0
##LAST=      -20513.1999529892, 0,           0
##MIN=       -20513.1999529892, -42725791,   0
##MAX=       20137.2065510759, 306394758,    0
$$ Real data points
##PAGE= N=1
##DATA TABLE= (X++(R..R)), XYDATA
$$ [...]
13016D552650O7098j164120K681575K520311k789369m878984q70613K474786P08200
13007C301534k453568k754402o37299K095865L957049K311165l235169p233540
12999d648365m868671Q3373R73493j058780o41718R67024j020442l530656N48937
12990a3195805P995552P794214o45370n117928Q1033N454876K518151l323626
12982A561097l796781j280539j947585l476509L6900O154925P174204K389948
12974F815660j496078r85754O41768Q7540j786673k959307k823020j341165J029633
12965b817396K649573K496108J882756K029392J380754j713818m936653m119999
12957c149283P58583M714222L570674j252839m610350l383019M27264K478237
$$ plain form
13016 4552650 4619748 3455628 6137203 8657514 5868145 989161 118548 2593334 3301534
13007 3301534 847966 -1906436 -2543735 -447870 3509179 5820344 2585175 -4648365
12999 -4648365 -9517036 -9433663 -8460170 -9518950 -10160668 -9193644 -10214086 -13744742 -13195805
12990 -13195805 -5200253 2593961 1948591 -3169337 -3088304 2366572 4884723 1561097
12982 1561097 -2235684 -3516223 -5463808 -8940317 -8903417 -2748492 4425712 6815660
12974 6815660 5319582 4333828 4975596 5063136 3276463 317156 -2505864 -3847029 -2817396
12965 -2817396 -167823 2328285 4211041 6240433 7621187 5907369 970716 -3149283
12957 -3149283 -2390700 2323522 5894196 4641357 31007 -3352012 -2924748 -446511
12949d46511J412235J0307N95068J529124J97153k714112m767634n494486m980406
12940a4659262j196590O071995J0597368N932905m010431q176673l461099J228074
12932g673713j061968n185651k962830M101654P926952N457430M75737l381166
12924b303555n065900l430582J676693O230623N446627N77169k276826m74243
12916C80006K321153K396928J010457J192770K459294J559937k320970n587132
12908C412443m520471m20390J746748K86815n63399K605234N895866L287388l205738
12899H524496n092787N4182M413726J285012n309981o942079k257170K858394
12891b466207L592098J42255m379789o145219k917502K601653M431578J253420
$$ plain form
12949 -446511 965724 976031 1571099 3100223 3297376 583264 -4184370 -9678856 -14659262
12940 -14659262 -15855852 -9783857 813511 6746416 2735985 -5440688 -8901787 -7673713
12932 -7673713 -8735681 -13921332 -16884162 -12782508 -4855556 601874 1077611 -2303555
12924 -2303555 -7369455 -10800037 -9123344 -2892721 2553906 3131075 854249 380006
12916 380006 2701159 5098087 6108544 7301314 9760608 11320545 8999575 3412443
12908 3412443 -1108028 -1528418 218330 505145 -58254 2546980 8442846 11730234 8524496
12899 8524496 3431709 3485891 7899617 9184629 3874648 -3067431 -5324601 -2466207
12891 -2466207 1125891 1268146 -3111643 -9256862 -12174364 -9572711 -5141133 -3887713
12883c887713j080080J435075M187233J573601l164223k950744J431583K862168
12875D06900l18700k388126l35736K013109J475272J10988J12728J48613o96268
12866E28780o26803P58406R13847p76058j265361O76278J959409O74368o18955
12857B223911M6509M11876j192667j944597N07542L177840K327241m16021j142662
12848C998972p305L22863J22746J311780K402327K30349l854828m776488j163414
12839a412998K524231K394178o7264j086928K75112J781821J244386j053082k610663
12830A988793j519080N98943j9332l684775n351203j015776N830767P751672K486030
12821G066039m917499q483495o460668p88610M745845O055575K347987j755055
$$ plain form
12883 -3887713 -4967793 -3532718 654515 2228116 -936107 -3886851 -2455268 406900
12875 406900 88200 -2299926 -2635662 -622553 852719 963707 1076435 1225048 528780
12866 528780 -98023 660383 1574230 798172 -467189 209089 2168498 2842866 2223911
12857 2223911 2270420 2682296 1489629 -454968 52574 3230414 5557655 5141634 3998972
12848 3998972 3991667 4314530 4437276 5749056 8151383 8381732 4526904 -249584 -1412998
12839 -1412998 1111233 3505411 3438147 2351219 2626331 4408152 5652538 4599456 1988793
12830 1988793 469713 1068656 1049324 -2635451 -7986654 -9002430 -3171663 4580009 7066039
12821 7066039 2148540 -6334955 -12795623 -13584233 -8838388 -2782813 -434826 -2189881
12813b189881j361541J829189K245502m54464j004114J836286K190270l113162
12805b1915p908193n141980K516179O509184M158756O60598M75672K156409K026608
12796E431318j017054n048690o896888m442832Q36443M402762L708238J337884
12788a688819R33342J964277J534980m86510j742789j463187p22425K27432J435457
12779h242J332913j049252l258514k571794m29819L92875J110852M226031P150648
12770F895698M899955j313267m876909l697275k543182m097911m606251j144701
12762a0483843L113271M486191M166130M109143K526529j994903n895566m999594
12754d972642q25801J581939K38765k446347l052999K57028O073222R096591M680054
$$ plain form
12813 -2189881 -3551422 -1722233 523269 68805 -935309 900977 3091247 -21915
12805 -21915 -7930108 -13072088 -10555909 -4046725 112031 772629 1248301 3404710 5431318
12796 5431318 4414264 -634426 -7531314 -11974146 -11137703 -6734941 -3026703 -1688819
12788 -1688819 -755477 1208800 2743780 2257270 514481 -948706 -1671131 -1443699 -8242
12779 -8242 1324671 275419 -2983095 -5554889 -5984708 -5591833 -4480981 -254950 6895698
12770 6895698 11795653 10482386 5605477 1908202 -634980 -4732891 -9339142 -10483843
12762 -10483843 -7370572 -2884381 1281749 5390892 7917421 5922518 26952 -4972642
12754 -4972642 -5798443 -4216504 -3977739 -6424086 -9477085 -9220057 -3146835 5949756 10629810
12745A0629810m120323q272436m067264J930960K511062n14872q62774K216821
12737e49016M077363K259608j148300l187690k278314J386885M733360L768844
12729I062740n87355k380212N12390K297998j351842n178350k241478M354312
12721D488203N698547N77810l610524k759643r05986k124166m208739k799002
12713e643500K320903O873811O117236m15226o779624n843144J208625M944550
12705B783631P97307l716251q17280M676793L206041l594089n751002j282812
12697c697662K000964O81251k9120K157205K091270k318776n167181k595603Q89205
12688e988447Q14694l90798L25226R23190j17772N27344M268921N967798K006421
$$ plain form
12745 10629810 6509487 -1762949 -5830213 -3899253 -1388191 -1903063 -2765837 -549016
12737 -549016 3528347 5787955 4639655 1451965 -826349 560536 5293896 9062740
12729 9062740 8475385 6095173 6607563 8905561 7553719 2375369 133891 4488203
12721 4488203 10186750 10764560 7154036 4394393 3488407 1364241 -2844498 -5643500
12713 -5643500 -3322597 3551214 9668450 9253224 2473600 -3369544 -2160919 2783631
12705 2783631 3580938 -135313 -952593 3724200 6930241 3336152 -2414850 -3697662
12697 -3697662 -1696698 -1015447 -1044567 1112638 3203908 885132 -4282049 -6877652 -5988447
12688 -5988447 -5173753 -5564551 -5239325 -4316135 -4433907 -3906563 362358 6330156 8336577
12679H336577k686487j965884J905710K360976j374166m419787l969422j547553
12671c360036O70490J529438M39940j566681k072781p01128J67134l98465m65658
12662e757747M99154L69147q90650k95923K225664K708338M88026J17475K601841
12653B065325K173574l241520o105481q51667N598270L749783l435978n441616
12645e489310o65550K596088M60210j596115P33696M084318M218177K295436R90936
12636G627886l64608l199830n690670m524693O56118N975787O122547n24265q343727
12627b265455q572398K45993Q705194P549826l62081m530608j402274K210574
12619A578771L38012m308754n867423l334298J00126K134909K707469K415030
$$ plain form
12679 8336577 5650090 3684206 5589916 7950892 6576726 2156939 -1812483 -3360036
12671 -3360036 -2689546 -1160108 -720168 -2286849 -4359630 -5060758 -4893624 -5292089 -5757747
12662 -5757747 -5258593 -4889446 -5780096 -6076019 -3850355 -1142017 -653991 -536516 2065325
12653 2065325 4238899 997379 -5108102 -5959769 -361499 3388284 -47694 -5489310
12645 -5489310 -6154860 -3558772 -3098562 -4694677 -3960981 123337 4341514 6636950 7627886
12636 7627886 7263278 4063448 -1627222 -6151915 -5495797 479990 6602537 6078272 -2265455
12627 -2265455 -10837853 -10591860 -1886666 5663160 5301079 770471 -631803 1578771
12619 1578771 1916783 -2391971 -8259394 -11593692 -11493566 -9358657 -6651188 -4236158
12611d236158J967173K005011K212483J732538Q46337N84865M55917j249705m126773
12602A91688m757477p09473N623580Q753646N839737q0101l450489k791878k228747
12593F390486m976732p546827m391938K680449N497480J256373k818792j34189
12585d043690N402676N596753M5152m522608m788470l909985m324060l730799
12577a4275031K23862N632689Q577600P283902L247786j50408n81999K22499j837365
12568H343535o556490p598612j162509O735191P332626J398919k306194j17576
12560F068890K453336Q05308k068177k142389j240604k760418n195858m977839
12552i057751k570474p22267J075931N065963R180191Q056445J029785n457204
$$ plain form
12611 -4236158 -2268985 -263974 1948509 3681047 4527384 5112249 5568166 4318461 191688
12602 191688 -4565789 -5275262 348318 9101964 14941701 14861600 11411111 8619233 6390486
12593 6390486 1413754 -6133073 -10525011 -7844562 -2347082 -1090709 -3909501 -4043690
12585 -4043690 1358986 6955739 7000891 2478283 -2310187 -6220172 -10544232 -14275031
12577 -14275031 -14051169 -8418480 159120 7443022 10690808 10540400 9958401 10180900 8343535
12568 8343535 1787045 -5811567 -6974076 -238885 7093741 8492660 6186466 6068890
12560 6068890 8522226 9327534 7259357 5116968 3876364 1115946 -4079912 -9057751
12552 -9057751 -11628225 -12350492 -11274561 -6208598 2971593 11028038 12057823 6600619
12544F600619n707631j836021q6542k178277l904620j840770K198007M418780
12536b336455L775311J553360j297699l841389m107520j533789Q78364K48907
12528f660910j506359o66549J630577Q23474k986305m249664p19626K882755K605771
12519h846836J053795J693121K547168M98843k200630j281312K344219L963895
12511b27737J958002j101366k736181k234526J53238K368258J279659k478068
12503c018721l597933K67491L959853K641992k80438O72099L223328J663401k185200
12494C345872j641130K696532L427056p43385k644952O78380K675384j275940
12486F517817n766578m263416P64984K829649J322719K15567O62210Q08520L72442
$$ plain form
12544 6600619 892988 -943033 -1029575 -3207852 -7112472 -8953242 -6755235 -2336455
12536 -2336455 1438856 2992216 1694517 -2146872 -6254392 -7788181 -6909817 -6660910
12528 -6660910 -8167269 -8833818 -7203241 -6379767 -9366072 -13615736 -14335362 -11452607 -8846836
12519 -8846836 -7793041 -6099920 -3552752 -3053909 -5254539 -6535851 -4191632 -227737
12511 -227737 1730265 628899 -2107282 -4341808 -4188570 -1820312 -540653 -3018721
12503 -3018721 -6616654 -6349163 -2389310 252682 -27756 644343 3867671 5531072 3345872
12494 3345872 1704742 4401274 7828330 7084945 4439993 5118373 7793757 6517817
12486 6517817 751239 -3512177 -2747193 82456 1405175 1620742 2282952 3091472 3463914
12477C463914K70947k65722j799791k033734O80613L302256K024647j615880l180746
12468H46504k244531j742857j498277J647971O764862P873560K416231m140651
12460I922812n538193k897313j629709k809913k556431P76010L726256L083943
12452B077462K22109j704794j793037o24224J555551L293391J430638m259712
12444A97384q160317m934859K649749O648211M144222l09070k398893k695327
12436d858900k426797k71717L823123O100619L619387j642995n726402o635059
12428h018741l669945K918899R158315Q929910J946492m018212k935610J347293
12420E658401J377350l078394n904769l945689J4494K429775K540158J260060
$$ plain form
12477 3463914 3734861 3469139 1669348 -364386 316227 3618483 5643130 4027250 846504
12468 846504 -1398027 -3140884 -4639161 -2991190 3773672 11647232 14063463 9922812
12460 9922812 4384619 1487306 -142403 -2952316 -5508747 -4732737 -1006481 2077462
12452 2077462 2299571 594777 -1198260 -1822484 -266933 3026458 4457096 197384
12444 197384 -7962933 -12897792 -10248043 -3599832 544390 235320 -2163573 -4858900
12436 -4858900 -7285697 -7557414 -3734291 2366328 5985715 4342720 -1383682 -8018741
12428 -8018741 -11688686 -8769787 388528 9318438 11264930 7246718 4311108 5658401
12420 5658401 7035751 3957357 -1947412 -5893101 -5878607 -3448832 -908674 351386
12412C51386n1846k73416p1901j189195k805169j850185J308143K105946n03240
12403b979477j095848L197585O535862L220677k536013l039751Q06633J959089
12395F068757j013930k927771j351921O83670Q62484k7431j248033k082197k37612
12386a273984M147392N517919L92219n196905l447965K774537M057244r55697
12378F014760m632084l214113q38562m01118P3897Q01109j013129m198441l815517
12369a1223198J44421K406606J937297L180014O374549N886622N51145l361857
12361E895599k413544n43643m54467N48504K710126J213595m068430n384957O34160
12352a863057N917772K768727m454843o574297k703354J008764J465265Q32250
$$ plain form
12412 351386 299540 26124 -45777 -1234972 -4040141 -5890326 -4582183 -2476237 -2979477
12403 -2979477 -4075325 -877740 5658122 8878799 6342786 3303035 4109668 6068757
12395 6068757 5054827 2127056 775135 1458805 2321289 2293858 1045825 -1036372 -1273984
12386 -1273984 2873408 8391327 8783546 3586641 138676 2913213 6970457 6014760
12378 6014760 1382676 -1831437 -2669999 -3071117 -2997220 -2196111 -3209240 -7407681 -11223198
12369 -11223198 -11078777 -8672171 -6734874 -3554860 2819689 8706311 9257456 5895599
12361 5895599 3482055 2938412 2483945 3032449 5742575 6956170 2887740 -2497217 -1863057
12352 -1863057 4054715 6823442 2368599 -4205698 -6909052 -5900288 -4435023 -3602773
12344c602773J298206K663182L475849J976490j725242l753739r04919L143974
12336B571028K116783k529137l457437p200Q86461j996015j302560M560507O315438
12327G157868n11041o406495k999386L167616K327055k268239j701893K322129
12319A087614J593210l004002l151020J904200M223350P10631k925050k475719
12311b036786l37527R13272K145135L288038J910624k062756n170331n087435
12303f437766k791808j02592J683422J641935O77341J278622L123969K227145
12295A300268k172378m314167l10298M736452M079984l19196j772857K39188Q51954
12286B318950q95227j495366m68492q18829k379164j715771J104150J937778o59113
$$ plain form
12344 -3602773 -2304567 358615 3834464 5810954 4085712 331973 -572946 2571028
12336 2571028 4687811 2158674 -1298763 -1305963 -419502 -2415517 -3718077 842430 7157868
12327 7157868 6646827 240332 -2759054 408562 2735617 467378 -1234515 1087614
12319 1087614 2680824 -323178 -3474198 -1569998 2653352 3363983 438933 -2036786
12311 -2036786 -2374313 -1461041 684094 3972132 5882756 3820000 -1350331 -6437766
12303 -6437766 -9229574 -9332166 -7648744 -6006809 -5329468 -4050846 -926877 1300268
12295 1300268 -872110 -5186277 -5496575 -760123 3319861 3000665 1227808 1466996 2318950
12286 2318950 1423723 -71643 -540135 -1358964 -3738128 -5453899 -4349749 -2411971 -3071084
12277c071084l392649l396017j008252K347048M958344M488507J023801j105953
12269H43745R75840L347659R67576l539710l257676K110587N595803L263209j239309
12260I067724l301052k861307j850630p57488N04817J496165K129354K475101
12252F902684J729515n83743l061960l882608k626413M27128M232114N290771
12244H427488N21728o290395o740257J93027N066959J773693l007637j300664
12236a356058K608963Q7127o022189n497740K017624O093893J852234l782032
12228c998178l735669P09550N050362O995342M966822j184315o331881m371627
12220a899594K070519L728110j761503o231363l537762J966865L476357J623371
$$ plain form
12277 -3071084 -6463733 -9859750 -10868002 -8520954 -3562610 925897 1949698 843745
12269 843745 1819585 5167244 6134820 2595110 -662566 1448021 7043824 10307033 9067724
12260 9067724 5766672 2905365 1054735 297247 802064 2298229 4427583 6902684
12252 6902684 8632199 8048456 4986496 1103888 -1522525 -1095397 3136717 8427488
12244 8427488 8949216 2658821 -4081436 -3888409 1178550 2952243 -55394 -1356058
12236 -1356058 1252905 1340032 -4682157 -10179897 -8162273 -2068380 -216146 -3998178
12228 -3998178 -7733847 -7024297 -1973935 5021407 9988229 8803914 2472033 -1899594
12220 -1899594 170925 3899035 2137532 -4093831 -7631593 -5664728 -2188371 -565000
12212e65000J301610L165767L343712m36180n699619p471376l037708M234816
12204e163978O964062K213458l959531m111139O71733L426299J855832M0636N06076
12195B443448R71329n89946k935132m125746l193469N0094L358127K570271k088343
12186c539367l992624K60427M137731J359581k665377N02136O927599N831947
12178H822053k179913n912261k006729J303751P7839K34380M037679M610706r77930
12169H009575n356472l377746K6307K36074L74177K349633J397327l588833m961508
12160d891466P20023M954101J132128l811887j386424L935488L285513j108346
12152B829130j028643K635135K048496l472308o622392l952331O25481L208877
$$ plain form
12212 -565000 736610 3902377 7246089 6809909 1110290 -6361086 -9398794 -5163978
12204 -5163978 1800084 4013542 54011 -4057128 -3385395 40904 1896736 1937372 2443448
12195 2443448 3414777 2824831 -110301 -4236047 -7429516 -7379422 -4021295 -1451024 -3539367
12186 -3539367 -7531991 -7271564 -3133833 -1774252 -4439629 -3937493 2990106 8822053
12178 8822053 6642140 729879 -1276850 26901 104740 339120 4376799 8987505 8009575
12169 8009575 2653103 -724643 -698336 -462262 -88085 2261548 3658875 70042 -4891466
12160 -4891466 -4171443 782658 1914786 -1897101 -3283525 651963 3937476 2829130
12152 2829130 1800487 4435622 6484118 3011810 -3610582 -7562913 -6937432 -3728555
12144c728555L288057J062303k250399l260927r25011P65190n32124q59933K346800
12135d094599M022054L72467k428468J992854P506620M067524n024375p215028
12127h00951l71070M557573J173625m232477m645694j666408O10890J861455K004346
12118a508711n06401l487393j802363L476450M553733q53481m925285k027320
12110g080771K469079J751765j364152n63582K536972J794283k239560l344896
12102f040862k49746K120448J762840K031526L875023L243741r99775l320183
12094B423012K4386M075851K146441l963791o661840l406352J139812K922593
12086a299888K407603N54718k801755n167098k362381M003895O236037J570091
$$ plain form
12144 -3728555 -440498 621805 -1628594 -4889521 -5814532 -5049342 -5581466 -6441399 -4094599
12135 -4094599 -72545 299922 -2128546 -135692 7370928 11438452 6414077 -800951
12127 -800951 -1172021 3385552 4559177 326700 -4318994 -5985402 -5374512 -3513057 -1508711
12118 -1508711 -2015112 -5502505 -7304868 -3828418 725315 -128166 -5053451 -7080771
12110 -7080771 -4611692 -2859927 -4224079 -4787661 -2250689 -456406 -2695966 -6040862
12102 -6040862 -6290608 -4170160 -2407320 -375794 3499229 6742970 5743195 2423012
12094 2423012 2447398 6523249 8669690 4705899 -1955941 -5362293 -4222481 -1299888
12086 -1299888 1107715 1662433 -1139322 -6306420 -8668801 -4664906 1571131 3141222
12078C141222k713025m86973L150555O16768m547524k881175M719733P119180
12070H118761N1764p386615o473006j46029L792286L387370J549227K25177K64228
12061C383163K423905M746510L416769r68676l289808k496662l495716p089907
12053c370422o205189K121335Q929256N528177k846632m798936M08139L631264
12045C396992O76574l553252m845256m377408l117990K44693M270300M659547
12037b645800J098422j598699r01615J86594r50617k356990j502243N89988J614865
12028f466095J471965J503196K215910K930574K376545l14712l819086m929613
12020e031316k632183j15961k9332l8929K926835O122712M043456k642653o802517
$$ plain form
12078 3141222 428197 -58776 3091779 3708547 -838977 -3720152 999581 8118761
12070 8118761 8170525 783910 -5689096 -5835125 -2042839 1344531 2893758 3118935 3383163
12061 3383163 5807068 10553578 13970347 13001671 9711863 7215201 3719485 -3370422
12053 -3370422 -9575611 -7454276 1474980 7003157 4156525 -642411 -234272 3396992
12045 3396992 4073566 520314 -4324942 -8702350 -11820340 -11575647 -7305347 -2645800
12037 -2645800 -1547378 -3146077 -4047692 -3861098 -4811715 -7168705 -8670948 -8080960 -6466095
12028 -6466095 -4994130 -3490934 -1275024 1655550 4032095 3717383 -101703 -5031316
12020 -5031316 -7663499 -7779460 -7808792 -7847721 -4920886 1201826 5245282 2602629 -4199888
12011d199888m269637J180538L646645J953934q49837j659857M64888L794215
12003F1001M846397K110034j122182o04257K262706J718179l476471o931220l323980
11994d459793L268881M298132j213915m711191N0427P438078O923961j970477
11986I624103q126791m138183L371280M102115p01272j942814J537010J850003
11978E575451k922287m458226J074870N204284R69363n085989l628715K599853
11970f71396M721659K314952J164648J151256j923490n363793k470735M609122
11962C532223O471352J174087l518885l503048l049085m303259l030811J702750
11954d524676L695470M677l616486k396479L97486P86611O04339J671601J202748
$$ plain form
12011 -4199888 -8469525 -7288987 -3642342 -1688408 -2538245 -4198102 -3733214 61001
12003 61001 4907398 7017432 5895250 5290993 7553699 9271878 5795407 -1135813 -4459793
11994 -4459793 -1190912 3107220 1893305 -2817886 -2767459 4670619 11594580 9624103
11986 9624103 1497312 -2640871 730409 4832524 4131252 2188438 3725448 5575451
11978 5575451 2653164 -1805062 -730192 4474092 5443455 357466 -3271249 -671396
11970 -671396 4050263 6365215 7529863 8681119 6757629 1393836 -1076899 3532223
11962 3532223 10003575 11177662 7658777 4155729 1106644 -3196615 -6227426 -4524676
11954 -4524676 -829206 -824529 -4441015 -6837494 -6440008 -5653397 -5049058 -3377457 -2174709
11945b174709j406892r11688M212670O080218q05725q643643o527214L186001
11937f990982Q526532N069118l89557k173883k092676k505811j631108J420153
11929g68214L414492K087312j38387k92583R43449J458415Q76661n43142l076927
11920C961076n454745m566555J18297M214652L454776o14509l018503k243766
11912d149277j206453j574752j112350J796136M321026K817911j669817m784486
11904e562062m621983k686894J28142M095667O859751M326413k379335n747473
11896e587774j487790M795325N357626J283113l88274J807584K395376j077872
11888G097314m099823l083400p61251n48281r11956N52298J709060n49917m036574
$$ plain form
11945 -2174709 -3581601 -4493289 -280619 5799599 4993874 -3649769 -10176983 -6990982
11937 -6990982 1535550 6604668 6215111 4041228 1948552 -557259 -2188367 -768214
11929 -768214 2646278 4733590 4595203 4302620 5246069 6704484 7581145 7038003 3961076
11920 3961076 -1493669 -6060224 -5941927 -1727275 1727501 1112992 -1905511 -4149277
11912 -4149277 -5355730 -6930482 -8042832 -6246696 -1925670 892241 -777576 -5562062
11904 -5562062 -10184045 -12870939 -12742797 -8647130 -1787379 2539034 159699 -5587774
11896 -5587774 -7075564 -2280239 3077387 4360500 3972226 5779810 8175186 7097314
11888 7097314 2997491 -85909 -847160 -1395441 -2307397 -1755099 -46039 -595956 -4632530
11879d632530l694478P27778M085754L198069Q17903Q05226K416766K120278l31153
11870E513613j064596J850216M464009J931424m018104o501086k666142K529557
11862B038891L285635o5773l448605m768005l977342p63129L722430N460205K282619
11853C766926k150757l292758k081645j639097o51987L562094P641323N547108
11845A0701207j169548m281246r48687K550596J038927k559436l283138j227859
11837H20816P31485J526454J192844m89200k407359k704299k063630k470319k652300
11828h515508m3361K929543J441131k506703j861822K968709L171447l394648
11820e811212o730106n82430O260021L544082l948297m501883J810126M654249
$$ plain form
11879 -4632530 -8327008 -7599230 -3513476 -315407 502496 1307722 3724488 5844766 5513613
11870 5513613 4449017 6299233 10763242 12694666 8676562 2175476 -490666 2038891
11862 2038891 5324526 5258753 1810148 -2957857 -6935199 -7698328 -3975898 1484307 3766926
11853 3766926 1616169 -1676589 -3758234 -5397331 -6049318 -2487224 5154099 10701207
11845 10701207 9531659 5250413 4301726 6852322 7891249 5331813 2048675 820816
11837 820816 1552301 3078755 4271599 3782399 1375040 -1329259 -3392889 -5863208 -8515508
11828 -8515508 -8558869 -5629326 -4188195 -6694898 -8556720 -5588011 -2416564 -5811212
11820 -5811212 -12541318 -13123748 -6863727 -3319645 -7267942 -11769825 -9959699 -5305450
11812e305450P67892k328046O8529L363435K987200J340455J881510K775232M67873
11803F018630m260980o995655m708378J053530N006205L065829k238547l801706
11795f861072M87210M148746J803096k263665j213727K863312K662798j629754
11787c056k572109J782950M496542J023742m089658m963153k329421q0532R31626
11778e803069J810428K087332P66313j311733k274815j008571K011901L951763
11770B29549J395672l995470m680238K512857Q756103M059272o616664q837953
11762g176872k37831N907993J720438l851805j445973L258477R64035m305774
11754e167312k707459L590839M174461j364072l113839J615933M100545j05972
$$ plain form
11812 -5305450 -4537558 -6865604 -6797075 -3433640 -446440 894015 2775525 5550757 6018630
11803 6018630 1757650 -5238005 -9946383 -8892853 -3886648 -820819 -3059366 -6861072
11795 -6861072 -6373862 -2225116 -422020 -2685685 -3899412 -1036100 1626698 -3056
11787 -3056 -2575165 -792215 3704327 4728069 638411 -4324742 -6654163 -6734695 -5803069
11778 -5803069 -3992641 -1905309 -1138996 -2450729 -4725544 -5734115 -3722214 229549
11770 229549 1625221 -2370249 -7050487 -4537630 4218473 8277745 1661081 -7176872
11762 -7176872 -7414703 -1506710 213728 -3638077 -5084050 -1825573 -861538 -5167312
11754 -5167312 -7874771 -4283932 -109471 -1473543 -4587382 -2971449 1129096 1023124
11746A023124l720332p22826L694043K559266j672806k487385M0606J098562l12109
11737d99857j257442r17750j154111k353071k968690k176773n7941L142836N554386
11728b688413M233753M7536j258580L344982Q504346O887859r85699p780130q362580
11719A943074l630922K544792N728984K605806m585129p531586j602679O065692
11711A538032N208933k577800o007467j006258M180647K820719j044809j500366
11703A611631j93031q80432j864114p05808l64757l346452n141744j446534K812390
11694i518851O03147m678956l725543L467257P199567L121028k165249k529951
11686h227551m01229J5553k3209K067794M401421L559459j83443l783821m768289
$$ plain form
11746 1023124 -2697208 -3420034 274009 2833275 1160469 -1326916 -1286310 -187748 -499857
11737 -499857 -1757299 -2675049 -3829160 -6182231 -9150921 -11327694 -11385635 -8242799 -2688413
11728 -2688413 1545340 1592876 334296 3679278 12183624 19071483 18085784 10305654 1943074
11719 1943074 -1687848 856944 6585928 9191734 4606605 -2924981 -4527660 1538032
11711 1538032 6746965 4169165 -1838302 -2844560 1336087 4156806 3111997 1611631
11703 1611631 1418600 538168 -1325946 -2031754 -2396511 -5742963 -10884707 -12331241 -9518851
11694 -9518851 -8915704 -13594660 -17320203 -13852946 -6653379 -3532351 -5697600 -8227551
11686 -8227551 -8628780 -8613227 -8636436 -6568642 -2167221 1392238 1208795 -2575026 -7343315
11677g343315j997787L516165P452669N741205K33989l224204k720856j468479
11669A89387j185206m43431Q6574j963868m089283j115905M290478L187116m177693
11660e221831n735644L256181J0077662L524092p270630o373504L903988P146081
11652C306395j271787q564635n617627J206802L307567K211585K681164L423188
11644F82652J497659j243958k210964k740208l654855j886564L371888O571271
11636C86921L349699k438051m572605l094122j666609m54147K198138M179838
11628b110938K339820j049177q50780K774092M560643K283832p05925j543386
11620E698181j415450j823168j672896j55190P81838o98424k998711k959912j96999
$$ plain form
11677 -7343315 -9341102 -5824937 1627732 7368937 7602926 4378722 1657866 189387
11669 189387 -995819 -1439250 -1352676 -3316544 -7405827 -8521732 -4231254 -1044138 -5221831
11660 -5221831 -10957475 -7701294 2376368 5900460 -1370170 -7743674 -3839686 3306395
11652 3306395 2034608 -6530027 -12147654 -10940852 -7633285 -5421700 -2740536 682652
11644 682652 2180311 936353 -1274611 -4014819 -7669674 -9556238 -6184350 386921
11636 386921 3736620 1298569 -3274036 -6368158 -8034767 -8488914 -6290776 -2110938
11628 -2110938 228882 -820295 -1671075 1103017 5663660 7947492 7241567 5698181
11620 5698181 4282731 2459563 786667 631477 1413315 714891 -2283820 -5243732 -5440731
11611e440731K201569J321858k127048m410686k751596J673482N132856N218488
11603H18192K377356j690653n200351o106607l374955J035101L921147M977939
11595c242831O090496O086359J032138p800431j1485214m114653P445107J0703479
11587D714450L135234n456481o175056p13950L658471L559608J009643j011618
11579B720301j253596L613J621081K621311L064667L017821J424476j803910l650271
11570G765493j533922J647660P92131k895253k662872K664156N118425m28776
11562A0467042o969550n027293K713510N097445q88239o329921m173391J783121
11554c327276M759480M307995L013294K07306m752226p486553m044482J292504
$$ plain form
11611 -5440731 -3239162 -1917304 -4044352 -8455038 -11206634 -9533152 -4400296 818192
11603 818192 3195548 1504895 -3695456 -9802063 -13177018 -12141917 -8220770 -3242831
11595 -3242831 2847665 8934024 9966162 2165731 -9319483 -13434136 -5989029 4714450
11587 4714450 7849684 2393203 -3781853 -4495803 -837332 2722276 3731919 2720301
11579 2720301 1466705 1470318 3091399 5712710 8777377 11795198 13219674 11415764 7765493
11570 7765493 6231571 7879231 8671362 5776109 3113237 5777393 10895818 10467042
11562 10467042 3497492 -1529801 1183709 6281154 5392915 -937006 -5110397 -3327276
11554 -3327276 1432204 5740199 8753493 8960799 4208573 -3277980 -7322462 -6029958
11546f029958J039822l719467m227422K492574Q590064O814138O06821j983491
11538C583081J46127J503038o00673k978458k519561j49104J998967L426244L966079
11529H375740K727863o9562k409341k895294k044173m27936K144930M521352L909018
11520A3832597l50887m738235n423521k638350O38479K391814J751243k038823
11512C424317p232458q211504j547303P114053P898409l79034p679870n730309
11504a2343699J725723N744859M437591K400547J301099j267672m358519l190826
11496e550897K094422M440768K49402m403390k833811K110635L221141L89096
11488b82634o35143J058513N74816k606363k191716L878802P667951K408863o159581
$$ plain form
11546 -6029958 -4990136 -8709603 -12937025 -10444451 -1854387 4959751 5566572 3583081
11538 3583081 3729208 5232246 4631573 1653115 -866446 -1015550 983417 4409661 8375740
11529 8375740 11103603 11034041 8624700 5729406 3685233 3257297 5402227 9923579 13832597
11520 13832597 13481710 8743475 3319954 681604 1320083 3711897 5463140 3424317
11512 3424317 -3808141 -12019645 -13566948 -6452895 1445514 1066480 -6613390 -12343699
11504 -12343699 -10617976 -4873117 -435526 1965021 3266120 1998448 -2360071 -5550897
11496 -5550897 -3456475 984293 1233695 -3169695 -6003506 -3892871 -671730 -282634
11488 -282634 -917777 140736 715552 -1890811 -4082527 -203725 7464226 9873089 3713508
11479C713508p091371J86513N654781L469128j127040j617733L38112k93920l008271
11470B23707l562709j768800j220948k083112k32790N224700Q780689N658933
11462A1019670j366610n541124m409362j377734j94474r75087j685694j198783
11454e729198j55464J72169m65072o70833Q37852K859168K938925J459951J639300
11445B886798L836239L422344k209907p731291o212485N21873M093549J602685
11437B09805j409900r68376j73618j697546k008015J658741M494094J098193m811549
11428c608171n140289L82308M160846K150144j650794k493315m26213K430135
11420d195349M607175M179675J60199l912680l085339J163448J992773k210000
$$ plain form
11479 3713508 -3377863 -3191350 2463431 5932559 4805519 3187786 3525898 3231978 223707
11470 223707 -3339002 -5107802 -6328750 -8411862 -8644652 -3419952 5360737 11019670
11462 11019670 9653060 4111936 -297426 -1675160 -1869634 -2844721 -4530415 -5729198
11454 -5729198 -5884662 -5712493 -6177565 -6848398 -6010546 -3151378 -212453 1247498 2886798
11445 2886798 6723037 10145381 7935474 204183 -6008302 -5486429 -1392880 209805
11437 209805 -1200095 -2168471 -2342089 -4039635 -6047650 -4388909 105185 1203378 -3608171
11428 -3608171 -8748460 -8366152 -4205306 -2055162 -3705956 -6199271 -6625484 -4195349
11420 -4195349 411826 4591501 4751700 839020 -2246319 -1082871 909902 -1300098
11412a300098m770466j223824L660867L861632J200614O16350J220320q90893
11404B374502m121341l217390J729927N156541M651917L226592K605179P19562
11396A3125489k668250l909487j577756M85131p22704k592156j677091N29951
11388I93127N59669j152737j539504j50386R37196J231115J891421K324199O29245
11379E723345k422991l475821j444698P76320O32917o61778n10840J278399K755830
11370B650683K579095J115777l55459o54382L08650J124830M73937q45318j043589
11361E354224m37232j018643k554526k249875L63669J651328n25694k676194o97570
11352b790513L607580N318592L702731J851505M32279k449847n424822m221381
$$ plain form
11412 -1300098 -6070564 -7294388 -3633521 228111 1428725 2045075 3265395 2374502
11404 2374502 -1746839 -4964229 -3234302 1922239 6574156 9800748 12405927 13125489
11396 13125489 10457239 6547752 4969996 5455127 4732423 2140267 463176 993127
11388 993127 1552796 400059 -1139445 -1289831 -352635 878480 2769901 5094100 5723345
11379 5723345 3300354 -175467 -1620165 -843845 -210928 -872706 -1383546 -105147 2650683
11370 2650683 5229778 6345555 5990096 5335714 5644364 6769194 7243131 6397813 5354224
11361 5354224 4916992 3898349 1343823 -906052 -542383 1108945 583251 -2092943 -2790513
11352 -2790513 817067 6135659 9838390 11689895 12122174 9672327 4247505 26124
11344B6124P50281L151800k61152m546051l929012J97479K624889K007625P88737
11335H10720J46569o02984j324836j545895k098602l119077k312094J504097N140767
11326c401335M852160J562469j153558k265944k820094k517585r21049k2859j228403
11317g916198j814848R13882M113634L368170P6852j197298q47258k506208m437514
11308a0246786j126614N975308Q172658K541167l034376j838203K103876J751521
11300D298551j908236l062901r96150L9110j307269j874575J54433K356851J547286
11291g52900k317168n805144m739393J427824P534829P571972K285065j545039
11283C660046m84279J355860k97001l191744l135529j144078r74345k124893o08615
$$ plain form
11344 26124 776405 3928205 3667053 -878998 -4808010 -4610531 -1985642 21983 810720
11335 810720 957289 354305 -970531 -2516426 -4615028 -7734105 -10046199 -8542102 -3401335
11326 -3401335 1450825 3013294 1859736 -406208 -3226302 -5743887 -6664936 -6687795 -7916198
11317 -7916198 -9731046 -8817164 -4703530 -1335360 -1258508 -2455806 -3303064 -5809272 -10246786
11308 -10246786 -11373400 -5398092 2774566 5315733 2281357 443154 2547030 4298551
11300 4298551 2390315 -672586 -1668736 -1629626 -2936895 -4811470 -4657037 -2300186 -752900
11291 -752900 -3070068 -8875212 -13614605 -12186781 -4651952 2920020 5205085 3660046
11283 3660046 3175767 4531627 4234626 1042882 -2092647 -3236725 -4211070 -6335963 -6944578
11274f944578M140078P539198N418809j164481o714396n968003P98469O497031
11266C602127M060495m334267q698545l915042L534916M933537Q01028k072830
11258b088581j355367m93556j131144q00497J584025L257861J841232j474677
11250f60704l696635k585188J977966O574691N717049j596447q226628o441419
11242h937315J600428O149972K897313j986895j626562K228234L382439P44251
11234D451865j288661l49723R35080K4464j457098p71297J294641J701985P9092
11225D620348p40574N87026J712532M88518j713958k873801l927588o203757p334359
11216a5385613m077848J718433M575612K823780L03880L35296K216856M188307
$$ plain form
11274 -6944578 -2804500 4734698 10153507 8989026 2274630 -3693373 -2894904 3602127
11266 3602127 7662622 3328355 -5370190 -9285232 -5750316 -816779 -15751 -2088581
11258 -2088581 -3443948 -3937504 -5068648 -5869145 -4285120 -1027259 813973 -660704
11250 -660704 -4357339 -6942527 -4964561 1610130 7327179 5730732 -2495896 -8937315
11242 -8937315 -7336887 -1186915 1710398 -276497 -1903059 325175 3707614 4451865
11234 4451865 3163204 2813481 3748561 3773025 2315927 1544630 2839271 4541256 4620348
11225 4620348 3879774 4466800 6179332 6667850 4953892 2080091 -1847497 -8051254 -15385613
11216 -15385613 -19463461 -17745028 -13169416 -10345636 -10041756 -9706460 -7489604 -3301297
11208c301297N491583M804120J101262l099813l880059j878559j080859j377104
11200c220726J196698N698219N537764n09953m412401p71255M546499L698800
11192A1763645j403694l616595j863558n22889j070310j501448j666513k774959
11184b656321l517508k195109n26769l13526P64004M576972P066423L719537k162516
11175D755187l520736k5930K308121R06978o11616O40729K884408L128469L91857
11166A0857467m335641q096716p244083j896220K861252L209623J188270J41108
11158c314940l21525j157915n14703K017389K834041P32306O6031K372854K086737
11149D800275k879634m710413J344826O339604J396806o062069l832238M089225
$$ plain form
11208 -3301297 2190286 6994406 8095668 4995855 1115796 -762763 -1843622 -3220726
11200 -3220726 -2024028 3674191 9211955 8702002 4289601 3518346 8064845 11763645
11192 11763645 10359951 6743356 4879798 4356909 3286599 1785151 118638 -2656321
11184 -2656321 -6173829 -8368938 -8895707 -9209233 -8445229 -3868257 3198166 6917703 4755187
11175 4755187 1234451 1208521 3516642 4423620 3812004 4452733 7337141 10465610 10857467
11166 10857467 6521826 -1574890 -8818973 -10715193 -7853941 -4644318 -3456048 -3314940
11158 -3314940 -3636465 -4794380 -5309083 -3291694 -457653 274653 340684 2713538 4800275
11149 4800275 1920641 -2789772 -1444946 4894658 6291464 229395 -3602843 486382
11141D86382M268272k958517m834916J087091L970081K38500j229254K403863
11133C431502K169776m587358p368590j138820L976713M27467l838996l58673
11125g286979M995725L553782q75044k85030L062542K402783p54345j127695o68074
11116C017665l862135p239053m481895J937166M417034K401892J415594K418506
11108B4774J242881k553646m194519j008647M235466O894220M145378k604856
11100F181051o785856k530636O166975Q354706J218704n521465m582201j191002
11092A310276j728196k253002K191790N757285J123986o026127m723003L521145
11084h25846P455550L811602k83465j104832k113022l946877k517986J426077
$$ plain form
11141 486382 4754654 1796137 -3038779 -1951688 2018393 2256893 1027639 3431502
11133 3431502 5601278 1013920 -6354670 -7493490 -3516777 -3089310 -6928306 -7286979
11125 -7286979 -2291254 1262528 387484 102454 3164996 5567779 4813434 3685739 3017665
11116 3017665 -844470 -8083523 -12565418 -10628252 -6211218 -3809326 -2393732 24774
11108 24774 1267655 -1285991 -5480510 -6489157 -2253691 4640529 8785907 6181051
11100 6181051 -604805 -3135441 3031534 11386240 12604944 7083479 2501278 1310276
11092 1310276 -417920 -2670922 -479132 5278153 6402139 376012 -4346991 -825846
11084 -825846 6629704 10441306 10157841 9053009 6939987 2993110 475124 1901201
11076A901201J552290k947277n017934j177248L251881L207658N65439j092543
11068B43467j506241q98947J455986L353822O20984n395032p341668j955841M732644
11059f690826N564048R98106l487833m695998l133501l35950K104449K850461
11051f827044K284688K156100K857710K951038J808214M54404n50456j702700
11043C431954k693346k187617J49352L027460M753116L902662Q8823m346919n404815
11034G20670k384680N34118J92377j056283j78886O42252k018175n613569m511980
11025a3674156R86456M519755K657354j212820k594863r82958J565153L241949
11017e494130L150311J930922J635001K574232J661936k897062p082310n556036
$$ plain form
11076 1901201 3453491 506214 -4511720 -5688968 -2437087 770571 1336010 243467
11068 243467 -1262774 -2161721 -705735 2648087 3269071 -2125961 -9467629 -11423470 -6690826
11059 -6690826 -1126778 -128672 -3616505 -8312503 -11446004 -11781954 -9677505 -6827044
11051 -6827044 -4542356 -2386256 471454 3422492 5230706 5685110 5134654 3431954
11043 3431954 738608 -1449009 -1299657 1727803 6480919 10383581 10472404 6125485 720670
11034 720670 -1664010 -1129892 -937515 -1993798 -2172684 -1530432 -3548607 -9162176 -13674156
11025 -13674156 -12687700 -8167945 -5510591 -6723411 -9318274 -10301232 -8736079 -5494130
11017 -5494130 -2343819 -412897 1222104 3796336 5458272 2561210 -4521100 -10077136
11009a0077136N29307M893466M646027K701322J820417J073040q07326k451666
11001B327451j833576Q97527L332287K669141j464948n341456m640203p02799
10993d756576M84684k573384l931562Q7648M106628K299865j653308p45943L447920
10984c234028L721604n18863k920873r24164J714432K723824L511939L627789
10976G701660J021463j933435o52629K916300J909218m082903p519048m521144
10968e160518P1467J539065J315994J354842R8627k338405j984724J955450M155254
10959A007052J421537j799241n12762L180119L853054K30375m572898o726319
10951c919083l383444M837251J1120008P754260l100503r802769n847745J821514
$$ plain form
11009 -10077136 -9547829 -4654363 -8336 2692986 4513403 5586443 4779117 2327451
11001 2327451 493875 1391402 4723689 7392830 5927882 586426 -4053777 -4756576
10993 -4756576 -4271892 -6845276 -10776838 -10689190 -6582562 -4282697 -5936005 -6681948 -3234028
10984 -3234028 487576 -31287 -2952160 -3876324 -2161892 561932 4073871 7701660
10976 7701660 8723123 6789688 6137059 9053359 10962577 6879674 -639374 -5160518
10968 -5160518 -5089051 -3549986 -2233992 -879150 -780523 -3118928 -5103652 -3148202 1007052
10959 1007052 2428589 629348 116586 3296705 7149759 7380134 2807236 -3919083
10951 -3919083 -7302527 -2465276 8654732 16408992 13308489 3505720 -2342025 -520511
10943e20511L378762r27366l956881k851335m68471J154162K421240K972089K127385
10934C329074J356064K010142K004434j171476n493305o477454l226402J150833
10926f518090M029939M685270K570237j634501l931347n63692N754034P484938
10918A1876788J946032m335297l954839J345298L379448n77937m036592j484409
10910D158492K891934J818395l212035m069706R18899M372577J941609j591563
10902G228602j955751k433588n430487n487086J078479P020950M699640n87459
10894D133300N84245N000645K592392m576305m876170J975730L422652l835216
10886D421273p227504J7747O578832J875618o604111o576927m34350J637369m60057
$$ plain form
10943 -520511 2858251 1930885 -2025996 -4877331 -5345802 -4191640 -1770400 1201689 3329074
10934 3329074 4685138 6695280 8699714 7528238 2034933 -4442521 -7668923 -6518090
10926 -6518090 -2488151 2197119 4767356 3132855 -798492 -1362184 4391850 11876788
10918 11876788 13822820 9487523 5532684 6877982 10257430 9679493 5642901 4158492
10910 4158492 7050426 8868821 5656786 1587080 2505979 6878556 8820165 7228602
10902 7228602 5272851 2839263 -2591224 -8078310 -6999831 21119 4720759 4133300
10894 4133300 4717545 9718190 12310582 7734277 2858107 4833837 8256489 4421273
10886 4421273 -2806231 -2788484 3790348 5665966 -938145 -7515072 -7949422 -6312053 -6772110
10877f772110M74656L978158L479805k68332j61705L995481M835575K20249l750093
10868F031684l568048k691322l314405k470926R20141K691359N56780j582247
10860c426984j08775K574058K519691M55534l03947O54457J126188M60798K09117
10851D160137J057307J594570O24858p47982m69936J261068J516657j518800n245713
10842B232166n381300j752710J361575J187164k37112j23J359078J554451K63496
10833E86685j186976k174628k735066k487939j331601k3441J162528K881007M752206
10824e57225M793484K185995j007111k220421j193271M73358J230393N20877q32651
10815C393428j076311K79201J376254Q66036K91711R33249M85761k954490n812350
$$ plain form
10877 -6772110 -6297454 -2319296 1160509 892177 730472 4725953 9561528 9781777 6031684
10868 6031684 2463636 -227686 -3542091 -6013017 -5092876 -2401517 -1844737 -3426984
10860 -3426984 -3535759 -961701 1557990 2013524 1709577 2364034 3490222 3951020 4160137
10851 4160137 5217444 6812014 7436872 6688890 6218954 7480022 8996679 7477879 2232166
10842 2232166 -3149134 -4901844 -3540269 -2353105 -2590217 -2590340 -1231262 323189 586685
10833 586685 -600291 -2774919 -5509985 -7997924 -9329525 -9352966 -8190438 -5309431 -557225
10824 -557225 4236259 6422254 5415143 3194722 2001451 2474809 3705202 4226079 3393428
10815 3393428 2317117 2596318 3972572 4838608 5130319 6063568 6549329 3594839 -2217511
10806b217511l660412O42842M08224l837359m668356Q3789L866044K339835m52058
10797g494962k14226J164590J392200K392151M429323L078840k473174n312220
10789c037478j185450L831747K921854p25726m30590K597085K827103N02174m71689
10780F829030p14472k951299m963804l320600o73274r30998j045687L066287O417763
10771A712946J850059n854392n268110L229719P426335K705275j960767o62238
10763C178827L41807l692089n668299Q36210Q518026O695240j845087n533829
10755B830806j663069J741359L20105j041570J441411L657834J082176l369026
10747E000026l833813j24153K724323J735010r66348j911593l19132J856918K208441
$$ plain form
10806 -2217511 -5877923 -5235081 -4826857 -8664216 -13332572 -13248783 -9382739 -7042904 -7494962
10797 -7494962 -7709188 -6544598 -5152398 -2760247 1669076 4747916 2274742 -3037478
10789 -3037478 -4222928 -391181 2530673 1804947 1374357 3971442 6798545 7300719 6829030
10780 6829030 6114558 3163259 -1800545 -5121145 -5794419 -6725417 -7771104 -4704817 1712946
10771 1712946 3563005 -2291387 -7559497 -4329778 3096557 5801832 3841065 3178827
10763 3178827 3520634 -171455 -5839754 -5003544 3514482 10209722 8364635 2830806
10755 2830806 1167737 2909096 3229201 2187631 3629042 7286876 8369052 5000026
10747 5000026 1166213 1042060 3766383 5501393 4535045 2623452 2304320 4161238 6369679
10738F369679j5837l076967m144443k261676O47021K439575L087348K926815O17057
10729F588572l998328o607911l004192L171219L459008k780639n755046K61291
10721h666026O758203L008234o859656q893086N25691J0072706R835376K568304
10713H349746l793739n956419m057138J226266N891182M039221l211600o707800
10705d220281j722366N156523O440419L898477K289695K84530m338574o659094
10697A129329j462805N885587N458827k275205p087566m129177O78166J477050
10689c25794K94767J074435K510338J139707k238957l349399m63269K931579K006185
10680C579592l295259p106746m280409K574333N940081L162053j158275l172058
$$ plain form
10738 6369679 6353842 3276875 -867568 -3129244 -2482223 -42648 3044700 5971515 6588572
10729 6588572 2590244 -4017667 -7021859 -3850640 -391632 -3172271 -8927317 -8666026
10721 -8666026 -1907823 1100411 -5759245 -14652331 -14126640 -4053934 5781442 8349746
10713 8349746 4556007 -1400412 -5457550 -4231284 1659898 5699119 2487519 -4220281
10705 -4220281 -5942647 -786124 5654295 9552772 11842467 12126997 7788423 1129329
10697 1129329 -333476 5552111 11010938 8735733 1648167 -2481010 -1802844 -325794
10689 -325794 -31027 1043408 3553746 4693453 2454496 -894903 -1358172 1573407 3579592
10680 3579592 284333 -6822413 -11102822 -8528489 -2588408 573645 -584630 -3756688
10672c756688m232492n141229k735973L375262O916958L686997j006894k33122
10664c127181L743764L850429j99544k700995k077496k042713l435242k641672
10656h630650J137518L573262J742434j778133k819569m49860K714971K953219
10648a556808j077404n622043m797387J658924O840241N591234J035732j319793
10640G52696j530869k566005l947227l604176k645704k788940k221037P09839
10632a7841423L184287K707403K265539M678543N987942J557619m836585n744870
10624h041545j237721K245890K180106J639592K221588K340733J673332J347336
10616D369311Q99590r0572K18312J954140J381106k118632k457229L076598O521432
$$ plain form
10672 -3756688 -7989180 -13130409 -15866382 -12491120 -5574162 -1887165 -2894059 -3127181
10664 -3127181 616583 4467012 4267468 1566473 -511023 -2553736 -5988978 -8630650
10656 -8630650 -7493132 -3919870 -2177436 -3955569 -6775138 -7224998 -4510027 -1556808
10648 -1556808 -2634212 -8256255 -13053642 -11394718 -4554477 1036757 2072489 752696
10640 752696 -778173 -3344178 -7291405 -10895581 -13541285 -16330225 -18551262 -17841423
10632 -17841423 -14657136 -11949733 -9684194 -5005651 982291 2539910 -2296675 -8041545
10624 -8041545 -9279266 -7033376 -4853270 -3213678 -992090 1348643 3021975 4369311
10616 4369311 5268901 5178329 5396641 7350781 8731887 6613255 4156026 7232624 13754056
10607A3754056Q28812p372385p283424j015479J036489j986411j759825K838616
10599i59551L718679j367915m892275l007876j163359k989428l999489l07154
10591a4968368M951327P376669O358128K337255l839361p594065m259567K679360
10583f958622M604930K67432k449022J172076O137004N834711N62243m217082
10575D953670l978345R67348M789081J686524m973137m742812L966179Q528907
10567A1197415Q40201q348384n980119J842515J046212n372167l058196P072082
10559g60441R248430j11891o690981k667917K728139K001643N10874K515032K784024
10550I556912q91656j975670J311223J234399m303649o300191r20640L180267
$$ plain form
10607 13754056 14582868 7210483 -72941 -1088420 -51931 -2038342 -3798167 -959551
10599 -959551 2759128 1391213 -3501062 -6508938 -7672297 -10661725 -14661214 -14968368
10591 -14968368 -10017041 -2640372 3717756 6055011 2215650 -5378415 -9637982 -6958622
10583 -6958622 -2353692 -2086260 -4535282 -3363206 2773798 8608509 9170752 4953670
10575 4953670 975325 1942673 6731754 8418278 3445141 -1297671 2668508 11197415
10567 11197415 12037616 3689232 -2290887 -448372 597840 -4774327 -7832523 -760441
10559 -760441 8487989 8376098 1685117 -982800 1745339 3746982 4257856 6772888 9556912
10550 9556912 8665256 6689586 8000809 9235208 4931559 -1368632 -2289272 890995
10542H90995P42246j265542J809151L129424j907452o178974l801307j66378n88161
10533g335998r45278K024262K854126j745549n147971k158224K164360K347565
10525g942707J135513J787814J721415m59197j295139q3706k70841j079126J053054
10516e432920K433965k903491r051515n305873L948687N323278N85244K606821
10508g795804Q983601N648910m067656l550860M008262M18276q789018k95619
10500e439908J8630251J4307963j1750372j8097812M109227J2848065o381576
10493H225838j0420544J6405644K1104440j6609718j8656042O8331130J48235399
10486B16616147Q9778611o7470109j48705464q4741281Q625189J8392652j9872763
$$ plain form
10542 890995 1633241 367699 2176850 5306274 3398822 -2780152 -6581459 -6747837 -7335998
10533 -7335998 -8281276 -6257014 -3402888 -5148437 -10296408 -12454632 -10290272 -7942707
10525 -7942707 -6807194 -5019380 -3297965 -3757162 -5052301 -5136007 -5406848 -6485974 -5432920
10516 -5432920 -2998955 -5902446 -14953961 -20259834 -16311147 -10987869 -10402625 -7795804
10508 -7795804 1187797 6836707 2769051 -781809 3226453 3644729 -5144289 -5439908
10500 -5439908 13190343 27498306 15747934 -2349878 1759349 14607414 8225838
10493 8225838 -2194706 14210938 35315378 18705660 49618 68380748 216616147
10486 216616147 306394758 238924649 90219185 5477904 14103093 32495745 12622982
10479A2622982k1080902Q287576J1083934r611344r248934J0043795J0262779
10472A2359886p685673r834026M904499O359004p803109r893235M497002J0474256
10464C378604J097309l463831L609152N698168k639887o177692N05657M148720
10456F156200j84791j225683M209124M770891k460463o123990k331098l29689
10448B480501k530808k71652O561585O683230j314201n004247l69171J546187
10440G781424m212129p646575k777145K197527J083346k36605K465455L237323
10432A892621p91196j914664L741523P409638K394161m211122m029282j037802
10424C453877k579341n761811l700423J290984J639780k275930k846546K208862
$$ plain form
10479 12622982 -8457920 -170344 10913590 1302246 -7946688 2097107 12359886
10472 12359886 4674213 -5159813 -255314 6103690 -1699419 -11592654 -7095652 3378604
10464 3378604 4475913 1012082 4621234 10319402 7679515 1501823 2007480 6156200
10456 6156200 5971409 4745726 8954850 13725741 11265278 5141288 2810190 2480501
10448 2480501 -50307 -321959 6239626 12922856 11608655 6604408 6235237 7781424
10440 7781424 3569295 -4077280 -6854425 -4656898 -3573552 -3810157 -1344702 1892621
10432 1892621 1101425 -813239 2928284 10337922 12732083 8520961 4491679 3453877
10424 3453877 874536 -4887275 -8587698 -7296714 -5656934 -7932864 -10779410 -8570548
10416h570548O340757M078132j484100l470181m59029K140823J17415k973532
10408d280263q20965N166210O561848P61668m223163k221637J454129j73941l443576
10399a219690j064295M219277M114748p64989k596561k71044K55224j586752m35966
10390F49952K926014J475390m401969n556963M13536M283711O00161l254064J26633
10381b737599N956428N612443j42102m146177l825828k054279p17233M51716J056671
10372e45960O68161L18768N15200K84729o5095J102875K588296R33439k913581
10363B886832l112927J964441N874556L334937j937990l372009r22683R88818
10355E703975J105382J120224N91265j945008m257308k531158K088664M107367
$$ plain form
10416 -8570548 -2229791 1848341 364241 -3105940 -3564969 -1424146 -1306731 -4280263
10408 -4280263 -5101228 64982 6626830 7388498 3165335 943698 2397827 2223886 -1219690
10399 -1219690 -2283985 1935292 6050040 5285051 2688490 2417446 2672670 1085918 649952
10390 649952 3575966 5051356 649387 -4907576 -4494040 -210329 389832 -2864232 -2737599
10381 -2737599 3218829 8831272 8689170 4542993 717165 -1337114 -2054347 -1602631 -545960
10372 -545960 122201 440969 956169 1240898 1175803 2278678 4866974 5800413 2886832
10363 2886832 -226095 1738346 7612902 10947839 9009849 5637840 4715157 5703975
10355 5703975 6809357 7929581 8520846 6575838 2318530 -212628 1876036 5983403
10347E983403J456830j592244p58019K237978K256399k153906o484118n506196
10339d559873K41608M618805L098472j628829l194489J63663L766818L186229
10331E692404m45659l233483l695720k685071l26720L615670P056570O637795
10323A2615786K182036k359506l650499k756304k525381k847753j259339K224935
10315A623975M101789K161836j442103l438201l194409j385332K047886N609201
10307F084642N017165j215089p152083n744593J392942O070746M657328J041977
10299A0153035j263735l015142m307759k977230j1243K66241k127577j891400
10291e174810K055944L627795j68844l789327k725743o98099j439813j174246
$$ plain form
10347 5983403 7440233 5847989 5089970 7327948 9584347 7430441 946323 -4559873
10339 -4559873 -4318265 300540 3399012 1770183 -1424306 -1260643 2506175 5692404
10331 5692404 5246745 2013262 -1682458 -4367529 -4694249 -1078579 5977991 12615786
10323 12615786 14797822 12438316 8787817 6031513 3506132 658379 -600960 1623975
10315 1623975 5725764 7887600 6445497 3007296 -187113 -1572445 475441 6084642
10307 6084642 11101807 9886718 2734635 -3009958 -1617016 4453730 9111058 10153035
10299 10153035 8889300 5874158 1566399 -1410831 -1422074 -1155833 -3283410 -5174810
10291 -5174810 -3118866 508929 340085 -3449242 -6174985 -6873084 -8312897 -9487143
10283i487143L368213O719244L157742k713620l236993l04927p20560l372586
10275f590630j945595K448278K594353j977167m132453j218478J802462K018267
10267g000963K209861L575970L222920N24638j422619j909119l212329m515940
10259h527581k510126J415800K165610j79448k39457K989115M388288K054055
10251A556256K58871J083224R87409j751482l582825k316544l76531Q01002K750681
10242e89939M533949K742446j133544j304278K155628K352495k420231n011500
10234A325026j691019J432487m58372k660645m13164K159521K70416k259967n53925
10225b849642J497220j601298n833738l847300K290640M860538L501085L670512
$$ plain form
10283 -9487143 -6118930 600314 3758056 1044436 -2192557 -2497484 -3218044 -6590630
10275 -6590630 -8536225 -6087947 -3493594 -5470761 -9603214 -10821692 -9019230 -7000963
10267 -7000963 -4791102 -1215132 2007788 2532426 1109807 -799312 -4011641 -8527581
10259 -8527581 -11037707 -9621907 -7456297 -7635745 -7875202 -4886087 -497799 1556256
10251 1556256 1815127 2898351 3885760 2134278 -1448547 -3765091 -4141622 -3340620 -589939
10242 -589939 3944010 6686456 5552912 4248634 6404262 8756757 6336526 1325026
10234 1325026 -365993 1066494 608122 -2052523 -2465687 -306166 -35750 -2295717 -2849642
10225 -2849642 -1352422 -2953720 -8787458 -12634758 -10344118 -5483580 -1982495 1688017
10217A688017M566090L03283p172431q286791j205751L977992P42748l933032
10209i319875j457762M586111M888570n09684k960949P02538L890892J528582
10201A348423k100422r18936K981288K883297j642815l867496j73649M583629
10193C093319M221909o95967m996803n665546l090223J476074N784683O325197
10185F452643K410551j343967q14262J326142j74809m483042n862221k514266
10177e003231J610752L467638L544577J994472j663543m635116l058842J092119
10169b651174J928208n55380j01442M349732N127153j961326r394769q059584
10161a1318582j03674M935343L218288m59697p67770K435403N580360N005576
$$ plain form
10217 1688017 6254107 6557390 -615041 -8901832 -10107583 -6129591 -5386843 -9319875
10209 -9319875 -10777637 -6191526 -1302956 -1812640 -4773589 -4071051 -180159 1348423
10201 1348423 -751999 -1670935 1310353 4193650 2550835 -1316661 -1490310 3093319
10193 3093319 7315228 6619261 1622458 -4043088 -7133311 -5657237 127446 6452643
10185 6452643 8863194 7519227 6704965 8031107 7856298 3373256 -2488965 -5003231
10177 -5003231 -3392479 75159 3619736 5614208 3950665 -684451 -3743293 -2651174
10169 -2651174 -722966 -1278346 -1379788 2969944 8097097 6135771 -3258998 -11318582
10161 -11318582 -11422256 -6486913 -3268625 -3728322 -4496092 -2060689 3519671 8525247
10153H525247Q1050n109658n180607k84652L348395J601906k345047l374045j106095
10144c843506J749387L981266N276442M176572K93129l669245m901698l482473
10136d20126q87657J429365R98973l578686q055909n720711K437128P166820M130441
10127b500362N86820L544078Q197432N821818k132306o674736m797847j571010
10119D73887l63753M98409J457827k7191l661039n146482k688174L62245J114627
10110g979644J127129K748678M682934L601357j034238n245709m152963K046458
10102d205998O647318L747438l396119n733153p30701M461553M167447J697364
10094F655149J660791J752726j473603m572984k757188Q95075J05797l791792
$$ plain form
10153 8525247 8606297 3496639 -1683968 -1968620 1379775 2981681 636634 -2737411 -3843506
10144 -3843506 -2094119 1887147 7163589 11340161 11633290 7964045 3062347 -420126
10136 -420126 -1307783 121582 1120555 -2458131 -10514040 -16234751 -13797623 -6630803 -2500362
10127 -2500362 -1913542 1630536 9827968 15649786 13517480 6842744 2044897 473887
10119 473887 110134 608543 2066370 2039179 -1621860 -6768342 -9456516 -9094271 -7979644
10110 -7979644 -6852515 -4103837 579097 4180454 3146216 -2099493 -6252456 -4205998
10102 -4205998 2441320 6188758 2792639 -2940514 -3671215 790338 4957785 6655149
10094 6655149 8315940 10068666 8595063 4022079 1264891 2159966 2265763 -1526029
10086a526029m164483k37009K412546J574496P31221J821777K741036K127465
10078E481020O06408j994244m831772l495651L692608R285669N366934l239721
10070A0871251m684534J597244M014100k114845p062052l032523L389303K546353
10062E524297l537581o312195m068018j395321K18399K757779N237639M471301
10054B896300J131147j055999j339720j960596k912656j690643J747327L980319
10046G95479K689067o44959k934899k451916J34028K175344J289167j599434k848155
10037c396278j003531Q87374k44796k757081k706158K72366K375911Q75580k174431
10028g871044k361623J433973M731669K340068l975661n654952J880893J1374464
$$ plain form
10086 -1526029 -5690512 -5927521 -3514975 -1940479 -1209258 612519 3353555 5481020
10078 5481020 6087428 4093184 -738588 -4234239 -541631 8744038 14110972 10871251
10070 10871251 6186717 7783961 11798061 9683216 2621164 -411359 2977944 5524297
10062 5524297 1986716 -4325479 -8393497 -9788818 -9570419 -6812640 -1575001 2896300
10054 2896300 4027447 2971448 1631728 -328868 -3241524 -4932167 -3184840 795479
10046 795479 3484546 2839587 -95312 -2547228 -2413200 -237856 1051311 -548123 -3396278
10037 -3396278 -4399809 -3512435 -3757231 -6514312 -9220470 -8948104 -6572193 -5696613 -7871044
10028 -7871044 -10232667 -8798694 -4067025 -1726957 -5702618 -11357570 -9476677 1897787
10020A897787J1885994L350198l763385l574442j625620l825007o665501m341155
10012f661131O84619J893193l97558m97155K115302J876678k867306o290126l731258
10003a3874742J700411M195336K990889J855613L130457N066109M372997J05664
9995I542734m733941n776018k428912P54898j28740k773525k281462R62090J947459
9986d915417m18111j291954J620288L444703J394m697704m363284j45787K164356
9977h601516K112212L824631O092834K561418n901216q478624K11446R876586
9969A697771P997567k058700o401657j052081M244834K653225r17331r70832p04534
9960D488262l783516n553134q58413N502270N325666R7917j840458Q45183J040614
$$ plain form
10020 1897787 13783781 17133979 13370594 9796152 8170532 4345525 -2319976 -6661131
10012 -6661131 -5976512 -4083319 -4480877 -4978032 -2862730 -986052 -3853358 -10143484 -13874742
10003 -13874742 -12174331 -7978995 -4988106 -3132493 -2036 5064073 9437070 9542734
9995 9542734 4808793 -967225 -3396137 -2641239 -2769979 -5543504 -7824966 -6862876 -4915417
9986 -4915417 -5333528 -6625482 -5005194 -1560491 -1559097 -6256801 -10620085 -10765872 -8601516
9977 -8601516 -6489304 -2664673 3428161 5989579 88363 -8390261 -8178815 1697771
9969 1697771 9695338 7636638 1234981 182900 4427734 7080959 6163628 5192796 4488262
9960 4488262 704746 -4848388 -5706801 -204531 5121135 5219052 3378594 4223777 5264391
9951E264391m229260q731447o854913j305516K231402K584288J921315J365667
9943g754073J017776J332752J995999J752641P00703J47333m39157k799870n352017
9934i397913l552413L220169Q936752P701351O04546o217691p972903m307953
9926a0986055J196859L417289N39746k679727k14945O060727P651005J533451
9918F518350n096244n480150k405692j487255j248075K689315P664423P031817
9910H186489J502680j285947J245048L290160Q69526k447911k933276k630800
9902E795969l787077l714252l42651K613187J971418J595975N428508Q247588
9894A7808665K481964p946735j0959750m023933K012579k33146m362233k293145
$$ plain form
9951 5264391 1035131 -7696316 -14551229 -15856745 -13625343 -11041055 -9119740 -7754073
9943 -7754073 -6736297 -5403545 -3407546 -1654905 -954202 -806869 -1246026 -4045896 -9397913
9934 -9397913 -12950326 -9730157 -793405 6907946 7512492 1294801 -6678102 -10986055
9926 -10986055 -9789196 -6371907 -5832161 -8511888 -8726833 -2666106 4984899 6518350
9918 6518350 1422106 -4058044 -6463736 -7950991 -9199066 -6509751 1154672 8186489
9910 8186489 9689169 8403222 9648270 12938430 13807956 11360045 8426769 5795969
9902 5795969 2008892 -1705360 -2048011 565176 2536594 4132569 9561077 17808665
9894 17808665 20290629 12343894 1384144 -2639789 -627210 -860356 -5222589 -7515734
9886g515734K875837M120524K578626K696328K065479k528648m687103K055516
9878A660825Q140981j497596k0687088k4746997n595916J4251200J3317979L15723
9870a4840889l276447L713717N723442r28111m023366J579332O207498L329610
9862b515214q33603l46778J075963q16926l278293l370038l004959k860152j18437
9853a6068437M051344L942725j91873q03551L904017N972292J477347k585224
9845c01360j177542K15121k597269l362661K443723O862981K359003l714837p41863
9836a4704O443918N129725l828885p520429k101978K541129K11839l046353r93404
9827c179142L334234M321160J549594k368675m856225k711670M380911Q978316
$$ plain form
9886 -7515734 -4639897 -519373 2059253 4755581 6821060 4292412 -394691 1660825
9878 1660825 9801806 8304210 -12382878 -37129875 -42725791 -28474591 -15156612 -14840889
9870 -14840889 -18117336 -14403619 -8680177 -9608288 -13631654 -12052322 -5844824 -2515214
9862 -2515214 -3348817 -3695595 -2619632 -3436558 -6714851 -10084889 -13089848 -15950000 -16068437
9853 -16068437 -12017093 -8074368 -8266241 -9069792 -5165775 806517 2283864 -301360
9845 -301360 -1478902 -1263781 -3861050 -7223711 -4779988 2082993 4441996 727159 -14704
9836 -14704 6429214 11558939 7730054 209625 -1892353 648776 860615 -2185738 -3179142
9827 -3179142 155092 4476252 6025846 3657171 -1199054 -3910724 470187 9448503
9819I448503L005514q934265j2669570l482520P313383Q625867L175806n26660
9811E956058j131323k014822k581513l75111K182159R77337k207768k132707J297610
9802c0080K983097N53569l012076m581504l981459j720160J954819M806214L394029
9793C66449j981180n941543m012851J603362M608884K414837j071739j155492
9785e169273J443872K397092M97479r90458j75257K29908k146325m510177k724903
9776a1148042K129395N062355L986960J442532J10507J53922O72992O46098r97343
9767B059376l275416k499339K586522O777535M484734j472512l163204P67754
9759F265450L502119J028692k438344k523399j373792k286658l393693j643632
$$ plain form
9819 9448503 12454017 3519752 -9149818 -12632338 -5318955 3306912 6482718 5956058
9811 5956058 4824735 2809913 228400 -146711 2035448 3012785 805017 -1327690 -30080
9802 -30080 2953017 3506586 494510 -4086994 -8068453 -9788613 -7833794 -3027580 366449
9793 366449 -1614731 -7556274 -11569125 -9965763 -5356879 -2942042 -4013781 -5169273
9785 -5169273 -3725401 -1328309 -830830 -1821288 -1996545 -1766637 -3912962 -8423139 -11148042
9776 -11148042 -9018647 -3956292 30668 1473200 1583707 1737629 2410621 3056719 2059376
9767 2059376 -1216040 -3715379 -1128857 5648678 10133412 8660900 5497696 6265450
9759 6265450 9767569 10796261 8357917 5834518 4460726 2174068 -1219625 -2863257
9751b863257J244367J881260J044436J573099K867906K064022r81292l784468
9743C046073m913375m354222j913169J623233L513213K314554L56776J75827O69498
9734E18408k26681j560274j466056o57714j40163J623046M882929N231542j39710
9725H065327n569373l534315L324895M936961j187554o242505l679413J799134
9717b086843L013366P85361j51934J31736r83950j919997J95328K565622L39920
9708A888609m108948l454309K640314N694684Q91462n577376n666506n44351K511791
9699e724630O30218k536491l307872j786601K69975J631041J601501M78028m6258
9690h791089J292773L603794N087496M655927J477383m297399q823210o639857
$$ plain form
9751 -2863257 -1618890 262370 1306806 2879905 5747811 7811833 6830541 3046073
9743 3046073 -1867302 -6221524 -8134693 -6511460 -2998247 -683693 -326917 -151090 518408
9734 518408 291727 -1268547 -2734603 -3392317 -3532480 -1909434 2973495 8205037 8065327
9725 8065327 2495954 -1038361 2286534 7223495 6035941 -206564 -3885977 -2086843
9717 -2086843 926523 1711884 1559950 1691686 707736 -1212261 -1016933 1548689 1888609
9708 1888609 -2220339 -5674648 -3034334 2660350 3551812 -2025564 -7692070 -8236421 -5724630
9699 -5724630 -5094412 -7630903 -10938775 -12725376 -12455401 -10824360 -9222859 -8744831 -8791089
9690 -8791089 -7498316 -3894522 1192974 5848901 7326284 3028885 -5794325 -12434182
9682a2434182J355117O410899L225894j652596M98846O379070N377786l274563
9674E886271q845396n732637r39772j280952l275432j565525J527654K069207
9666a2156582K495780N396821N916035l55131p036555m678104M314406Q504213
9658B400883L629441l362293n741665l581137Q64902N699926O953728J944670
9650H808455m267878l917100J396766K365138l195698o707887k689792L177862
9642e030134M081020J669542M52632L4545j357895j893199l32577K74469j669595
9633c771192k210633J347871M835834L724427P3741k262694l815268n236792l034993
9624a0349699L466114O890116J886013m803702l838608J582477J062485n266648
$$ plain form
9682 -12434182 -11079065 -4668166 -1442272 -3094868 -2596022 3783048 9160834 5886271
9674 5886271 -2959125 -8691762 -9631534 -10912486 -14187918 -15753443 -14225789 -12156582
9666 -12156582 -9660802 -4263981 1652054 1296923 -5739632 -10417736 -6103330 2400883
9658 2400883 6030324 2668031 -3073634 -6654771 -5789869 -89943 6863785 8808455
9650 8808455 4540577 623477 2020243 4385381 1189683 -5518204 -8207996 -5030134
9642 -5030134 -949114 720428 1173060 1207605 -150290 -2043489 -2376066 -2101597 -3771192
9633 -3771192 -5981825 -4633954 201880 3926307 4000048 1737354 -2077914 -7314706 -10349699
9624 -10349699 -6883585 6531 1892544 -2911158 -6749766 -5167289 -4104804 -9371452
9616i371452o635289O23382P254601N791949M90402j862230j916837k807255k657373
9607a1090102J172728N402304N016117J093928j157621j79113R50588O5927j573335
9598b98579j894973m56488J339855J181655j660854m060022j901901L617257O152732
9589B018682K814317j418421j323558N63817j199710n137636m727036P01407M246445
9580c461693K195256l57931J566827M127791R97030n157348n270599K202008P615208
9571D456549L496481m503693n580613R76568N561268K611517k186360j699687
9563C132030J789471J001499m373914o802415k067674M535966N665173J495492
9555D375628j951017j804292j119493k609596l954819j776779K480018M294055
$$ plain form
9616 -9371452 -16006741 -15383359 -8128758 -2336809 -1846407 -3708637 -5625474 -8432729 -11090102
9607 -11090102 -9917374 -4515070 501047 1594975 437354 258241 1208829 1274756 -298579
9598 -298579 -2193552 -2650040 -1310185 -128530 -1789384 -5849406 -7751307 -4134050 2018682
9589 2018682 4832999 3414578 2091020 2654837 1455127 -3682509 -8409545 -7708138 -3461693
9580 -3461693 -1266437 -1624368 -57541 4070250 5067280 -90068 -5360667 -3158659 4456549
9571 4456549 7953030 3449337 -2131276 -1154708 4406560 7018077 4831717 3132030
9563 3132030 4921501 5923000 1549086 -5253329 -7321003 -2785037 2880136 4375628
9555 4375628 2424611 620319 -499174 -3108770 -7063589 -8840368 -6360350 -2066295
9547b066295K768049J594625K682154K915218k93548l761735k948442N90294J216690
9538B697010k016617m136127k604988j185877k824422l935276k96889N131683
9530i171503N885822J607780j731020r41212N25073q93947l226790k640063L98882
9521a0186978K058409R29632k43855J194901M041920M803641K096116j792798
9513B900988l743509l033576j008740J305254L467927M030890J373576l019978
9505B272832m700260j603620K671065L380110R61558k17054J281913K090480j44300
9496E992724k586015j428641J855792K074486k029106n219374k729411K685459
9488a384086L940123q22999n566472m321189J407500N459612M805972J573976
$$ plain form
9547 -2066295 701754 2296379 4978533 7893751 7600203 3838468 890026 1480320 2697010
9538 2697010 680393 -3455734 -6060722 -7246599 -10071021 -14006297 -14303186 -9171503
9530 -9171503 -3285681 -1677901 -3408921 -4350133 -3825060 -4719007 -7945797 -10585860 -10186978
9521 -10186978 -8128569 -7198937 -7442792 -6247891 -2205971 2597670 4693786 2900988
9513 2900988 -842521 -3876097 -4884837 -3579583 -111656 3919234 5292810 2272832
9505 2272832 -2427428 -4031048 -1359983 2020127 2981685 2764631 4046544 6137024 5992724
9496 5992724 3406709 1978068 3833860 5908346 3879240 -1340134 -4069545 -1384086
9488 -1384086 2556037 1733038 -3833434 -8154623 -6747123 -1287511 3518461 5092437
9480E092437j134515k274661k355489k452392l135193k691309J569863P847070
9472D65811Q970600J514974p189380p462952p40518K929784j5236k979118j568236
9463f074271K00575n85873K49957M740998O364003N33468n701195l337447M539866
9454I30081P587589L200836k388559n034240n561396l852286P40051M220709K082516
9445A925301k141607j279323L262885L405793j387522k627320K388745N299619
9437H846571P07984m610365l124802J160308K3737n222258o223439r84458L505169
9428e921553J987420k060266j939189L276480P540425N130693k005675n917143
9420I1192k575346K620040K448773j895955l609818j260126K44907q93217j144904
$$ plain form
9480 5092437 3957922 1683261 -672228 -3124620 -6259813 -8951122 -7381259 465811
9472 465811 9436411 10951385 3762005 -3700947 -4441465 -1511681 -1526917 -4506035 -6074271
9463 -6074271 -5873696 -6459569 -6209612 -1468614 4895389 5428857 -272338 -3609785 930081
9454 930081 8517670 11718506 9329947 4295707 -1265689 -5117975 -4377924 -157215 1925301
9445 1925301 -216306 -1495629 1767256 5173049 3785527 1158207 3546952 8846571
9437 8846571 9554555 4944190 1819388 2979696 3003433 -2218825 -8442264 -9426722 -5921553
9428 -5921553 -3934133 -5994399 -7933588 -4657108 2883317 8014010 6008335 91192
9420 91192 -2484154 135886 2584659 688704 -2921114 -4181240 -3936333 -4829550 -5974454
9411e974454J63524p83897l351147j163756O032785Q651064J798658n213536k437578
9402b278337M947096M831971k879903p056457l005397K001543J715916n64461
9394b288029L85870L168839L184588K4295k439172j315007J995642K950931j421426
9385D246531p938401r416094l502427L624483N606372M201267M331894M763895
9377E917520J005904m785389n357642J24009M275271K725595l29209k74748J125435
9368D426746N61452j016520j363123j079424j135226l07028J569251J716172q69390
9359B502910k620994q01395J922169J920163J48963n79356n59224j241213j336448
9350f44425O07541K325253J253409m32728P42290K967473J613968k744696m671356
$$ plain form
9411 -5974454 -5810930 -6594827 -9945974 -11109730 -5076945 3574119 5372777 159241 -2278337
9402 -2278337 2668759 7500730 4620827 -2435630 -5441027 -3439484 -1723568 -2288029
9394 -2288029 -1902159 1266680 4451268 4475563 2036391 721384 2717026 5667957 4246531
9385 4246531 -3691870 -13107964 -16610391 -12985908 -7379536 -3178269 1153625 5917520
9377 5917520 6923424 2138035 -3219607 -3095598 1179673 3905268 3576059 3301311 4426746
9368 4426746 4988198 3971678 2608555 1529131 393905 86877 1656128 3372300 2502910
9359 2502910 -118084 -919479 1002690 2922853 3071816 2492460 1933236 692023 -644425
9350 -644425 -36884 2288369 3541778 3109050 3851340 6818813 8432781 5688085 1016729
9341A016729k248086N89546R27506N30221R47463L37004j992300k551702R21749
9332a521870M520859L112898j877321m230057j743431J078037j35058l577281
9324d373224m027037J18353M689437M640675l9933m252025l745798J3265K363219
9315d613068J870898J311465J958348Q76107l540269o772735l432980M261617
9307h080617Q225683M822559j074116l316661j591938M65460N78224j073622l107749
9298d152777l152258L06060M303162L197343l197306p287513l508604L411215
9290a0080678N332353K438975J123211K367064R19315l659220m364103J610217
9282d312866O774368M264882j610912k393064J686466L342570k4398l815041m534764
$$ plain form
9341 1016729 -1231357 -641811 285695 815916 1763379 2100383 108083 -2443619 -1521870
9332 -1521870 2998989 6111887 4234566 4509 -1738922 -660885 -795943 -4373224
9324 -4373224 -8400261 -8281908 -3592471 1048204 1008271 -3243754 -6989552 -6976287 -4613068
9315 -4613068 -2742170 -1430705 527643 1403750 -2136519 -8909254 -12342234 -8080617
9307 -8080617 145066 4967625 3893509 576848 -1015090 -549630 28594 -1045028 -4152777
9298 -4152777 -7305035 -6998975 -2695813 501530 -2695776 -9983289 -13491893 -10080678
9290 -10080678 -4748325 -2309350 -1186139 1180925 2100240 -1558980 -5923083 -4312866
9282 -4312866 2461502 6726384 5115472 2722408 4408874 7751444 7727046 3912005 -622759
9273f22759l493073j798340J698805N718648N617968P9985n564499n833872j737041
9264e934178J896496K888615K490348J969810J645774J900723K360830J277937
9256A0496355j730585l804188k719300j174397l132513o531871m809279K963092
9248a0442686Q660913N483395k139607m339813M12703L688607n3200n347719m141417
9239h218824K245030N263493J523023k987905k068728K323192L918922J218620
9231C216823j350350n02121J603785J355818p56386j188312J019747K655387J208860
9222G263251j283424j524320k74282r76267l625010m090904n68967L220498L402857
9213A543432R98752j192153l268881n906361o436884k388466K936223M019701
$$ plain form
9273 -622759 -4115832 -5914172 -4215367 1503281 7121249 7201234 1636735 -4197137 -5934178
9264 -5934178 -4037682 -1149067 1341281 3311091 4956865 6857588 9218418 10496355
9256 10496355 8765770 4961582 2242282 1067885 -2064628 -8596499 -13405778 -10442686
9248 -10442686 -1781773 3701622 1562015 -2777798 -2365095 1323512 1270312 -4077407 -8218824
9239 -8218824 -5973794 -710301 812722 -2175183 -4243911 -1920719 1998203 3216823
9231 3216823 1866473 1364352 2968137 4323955 3567569 2379257 3399004 6054391 7263251
9222 7263251 5979827 4455507 4181225 3204958 -420052 -4510956 -5079923 -1859425 1543432
9213 1543432 2542184 1350031 -1918850 -7825211 -14262095 -16650561 -13714338 -9694637
9205i694637J433725P95452L426983M225227K31638m486417n055010k065602J169427
9196a0019214L347962M173708K547418r06738k752580j282161Q62048J314550
9188b715007J647154L155469K897651j535701o356629n884373p45810L188011
9180f349235L072366J610821J607016K323510J882754J11218j729584k066641
9172D62225J7228L235894M280935J409661l024265n265323m179899j253756J465907
9163b851393J931531p29538l694454k381243K666485M887603J172029k444767
9155a443747K15096N198509M305009j824455m898551k092050P67650j35548j158410
9146a066497J045209L502040K290086j466063m326491m905018k998612J186981
$$ plain form
9205 -9694637 -8260912 -7465460 -4038477 186750 418388 -4068029 -9123039 -11188641 -10019214
9196 -10019214 -6671252 -2497544 49874 -856864 -3609444 -4891605 -4029557 -2715007
9188 -2715007 -1067853 2087616 4985267 3449566 -2907063 -8791436 -9537246 -6349235
9180 -6349235 -3276869 -1666048 -59032 2264478 4147232 4258450 2528866 462225
9172 462225 479453 3715347 7996282 9405943 6381678 1116355 -3063544 -4317300 -2851393
9163 -2851393 -919862 -1649400 -5343854 -7725097 -5058612 -171009 1001020 -1443747
9155 -1443747 -1228651 3969858 8274867 6450412 1551861 -540189 227461 91913 -1066497
9146 -1066497 -21288 3480752 5770838 4304775 -21716 -4926734 -7925346 -6738365
9138f738365M662759L281889j763372l996070r36296K000179L38869k342863r83042
9129f476312K317414K265089p50536k252960j541002j255936p76916K767564P085425
9120A381830N627847k214263q034383m920482L347658P396077L698607k727917
9112C554974n329418k303315L322066O846202N119740q67247o006824n538182
9104a202004k90486L953041L090449q32098l032740k296087j502382k458417l130409
9095g701133r74005L167537O006491N347569J620656k673661m084477p76866M428420
9086D360531N666417R16092m663884n083733j402395L71598j923625m268704k997141
9077i024844N63831L041924L006827O56044l129294n687136l736283J959684N695572
$$ plain form
9138 -6738365 -2075606 1206283 -557089 -4553159 -5489455 -3489276 -3150407 -5493270 -6476312
9129 -6476312 -4158898 -1893809 -2644345 -4897305 -6438307 -7694243 -8471159 -5703595 1381830
9120 1381830 7009677 4795414 -3238969 -8159451 -4811793 2584284 6282891 3554974
9112 3554974 -1774444 -4077759 -755693 6090509 11210249 10343002 4336178 -1202004
9104 -1202004 -1492490 2460551 5551000 4718902 1686162 -609925 -2112307 -4570724 -7701133
9095 -7701133 -8675138 -5507601 498890 5846459 7467115 4793454 708977 -67889 4360531
9086 4360531 10026948 10943040 6279156 1195423 -206972 164626 -1758999 -6027703 -9024844
9077 -9024844 -8461013 -5419089 -2412262 -1756218 -4885512 -10572648 -14308931 -12349247 -6653675
9068f653675L437884j529043k652640J286343M939959L806475k85032k533591
9060a83320j691023n42460n98608K70381L339561N102547J566414m709846o610998
9051d057352k195840K496519K587477J208559K992438N191947J773660n774051
9043D223357q899321l762154L468855N004133O49752l665869l517329L4526K516218
9034c947832J029364k244602k473332Q82663K407775j175466m844560k264507
9026a2630497M010251N973617K110247j496649j357572Q706J114525L517618N405195
9017F655441J978676n016272o922895j247241L530371J211843k687855j306911
9009c804843J992615Q41810k204228p79204L127873K482536k234363l979596j291144
$$ plain form
9068 -6653675 -3215791 -4744834 -7397474 -6111131 -1171172 2635303 2350271 -183320
9060 -183320 -1874343 -2416803 -3015411 -2745030 594531 5697078 7263492 2553646 -4057352
9051 -4057352 -6253192 -3756673 -1169196 39363 3031801 8223748 9997408 4223357
9043 4223357 -4675964 -8438118 -4969263 34870 684622 -2981247 -6498576 -6464050 -3947832
9034 -3947832 -2918468 -5163070 -7636402 -6753739 -4345964 -5521430 -10365990 -12630497
9026 -12630497 -8620246 -2646629 -536382 -2033031 -3390603 -3381897 -2267372 1250246 6655441
9017 6655441 8634117 3617845 -3305050 -4552291 -1021920 189923 -2497932 -3804843
9009 -3804843 -1812228 -970418 -3174646 -3953850 -825977 1656559 -577804 -4557400 -5848544
9000e848544L53518p94621k48847L259464M643386J400083j880087j198788J113392
8991G98956J817270K071357L298828K888530j142520n021722l976254K20628J609790
8982B564863j000271k428695P49962M650799L263289k964954p066827m260071
8974f491905K015172M528610J090281l654433m689757j839417K027084M879654
8966b134711N829401L928741p07275n395885o537674l063356K179170M495837
8958a405752J647188l089131l823534K70377K973640J73875k647168J403493P779367
8949C282355N507417m966137j0315277m163482L225682J849995k387332Q22328
8941g144451P813288P058117j416279o323237l113992J034303O91666r73277q67184
$$ plain form
9000 -5848544 -5495026 -6289647 -6538494 -3279030 1364356 2764439 884352 -314436 798956
8991 798956 2616226 4687583 7986411 10874941 9732421 4710699 734445 955073 2564863
8982 2564863 1564592 -864103 -114141 4536658 7799947 4834993 -2231834 -6491905
8974 -6491905 -4476733 51877 1142158 -2512275 -7202032 -9041449 -7014365 -2134711
8966 -2134711 3694690 7623431 6916156 1520271 -5017403 -8080759 -5901589 -1405752
8958 -1405752 241436 -2847695 -6671229 -6400852 -3427212 -3253337 -5900505 -4497012 3282355
8949 3282355 8789772 3823635 -6491642 -10655124 -7429442 -5579447 -7966779 -7144451
8941 -7144451 668837 7726954 6310675 -12562 -3126554 -2092251 -1400585 -2373862 -3241046
8932c241046j177534k752983k082532J628065L895567K640842J448851K336022
8924B695252K339485K68370m48043R27834j32428m356133m777585K109433Q276679
8915F902864M827311m458024q546870m747204k72139K77595K66679K819158M885763
8906A955133K873000r79590k017703j21106P53124j153364l161845k545613l15565
8897d713529P99072J39888j166381k768337m505132m210793J7992N220059N736802
8888e450359J295305j854413j22975K426052J839347J194516M021333O055249
8880I404055J430810o287412q014253k577033K326795K147774q749j221322k513687
8871e313022l404623j010830L180294L440282p03828k668185N90839L778806K525064
$$ plain form
8932 -3241046 -4418580 -7171563 -9254095 -7626030 -3730463 -1089621 359230 2695252
8924 2695252 5034737 5303107 4855064 5782898 5650470 1294337 -3483248 -1373815 6902864
8915 6902864 11730175 7272151 -1274719 -6021923 -6294062 -6016467 -5749788 -2930630 1955133
8906 1955133 4828133 3848543 1830840 1709734 2462858 1309494 -1852351 -4397964 -4713529
8897 -4713529 -3914457 -3774569 -4940950 -7709287 -12214419 -16425212 -16407220 -11187161 -5450359
8888 -5450359 -4155054 -6009467 -6132442 -3706390 -1867043 -672527 3348806 9404055
8880 9404055 10834865 4547453 -3466800 -6043833 -3717038 -1569264 -1578013 -2799335 -5313022
8871 -5313022 -8717645 -9728475 -6548181 -3107899 -3811727 -6479912 -5889073 -2110267 414797
8862D14797j11595n36671o59610k214341k078279J217943K829546n03002l852425
8853e493637j848754K406725K996362Q66235O08280J713227N29610k285370l493603
8844d000925l593294m418026l472427J687888O183335L622160k423865k180214
8836h595368N006576Q759883L339059l805008l643084J580514L345661o6300k559333
8827C362600o14771J850626K92671l448098m106091p68157K186863J975418J190562
8818A921623K453996L002102q14886n961617n828037m84678K928357J169931q48635
8809b461844O76584K286439O16522j139047J24522Q08524k247976l931934J005156
8800d263054O607147L088884o645039r201460k35592Q896109P489903m96540m249127
$$ plain form
8862 414797 303202 -233469 -893079 -3107420 -5185699 -3967756 -1138210 -1641212 -5493637
8853 -5493637 -7342391 -4935666 -1939304 -1073069 -464789 1248438 1778048 -507322 -4000925
8844 -4000925 -7594219 -12012245 -15484672 -13796784 -7613449 -3991289 -6415154 -8595368
8836 -8595368 -3588792 5171091 8510150 4705142 1062058 2642572 5988233 5921933 3362600
8827 3362600 2747829 4598455 4891126 1443028 -2663063 -3431220 -1244357 731061 1921623
8818 1921623 4375619 7377721 6562835 601218 -5226819 -5711497 -2783140 -1613209 -2461844
8809 -2461844 -1785260 501179 1117701 -21346 103176 911700 -1336276 -5268210 -4263054
8800 -4263054 2344093 5432977 -1212062 -10413522 -10649114 -1753005 5736898 5240358 991231
8791I91231j344459J483532m32042l909224l375514J546071N410882L473388k043413
8782A800452m094383q2268M045008J947636l762197n193208m88345M332169M581292
8773C086156K001484l38769k418057m158170l014558J684125N381589L216738
8765E440538l244773p299980m694132J987940O433917N127077O11360j764245
8757B597702j46212K099369J494459r35032j989294j102244m2897N72648J275662
8748C824161J317244m99220l102886m097088k887120n53324K195612M394863L811338
8739D403580k71023m675589n853692m175360j782742J188613M353386M235769
8731b577058q36714n600217m061100J085381K429934j52244N6062M109016M769738
$$ plain form
8791 991231 -353228 1130304 698262 -3210962 -6586476 -5040405 370477 3843865 1800452
8782 1800452 -2293931 -2376199 1668809 3616445 -145752 -5338960 -5827305 -1495136 3086156
8773 3086156 5087640 4748871 2330814 -1827356 -4841914 -3157789 2223800 5440538
8765 5440538 2195765 -5104215 -9798347 -7810407 -1376490 3750587 4361947 2597702
8757 2597702 2451490 4550859 6045318 5110286 3120992 2018748 1975851 2548499 3824161
8748 3824161 5141405 4642185 1539299 -2557789 -5444909 -5998233 -3802621 592242 4403580
8739 4403580 4132557 -543032 -6396724 -10572084 -12354826 -11166213 -6812827 -2577058
8731 -2577058 -3413772 -9013989 -13075089 -11989708 -9559774 -9712018 -9655956 -5546940 -777202
8722g77202j021935n921954l236977K911329M399545Q76395j557049j58155J933013
8713b552990J568964o89665k399214j831970Q28802L188642K567773o20089k959533
8704b899280k383214m45536N61033M45945J50122K72939J431462L747484N300300
8695F181255L582579q48979m546562n259407l442653j60756L264152M064005N82914
8686C416548l982365m590762j209779J609217J800412J454376J506793N15150
8678E19590p51084L70501K563410J484109k033731j870716K977313N387272J075475
8669I722139m588702n256286k476390p50562J63709K122157K985983L69791l017473
8660g25634l365984j468427L73511K888554O250909O582099J814388l169411l230156
$$ plain form
8722 -777202 -1799137 -7721091 -10958068 -8046739 -3647194 -2770799 -4327848 -4486003 -2552990
8713 -2552990 -984026 -1673691 -4072905 -5904875 -5076073 -1887431 680342 60253 -2899280
8704 -2899280 -5282494 -5728030 -5166997 -4721052 -4570930 -4297991 -2866529 880955 6181255
8695 6181255 9763834 8914855 4368293 -891114 -4333767 -4494523 -1230371 2833634 3416548
8686 3416548 -565817 -5156579 -6366358 -4757141 -2956729 -1502353 4440 519590
8678 519590 -231494 139007 2702417 4186526 2152795 282079 3259392 8646664 9722139
8669 9722139 5133437 -122849 -2599239 -3349801 -3186092 -1063935 1922048 2291839 -725634
8660 -725634 -4091618 -5560045 -5186534 -2297980 3952929 10535028 12349416 9180005 5949849
8651E949849p81491q20863k333661j432224P40919N79720o92488K37010J550891
8642B997662m50323l335056j928870K126545K676299k15486n97738K513224L542197
8633G328454O69827q74910J757772L920518J160089l972275o235913m340339o58784
8624a245561J949415J383773k003237m124098j491191K924508K828634k141986
8616a919743n666633m071409p44105L81455K11124R47168K006569K270498K495671
8607d089405K944486J951014r83942l589817l962843k648875p31685J203951J828702
8598h078414K84511j049398J114012N456635O908372L520823j436029m406399
8590B314113m479684j746601K522524M563992K250184m06021R70063K560133j875818
$$ plain form
8651 5949849 5168358 4347495 2013834 581610 1322529 1902249 1209761 1446771 2997662
8642 2997662 2547339 -787717 -2716587 -590042 2086257 1870771 1273033 3786257 7328454
8633 7328454 7998281 7123371 8881143 12801661 13961750 9989475 3753562 -586777 -1245561
8624 -1245561 703854 2087627 84390 -4039708 -5530899 -2606391 222243 -1919743
8616 -1919743 -7586376 -11657785 -12401890 -12020435 -11809311 -10862143 -8855574 -6585076 -4089405
8607 -4089405 -1144919 806095 -177847 -3767664 -7730507 -10379382 -11111067 -9907116 -8078414
8598 -8078414 -7793903 -8843301 -7729289 -2272654 4635718 8156541 6720512 2314113
8590 2314113 -2165571 -3912172 -1389648 3174344 5424528 5018507 5988570 8548703 6672885
8581F672885p824698m154472P834330J2499345K574438q726333p241652J530724
8573C164567L237410k486164m318613L59964K576027j323411l993465r83816J837396
8564a930105l99824k738765O97149O243126O250633O56755l606996k529980J100920
8555C742913K908760J824186l63237j656502j578714j351908k140816k847027
8547a462345j051098L092113N693202L521792j546494m354997k445846J378577
8539B824904K716241M68576k770230m357068m062358k820831r65710R88665J486436
8530f491375J06317o11271J531424M060845K660852j673507l012242N77265L407912
8521E56220N24894m611522n078232j15237M756654N250860J718945l178065n927752
$$ plain form
8581 6672885 -1151813 -5306285 2528045 15027390 17601828 8875495 1633843 3164567
8573 3164567 6401977 3915813 -402800 -42836 2533191 1209780 -2783685 -3767501 -1930105
8564 -1930105 -2329929 -5068694 -4371545 1871581 8122214 8778969 5171973 2641993 3742913
8555 3742913 6651673 8475859 8112622 6456120 4877406 3525498 1384682 -1462345
8547 -1462345 -2513443 578670 6271872 9793664 8247170 3892173 1446327 2824904
8539 2824904 5541145 6009721 3239491 -1117577 -5179935 -8000766 -8966476 -7977811 -6491375
8530 -6491375 -6385058 -6996329 -5464905 -1404060 1256792 -416715 -3428957 -2851692 556220
8521 556220 1081114 -3530408 -8608640 -8723877 -3967223 1283637 3002582 -175483 -6103235
8512f103235l072801M474656R319438N169623l989158p941002l592637J853188
8504c881928K289046N52604J479740L120489O34438m564595n984390j538153L641595
8495d251154M573267K198771J65726o29909j648758k948448k851170r31338J077838
8486e245175J764636J675898J750661J516618j5317k447556m080107l570027r60661
8477i611030K278130L838920K497601K02563M64879L345766M346670O43236m028256
8468C978479m352513j260125O3842j212522q34780K471830M451035K461898o82713
8459E084431k342889l762245n242498l556959J817799N429871L470596m56886
8451D41220j986931k809585n063904m882170Q50609O486156N339621J258701K407887
$$ plain form
8512 -6103235 -9176036 -4701380 4618058 9787681 5798523 -2142479 -5735116 -3881928
8504 -3881928 -1592882 -1040278 439462 3559951 4194389 -370206 -6354596 -7892749 -4251154
8495 -4251154 322113 2520884 2686610 2056701 407943 -2540505 -5391675 -6323013 -5245175
8486 -5245175 -3480539 -1804641 -53980 1462638 1447321 -1000235 -5080342 -8650369 -9611030
8477 -9611030 -7332900 -3493980 -996379 -793816 -328937 3016829 7363499 8006735 3978479
8468 3978479 -374034 -1634159 -1570317 -2782839 -3617619 -1145789 3305246 5767144 5084431
8459 5084431 2741542 -1020703 -6263201 -9820160 -8002361 -2572490 898106 441220
8451 441220 -1545711 -4355296 -9419200 -14301370 -13450761 -6964605 -1624984 -366283 2041604
8442B041604O675400M847585k892829o145937j287376K999769P29034k388244
8434D579006m72207K269555J3166m242869m487615j479627O80181K055396L708477
8425B623463K583300k522986m910477J103980Q983038P482282k590103r111187
8417C641310o073411n20048o6591k470854j988654P59662J146871j091961j583207
8408h246883J698599N451977N570296K154754j134924j807470j295999k429318
8400c8968n079822o092367l607120N49448L379030L646483J775361p63355j322119
8391g553429J609292M945196L506103k420181o176539l778575O65784J904805
8383g297544J125528J929933L187252J863327m77884n63478j01199k485264m849456
$$ plain form
8442 2041604 8717004 13564589 10671760 4525823 3238447 6238216 6967250 4579006
8434 4579006 4106799 6376354 6389520 2146651 -2340964 -3820591 -3140410 -1085014 2623463
8425 2623463 5206763 2683777 -2226700 -1122720 7860318 15342600 12752497 3641310
8417 3641310 -2432101 -2952149 -3018740 -5489594 -7478248 -6718586 -5571715 -6663676 -8246883
8408 -8246883 -6548284 -1096307 4473989 6628743 5493819 3686349 2390350 -38968
8400 -38968 -5118790 -11211157 -14818277 -14268829 -10889799 -7243316 -5467955 -6231310 -7553429
8391 -7553429 -5944137 -998941 2507162 86981 -6089558 -9868133 -9202349 -7297544
8383 -7297544 -6172016 -4242083 -1054831 808496 330612 -232866 -334065 -2819329 -7668785
8374g668785j442643N591501P184303M77872o606280o621480j911248Q79883L26368
8365i790509k3580J928243M535834N060566K481871j312104k734483n80380J666571
8356A232029K32229l165283l489239L59217M444664N436304L253065j111670n756935
8347A434381o723161j953496M138914N394635K270568k88107j503896l756818
8339i86980m665162J48997O760752O385907J51120j642186K591246K279921n912857
8330E110758j0097085l145404L782947j45382o343896j813772P377501O068019
8322G93686l503140n333801K942915O785876K77452m732841k26892M991159K179461
8313D173875k562802q22582K876132Q808o533719p715831l215369q0228k28269
$$ plain form
8374 -7668785 -9111428 -3519927 3664376 4142248 -2464032 -9085512 -10996760 -10116877 -9790509
8365 -9790509 -9814089 -7885846 -3350012 1710554 4192425 2880321 145838 -434542 1232029
8356 1232029 1464258 -1701025 -5190264 -4831047 -386383 5049921 8302986 7191316 1434381
8347 1434381 -5288780 -7242276 -3103362 2291273 4561841 4273734 2769838 -986980
8339 -986980 -5652142 -5503145 1257607 7643514 7794634 6152448 8743694 11023615 5110758
8330 5110758 -4986327 -8131731 -4348784 -4494166 -10838062 -12651834 -5274333 793686
8322 793686 -2709454 -8043255 -5100340 1685536 1962988 -2769853 -2996745 1994414 4173875
8313 4173875 1611073 788491 3664623 3673431 -2860288 -10576119 -13791488 -13871716 -14099985
8304a4099985O96031L757435M765847J829184j749137k701199j389337P1044K20248
8295h599869q58767j214426J025962M250515M600536J776212j37868P83110J450580
8286C075985l43218k144480j854352j395498j915743o63785L227047N271784K835063
8277F092803M49077K283174M480775J636534l625345m912661k331805r77963j974981
8268A119608k401600j745141j252010N92924M501237N269554j165536q196164
8260c277128o017579K874268O542334J805775k136060N0967K187601o33000l209286
8251a812108o96655K068339l62569l852177k188279J828065J777226j204592j790165
8242f232915o79496j909697l235442N90114O658133O651108Q70567j139590L823342
$$ plain form
8304 -14099985 -13403954 -9646519 -4880672 -3051488 -4800625 -7501824 -8891161 -8820117 -8599869
8295 -8599869 -9458636 -10673062 -9647100 -5396585 -796049 980163 842295 1625405 3075985
8286 3075985 2732767 588287 -1266065 -2661563 -4577306 -5241091 -2014044 3257740 6092803
8277 6092803 6541880 8825054 13305829 14942363 11317018 6404357 4072552 3094589 1119608
8268 1119608 -1281992 -3027133 -4279143 -3686219 815018 6084572 4919036 -3277128
8260 -3277128 -9294707 -6420439 121895 1927670 -208390 -157423 2030178 1397178 -1812108
8251 -1812108 -2508763 -440424 -802993 -4655170 -6843449 -5015384 -3238158 -4442750 -6232915
8242 -6232915 -6912411 -8822108 -12057550 -11467436 -4809303 1841805 2712372 1572782 5396124
8233E396124O770458R43584o952263o935100n16371K984856Q52915j081593M68614
8224A931224J803404J91147j126754P63011K811783J200753j899927k036958k77996
8215C359687j312187m809923n204190r67655K336889R31250j247760K41826K572964
8206d099099J058822j884536o65296L179988L149872m89813m52356M581410O301784
8197A0680776L01556n521201k821920L887370M294105j887073n475502k326530
8189A131581J874696J876459j13147p5997J318577J145383q84155k800434l145493
8180C27470j821008k43762q00640l460654l801588J325684O996353N229826k605304
8171A146377n822111K62799O687669M060712l320259m679088M35364K476260k240739
$$ plain form
8233 5396124 12166582 13110166 6157903 -777197 -1293568 1691288 2544203 1462610 1931224
8224 1931224 3734628 3925775 2799021 3562032 6373815 7574568 5674641 3637683 3359687
8215 3359687 2047500 -2762423 -7966613 -8934268 -6597379 -5666129 -6913889 -6672063 -4099099
8206 -4099099 -3040277 -4924813 -5590109 -2410121 739751 249938 -202418 4378992 10680776
8197 10680776 10982332 5461131 2639211 6526581 10820686 8933613 3458111 1131581
8189 1131581 3006277 4882736 4769589 4693592 6012169 7157552 6273397 3472963 327470
8180 327470 -1493538 -1737300 -2537940 -5998594 -9800182 -8474498 -1478145 3751681 1146377
8171 1146377 -4675734 -4412935 2274734 6335446 3015187 -1663901 -1228537 1247723 -993016
8162i93016o180529l191752K292641L080706k99297k299408r60179J578774L897680
8153c074380N381141L999594p00093m266717k460998J645571J544648k446556
8145c77790l428636R27323M517262K595505j193301j674563k13598m14369n09650
8136B28183K983500O913215M559258l512950q963653p160715k667362j038417
8128h658941j099799P84371L331731K333772k026898m538303j684012L989222
8120g568857O904880M365383j065633m505089l744227r18944R46880J601889K287527
8111a696191K491985R95326p15889J54293K810331L311990P34807j143060J43957
8102G087549J941592R39388j933215l600910k965677o16912K643364M639188K454122
$$ plain form
8162 -993016 -7173545 -10365297 -8072656 -4991950 -5291247 -7590655 -8550834 -6972060 -3074380
8153 -3074380 2306761 6306355 5606262 1339545 -1121453 524118 2068766 -377790
8145 -377790 -3806426 -2879103 1638159 4233664 3040363 1365800 1152202 737833 228183
8136 228183 3211683 10124898 14684156 11171206 2207553 -4953162 -7620524 -8658941
8128 -8658941 -9758740 -8974369 -5642638 -3308866 -5335764 -9874067 -11558079 -7568857
8120 -7568857 -663977 3701406 2635773 -1869316 -5613543 -6532487 -5585607 -3983718 -1696191
8111 -1696191 795794 1791120 1075231 1229524 4039855 7351845 8086652 6943592 7087549
8102 7087549 9029141 9968529 8035314 4434404 1468727 851815 3495179 8134367 10588489
8093A0588489k868335n475922k054204K854259K795035j780864m931673l675966
8085d549181o67773N90284o57919l012724m016509j567437L145343N690823L953945
8076a091148J250967Q98352R79757j229140l194137j285085J945446J540558r38808
8067a123238o6170L093426K094940l094986m796938l42419L129314O42702k468918
8058b932287j98646L789099K783490j534191k323662J135928L167460J020957
8050D908148k347921m035027l812023j555938K371170M410482R72699n187915
8042d276325o805020j435838N297826P076753L731383o41340k931200k624378
8034b608139r19761L392j167790k692084j610117J437413K176650q31026k790746
$$ plain form
8093 10588489 7720154 2244232 190028 3044287 5839322 4058458 -873215 -4549181
8085 -4549181 -5216954 -4626670 -5284589 -8297313 -12313822 -13881259 -10735916 -5045093 -1091148
8076 -1091148 159819 1058171 2037928 808788 -2385349 -3670434 -1724988 -184430 -1123238
8067 -1123238 -1189408 1904018 3998958 903972 -3892966 -4235385 -1106071 -463369 -2932287
8058 -2932287 -3130933 658166 3441656 1907465 -416197 719731 3887191 4908148
8050 4908148 2560227 -1474800 -5286823 -6842761 -4471591 -61109 911590 -4276325
8042 -4276325 -11081345 -12517183 -7219357 -142604 3588779 2947439 16239 -2608139
8034 -2608139 -3527900 -3524508 -4692298 -7384382 -8994499 -7557086 -5380436 -6211462 -9002208
8025i002208J027622P549149Q749518K365099m440286m283389P29514K380341
8017E075360j944089n900712l726225J641834L463319P73025j759468j602758
8009c979714n24603M26971K312915L984028K169544k293667l899642q42569J495486
8000a151251r06361l911810j921466L006395M568794J670678j451320k334688
7992b431029j739843K07070L432998M822453J705060k463908k024638J853009
7984C361172K541517j587299m925128l888365j605666j300693j415414k25443
7976i045319M79322k68637K04955K985004M253217J295704k337253k051454Q79816
7967c604645K025916N72397q64193q59686K50087K262033M036514K840456j745106
$$ plain form
8025 -9002208 -7974586 -425437 8324081 10689180 6248894 1965505 2695019 5075360
8017 5075360 3131271 -2769441 -6495666 -4853832 -1390513 -617488 -2376956 -3979714
8009 -3979714 -4504317 -4077346 -1764431 2219597 4389141 2095474 -1804168 -2646737 -1151251
8000 -1151251 -2057612 -5969422 -7890888 -4884493 -315699 1354979 -96341 -2431029
7992 -2431029 -4170872 -3963802 -530804 4291649 5996709 3532801 1508163 3361172
7984 3361172 5902689 4315390 -609738 -4498103 -6103769 -7404462 -8819876 -9045319
7976 -9045319 -8565997 -8834634 -8629679 -5644675 -1391458 -95754 -2433007 -4484461 -3604645
7967 -3604645 -1578729 -1006332 -1870525 -2730211 -2480124 -218091 3818423 6658879 4913773
7958D913773n638417n401144k891178j279118J60899K782596L724262L24814l412051
7949f715564j722173L234478M123793K91805j304812J905545L566741q63913o211260
7940c695360n450851L4548L681981L321973J835212Q84381k65059q63528J048779
7931E32076M318825M921867J462712k635523l478879j058303J638331K248850
7923G949956Q66216q42799j615996j743855k206530k974029l091299k335187j343940
7914g337463n5900K035035L786376L077807L95462j043798n3819O99627n43091
7905I60236j525309l34902P72339k23942l71458L340468P059958M626151k200116
$$ plain form
7958 4913773 -724644 -6125788 -9016966 -10296084 -10135185 -7352589 -3628327 -3303513 -6715564
7949 -6715564 -8437737 -5203259 -1079466 -787661 -2092473 -186928 3379813 2515900 -3695360
7940 -3695360 -9146211 -9111663 -5429682 -2107709 -272497 611884 346825 -516703 532076
7931 532076 4850901 9772768 11235480 8599957 5121078 4062775 5701106 7949956
7923 7949956 8816172 7973373 6357377 4613522 2406992 -567037 -3658336 -5993523 -7337463
7914 -7337463 -7393363 -5358328 -1571952 1505855 1901317 857519 803700 1503327 960236
7905 960236 -565073 -899975 -127636 -351578 -723036 2617432 9677390 14303541 12103425
$$ [...]
##END NTUPLES=NMR SPECTRUM
##END=
