##TITLE=31Pdec_SR34_2ACCl
 CDCl3, 124 sc
 4.03.2021
##JCAMPDX= 6.0         $$ Bruker NMR JCAMP-DX V2.0
##DATA TYPE= NMR SPECTRUM
##DATA CLASS= NTUPLES
##ORIGIN= UXNMR, Bruker Analytische Messtechnik GmbH
##OWNER= root
$$ XWIN-NMR		Version 3.5
$$ Thu Mar  4 12:32:48 2021 Russian Standard Time (UT+4h)  she@DPX200
##.OBSERVE FREQUENCY= 81.013821
##.OBSERVE NUCLEUS= ^31P
##.ACQUISITION MODE= SIMULTANEOUS
##.ACQUISITION SCHEME= undefined
##.AVERAGES= 124
##.DIGITISER RES= 16
##SPECTROMETER/DATA SYSTEM= spect
##.PULSE SEQUENCE= zgpg30
##.SOLVENT NAME= CDCl3
##.SHIFT REFERENCE= (INTERNAL, CDCl3, 0, 248.564)
##AUDIT TRAIL= $$ (NUMBER, WHEN, WHO, WHERE, WHAT)
$$ ##TITLE= Audit trail, XWIN-NMR		Version 3.5
$$ ##JCAMPDX= 5.01
$$ ##ORIGIN= Bruker BioSpin GmbH
$$ ##OWNER= she
$$ F:/spectra/data/she/nmr/P31/1/pdata/1/auditp.txt
$$ ##AUDIT TRAIL=  $$ (NUMBER, WHEN, WHO, WHERE, WHAT)
(   1,<2021-03-04 12:30:55.82 +0400>,<she>,<DPX200>,
      <continue with go, POWCHK disabled, PULCHK disabled
       configuration hash MD5:
       00 E9 B6 7A A2 85 ED C7 34 08 36 98 17 FE 4E 26
       data hash MD5: 32K
       99 ED 2A FD EE 9F 6C 08 70 1A 5E EA 4F 0C 03 76>)
(   2,<2021-03-04 12:30:58.42 +0400>,<she>,<DPX200>,
      <Start of raw data processing
       efp BC_mod = 2 LB = 1 FT_mod = 6 PKNL = 1 PHC0 = -3021.099 PHC1 = 179.2009 SI = 64K 
       data hash MD5: 64K
       3A 05 9E B9 FD 62 68 24 25 4D EF 18 94 D3 66 22>)
(   3,<2021-03-04 12:31:29.00 +0400>,<she>,<DPX200>,
      <pk PHC0 = -381.4619 PHC1 = 321.9999 
       data hash MD5: 64K
       27 E0 A4 B6 8B 92 67 82 6A 7A 3B 76 20 8C ED 93>)
(   4,<2021-03-04 12:32:16.34 +0400>,<she>,<DPX200>,
      <pk PHC0 = 78.6965 PHC1 = -505.3998 
       data hash MD5: 64K
       09 21 67 A2 12 A9 46 BD 2C DD 7D 73 93 D4 F7 31>)
(   5,<2021-03-04 12:32:19.98 +0400>,<she>,<DPX200>,
      <abs ABSG = 5 
       data hash MD5: 64K
       CF A8 C9 76 0B 9A DC E0 89 CB 3D CF 5C CB 07 60>)
$$ ##END=
$$ 
$$ hash MD5
$$ 4E 0E 6C 37 AB 8A FA F7 E8 CD 4D 0E EE 34 EE C4
##$RELAX= 
##$RELAX= 
##$RELAX= 
##$RELAX= 
##$RELAX= 
##$RELAX= 
##$RELAX= 
##$RELAX= 
$$ Bruker specific parameters
$$ --------------------------
##$DU= <F:/spectra>
##$EXPNO= 1
##$NAME= <P31>
##$PROCNO= 1
##$TYPE= <nmr>
##$USER= <she>
##$AMP= (0..31)
100 100 100 100 100 100 100 100 100 100 100 100 100 100 100 100 100 100 
100 100 100 100 100 100 100 100 100 100 100 100 100 100 
##$AQSEQ= 0
##$AQ_mod= 1
##$AUNM= <au_zg>
##$AUTOPOS= <>
##$BF1= 81.014009
##$BF2= 200.13
##$BF3= 200.13
##$BF4= 200.13
##$BF5= 200.13
##$BF6= 200.13
##$BF7= 200.13
##$BF8= 200.13
##$BYTORDA= 1
##$CFDGTYP= 0
##$CFRGTYP= 5
##$CHEMSTR= <none>
##$CNST= (0..31)
1 1 145 1 1 1 1 1 1 1 1 1 1 1 1 1 1 1 1 1 1 1 1 1 1 1 1 1 1 1 1 1 
##$CPDPRG= <waltz16>
##$CPDPRG1= <>
##$CPDPRG2= <waltz16>
##$CPDPRG3= <>
##$CPDPRG4= <mlev>
##$CPDPRG5= <mlev>
##$CPDPRG6= <mlev>
##$CPDPRG7= <mlev>
##$CPDPRG8= <mlev>
##$CPDPRGB= <>
##$CPDPRGT= <>
##$D= (0..31)
$$ [...]
##$SUBNAM3= <"">
##$SUBNAM4= <"">
##$SUBNAM5= <"">
##$SUBNAM6= <"">
##$SUBNAM7= <"">
##$SUBNAM8= <"">
##$SUBNAM9= <"">
##$SW= 501.771253377433
##$SWIBOX= (0..15)
0 1 3 0 0 0 0 0 0 0 0 0 0 0 0 0 
##$SW_h= 40650.406504065
##$TD= 32768
##$TD0= 1
##$TE= 0
##$TE2= 300
##$TE3= 300
##$TEG= 300
##$TL= (0..7)
0 120 53 12 22 120 120 120 
##$TP= (0..7)
150 150 150 150 150 150 150 150 
##$TP07= 0
##$TPNAME0= <>
##$TPNAME1= <>
##$TPNAME2= <>
##$TPNAME3= <>
##$TPNAME4= <>
##$TPNAME5= <>
##$TPNAME6= <>
##$TPNAME7= <>
##$TPOAL= (0..7)
0.5 0.5 0.5 0.5 0.5 0.5 0.5 0.5 
##$TPOFFS= (0..7)
0 0 0 0 0 0 0 0 
##$TUNHIN= 0
##$TUNHOUT= 0
##$TUNXOUT= 0
##$USERA1= <user>
##$USERA2= <user>
##$USERA3= <user>
##$USERA4= <user>
##$USERA5= <user>
##$V9= 5
##$VALIST= <valist>
##$VCLIST= <CCCCCCCCCCCCCCC>
##$VD= 0
##$VDLIST= <DDDDDDDDDDDDDDD>
##$VPLIST= <PPPPPPPPPPPPPPP>
##$VTLIST= <TTTTTTTTTTTTTTT>
##$WBST= 1024
##$WBSW= 4
##$XGAIN= (0..3)
0 0 0 0 
##$XL= 0
##$YL= 0
##$YMAX_a= 25200
##$YMIN_a= -23928
##$ZGOPTNS= <>
##$ZL1= 120
##$ZL2= 120
##$ZL3= 120
##$ZL4= 120
##$ABSF1= 248.5645
##$ABSF2= -253.2056
##$ABSG= 5
##$ABSL= 3
##$ALPHA= 0
##$AQORDER= 0
##$ASSFAC= 0
##$ASSFACI= 0
##$ASSFACX= 0
##$ASSWID= 0
##$AUNMP= <proc_1d>
##$AZFE= 0.1
##$AZFW= 0.5
##$BCFW= 0
##$BC_mod= 2
##$BYTORDP= 0
##$COROFFS= 0
##$CY= -3
##$DATMOD= 1
##$DC= 0
##$DFILT= <>
##$DTYPP= 0
##$F1P= 0
##$F2P= 0
##$FCOR= 1
##$FTSIZE= 65536
##$FT_mod= 6
##$GAMMA= 0
##$GB= 0
##$INTBC= 1
##$INTSCL= 5.30512e-09
##$ISEN= 30
##$LB= 1
##$LEV0= 0
##$LPBIN= 0
##$MAXI= 10000
##$MC2= 0
##$MEAN= 0
##$ME_mod= 0
##$MI= 50
##$NCOEF= 0
##$NC_proc= -7
##$NLEV= 6
##$NOISF1= 182.463
##$NOISF2= 159.3651
##$NSP= 0
##$NTH_PI= 0
##$NZP= 0
##$OFFSET= 248.5645
##$PC= 4
##$PHC0= -3323.865
##$PHC1= -4.199005
##$PH_mod= 1
##$PKNL= yes
##$PPARMOD= 0
##$PSCAL= 0
##$PSIGN= 0
##$REVERSE= no
##$SF= 81.014009
##$SI= 65536
##$SIGF1= 159.3651
##$SIGF2= -187.1042
##$SINO= 113.3802
##$SIOLD= 16384
##$SREGLST= <1H.CDCl3>
##$SSB= 0
##$STSI= 65536
##$STSR= 0
##$SW_p= 40650.406504065
##$SYMM= 0
##$S_DEV= 0
##$TDeff= 32768
##$TDoff= 0
##$TI= <>
##$TILT= no
##$TM1= 0
##$TM2= 0
##$TOPLEV= 0
##$USERP1= <user>
##$USERP2= <user>
##$USERP3= <user>
##$USERP4= <user>
##$USERP5= <user>
##$WDW= 1
##$XDIM= 65536
##$YMAX_p= 280754342
##$YMIN_p= -78456713
$$ End of Bruker specific parameters
$$ ---------------------------------
##NTUPLES= NMR SPECTRUM
##VAR_NAME=  FREQUENCY,     SPECTRUM/REAL,   SPECTRUM/IMAG
##SYMBOL=    X,             R,               I
##VAR_TYPE=  INDEPENDENT,   DEPENDENT,       DEPENDENT
##VAR_FORM=  AFFN,          ASDF,            ASDF
##VAR_DIM=   65536,         65536,           65536
##UNITS=     HZ,            ARBITRARY UNITS, ARBITRARY UNITS
##FACTOR=    0.620285442955139, 1,           1
##FIRST=     20137.2065510759, 0,            0
##LAST=      -20513.1999529892, 0,           0
##MIN=       -20513.1999529892, -78456713,   0
##MAX=       20137.2065510759, 280754342,    0
$$ Real data points
##PAGE= N=1
##DATA TABLE= (X++(R..R)), XYDATA
$$ [...]
$$ plain form
12903 -913970 7162305 11330391 6686240 -1887106 -6753388 -7437655 -8710608 -11614244
12895 -11614244 -12105619 -7713238 -670708 5633465 9744625 11684177 12280332 12896005
12887 12896005 13565228 11696665 4742348 -5697739 -13728774 -13655231 -5188727 5129167
12879 5129167 9014457 4787011 -1048638 -3022540 -4225364 -9441181 -14153029 -9328245
12871 -9328245 3267950 10854535 7435019 1781614 2637939 5591547 2395922 -4645609
12863 -4645609 -7564697 -6916680 -10369583 -18736413 -23036451 -16782173 -4530631 3822044
12855 3822044 3445837 -1897617 -4774813 -2356034 452013 -1461237 -4206867 290158
12847 290158 10295240 14928650 11886730 12323373 20409900 20935860 1107082 -25059238
$$ packed form
12903i13970Q076275M168086m644151q573346m866282o84267j272953k903636
12895a1614244m91375M392381P042530O304173M111160J939552N96155O15673
12887A2896005O69223j868563o954317j0440087q031035P3543Q466504J0317894
12879E129167L885290m227446n835649j973902j202824n215817m711848M824784
12871i328245J2596195P586585l419516n653405Q56325K953608l195625p041531
12863d645609k919088O48017l452903q366830m300038O254278J2251542Q352675
12855C822044l76207n343454k877196K418779K808047j913250k745630M497025
12847B90158J0005082M633410l041920M36643Q086527N25960j9828778k6166320
$$ plain form
12839 -25059238 -32367002 -20157843 -12886844 -24176609 -39515825 -40702255 -30414290
12832 -30414290 -22221589 -19324601 -15958746 -11623013 -11109329 -14247880 -16013700 -14800420
12824 -14800420 -12484785 -8440347 -1245320 5317365 5734505 1791387 1063003 6043018
12816 6043018 11228245 11915262 9541492 6294523 645026 -7633608 -12543702 -7733023
12808 -7733023 4086023 12803531 12892118 9847910 12581235 22158629 31229735 33110365
12800 33110365 27538290 17603800 5739405 -4990459 -9751907 -6622676 -796233 239397
12792 239397 -4387527 -8279615 -6195147 97448 5147859 6277047 5260051 4978550
12784 4978550 5752429 5492218 4094332 6422760 17000311 30813419 34969211 23704665
$$ packed form
12839b5059238p307764J2209159P270999j1289765j5339216j186430J0287965
12832c0414290Q192701K896988L365855M335733N13684l138551j765820J213280
12824a4800420K315635M044438P195027O562685M17140l943118p28384M980015
12816F043018N185227O87017k373770l246969n649497q278634m910094M810679
12808g733023J1819046Q717508Q8587l044208K733325R577394R071106J880630
12800C3110365n572075r934490j1864395j0729864m761448L129231N826443J035630
12792B39397m626924l892088K084468O292595N050411J129188j016996k81501
12784D978550P73879k60211j397886K328428J0577551J3813108M155792j1264546
$$ plain form
12776 23704665 6892405 -2513103 -5133942 -10730998 -20016994 -22312936 -12753334 -835723
12768 -835723 2888489 -278578 -3354186 -4719106 -5668999 -3660190 3043407 8397940
12760 8397940 5640022 -1154337 -2051898 2989220 3297775 -5586030 -13396842 -8821238
12752 -8821238 4529321 12522725 8289087 -550443 -2763083 2865897 7252439 2717226
12744 2717226 -7875059 -14822859 -12961754 -6754175 -3647744 -5169554 -6817738 -5043232
12736 -5043232 -1256512 1136631 1429241 2319101 6263319 11274726 11271706 2656721 -9650831
12727 -9650831 -16170693 -14026202 -10125704 -10643213 -12078537 -8061567 -1319501 -896953
12719 -896953 -7924462 -12561932 -8006902 -586008 -737759 -8659951 -15200227 -14595873 -9538108
$$ packed form
12776B3704665j6812260r405508k620839n597056r285996k295942R559602J1917611
12768h35723L724212l167067l075608j364920r49893K008809O703597N354533
12760H397940k757918o794359q97561N041118L08555q883805p810812M575604
12752h821238J3350559P993404m233638q839530k212640N628980M386542m535213
12744B717226j0592285o947800J861105O207579L106431j521810j648184J774506
12736e043232L786720K393143K92610Q89860L944218N011407l020q614985j2307552
12727i650831o519862K144491L900498n17509j435324M016970O742066M22548
12719h96953p027509m637470M555030P420894j51751p922192o540276O04354N057765
$$ plain form
12710 -9538108 -3568488 4561668 15375721 22491822 18490430 6528548 1546 7434547
12702 7434547 21343482 26576877 17957611 4542033 -3224497 -4323901 -3047351 -364701
12694 -364701 5203129 11687785 14820945 14129289 13202475 14590089 18337012 24023191 29485048
12685 29485048 29132110 19621882 6623294 -598576 -1364043 -3142784 -8396177 -10745626
12677 -10745626 -7050737 -3608039 -4389708 -2109626 9971575 24111788 26998195 18832906
12669 18832906 11960457 11722731 10571098 2845743 -5835799 -8261956 -5418905 -1201859
12661 -1201859 4628037 11619353 13513521 5983140 -4831664 -9473741 -8166092 -9011814
12653 -9011814 -14844760 -19773644 -18954390 -14371162 -9115122 -2314849 7055825 15933274
$$ packed form
12710i538108N969620Q130156J0814053P116101m001392j1961882o527002P433001
12702G434547J3908935N233395q619266j3415578p766530j099404J276550K682650
12694c64701N567830O484656L133160o91656r26814J387614L746923N686179N461857
12685B9485048l52938r510228j2998588p221870p65467j778741n253393k349449
12677a0745626L694889L442698p81669K280082J2081201J4140213K886407q165289
12669A8832906o872449k37726j151633p725355q681542k426157K843051M217046
12661a201859N829896O991316J894168p530381j0814804m642077J307649q45722
12653i011814n832946m928884Q19254M583228N256040O800273R370674Q877449
$$ plain form
12645 15933274 20353514 20328313 19020590 18998204 20880534 23567990 24502721 21907461 17691428
12636 17691428 15338099 13961450 8416159 -2188114 -9917574 -6194355 7469051 20965622
12628 20965622 26547708 24398693 18514346 12061714 7326362 5458337 4259601 -85767
12620 -85767 -6727893 -8944392 -2370674 8188498 13991870 12674417 9075932 6729475
12612 6729475 3684200 -2223556 -8771228 -12638143 -13772652 -13599940 -11997757 -9452365
12604 -9452365 -9192514 -12457056 -13581368 -5426517 10435952 24107963 28593513 25995979
12596 25995979 21795913 18130931 14578273 10898738 6743235 2569376 1885315 7076815
12588 7076815 11869011 6014809 -8757492 -16511945 -7906298 4919176 3991001 -10385952
$$ packed form
12645A5933274M420240k5201j307723k2386J882330K687456R34731k595260m216033
12636A7691428k353329j376649n545291j0604273p729460L723219J3663406J3496571
12628B0965622N582086k149015n884347o452632m735352j868025j198736m345368
12620h5767o642126k216499O573718J0559172N803372j317453l598485k346457
12612F729475l045275n907756o547672l866915j134509J72712J602183K545392
12604i452365K59851l264542j124312Q154851J5862469J3672011M485550k597534
12596B5995979m200066l664982l552658l679535m155503m173859o84061N191500
12588G076815M792196n854202j4772301p754453Q605647J2825474r28175j4376953
$$ plain form
12580 -10385952 -22647444 -24378248 -20718059 -17185536 -14443358 -15820184 -25011904 -34256547
12572 -34256547 -30009938 -14333571 -4798808 -7041031 -4904683 11360199 24501908 14995808
12564 14995808 -6527844 -12569021 2150666 16346672 15600692 9428520 10960257 17391331
12556 17391331 18995911 15127056 11999220 11988933 12543819 11403908 8458838 5623557
12548 5623557 6257026 10775240 13639474 10402083 5877724 7371409 11502128 7831149
12540 7831149 -4740181 -16159270 -20431884 -20906702 -18946989 -10589904 1801642 7942038
12532 7942038 5208737 2970825 5158875 2382678 -10102259 -20787941 -19982015 -16734790
12524 -16734790 -23551096 -34807363 -36338477 -28387041 -21971555 -18105371 -8645600 4663190
$$ packed form
12580a0385952j2261492j730804L660189L532523K742178j376826r191720r244643
12572c4256547M246609J5676367R534763k242223K136348J6264882J3141709r506100
12564A4995808k1523652o041177J4719687J4196006p45980o172172J531737O431074
12556A7391331J604580l868855l127836j0287N54886j139911k945070k835281
12548E623557O33469M518214K864234l237391m524359J493685M130719l670979
12540G831149j2571330j1419089m272614m74818J959713Q357085J2391546O140396
12532G942038k733301k237912K188050k776197j2484937j0685682Q05926L247225
12524a6734790o816306j1256267j531114P951436O415486L866184R459771J3308790
$$ plain form
12516 4663190 9922975 4823532 674488 3725905 6392527 1460766 -6572207 -9352296
12508 -9352296 -5223217 1617528 5554483 2066614 -6837332 -10469823 -1767211 9781060
12500 9781060 8731165 -3910620 -12390664 -10539285 -8364851 -10932371 -8344671 4460035
12492 4460035 13866475 6737667 -8195784 -12890980 -6316329 -2887366 -8146251 -11149372
12484 -11149372 -2965369 8784680 9363716 -4461391 -20106531 -23000180 -12603033 -2108400
12476 -2108400 -1076251 -3331873 1702548 10689178 11260184 3488118 863794 6762564
12468 6762564 7378990 -3211942 -8365518 5732160 23955069 21303667 -134921 -14547595
12460 -14547595 -9805145 -408634 -1038185 -6876482 -7301418 -3387986 -1951894 -3002654
$$ packed form
12516D663190N259785n099443m149044L051417K666622m931761q032973k780089
12508i352296M129079O840745L936955l487869q903946l632491Q702612J1548271
12500I781060j049895j2641785q480044J851379K174434k567520K587700J2804706
12492D460035R406440p128808j4933451m695196O574651L428963n258885l003121
12484a1149372Q184003J1750049N79036j3825107j5645140k893649J0397147J0494633
12476b108400J032149k255622N034421Q986630N71006p772066k624324N898770
12468F762564O16426j0590932n153576J4097678J8222909k651402k1438588j4412674
12460a4547595M742450R396511o29551n838297m24936L913432J436092j050760
$$ plain form
12452 -3002654 -2802818 -2176346 -3400228 -3905352 -134102 5815429 8881245 7743596 4944979
12443 4944979 2786220 1894372 1583211 217453 -2083445 -1184051 6160122 15123830 16386552
12434 16386552 7994932 -2150435 -6784007 -5818102 -1228195 6455860 13345689 12298666
12426 12298666 3285121 -3680734 -2627126 -1857283 -11329266 -24776675 -25444834 -9012140
12418 -9012140 9479428 14550365 8436297 5357134 12526081 23244821 27886457 25642049
12410 25642049 22233960 19424858 12782392 1024805 -8094186 -6401296 2907038 8384221
12402 8384221 5109307 423622 3473606 14188769 25067252 29767826 27183903 20080591
12394 20080591 12235294 5207977 -2628832 -11631662 -17002105 -14598080 -9768202 -12719445
$$ packed form
12452c002654J99836O26472j223882n05124L771250N949531L065816j137649k798617
12443D944979k158759q91848l11161j365758k300898Q99394P344173Q963708J262722
12434A6386552q391620j0145367m633572R65905M589907P684055O889829j047023
12426A2298666r013545o965855J053608P69843r471983j3447409o68159J6432694
12418i012140J8491568N070937o114068l079163P168947J0718740M641636k244408
12410B5642049l408089k809102o642466j1757587r118991J692890R308334N477183
12402H384221l274914m685685L049984J0715163J0878483M700574k583923p103312
12394B0080591p845297p027317p836809r002830n370443K404025M829878k951243
$$ plain form
12386 -12719445 -23555665 -30245783 -25234623 -16015728 -13570044 -17588081 -20320249 -19012998
12378 -19012998 -16421493 -13772958 -11609344 -13443864 -19591737 -21128038 -10379634 4934721
12370 4934721 9497623 1778542 -4628750 -2805530 -2576132 -12921299 -25623019 -25987110
12362 -25987110 -13193328 -452313 1781894 -5136045 -13622611 -17321718 -13772120 -5755469
12354 -5755469 -378359 -2578263 -9496083 -14331367 -14474344 -12204038 -9129651 -4918326
12346 -4918326 -845761 693079 772547 3207453 7990346 9975178 6316655 1567901
12338 1567901 2469782 9794056 17707998 19981090 15604813 9693505 9164221 15224014
12330 15224014 20221127 15823684 4884553 -397693 5255424 12099456 9032081 -142584
$$ packed form
12386a2719445j0836220o690118N011160R218895K445684m018037k732168J307251
12378a9012998K591505K648535K163614j834520o147873j536301J0748404J5314355
12370D934721M562902p719081o407292J823220K29398j0345167j2701720l64091
12362b5987110J2793782J2741015K234207o917939q486566l699107L549598Q016651
12354e755469N377110k199904o917820m835284j42977K270306L074387M211325
12346d918326M072565J538840P9468K434906M782893J984832l658523m748754
12338A567901R01881P324274P913942K273092m376277n911308n29284O059793
12330A5224014M997113m397443j0939131n282246N653117O844032l067375r174665
$$ plain form
12322 -142584 -2417963 5489874 13575409 13603994 7994918 1802753 -4617157 -11003471 -13913048
12313 -13913048 -13077949 -12863147 -11931663 -1223302 19125079 30890358 19430005 -2305001
12305 -2305001 -7804650 7170634 20096425 14844162 1768139 -1958949 3668784 7776202
12297 7776202 6739940 3676353 -1583219 -9535320 -14053275 -10097054 -3604109 -2692095
12289 -2692095 -3896303 917966 8471711 8702461 2906939 2517573 10001982 15730436
12281 15730436 15261125 14616940 15219378 9512390 -2354291 -7129819 1350048 11009361
12273 11009361 11331593 10119552 16686611 21917962 13640514 1582220 4450072 17005261
12265 17005261 14687367 -7260600 -23471977 -15127451 4327855 12385439 8452080 5816799
$$ packed form
12322a42584k275379P907837Q085535K8585n609076o192165o419910o386314k909577
12313a3913048Q35099K14802R31484J0708361K0348381J1765279j1460353k1735006
12305b305001n499649J4975284J2925791n252263j3076023l727088N627733M107418
12297G776202j036262l063587n259572p952101m517955L956221O492945R12014
12289b692095j204208M814269P553745K30750n795522l89366P484409N728454
12281A5730436m69311o44185O02438n706988j1866681m775528Q479867R659313
12273A1009361L22232j212041O567059N231351q277448j2058294K867852J2555189
12265A7005261k317894k1947967j6211377Q344526J9455306Q057584l933359k635281
$$ plain form
12257 5816799 6570551 3245831 -2808485 -3326030 515603 464807 -2242183 883026 7553678
12248 7553678 6335619 -1559205 -88544 15659829 28014223 21485209 5099386 -2828539
12240 -2828539 -1149127 -1860739 -6983983 -6501537 2387428 9571246 7998363 3215700
12232 3215700 3380397 9486833 19076799 30496723 38685490 34886154 17343937 -2510481
12224 -2510481 -10622458 -4674077 5716433 10200710 5759464 -3461564 -10435540 -10539132
12216 -10539132 -4868672 2256501 8638331 14231416 16884728 13652483 7237191 4840009
12208 4840009 8016664 9747489 5154878 -1008673 -2431114 -903426 -1460133 -2750971
12200 -2750971 -191930 4249222 3890863 -1878855 -6502782 -6389258 -4920319 -4911352 -3908673
$$ packed form
12257E816799P53752l324720o054316n17545L841633n0796k706990L125209O670652
12248G553678j218059p894824J470661J5748373J2354394o529014j6385823p927925
12240b828539J679412p11612n123244M82446Q888965P183818j572883m782663
12232C215700J64697O106436R589966J1419924Q188767l799336j7542217j9854418
12224b510481q111977N948381J0390510M484277m441246r221028o973976j03592
12216a0539132N670460P125173O381830N593085K653312l232245o415292k397182
12208D840009L176655J730825m592611o163551j422441J527688n56707j290838
12200b750971K559041M441152l58359n769718m623927J13524J468939Q967J002679
$$ plain form
12191 -3908673 160010 4366914 5626826 5933788 8582290 11896036 10830698 3615457
12183 3615457 -6306822 -14092087 -16651719 -13148627 -5953528 -1371947 -5452739 -16412351
12175 -16412351 -23820639 -19630248 -9505676 -7952513 -20073301 -33319666 -32300573 -18018462
12167 -18018462 -5316307 -2920380 -4756882 -2456874 2634151 4988834 5354892 8353669
12159 8353669 13208676 13781525 6986301 -3316784 -10211046 -9263946 -2493994 1644308
12151 1644308 -3271742 -10998131 -7364970 9486894 21557619 12588101 -8797480 -18976120
12143 -18976120 -9356302 5667231 10421170 5154122 -1119387 -3498000 -1536854 4271694
12135 4271694 9937889 8606101 118546 -5335045 413816 11427688 14597607 6520707
$$ packed form
12191c908673M068683M206904J259912L06962K648502L313746j065338p215241
12183C615457r922279p785265k559632L503092P195099M581581m080792j0959612
12175a6412351p408288M190391J0124572J553163j2120788j3246365J019093J4282111
12167a8018462J2702155K395927j836502K300008N091025K354683L66058K998777
12159H353669M855007N72849o795224j0303085o894262R47100O769952M138302
12151A644308m916050p726389L633161J6851864J2070725q969518k1385581j0178640
12143a8976120R619818J5023533M753939n267048o273509k378613J961146N808548
12135D271694N666195j331788q487555n453591N748861J1013872L169919q076900
$$ plain form
12127 6520707 -2955795 -3996661 1976348 6744186 7592965 10132640 17475839 21710145
12119 21710145 13345497 -1934130 -6538925 4782702 15201885 9550436 -2970522
12112 -2970522 -4448751 2086263 -803199 -12280306 -11843710 5097978 15583839 5005374
12104 5005374 -8373712 -3137258 10476269 9827832 325206 7370493 32436379 46904916
12096 46904916 34105673 11391513 222459 -3418117 -13420933 -25243176 -22724417
12089 -22724417 -5248842 9844458 10443507 1655351 -5936433 -8701832 -7704869 -2663342
12081 -2663342 6256368 14159788 13888190 3787834 -8200148 -10474571 -127790 11740915
12073 11740915 11154005 -1984354 -13160023 -10947572 -162181 5837015 965203 -9970966
$$ packed form
12127F520707r476502j040866N973009M767838Q48779K539675P343199M234306
12119B1710145q364648j5279627m604795J1321627J0419183n651449j2520958
12112b970522j478229O535014k889462j1477107M36596J6941688J0485861j0578465
12104E005374j3379086N236454J3613527o48437r502626P045287K5065886J4468537
12096D6904916j2799243k2714160j1169054l640576j0002816j1822243K518759
12089b2724417J7475575J5093300N99049q788156p591784k765399R96963N041527
12081b663342Q919710P903420k71598j0100356j1987982k274423J0346781J1868705
12073A1740915n86910j3138359j1175669K212451J0785391N999196m871812j0936169
$$ plain form
12065 -9970966 -19209982 -21957251 -17211418 -8592230 -3055036 -3872621 -6171972 -3896695
12057 -3896695 1086050 2821585 2369746 7106321 18132895 26354335 24555832 17157401
12049 17157401 13464872 15866678 19438019 19583824 15089313 6381593 -3884269 -10004717
12041 -10004717 -7966558 -496135 6342792 10167346 11689680 9345768 1186625 -7992000
12033 -7992000 -8884754 241063 9682547 10239502 4112525 -371529 -489164 -16596 -1223504
12024 -1223504 -2058720 -636511 2511881 6802165 12059167 16156649 15735176 10110081
12016 10110081 1950629 -6175771 -13421887 -18636403 -19375411 -14058678 -4121667 6142883
12008 6142883 11825013 11263558 8565037 9645948 14265870 15661155 10821931 6615260
$$ packed form
12065i970966r239016k747269M745833Q619188N537194q17585k299351K275277
12057c896695M982745J735535m51839M736575J1026574Q221440j798503p398431
12049A7157401l692529K401806L571341J45805m494511q707720j0265862o120448
12041a0004717K038159P470423O838927L824554J522334k343912q159143r178625
12033g992000q92754R125817R441484N56955o126977m484054j17635M72568j206908
12024a223504q35216J422209L148392M290284N257002M097482m21473n625095
12016A0110081q159452q126400p246116n214516p39008N316733R937011J0264550
12008F142883N682130n61455k698521J080911M619922J395285m839224m206671
$$ plain form
12000 6615260 10698062 20003930 24610478 20744102 13419433 7975877 5973820 8083442
11992 8083442 13244671 15302367 8391731 -3807583 -11455314 -11096050 -7157749 -2197959
11984 -2197959 4028031 6226258 -2531000 -16118359 -18872695 -9069550 -3850106 -12163259
11976 -12163259 -18482202 -7290763 9751454 9926435 -5446239 -12800791 -1080428 14940269
11968 14940269 18572908 11422323 4136828 744886 -399701 316773 3075926 7406539
11960 7406539 15241167 28500341 41612787 44609953 36171223 25353123 18437895 13795156
11952 13795156 11979227 18259824 29096562 28786319 9920112 -12166208 -16980673 -4452684
11944 -4452684 8477963 11623891 9373091 7544215 5655136 3340462 3116256 3588215
$$ packed form
12000F615260M082802R305868M606548l866376p324669n443556k002057K109622
11992H083442N161229K057696o910636j2199314p647731L59264L938301M959790
11984b197959O225990K198227q757258j3587359k754336R803145N219444q313153
11976a2163259o318943J1191439J7042217J74981j5372674p354552J1720363J6020697
11968A4940269L632639p150585p285495l391942j144587P16474K759153M330613
11960G406539P834628J3259174J3112446K997166q438730j0818100o915228m642739
11952A3795156j815929O280597J0836738l10243j8866207k2086320m814465J2527989
11944d452684J2930647L145928k250800j828876j889079k314674k24206M71959
$$ plain form
11936 3588215 -895997 -9804087 -13548516 -6470434 3214037 2947722 -7736034 -16594454
11928 -16594454 -14078651 -4170096 2030331 148580 -3834207 -3371307 -181779 154561
11920 154561 -1688128 199879 5399493 4502301 -7380698 -20968018 -24054009 -17985606
11912 -17985606 -13805975 -14577971 -13097653 -8189063 -10053205 -22566220 -31721178 -23706325
11904 -23706325 -7343890 -3422469 -13806586 -18258899 -6208625 5580789 -1122743
11897 -1122743 -16292698 -16276875 -992707 6212767 -2739165 -6120374 11962372 31988706
11889 31988706 25622460 -556958 -12987260 301552 14471311 6656669 -12951835
11882 -12951835 -21436126 -16669472 -12904497 -14072146 -11112250 -1832606 4720946 4611897
$$ packed form
11936C588215m484212q908090l744429P078082R684471k66315j0683756q858420
11928a6594454K515803R908555O200427j881751l982787M62900L189528L36340
11920A54561j842689J888007N199614q97192j1882999j3587320l085991O068403
11912a7985606M179631p71996J480318M908590j864142j2513015r154958Q014853
11904b3706325J6362435L921421j0384117m452313J2050274J1789414o703532
11897a122743j5169955J5823J5284168P205474q951932l381209J8082746K0026334
11889C1988706o366246k6179418j2430302J3288812J4169759p814642j9608504
11882a2951835q484291M766654L764975j167649K959896R279644O553552j09049
$$ plain form
11874 4611897 4690555 8848657 11410169 8632027 5375063 4687184 1407601 -6239921 -8322583
11865 -8322583 2885096 17133695 16916476 2005317 -8872035 -2778993 11545638 17546842
11857 17546842 12409759 7052821 8904959 13342427 12501658 5806918 -1146374 -4003222
11849 -4003222 -2306121 2833945 9398957 13107761 9691270 470610 -7292155 -8534657
11841 -8534657 -6853102 -9017152 -14413810 -15700312 -11025010 -8791549 -15381987 -23645010
11833 -23645010 -21660867 -10331951 -2483681 -3903470 -5879151 -703700 5978250 6496814
11825 6496814 5964808 13833839 25907938 28618195 19877069 11600650 10071930 8538468
11817 8538468 4015966 5991672 18505134 26921537 17063371 -1230694 -6050007 5347259
$$ packed form
11874D611897P8658M158102K561512k778142l256964o87879l279583p647522k082662
11865h322583J1207679J4248599k17219j4911159j0877352O093042J4324631O001204
11857A7546842n137083n356938J852138M437468q40769o694740o953292k856848
11849d003222J697101N140066O565012L708804l416491r220660p762765j242502
11841h534657J681555k164050n396658j286502M675302K233461o590438q263023
11833b3645010J984143J1328916P848270j419789j975681N175451O681950N18564
11825F496814n32006P869031J2074099K710257q741126q276419j528720j533462
11817H538468m522502J975706J2513462Q416403r858166j8294065m819313J1397266
$$ plain form
11809 5347259 13968854 7632369 -4052262 -7196582 -2194886 2225426 2909953 1962486
11801 1962486 -235010 -3766014 -5656277 -4122303 -2627897 -4306615 -5992329 -3095605
11793 -3095605 2737289 5986208 4748154 1214915 -2911585 -6692559 -7453208 -2913651
11785 -2913651 4505078 9006295 7188817 862967 -4939764 -5786876 -1689115 1989735
11777 1989735 248311 -4295547 -4102552 1917538 5176757 -1139336 -12464153 -19221012
11769 -19221012 -18570122 -14775262 -11538259 -9686449 -9986128 -12607893 -15039384 -14756676
11761 -14756676 -12301268 -8454238 -1856404 6169508 8805686 2167454 -7026124 -9650911
11753 -9650911 -7082433 -7234563 -9817951 -6204068 5264854 14774826 15588690 13297982
$$ packed form
11809E347259Q621595o336485j1684631l144320N001696M420312O84527r47467
11801A962486k197496l531004j890263J533974J494406j678718j685714K896724
11793c095605N832894L248919j238054l533239m126500l780974p60649M539557
11785b913651P418729M501217j817478o325850n802731q47112M097761L678850
11777A989735j741424m543858J92995O020090L259219o316093j1324817o756859
11769a9221012O50890L794860L237003J851810k99679k621765k431491K82708
11761a4756676K455408L847030O597834Q025912K636178o638232r193578k624787
11753i650911K568478j52130k583388L613883J1468922R509972Q13864k290708
$$ plain form
11745 13297982 14453050 14193516 4003727 -12698517 -22009682 -16232480 -2316522 7403520
11737 7403520 7781960 2360553 -3625835 -8257187 -12226384 -16401342 -21097214 -25753364
11729 -25753364 -27284190 -20298751 -3010678 16581217 25344509 18893831 6823785 363252
11721 363252 -505116 -1784581 -2368276 3823014 14150810 17215133 9112265 -573917
11713 -573917 -3695072 -4697178 -9908991 -14692857 -11468198 -4409441 -4144168 -10306456
11705 -10306456 -11390090 -2453189 8342269 13585661 16235549 19932644 19172263 7870461
11697 7870461 -8046031 -16237928 -13932147 -9645221 -9291242 -8973366 -3715847 3869236
11689 3869236 7905635 7289182 4535039 -51505 -7529426 -15037834 -16955570 -12273713
$$ packed form
11745A3297982J155068k59534j0189789j6702244r311165N777202J3915958R720042
11737G403520L78440n421407n986388m631352l969197m174958m695872m656150
11729b5753364j530826O985439J7288073J9591895Q763292o450678j2070046o460533
11721C63252q68368j279465n83695O191290J0327796L064323q102868r686182
11713e73917l121155j002106n211813m783866L224659P058757K65273o162288
11705a0306456j083634Q936901J0795458N243392K649888L697095p60381j1301802
11697G870461j5916492q191897K305781M286926L53979L17876N257519P585083
11689C869236M036399o16453k754143m586544p477921p508408j917736M681857
$$ plain form
11681 -12273713 -6632578 -5100194 -5839368 -3318719 3986578 11672757 14658498 12360010
11673 12360010 8507112 7302631 10340248 16170124 21391349 21981026 15342580 3397368
11665 3397368 -6403653 -6230969 3692395 13611314 14120735 6682337 1168232 3263999
11657 3263999 8033378 7020744 -1476252 -11099201 -14341917 -9326933 -1243653 2329383
11649 2329383 -663300 -3801018 -304610 6377712 5702750 -4529709 -12442046 -6715363
11641 -6715363 8183002 18205393 17916612 14535722 14650366 15267180 10716013 2548461
11633 2548461 -1390300 4673850 18630333 30823583 30529273 16416927 1070873 -293306
11625 -293306 12142594 21159483 12584202 -7182474 -18634030 -11673400 4545951 13666109
$$ packed form
11681a2273713N641135J532384p39174K520649P305297P686179K985741k298488
11673A2360010l852898j204481L037617N829876N221225N89677o638446j1945212
11665C397368r801021J72684R923364R918919N09421p438398n514105K095767
11657C263999M769379j012634q496996r622949l242716N014984Q083280L573036
11649B329383k992683l137718L496408O682322o74962j0232459p912337N726683
11641f715363J4898365J0022391k88781l380890J14644O16814m551167q167552
11633B548461l938761O064150J3956483J2193250k94310j4112346j5346054j364179
11625b93306J2435900R016889q575281j9766676j1451556O960630J6219351R120158
$$ plain form
11617 13666109 9385888 -433221 -4000386 2060493 10453986 12740748 9422152 7726512
11609 7726512 10036132 10202424 4392410 -85764 6292529 20141313 27227585 20425237
11601 20425237 8061477 1562329 1712948 2128800 692644 528375 2700560 5222889
11593 5222889 7993162 11542901 11386417 1946333 -12033786 -16469540 -5107049 10960534
11585 10960534 16824314 11126075 2928801 -3470003 -10797326 -18077357 -18366306 -8962423
11577 -8962423 4481488 16325623 25694350 30204284 23578323 5381957 -12951161 -18613395
11569 -18613395 -10993242 -83518 5663531 5717700 4584431 6469717 10872717 11816817
11561 11816817 5168912 -2660677 -350270 11678623 19384251 14827942 7342821 6779693
$$ packed form
11617A3666109m280221r819109l567165O060879Q393493K286762l318596j695640
11609G726512K309620J66292n810014m478174O378293J3848784P086272o802348
11601B0425237j2363760o499148J50619M15852j436156j64269K172185K522329
11593E222889K770273L549739j56484r440084j3980119m435754J1362491J6067583
11585A0960534N863780n698239q197274o398804p327323p280031k88949R403883
11577h962423J3443911J1844135R368727M509934o625961j8196366j8333118n662234
11569a8613395P620153J0909724N747049N4169j133269J885286M403000R44100
11561A1816817o647905p829589K310407J2028893P705628m556309p485121n63128
$$ plain form
11553 6779693 6805054 -1947011 -11511384 -7305836 5632435 7325331 -5905939 -15298720
11545 -15298720 -9659563 -1736303 -4972045 -11630696 -8228375 905368 2283851 -3401708
11537 -3401708 -3966338 2819311 7182590 5829034 7133607 15494321 23280267 22889222
11529 22889222 17220863 13124157 11444903 8527679 3057712 -2584810 -5378137 -4273783
11521 -4273783 -1532680 -1013138 -2745536 -1277911 6757845 16049134 18657469 14076907
11513 14076907 7568573 1948403 -1480766 2153145 14583736 24749207 19084615 2439268
11505 2439268 -5472799 1555542 6408527 -4755757 -20396446 -20806751 -6491602 6154432
11497 6154432 10393141 13156752 16356099 12127549 -588323 -10266072 -9712116 -6588448
$$ packed form
11553F779693K5361q752065r564373M205548J2938271J692896j3231270r392781
11545a5298720N639157P923260l235742o658651L402321R133743J378483n685559
11537c401708n64630O785649M363279j353556J304573Q360714P785946l91045
11529B2889222n668359m096706j679254k917224n469967n642522k793327J104354
11521d273783K741103N19542j732398J467625Q035756R291289K608335m580562
11513A4076907o508334n620170l429169L633911J2430591J0165471n664592j6645347
11505B439268p912067P028341M852985j1164284j5640689m10305J4315149J2646034
11497F154432M238709K763611L199347m228550j2715872r677749N53956L123668
$$ plain form
11489 -6588448 -9722802 -14940172 -13190168 -5208399 1374134 4598160 8466610 13296978
11481 13296978 14632714 11476929 8472263 9266618 13211532 18654849 23646397 22967636
11473 22967636 11501668 -6278029 -16069775 -8491221 8825944 19291940 16187322
11466 16187322 7729213 3124309 665513 -5679660 -13244935 -12980133 -4362457 1270165
11458 1270165 -3701221 -12088183 -13303850 -9440566 -9936947 -14124823 -11908179 -1996258
11450 -1996258 4382814 2299812 1919739 9838264 14108388 1446161 -18972285 -25143061
11442 -25143061 -12543090 1054742 1550924 -5705617 -9545064 -8478678 -6005344 -1679968
11434 -1679968 4679478 7459246 1785120 -9180247 -18452142 -21514739 -15436533 208758
$$ packed form
11489f588448l134354n217370J750004P981769O582533L224026L868450M830368
11481A3296978J335736l155785l004666P94355L944914N443317M991548o78761
11473B2967636j1465968j7779697r791746P578554J7317165J0465996l104618
11466A6187322q458109m604904k458796o345173p565275K64802Q617676N632622
11458A270165m971386q386962j215667L863284m96381m187876K216644R911921
11450a996258O379072k083002l80073P918525M270124j2662227k0418446o170776
11442b5143061J2599971J3597832M96182p256541l839447J066386K473334M325376
11434a679968O359446K779768n674126j0965367r271895l062597O078206J5645291
$$ plain form
11426 208758 17271350 23322024 17947252 14456853 17989230 14841779 -3732477 -19739469
11418 -19739469 -10074439 16991109 29709714 16970491 1657632 4450841 16243654
11411 16243654 18444256 12223181 10387770 12713486 9059288 1012986 927697 9617432
11403 9617432 12295660 847935 -13728270 -17567216 -11845431 -6593908 -4619398 -950322
11395 -950322 5709470 9906802 7540977 1001254 -4347087 -4911083 -339222 5970042
11387 5970042 7998098 2709768 -4957197 -6462052 -191382 5706682 2655679 -8899352
11379 -8899352 -20864487 -25564008 -21024138 -11708256 -6312821 -11043040 -21561927 -25246158
11371 -25246158 -15987996 -3126082 439792 -4339304 -5648383 323217 4170665 -776197
$$ packed form
11426B08758J7062592O050674n374772l490399L532377l147451j8574256j6006992
11418a9739469R665030K7065548J2718605j2739223j5312859K793209J1792813
11411A6243654K200602o221075j835411K325716l654198q046302q5289Q689735
11403I617432K678228j1447725j4576205l838946N721785N251523J974510L669076
11395i50322O659792M197332k365825o539723n348341n63996M571861O309264
11387E970042K028056n288330p666965j504855O270670N898064l051003j1555031
11379h899352j1965135m699521M539870R315882N395435m730219j0518887l684231
11371b5246158R258162J2861914L565874m779096j309079N971600L847448m946862
$$ plain form
11363 -776197 -7636051 -6857299 104531 5231167 6376890 7709278 11344639 15307452
11355 15307452 17384931 15706841 8434551 -2243535 -9524480 -10504892 -10828284 -15156477
11347 -15156477 -18612839 -15421174 -10541514 -12696332 -19764501 -22246640 -18788441 -16253601
11339 -16253601 -15177124 -7926786 6899059 20197161 26014341 29131283 34831213 40032614
11331 40032614 38941444 30379851 16834079 3270491 -2488196 2637696 8638543 2829590
11323 2829590 -10645284 -15158374 -7228632 -1460563 -5271891 -7410755 -833130 2359778
11315 2359778 -6816636 -15103448 -9164519 -1230486 -8928326 -21280781 -13105843 11709250
11307 11709250 21515286 4197492 -15481497 -14981209 -4802961 -5508678 -15009516 -18044184
$$ packed form
11363g76197o859854P78752O961830N126636J145723J332388L635361L962813
11355A5307452K077479j678090p272290j0678086p280945r80412l23392m328193
11347a5156477l456362L191665M879660k154818p068169k482139L458199K534840
11339a6253601J076477P250338J4825845J3298102N817180L116942N699930N201401
11331D0032614j091170q561593j3545772j3563588n758687N125892O000847n808953
11323B829590j3474874m513090P929742N768069l811328k138864O577625L192908
11315B359778r176414q286812N938929P934033p697840j2352455Q174938K4815093
11307A1709250R806036j7317794j9678989N00288J0178248p05717r500838l034668
$$ plain form
11299 -18044184 -13744358 -12597849 -13609025 -5107664 12724666 23365935 15551335 -2528562
11291 -2528562 -15180031 -17241742 -15407749 -16407691 -18509057 -14170178 -9300 16239848
11283 16239848 21062048 9182687 -10172968 -23126034 -24219317 -17186965 -7286303 1518760
11275 1518760 4536596 -1087542 -10779468 -14887162 -8949259 1484313 7925848 8035820
11267 8035820 5539394 3240922 -606587 -8555094 -18608441 -24283983 -20067144 -6315198
11259 -6315198 10598565 21768914 20510838 7398857 -7952791 -13749738 -7930859 -724572
11251 -724572 -1838702 -8031237 -8511555 -276658 8833927 11694901 8903893 3323076
11243 3323076 -4212570 -10523092 -9026010 1604339 13272565 18242380 17971687 16546530
$$ packed form
11299a8044184M299826J146509j011176Q501361J7832330J0641269p814600j8079897
11291b528562j2651469k061711J833993r99942k101366M338879J4160878J6249148
11283A6239848M822200j1879361j9355655j2953066j093283P032352R900662Q805063
11275A518760L017836n624138r691926m107694N937903J0433572O441535J09972
11267H035820k496426k298472l847509p948507j0053347n675542M216839J3751946
11259f315198J6913763J1170349j258076j3111981j5351648n796947N818879P206287
11251g24572j114130o192535m80318Q234897R110585K860974k791008n580817
11243C323076p535646o310522J497082J0630349J1668226M969815k70693j425157
$$ plain form
11235 16546530 11028727 -2989746 -19190160 -23712951 -11737145 6214287 16442550
11228 16442550 15202168 8267911 2828768 2395438 5784502 8516157 7515840 5056309
11220 5056309 4727330 3870922 -3745595 -15788409 -19549019 -8512692 4964546 2965607
11212 2965607 -13798479 -25590979 -19831249 -7546800 -6692461 -16809797 -21572722 -13831991
11204 -13831991 -4963572 -5792413 -10053521 -5792535 4711560 8603099 2938516 -1692629
11196 -1692629 368514 645791 -7965747 -17336347 -15935103 -7383891 -4921917 -10620008
11188 -10620008 -13324909 -7974248 -3668473 -7518514 -12176042 -8238501 -401112 -52349
11180 -52349 -6861694 -9970474 -5786846 -2033509 -2604543 -980548 5938249 8585952 -1746974
$$ packed form
11235A6546530n517803j4018473j6200414m522791J1975806J7951432J0228263
11228A6442550j240382o934257n439143m33330L389064K731655j000317k459531
11220E056309l28979q56408p616517j2042814l760610J1036327J3477238j998939
11212B965607j6764086j1792500N759730J2284449Q54339j0117336m762925P740731
11204a3831991Q868419q28841m261108M260986J0504095L891539n664583m631145
11196a692629K061143K77277q611538r370600J401244Q551212K461974n698091
11188a0620008k704901N350661M305775l850041m657528L937541P837389L48763
11180e2349o809345l108780M183628L753337n71034J623995O918797K647703j0332926
$$ plain form
11171 -1746974 -17963209 -26063298 -23874293 -19803400 -16164479 -6873628 7280826 14131320
11163 14131320 6516212 -6622384 -12680409 -11439001 -10619692 -11287512 -7522248 1613333
11155 1613333 8935279 8515877 1515335 -7946155 -16765506 -21821967 -20733264 -15593084
11147 -15593084 -11512408 -9757676 -6485608 9534 5161056 4045390 -1765716 -6211065
11139 -6211065 -5568841 -1140135 2861030 2097792 -5087521 -15176071 -21205740 -19394359
11131 -19394359 -13135397 -8312950 -5584833 -128630 10574937 21388776 24253636 17737274
11123 17737274 9460514 7803964 12908407 18060842 18572107 15574890 11348094 6078684
11115 6078684 1348732 1759317 8918157 17456170 21409734 21100210 19011480 13461297
$$ packed form
11171a746974j6216235q100089K189005M070893L638921R290851J4154454O850494
11163A4131320p615108j3138596o058025J241408Q19309o67820L765264R135581
11155A613333P321946m19402p000542r461490q819351n056461J088703N140180
11147a5593084M080676J754732L272068O495142N151522j115666n811106m445349
11139f211065O42224M428706M001165p63238p185313j0088550o029669J811381
11131a9394359O258962M822447K728117N456203J0703567J0813839K864860o516362
11123A7737274q276760j656550N104443N152435N11265k997217m226796n269410
11115F078684m729952M10585P158840Q538013L953564l09524k088730n550183
$$ plain form
11107 13461297 3573442 -3589499 -956146 5315122 2385618 -8493050 -10924239 2056200
11099 2056200 15400880 13200576 1311491 -3938797 -1706202 -5407569 -18421991 -27730537
11091 -27730537 -24695139 -17750060 -17695060 -21464257 -19182423 -9539794 1064712 9388079
11083 9388079 16025842 18524280 13375156 4216361 -487062 1112115 2410664 -618396
11075 -618396 -3908841 -3735363 -3660034 -7881016 -12768511 -11553453 -4977514 -960732 -4001452
11066 -4001452 -10026277 -12498572 -9749202 -5177970 -3099493 -5448317 -10513664 -14235213
11058 -14235213 -14152354 -11820791 -9888704 -8195310 -5390936 -2778549 -2442868 -2317181 1967764
11049 1967764 9640666 13747606 9081215 -2283915 -14068591 -20568060 -18260221 -8042659
$$ packed form
11107A3461297r887855p162941K633353O271268k929504j0878668k431189J2980439
11099B056200J3344680k200304j1889085n250288K232595l701367j3014422r308546
11091b7730537L035398O945079N5000l769197K281834R642629J0604506Q323367
11083I388079O637763K498438n149124r158795m703423J599177J298549l029060
11075f18396l290445J73478P5329m220982m887495J215058O575939M016782l040720
11066d001452o024825k472295K749370M571232K078477k348824n065347l721549
11058a4235213Q2859K331563J932087J693394K804374K612387L35681J25687M284945
11049A967764P672902M106940m666391j1365130j1784676o499469K307839J0217562
$$ plain form
11041 -8042659 2815706 6439341 3805513 2785561 5445476 5196982 -220682 -2294932
11033 -2294932 5208393 15284100 18480324 17077559 17891406 17810440 10141963 856420
11025 856420 2256864 11108272 10514143 -2725046 -10199234 -53285 12698948 7878781
11017 7878781 -9123202 -15366620 -3706141 9500451 10239128 3998556 1699476 1970097
11009 1970097 -2557115 -9451094 -8904960 194894 7157888 4483928 -2057468 -2830323
11001 -2830323 1819986 3474773 -1319001 -6894988 -7343063 -3044297 3264239 10589122
10993 10589122 16504579 15883011 8131034 1077284 1414143 5012908 4011795 535731
10985 535731 4077915 15416997 22806975 17506782 5760938 518267 5808013 13930810
$$ packed form
11041h042659J0858365L623635k633828j019952K659915k48494n417664k074250
11033b294932P503325J0075707L196224j402765Q13847q0966p668477r285543
11025H56420J400444Q851408n94129j3239189p474188J0145949J2752233m820167
11017G878781j7001983o243418J1660479J3206592P38677o240572k299080K70621
11009A970097m527212o893979N46134R099854O962994k673960o541396p72855
11001b830323M650309J654787m793774n575987m48075M298766O308536P324883
10993A0589122N915457o21568p751977p053750L36859L598765j001113l476064
10985E35731L542184J1339082P389978n300193j1745844n242671N289746Q122797
$$ plain form
10977 13930810 15800975 10539751 5153393 5731803 9396523 7607143 -1035705 -6450705
10969 -6450705 -703636 9356089 11715287 7407143 7596500 14200954 17228144 13322711
10961 13322711 12420645 19976092 25863729 20150564 9194297 5295048 8525595 10251328
10953 10251328 8799158 10013756 15501693 20583433 22193141 20701659 16107304 9589897
10945 9589897 5739261 6152207 4957354 -1447705 -5461577 646258 9298890 6252859
10937 6252859 -6788393 -11932121 212742 17456802 22110589 11087220 -4550935
10930 -4550935 -12760432 -9048969 1986665 9870750 7770868 818356 -250174 5728845
10922 5728845 9039361 4445989 -1503761 -2869167 -4501875 -11760872 -17054003 -7696370
$$ packed form
10977A3930810J870165n261224n386358N78410L664720j789380q642848n415000
10969f450705N747069J0059725K359198m308144J89357O604454L027190l905433
10961A3322711r02066P555447N887637n713165j0956267l899249L230547J725733
10953A0251328j452170J214598N487937N081740J609708j491482m594355o517407
10945I589897l850636M12946j194853o405059m013872O107835Q652632l046031
10937F252859j3041252n143728J2144863J7244060M653787j1023369j5638155
10930d550935q209497L711463J1035634P884085k099882o952512j068530N979019
10922E728845L310516m593372n949750j365406j632708p258997n293131R357633
$$ plain form
10914 -7696370 14427554 31055282 27999354 10901924 -3327704 -6679741 -6343689 -11694933
10906 -11694933 -20857873 -24182687 -18274729 -10364977 -7705721 -8513113 -7194454 -3988631
10898 -3988631 -3813338 -7725461 -10936196 -8985829 -2544762 2899323 67013 -13919580
10890 -13919580 -30898802 -35795535 -22959146 -4378752 4784652 4509261 5593267 11139983
10882 11139983 13384154 7966872 160133 -4653904 -6887548 -6990705 -3026139 3188139
10874 3188139 5953323 4684201 5341060 10555686 16240297 19704096 21916366 19835124
10866 19835124 7781667 -9501763 -17048079 -9361009 1167351 3126019 2023838 7242605
10858 7242605 13534678 8891836 -5830441 -18529273 -22889483 -21463083 -15408925 -4409216
$$ packed form
10914g696370K2123924J6627728l055928j7097430j4229628l352037L36052n351244
10906a1694933r162940l324814N907958P909752K659256q07392J318659L205823
10898c988631J75293l912123l210735J950367O441067N444085k832310j3986593
10890a3919580j6979222m896733J2836389J8580394R163404k75391J084006N546716
10882A1139983K244171n417282p806739m814037k233644j03157L964566O214278
10874C188139K765184j269122O56859N214626N684611L463799K212270k081242
10866A9835124j2053457j7283430p546316P687070J0528360J958668j102181N218767
10858G242605O292073m642842j4722277j2698832m360210J426400O054158J0999709
$$ plain form
10850 -4409216 4714617 2634796 -7956509 -13806895 -9261273 -2935617 -3568510 -8561179
10842 -8561179 -10690027 -8792309 -7111116 -8732913 -12946944 -16121866 -14562099 -9708180
10834 -9708180 -8492024 -12894620 -12254201 4415433 29088210 39397137 26109458 5394202
10826 5394202 -2288979 3418499 7326805 696228 -10967903 -18892840 -20541810 -17762790
10818 -17762790 -12136393 -4541382 3470479 9369954 10754104 8266352 7520691 14529975
10810 14529975 27455020 36498821 34467484 24062890 12429021 3032798 -3350940 -4613302
10802 -4613302 -471253 3543940 2343434 242763 6491819 21339984 33342498 32949981
10794 32949981 23403828 14778756 11327800 9092663 3989720 -2294702 -5062483 -2482337
$$ packed form
10850d409216R123833k079821j0591305n850386M545622O325656o32893m992669
10842h561179k128848J897718J681193j621797m214031l174922J559767M853919
10834i708180J216156m402596O40419J6669634K4672777J0308927j3287679k0715256
10826E394202p683181N707478L908306o630577j1664131p924937j648970K779020
10818a7762790N626397P595011Q011861N899475J384150k487752p45661P009284
10810A4529975J2925045R043801k031337j0404594j1633869r396223o383738j262362
10802d613302M142049M015193j200506k100671O249056J4848165J2002514l92517
10794C2949981r546153q625072l450956k235137n102943o284422k767781K580146
$$ plain form
10786 -2482337 3130413 9298901 16509005 25516658 32701718 32240011 24477615 17526796
10778 17526796 16178401 13280119 -482615 -20027688 -28732977 -19948162 -6075943 -825090
10770 -825090 -1455627 2169596 8078539 5248762 -5812128 -10393101 -1478858 8638175
10762 8638175 6928847 -189843 3031050 16801546 24249009 14915383 -1487907 -8690828
10754 -8690828 -3384349 3963979 3082052 -6159142 -15609688 -17457732 -11907606 -7074467
10746 -7074467 -9500199 -15469650 -15656648 -8243441 -1934155 -4343157 -12959499 -20453039
10738 -20453039 -23517259 -22494398 -17430854 -10078108 -6053271 -8822171 -13647160 -13105389
10730 -13105389 -6942899 -947277 2475217 6326882 11705939 14521246 11198960 3566869
$$ packed form
10786b482337N612750O168488P210104R007653P185060m61707p762396o950819
10778A7526796j348395k898282j3762734j9545073q705289Q784815J3872219N250853
10770h25090o30537L625223N908943k829777j1060890m580973Q914243J0117033
10762H638175j709328p118690L220893J3770496P447463r333626j6403290p202921
10754h690828N306479P348328q81927r241194r450546j848044N550126M833139
10746g074467k425732n969451j86998P413207O309286k409002q616342p493540
10738b0453039l064220J022861N063544P352746M024837k768900m824989N41771
10730a3105389O162490N995622L422494L851665N379057K815307l322286p632091
$$ plain form
10722 3566869 -3519376 -6746050 -6009240 -3782586 -2559016 -1193276 4209024 13260603
10714 13260603 18710964 15493734 8708952 6169530 6432355 2971293 -1876015 1784743
10706 1784743 14990232 25774899 25164382 17693343 11490761 7475726 4389455 5205446
10698 5205446 10438289 12822230 7549005 1230760 1390044 3352655 -1573715 -10066953
10690 -10066953 -11399566 -5156502 -1398953 -3867616 -5843936 -3843284 -2848532 -5000781
10682 -5000781 -5021337 -1218889 349664 -1652740 1526738 13717242 23557468 19655055
10674 19655055 8552144 5894529 14187849 21213852 18749556 11301899 5526500 1850688
10666 1850688 91868 4037845 14022765 20968199 15647555 2051392 -5386703 954847
$$ packed form
10722C566869p086245l226674P36810K226654J223570J365740N402300R051579
10714A3260603N450361l217230o784782k539422K62825l461062m847308L660758
10706A784743J3205489J0784667o10517p471039o202582m015035l086271Q15991
10698E205446N232843K383941n273225o318245J59284J962611m926370q493238
10690a0066953j332613O243064L757549k468663j976320K000652R94752k152249
10682e000781k0556L802448J568553k002404L179478J2190504R840226l902413
10674A9655055j1102911k657615Q293320P026003k464296p447657n775399l675812
10666A850688j758820L945977R984920O945434n320644j3596163p438095O341550
$$ plain form
10658 954847 12666082 16484685 10897136 6047481 8158330 11268824 7485362 -1267306
10650 -1267306 -8174207 -13072168 -19742681 -24303280 -18159802 -4243935 1720813 -7849316
10642 -7849316 -20067931 -18562532 -5296592 4519422 4353905 2028675 4797606 9376797
10634 9376797 9443249 5665159 3974093 7225700 12001174 13184802 10064127 6338199
10626 6338199 3419346 -2956937 -15038611 -25256072 -24549965 -17351168 -17073732 -25181449
10618 -25181449 -28147580 -20086857 -13243363 -16469066 -18562985 -7801573 4904582 1296672
10610 1296672 -14579565 -22412024 -15922488 -6350161 824560 10063382 16873030 8380852
10602 8380852 -12615321 -25698267 -21594641 -13220284 -11252315 -9436560 -3492797 -3412724
$$ packed form
10658I54847J1711235L818603n587549m849655K110849L110494l783462q752668
10650a267306o906901m897961o670513m560599O143478J3915867N964748r570129
10642g849316j2218615J505399J3265940R816014j65517k325230K768931M579191
10634I376797O6452l778090j691066L251607M775474J183628l120675l725928
10626F338199k918853o376283j2081674j0217461P06107P198797K77436q107717
10618b5181449k966131Q060723O843494l225703k093919J0761412J2706155l607910
10610A296672j5876237p832459O489536R572327P174721R238822O809648q492178
10602H380852k0996173j3082946M103626Q374357J967969J815755N943763Q0073
$$ plain form
10594 -3412724 -13559485 -19610188 -11333182 -2032090 -7933328 -22082030 -26849051 -20686883
10586 -20686883 -14132439 -9556230 -3835065 -2073575 -8482236 -10664086 5683154 30406042
10578 30406042 38460038 24897514 10345180 10251930 17470716 19492838 16678314 16808014
10570 16808014 22565597 29373018 28947609 15641786 -3233291 -8538683 7360831 24336577
10562 24336577 17844166 -5762309 -16988686 -5095590 9985913 11071921 5983671
10555 5983671 6911986 8036081 -1523719 -16508391 -22420797 -15231752 -2620230 7398714
10547 7398714 9996585 3305886 -6822565 -9514161 -4143294 -4093591 -16566054 -28511433
10539 -28511433 -24412686 -9607671 -1402680 -2259168 1646343 15219443 23998716 15164261
$$ packed form
10594c412724j0146761o050703Q277006R301092n901238j4148702m767021O162168
10586b0686883O554444M576209N721165J761490o408661k181850J6347240K4722888
10578C0406042Q053996j3562524j4552334r3250P218786K022122k814524J29700
10570A6808014N757583O807421m25409j3305823j8875077n305392J5899514J6975746
10562B4336577o492411k3606475j1226377J1893096J5081503J086008n088250
10555E983671R28315J124095r559800j4984672n912406P189045J2611522J0018944
10547G398714K597871o690699j0128451k691596N370867M9703j2472463j1945379
10539b8511433M098747J4805015Q204991q56488L905511J3573100Q779273q834455
$$ plain form
10531 15164261 -2527340 -9538566 -786453 9830876 9382305 1088711 -4214838 -4243293
10523 -4243293 -4789619 -7207604 -7230610 -6114383 -10700911 -18729935 -16852596 -708064
10515 -708064 15052308 16839413 10775960 8976700 8650645 851822 -9408903 -10318358
10507 -10318358 -4032035 -1758051 -3537481 -1633130 1463420 -1907455 -7449097 -7505014
10499 -7505014 -8906424 -18681695 -22457751 -6907068 7705133 -4303202 -23499145 -12058234
10491 -12058234 14984193 9711602 -9431623 42329465 178799557 280754342 238097807
10484 238097807 100946210 10933584 17016904 45324804 35278617 12137979 12016858
10477 12016858 18203526 6416632 -7645702 -4304156 1307156 -8577855 -19692335 -15216289
$$ packed form
10531A5164261j7691601p011226Q752113J0617329m48571q293594n303549k8455
10523d243293n46326k417985k3006J116227m586528q029024J877339J6144532
10515g08064J5760372J787105o063453j799260l26055p798823j0260725r09455
10507a0318358O286323K273984j779430J904351L096550l370875n541642n5917
10499g505014j401410r775271l776056J5550683J4612201j2008335j9195943J1440911
10491a2058234K7042427n272591j9143225N1761088J36470092J01954785m2656535
10484B38097807j37151597r0012626O083320K8307900j0046187k3140638j21121
10477A2016858O186668j1786894j4062334L341546N611312r885011j1114480M476046
$$ plain form
10469 -15216289 -8121639 -13545168 -17666745 -4813473 9940907 6237014 -5457830 -3639299
10461 -3639299 7326963 9807112 5578503 6561169 7849557 -650382 -8673367 -933998
10453 -933998 13346535 15234894 9532335 12981080 18958013 7988041 -12057000 -12411075
10445 -12411075 9401424 24124639 17939704 10815288 16950168 19407061 2081168 -19502881
10437 -19502881 -21410733 -6783065 3637415 3453698 2341734 4363787 4146794 1004137
10429 1004137 559170 3314061 4323703 3592834 5874776 10486272 11451917 8256970 6817110
10420 6817110 7981181 4670573 -4876303 -9350914 1423356 18406384 20386469 1442445
10412 1442445 -18686920 -19617564 -8307675 -8843561 -26485903 -38751249 -27866102 -5897222
$$ packed form
10469a5216289P094650n423529m121577J2853272J4754380l703893j1694844J818531
10461c639299J0966262K480149m228609R82666J288388q499939q022985P739369
10453i33998J4280533J888359n702559L448745N976933j0969972k0045041l54075
10445a2411075K1812499J4723215o184935p124416O134880K456893j7325893k1584049
10437a9502881j907852J4627668J0420480j83717j111964K022053k16993l142657
10429A004137m44967K754891J009642p30869K281942M611496R65645l194947j439860
10420F817110J164071l310608r546876m474611J0774270J6983028J980085j8944024
10412A442445k0129365r30644J1309889n35886j7642342j2265346J0885147K1968880
$$ plain form
10404 -5897222 4680185 2463825 2125449 6486481 4134621 -7246701 -15566778 -15014316
10396 -15014316 -13558239 -14805340 -10437638 1373983 7597666 1987683 -604133 13390032
10388 13390032 32211024 34724719 21567623 11322036 10548230 7565622 -4063221 -14823574
10380 -14823574 -16250097 -12853625 -10982619 -8987766 -5291672 -4514684 -7865719 -7890788
10372 -7890788 -1244378 2948854 -2860361 -10950084 -9871474 -2295869 1577972 2610045
10364 2610045 9265516 18133868 15385534 577803 -7652631 2332963 16758924 15004505
10356 15004505 -2976513 -19719938 -23856452 -17771526 -6163263 8323366 17985596
10349 17985596 13050338 -3254032 -13702370 -8048593 3351006 4566598 -4204245 -9748087
$$ packed form
10404e897222J0577407k216360l38376M361032k351860j1381322q320077N52462
10396a5014316J456077j247101M367702J1811621O223683n609983k591816J3994165
10388A3390032J8820992K513695j3157096j0245587p73806k982608j1628843j0760353
10380a4823574j426523L396472J871006J994853L696094P76988l351035k5069
10372g890788O646410M193232n809215q089723J078610P575605L873841J032073
10364B610045O655471Q868352k748334j4807731q230434R985594J4425961j754419
10356A5004505j7981018j6743425m136514O084926J1608263J4486629R662230
10349A7985596m935258j6304370j0448338N653777J1399599J215592q770843n543842
$$ plain form
10341 -9748087 -6570732 -2994953 -5839042 -9783053 -7514081 -3128820 -6981986 -19555209
10333 -19555209 -28879098 -25879800 -15783267 -9819269 -9972474 -8449607 -901790 7062362
10325 7062362 8578347 4926818 2541614 4905170 11511586 20838092 28906403 28275968
10317 28275968 15841598 575162 -4260389 2342316 7741519 3289136 -4074806 -2936625
10309 -2936625 5853101 10878372 5841411 -3726280 -9150477 -7724705 -2013085 4351231
10301 4351231 7498847 4446590 -2471128 -4899832 3049565 16266335 23184511 19630185
10293 19630185 13673933 14533419 21151352 25983906 26191190 24334322 19975986 9633538
10285 9633538 -3079159 -6408776 4490973 17845821 18137948 5157044 -6979351 -7479497
$$ packed form
10341i748087L177355L575779k844089l944011K268972M385261l853166j2573223
10333a9555209r323889K999298J0096533N963998j53205J522867P547817P964152
10325G062362J515985l651529k385204K363556O606416R326506Q068311o30435
10317B8275968j2434370j5266436m835551O602705N399203m452383p363942J138181
10309b936625Q789726N025271n036961r567691n424197J425772N711620O364316
10301D351231L147616l052257o917718k428704P949397J3216770O918176l554326
10293A9630185n956252Q59486O617933M832554K07284j856868m358336j0342448
10285I633538j2712697l329617J0899749J3354848K92127j2980904j2136395n00146
$$ plain form
10277 -7479497 1591792 11887271 17198409 15075124 7107994 -652958 -2608822 109967
10269 109967 2596424 4500216 9010770 13839407 11644014 2025593 -4731053 -611317
10261 -611317 9358420 14479272 11928602 7485899 5973369 6503850 5894518 2683840 -1594054
10252 -1594054 -2868168 1873914 9245876 10489570 1197008 -12048660 -18341856 -14436179
10244 -14436179 -6686595 -2193107 -2103064 -4068237 -7343231 -12658910 -18455611 -20244262
10236 -20244262 -14748158 -3421406 9071473 18599795 22689693 20319323 13700736 8123127
10228 8123127 5398373 -261595 -12715701 -22249214 -14954498 4490169 13480299 1931409
10220 1931409 -12011973 -8384962 5742225 10586087 6085736 8022831 16855532 15134317
$$ packed form
10277g479497R071289J0295479N311138k123285p967130p760952j955864K718789
10269A09967K486457J903792M510554M828637k195393r618421o756646M119736
10261f11317R969737N120852k550670m442703j512530N30481o09332l210678m277894
10252a594054j274114M742082P371962J243694r292562j3245668o293196L905677
10244a4436179P749584M493488R0043j965173l274994n315679n796701j788651
10236b0244262N496104J1326752J2492879R528322M089898k370370o618587n577609
10228H123127k724754n659968j2454106r533513P294716J9444667Q990130j1548890
10220A931409j3943382L627011J4127187M843862m500351J937095Q832701j721215
$$ plain form
10212 15134317 -1846431 -15960670 -13967428 -5498712 -3918038 -6572574 -5376970 -2411746
10204 -2411746 -2875866 -4344074 -4217532 -7070251 -14077167 -15847138 -6512936 5247955
10196 5247955 9689812 9971849 12115444 12516079 7641390 4665070 8448591 8745418 -3964864
10187 -3964864 -19590046 -22614135 -17219284 -19724473 -31267193 -36647361 -27987879 -12937839
10179 -12937839 -987858 3686738 -1288433 -12219323 -15300569 -2708909 11330726
10172 11330726 7812686 -8062030 -15004411 -9296027 -6945295 -12202153 -9985202 4217215
10164 4217215 12241894 2774606 -8795260 -5167301 6000180 7264377 -180542 -2048559
10156 -2048559 3461097 4195675 -4543659 -12794690 -11732908 -5621738 -4226693 -9259296
$$ packed form
10212A5134317j6980748j4114239J993242Q468716J580674k654536J195604K965224
10204b411746m64120j468208J26542k852719p006916j769971R334202J1760891
10196E247955M441857K82037K143595M00635m874689k976320L783521K96827j2710282
10187c964864j5625182l024089N394851k505189j1542720n380168Q659482J5050040
10179a2937839J1949981M674596m975171j0930890l081246J2591660J4039635
10172A1330726l518040j5874716o942381N708384K350732n256858K216951J4202417
10164D217215Q024679r467288j1569866L627959J1167481J264197p444919j868017
10156b048559N509656P34578q739334q251031J061782O111170J395045n032603
$$ plain form
10148 -9259296 -12392997 -6041115 5776005 10460133 2525515 -8416188 -10271515 -3585606
10140 -3585606 3626550 9741848 16566471 18199266 8455531 -3566650 -3020674 6187028
10132 6187028 5747662 -6558284 -12194861 -3065073 5119222 504034 -5729877 -1920024
10124 -1920024 2403667 -4588848 -13196479 -8015924 4894417 8505909 3898764 6428265
10116 6428265 16615925 16310353 -4144070 -31023370 -43309264 -33781059 -12972060 877599
10108 877599 -2315424 -13110069 -12366190 2474522 11454053 1310152 -12743897 -9481294
10100 -9481294 5943900 11831271 4220891 -703182 5056868 12780831 16822813 21378348
10092 21378348 24448932 15575177 -4111545 -17275346 -13527253 -2495392 3198830 3854738
$$ packed form
10148i259296l133701O351882J1817120M684128p934618j0941703j855327O685909
10140c585606P212156O115298O824623J632795r743735j2022181N45976R207702
10132F187028m39366j2305946n636577R129788Q184295m615188o233911L809853
10124a920024M323691o992515q607631N180555J2910341L611492m607145K529501
10116F428265J0187660l05572k0454423k6879300j2285894R528205K0808999J3849659
10108H77599l193023j0794645P43879J4840712Q979531j0143901j4054049L262603
10100i481294J5425194N887371p610380m924073N760050P723963M041982M555535
10092B1378348L070584q873755j9686722j3163801L748093J1031861N694222O55908
$$ plain form
10084 3854738 3988646 1315091 -6025498 -11744746 -9910407 -3236963 3187735 7560269
10076 7560269 6034867 -6398641 -22473239 -22684700 71506 25850183 30570109 16613697
10068 16613697 6902375 12582884 21280413 18308617 6558057 -574810 1565613 4158499
10060 4158499 -2067171 -14216793 -20111482 -12768771 1028727 8422866 4254394 -6012752
10052 -6012752 -14610747 -17578221 -14000989 -5626863 2078189 4057578 1825373 602146
10044 602146 319520 -4197537 -13182829 -19021487 -16019218 -7431500 -95237 2957874
10036 2957874 2070039 -2104011 -8300702 -14282641 -18158527 -18039877 -12231320 -3906723
10028 -3906723 -2202323 -11371447 -21556657 -19562422 -6917435 3555329 7639479 12466415
$$ packed form
10084C854738J33908k673555p340589n719248J834339O673444O424698M372534
10076G560269j525402j2433508j6074598k11461K2756206K5778677M719926j3956412
10068A6613697r711322N680509Q697529k971796j1750560p132867K140423K592886
10060D158499o225670j2149622n894689P342711J3797498P394139m168472j0267146
10052f012752q597995k967474L577232Q374126P705052J979389k232205j223227
10044F02146k82626m517057q985292n838658L002269Q587718P336263L053111
10036B957874q87835m174050o196691n981939l875886J18650N808557Q324597
10028c906723J704400r169124j0185210J994235J2644987J0472764M084150M826936
$$ plain form
10020 12466415 18508647 15177487 413316 -10550309 -5917160 5158452 6788746 -1503118
10012 -1503118 -8048681 -6563301 579944 9787762 16209198 12594618 -828854 -11049705
10004 -11049705 -7894270 685604 903826 -4626217 -1142060 14120182 26206636 21843255
9996 21843255 3420587 -17059282 -28186593 -23799929 -8103990 3595246 -474962
9989 -474962 -12944818 -16396988 -7240519 1721535 2773677 2879298 8262541 13751984
9981 13751984 14187217 13765159 15516020 12653140 653827 -11152226 -11409586 -3449205
9973 -3449205 1075302 -195476 -1009755 -868406 -5448758 -13369530 -15429330 -9450404 -4673222
9964 -4673222 -7103352 -10154002 -5653168 3988977 11687268 16922448 22128836 22511509
$$ packed form
10020A2466415O042232l331160j4764171j0963625M633149J1075612J630294q291864
10012a503118o545563J485380P143245R207818O421436l614580j3423472j0220851
10004a1049705L155435Q579874K18222n530043L484157J5262242J2086454m363381
9996B1843255j8422668k0479869j1127311M386664J5695939J1699236m070208
9989d74962j2469856l452170R156469Q962054J052142J05621N383243N489443
9981A3751984M35233m22058J750861k862880j1999313j1806053k57360P960381
9973c449205M524507j270778q14279J41349m580352p920772k059800N978926M777182
9964d673222k430130l050650M500834R642145P698291N235180N206388L82673
$$ plain form
9956 22511509 10654370 -8760846 -19339038 -11958964 4217058 14549264 16106212
9949 16106212 15341160 13975940 7065660 -5575582 -15347174 -15155934 -7388205 1275037
9941 1275037 7323278 9559843 6759686 1058409 -1068945 3122100 7084878 3223374
9933 3223374 -6197056 -12422427 -12021865 -8500146 -3735953 4192711 13868216 18577661
9925 18577661 14231655 4241685 -5418119 -11319660 -11536322 -5567532 1788902 2312605
9917 2312605 -5343316 -11782839 -8701399 -1217686 -1799196 -12888003 -22419708 -18970972
9909 -18970972 -6665496 -550308 -8199842 -20178401 -21301987 -9669399 -98620 -6395381
9901 -6395381 -23487679 -32332536 -22405323 -3781557 5738061 998635 -7678730 -9341006
$$ packed form
9956B2511509j1857139j9415216j0578192P380074J6176022J0332206J556948
9949A6106212p65052j365220o910280j2641242r771592J91240P767729Q663242
9941A275037O048241K236565k800157n701277k127354M191045L962778l861504
9933C223374r420430o225371M00562L521719M764193P928664R675505M709445
9925A8577661m346006r989970r659804n901541k16662N968790P356434N23703
9917B312605p655921o439523L081440P483713n81510j1088807r531705L448736
9909a8970972J2305476O115188p649534j1978559j123586J1632588R570779o296761
9901f395381j7092298q844857R927213J8623766R519618m739426q677365j662276
$$ plain form
9893 -9341006 -3789033 2391290 5149580 4680167 1798138 -2071437 -2998939 1280810 5265018
9884 5265018 1217555 -6046195 1711691 33542076 70774934 82969455 62668051 33031194
9876 33031194 18000736 16597931 13650706 5015217 -119135 3267424 8913537 9424704
9868 9424704 4183939 -3583090 -10385136 -12529541 -8551404 -1680371 4527031 10598071
9860 10598071 15865459 13601255 475986 -13117035 -14112435 -6330399 -5420019 -13905699
9852 -13905699 -16798007 -6364126 4630687 3414611 -2808795 50359 10025356 13821621
9844 13821621 8555809 3793734 3712791 1485206 -6104538 -10165206 -2055100 12236732
9836 12236732 16962326 4991572 -12820528 -19021186 -9824033 -34857 -4232090 -17300272
$$ packed form
9893i341006N551973O180323K758290m69413k882029l869575r27502M279749L984208
9884E265018m047463p263750P757886L1830385L7232858J2194521k0301404k9636857
9876C3031194j5030458j402805k947225q635489n134352L386559N646113N11167
9868I424704n240765p767029o802046k144405L978137O871033O207402O071040
9860A0598071N267388k264204j3125269j3593021r95400P782036R10380q485680
9852a3905699k892308J0433881J0994813j216076o223406K859154R974997L796265
9844A3821621n265812m762075q0943k227585p589744m060668Q110106J4291832
9836A2236732M725594j1970754j7812100o200658R197153R789176m197233j3068182
$$ plain form
9828 -17300272 -21860761 -12724953 -1812154 2676623 7194858 16304230 20245767 11452988
9820 11452988 1241160 3914772 12825572 10380969 -3313102 -11375471 -8081795 -5512910
9812 -5512910 -9860376 -11389489 -5066470 -2613488 -12722027 -24201792 -22469765 -11787645
9804 -11787645 -6633616 -8648195 -7100070 1651957 9248843 9320931 4789791 187546
9796 187546 -3856013 -6679903 -5841374 -1643371 1975454 2406683 -28768 -5105583 -12235245
9787 -12235245 -17548184 -17356037 -14442519 -14372526 -15009521 -7487007 9548751 24320500
9779 24320500 26149004 19759348 18383604 25737371 32352478 29170469 17781595 5832378
9771 5832378 -1874425 -5247429 -6668857 -9826051 -16693314 -22718691 -19658897 -7471070
$$ packed form
9828a7300272m560489R135808J0912799M488777M518235R109372L941537q792779
9820A1452988j0211828K673612Q910800k444603j3694071q062369L293676K568885
9812e512910m347466j529113O323019K452982j0108539j1479765J732027J0682120
9804a1787645N154029k014579J548125Q752027P596886P2088m531140m602245
9796A87546m043559k823890Q38529M198003L618825M31229k435451n076815p129662
9787a2235245n312939J92147K913518O9993o36995P522514J7035758J4771749
9779B4320500J828504o389656j375744P353767O615107l182009j1388874j1949217
9771E832378p706803l373004j421428l157194o867263o025377L059794J2187827
$$ plain form
9763 -7471070 1581127 -2613024 -13287745 -15480986 -7745045 -4291147 -13400940 -24586877
9755 -24586877 -23296448 -10088507 2408296 5615976 175458 -10337375 -22153630 -29760307
9747 -29760307 -28894840 -20635759 -8618225 4543870 14170242 13363934 3413646 -1901911
9739 -1901911 7368088 21416845 22878202 11644153 3784583 6481943 9115585 2640479
9731 2640479 -5944105 -5146908 5007595 15123612 17387006 9877413 -3029148 -11287474
9723 -11287474 -7813327 795492 343648 -12207807 -25655145 -31643013 -32426896 -28790145
9715 -28790145 -15703714 2982740 11239390 3127072 -5654742 -1394357 5951894 1015957
9707 1015957 -8707081 -3501576 15656856 26252429 16223270 -1710641 -10567241 -8392903
$$ packed form
9763g471070R052197m194151j0674721k193241P735941L453898r109793j1185937
9755b4586877J290429J3207941J2496803L207680n440518j0512833j1816255p606677
9747b9760307Q65467Q259081J2017534J3162095R626372q06308r950288n315557
9739a901911R269999J4048757J461357j1234049p859570K697360K633642o475106
9731B640479q584584P97197J0154503J0116017K263394p509593j2906561q258326
9723a1287474L474147Q608819m51844j2551455j3447338n987868p83883L636751
9715b8790145J3086431J8686454Q256650q112318q781814M260385P346251m935937
9707A015957r723038N205505J9158432J0595573j0029159j7933911q856600K174338
$$ plain form
9699 -8392903 -2661005 1854265 4371614 6341483 11598825 20614241 24154458 12194786
9691 12194786 -9986350 -24627047 -21956744 -8512682 5438704 15548414 18870906
9684 18870906 12544754 2047331 -226850 8948179 17846389 16085961 8172120 4141050
9676 4141050 4775928 4387394 2303002 2560944 4981914 4120197 -3478501 -15572599 -26754423
9667 -26754423 -31557669 -26929657 -14897945 -1972656 5667585 5480607 -2155722 -14193161
9659 -14193161 -24032894 -24880919 -16229315 -4776997 1691205 -488915 -9908816 -20296238
9651 -20296238 -23518168 -17695491 -10963683 -11572434 -16311609 -15834105 -9284202 -4388928
9643 -4388928 -3875175 -2572272 741301 -79872 -6596021 -11006282 -8327351 -3668614 -1510204
$$ packed form
9699h392903N731898M515270K517349J969869N257342R015416L540217j1959672
9691A2194786k2181136j4640697K670303J3444062J3951386J0109710L322492
9684A8870906o326152j0497423k274181R175029Q898210j760428p913841m031070
9676D141050O34878l88534k084392K57942K420970q61717p598698j2094098j1181824
9667b6754423m803246M628012J2031712J2925289P640241j86978p636329j2037439
9659a4193161r839733q48025Q651604J1452318O468202k180120r419901j0387422
9651b0296238l221930N822677O731808o08751m739175M77504O549903M895274
9643d388928N13753J302903L313573q21173o516149m410261K678931M658737K158410
$$ plain form
9634 -1510204 2858384 13566197 23747606 23759654 14417679 3858725 -4329438 -11441346
9626 -11441346 -15225942 -10321757 2092927 11603144 8694876 -4261365 -14463481 -12618677
9618 -12618677 -4801739 -5778073 -18276685 -26420480 -17309490 -1530532 880574 -10084652
9610 -10084652 -16070326 -10287983 -5635918 -8723297 -6927620 8139780 22986583 22753934
9602 22753934 14335936 12505641 15258158 11126771 1767149 -2016626 -1006340 -5459391
9594 -5459391 -15191415 -19377184 -15076612 -9604192 -4942691 3761936 13190437 11983073
9586 11983073 -319896 -9289176 -5898248 2158150 5591225 7980768 16633982 27783015
9578 27783015 30582912 21968825 10037396 3534581 2479995 79841 -7204033 -13287746
$$ packed form
9634a510204M368588J0707813J0181409J2048r341975j0558954q188163p111908
9626a1441346l784596M904185J2414684R510217k908268j2956241j0202116J844804
9618a2618677P816938r76334j2498612q143795R110990J5778958K411106j0965226
9610a0084652n985674N782343M652065l087379J795677J5067400J4846803k32649
9602B2753934q417998j830295K752517m131387r359622l783775J010286m453051
9594e459391r732024m185769M300572N472420M661501Q704627R428501j207364
9586A1983073j2302969q969280L390928Q056398L433075K389543Q653214J1149033
9578B7783015K799897q614087j1931429o502815j054586k400154p283874o083713
$$ plain form
9570 -13287746 -9413859 2814727 11961974 12705184 12446199 16482203 17060936 7353710
9562 7353710 -3328310 -2298494 5778150 7129725 2695256 5105616 13739405 13069039
9554 13069039 -962870 -11731077 -5919909 8566041 16160978 12242779 1308210 -11280983
9546 -11280983 -18510302 -13700393 -600892 7678453 5125814 -1291775 -5494763 -9577911
9538 -9577911 -12937629 -8778804 1488420 5142670 -1642904 -5319330 2628990 10226865
9530 10226865 5921593 151121 7801065 20560090 17824093 -1144723 -16642043 -17380067
9522 -17380067 -10600718 -4208061 1822511 4035726 -5619251 -23217541 -30925502 -20248339
9514 -20248339 -5284661 -3915092 -15148921 -24298288 -23550789 -17729806 -13547041 -12229254
$$ packed form
9570a3287746L873887J2228586R147247P43210k58985M036004N78733r707226
9562G353710j0682020J029816Q076644J351575m434469K410360Q633789o70366
9554A3069039j4031909j0768207N811168J4485950P594937l918199j0934569j2589193
9546a1280983p229319M809909J3099501Q279345k552639o417589m202988m083148
9538i577911l359718M158825J0267224L654250o785574l676426P948320P597875
9530A0226865m305272n770472P649944J2759025k735997j8968816j5497320p38024
9522a7380067O779349O392657O030572K213215r654977j7598290p707961J0677163
9514b0248339J4963678J369569j1233829r149367P47499N820983M182765J317787
$$ plain form
9506 -12229254 -12345904 -13302279 -14492157 -14551256 -13090266 -11563711 -10943441 -8996798 -2041137
9497 -2041137 8980766 16471237 14528656 8262293 8302281 15171647 17346342 8549290
9489 8549290 -1996537 -3621988 -220101 -1801333 -5967576 -785957 15432295 29636894
9481 29636894 30927816 21861580 10636126 1207381 -5332597 -7327730 -5093884 -2033864
9473 -2033864 -412320 -25237 -1738215 -6783382 -11756439 -10929080 -5509812 -4201121 -11665900
9464 -11665900 -21900496 -25954218 -21416032 -11771952 -1281407 6655977 10277220 11176689
9456 11176689 11803500 10272307 2442884 -9802873 -18280913 -18666657 -15233503 -13013830
9448 -13013830 -11246948 -7789053 -3951027 -765130 4083035 10883285 14276612 9975720
$$ packed form
9506a2229254j16650r56375j189878n9099J460990J526555O20270J946643O955661
9497b041137J1021903P490471j942581o266363L9988O869366K174695q797052
9489H549290j0545827j625451L401887j581232m166243N181619J6218252J4204599
9481B9636894J290922r066236j1225454r428745o539978j995133K233846L060020
9473b033864J621544L87083j712978n045167m973057Q27359N419268J308691p464779
9464a1665900j0234596m053722M538186R644080J0490545P937384L621243Q99469
9456A1176689O26811j531193p829423j2245757q478040l85744L433154K219673
9448a3013830J766882L457895L838026L185897M848165O800250L393327m300892
$$ plain form
9440 9975720 1095723 -6772765 -12652995 -17607721 -19530847 -16426367 -11549440 -9290083
9432 -9290083 -8512583 -5733475 -2445495 -2982942 -6623801 -7988887 -4605392 1438870 8530135
9423 8530135 16291988 21516666 19568888 11239117 3223174 65315 -369073 -1809065
9415 -1809065 -3598729 -2003471 4347501 11517888 12307728 2876077 -10736094 -15687365
9407 -15687365 -6369435 6926800 9280343 -274933 -8725169 -7868702 -4485282 -8105162
9399 -8105162 -16260346 -18775362 -12867358 -6822072 -8646703 -15618031 -16931100 -6144407
9391 -6144407 9566847 14925252 4217057 -9363141 -8536886 5249436 13395728 6156838
9383 6156838 -4627598 -5150435 -385294 -3552902 -13110838 -15422111 -7419322 -1331895
$$ packed form
9440I975720q879997p868488n880230m954726j923126L104480M876927K259357
9432i290083P77500K779108L287980n37447l640859j365086L383495O044262P091265
9423H530135P761853N224678j947778q329771q015943l157859m34388j439992
9415a809065j789664J595258O350972P170387P89840r431651j3612171m951271
9407a5687365R317930J3296235K353543r555276q450236Q56467L383420l619880
9399h105162q155184k515016N908004O045286j824631o971328j313069J0786693
9391f144407J5711254N358405j0708195j3580198Q26255J3786322Q146292p238890
9383F156838j0784436n22837M765141l167608r557936k311273Q002789O087427
$$ plain form
9375 -1331895 -5404571 -13198457 -15694704 -12629058 -7193628 270051 7740938 9633569
9367 9633569 5340244 1945590 3243056 4289555 2398898 4051259 12864557 19442251
9359 19442251 13484845 -204174 -8086911 -5485225 1934184 9612431 16452518 19104514
9351 19104514 14591341 6842048 1589552 -2430071 -8228232 -11137866 -6101877 -118616
9343 -118616 -3485299 -11259335 -9327335 1206075 2873742 -11618136 -28201892 -32529996
9335 -32529996 -26909105 -19044906 -8987178 3087080 9701935 8244213 9043742 19533202
9327 19533202 30484627 30361160 23892507 22654706 25330331 22600189 15836594 14787921
9319 14787921 19372330 19119830 10356514 234320 -6846707 -13903319 -20990522 -22475705
$$ packed form
9375a331895m072676p793886k496247L065646N435430P463679P470887J892631
9367I633569m293325l394654J297466J046499j890657J652361Q813298O577694
9359A9442251n957406j3689019p882737K601686P419409P678247O840087K651996
9351A9104514m513173p749293n252496m019623n798161k909634N035989N983261
9343a18616l366683p774036J932000J0533410J667667j4491878j6583756m328104
9335c2529996N620891P864199J0057728J2074258O614855j457722P99529J0489460
9327A9533202J0951425j23467o468653j237801K675625k730142o763595j048673
9319A4787921M584409k52500q763316j0122194p081027p056612p087203j485183
$$ plain form
9311 -22475705 -17730201 -13885088 -14187514 -12656255 -4258869 7121054 14530732 15657849
9303 15657849 12095656 6547810 2716129 2685273 3113673 -868941 -7443070 -9292636 -3569544
9294 -3569544 4555265 8586725 6457032 662838 -2773093 1696754 10491887 10712696
9286 10712696 -3373537 -18705320 -19039977 -7524792 -246620 -1212209 -884947 1689266
9278 1689266 -3841737 -15509822 -14267191 6657203 26370108 24426101 8914204 529152
9270 529152 2012674 2225173 496210 5454513 14193435 13540197 2173202 -6661243 -6240690
9261 -6240690 -3618344 -3162391 645185 8919436 12339963 6742655 1085349 1078872 -2532918
9252 -2532918 -18036388 -35139405 -36591152 -21545222 -4916373 2834784 3485201 1218517
$$ packed form
9311b2475705M745504L845113l02426J531259Q397386J1379923P409678J127117
9303A5657849l562193n547846l831681l0856M28400l982614o574129j849566N723092
9294c569544Q124809M031460k129693n794194l435931M469847Q795133K20809
9286A0712696j4086233j5331783l34657J1515185P278172r65589L27262K574213
9278A689266n531003j1668085J242631K0924394J9712905j944007j5511897q385052
9270E29152J483522K12499j728963M958303Q738922o53238j1366995q834445M20553
9261f240690K622346M55953L807576Q274251L420527n597308n657306o477l611790
9252b532918j5503470j7103017j451747J5045930J6628849P751157O50417k266684
$$ plain form
9244 1218517 -2501020 -4150745 -95696 4548404 40140 -11288335 -13518689 894174
9236 894174 17256814 16576418 803907 -11491598 -11398102 -8505617 -12166165 -16792191
9228 -16792191 -12735373 -2871046 1304829 -4032260 -12031757 -17301688 -21808323 -26320127
9220 -26320127 -23885875 -8159259 14983245 30588693 30089621 19540041 10905414 8767158
9212 8767158 9108622 8807337 10161031 14420180 16600387 11787523 3524052 41735 3304683
9203 3304683 7497415 7954560 5568692 2180427 -1680358 -3282001 876074 7700894
9195 7700894 8718052 1973119 -4150242 -2484007 4999436 14492951 26273990 37453169
9187 37453169 38937620 28527207 17980249 16681236 17238985 9810411 1665334 5944114
$$ packed form
9244A218517l719537j649725M055049M644100m508264j1328475k230354J4412863
9236H94174J6362640o80396j5772511j2295505R3496K892485l660548m626026
9228a6792191M056818R864327M175875n337089p999497n269931m506635m511804
9220b6320127K434252J5726616K3142504J5605448m99072j0549580q634627k138256
9212H767158L41464l01285J353694M259149K180207m812864q263471l482317L262948
9203C304683M192732M57145k385868l388265l860785j601643M158075O824820
9195G700894J017158o744933o123361J666235P483443R493515J1781039J1179179
9187C7453169J484451j0410413j0546958j299013N57749p428574q145077M278780
$$ plain form
9179 5944114 17329488 18284906 7123907 -420398 1192365 -1224248 -15192667 -28878117
9171 -28878117 -30474670 -24868214 -21074101 -17707984 -11869994 -9331719 -13926599 -17932702
9163 -17932702 -14645513 -10090804 -10742175 -10496550 -2791204 5043409 4442761 2774950 10586086
9154 10586086 19648170 13711172 -2858223 -8255639 4141464 16085884 12059438 -783435
9146 -783435 -7842370 -7886377 -8602286 -11136106 -9571482 -1362900 8945975 14393062 11104975
9137 11104975 2347274 -2212141 3440256 11910741 9781554 -3795226 -14033453 -9516509
9129 -9516509 3392624 10263717 6372205 -1554537 -7018989 -10220854 -13930032 -17965241
9121 -17965241 -18715618 -12694093 -1001697 9720913 13039812 9852203 6999699 8120187
$$ packed form
9179E944114J1385374R55418j1160999p544305J612763k416613j3968419j3685450
9171b8878117j596553N606456L794113L366117N837990K538275m594880m006103
9163a7932702L287189M554709o51371K45625P705346P834613o00648j667811P811136
9154A0586086R062084n936998j6569395n397416J2397103J1944420m026446j2842873
9146g83435p058935m4007p15909k533820J564624Q208582J0308875N447087l288087
9137A1104975q757701m559415N652397Q470485k129187j3576780j0238227M516944
9129i516509J2909133O871093l891512p926742n464452l201865l709178m035209
9121a7965241p50377O021525J1692396J0722610L318899l187609k852504J120488
$$ plain form
9113 8120187 9178934 4549809 -5560662 -15906217 -22019250 -22680045 -18075858 -8796260
9105 -8796260 2377726 9953967 10352982 7701023 11030778 22103243 29698012 22705718
9097 22705718 6611287 -2520686 -380997 1476784 -2548155 -508814 16838368 36253087
9089 36253087 37405151 21212949 7194542 5627131 7519559 2178039 -9094242 -18825559
9081 -18825559 -21609513 -14868822 -1406266 8331659 6869009 2286538 8573228 23581009
9073 23581009 30071193 20245492 5049400 -4134768 -8564469 -12132885 -12985345 -12105855
9065 -12105855 -16589508 -26082759 -28683619 -19306137 -9644489 -9798992 -12514798 -7846836
9057 -7846836 -1610393 -4110678 -9676558 -4481431 10208282 19067226 15403971 8364725
$$ packed form
9113H120187J058747m629125j0110471j0345555o113033o60795M604187R279598
9105h796260J1173986P576241L99015k651959L329755J1072465P594769o992294
9097B2705718j6094431r131973K139689J857781m024939K039341J7347182J9414719
9089C6253087J152064j6192202j4018407j567411J892428n341520j1272281r731317
9081a8825559k783954O740691J3462556R737925j462650m582471O286690J5007781
9073B3581009O490184r825701j5196092r184168m429701l568416q52460Q79490
9065a2105855m483653r493251k600860R377482R661648j54503k715806M667962
9057g846836O236443k500285n565880N195127J4689713Q858944l663255p039246
$$ plain form
9049 8364725 7043576 9690097 10491183 7395744 1231589 -5821252 -9777301 -7751596
9041 -7751596 -480160 11027335 26338552 38768731 36080287 16513897 -3683056 -9035878
9033 -9035878 -3293334 2502815 10224114 25358669 35578635 22207261 -7697222 -24664934
9025 -24664934 -16956096 -4989555 -7488593 -15307118 -12469215 -3803793 -3069862 -7520777
9017 -7520777 -4851045 2992092 3302152 -4253483 -7241163 -2360996 195653 -3797538
9009 -3797538 -5356323 962112 7703937 8335869 7529175 9516471 7476962 -4933449
9001 -4933449 -19515023 -22348667 -12099244 589447 8491259 12545422 13798369 11738381
8993 11738381 10657251 16842314 27251363 30822641 24433112 18060182 19325090 22373355
$$ packed form
9049H364725j321149K646521Q01086l095439o164155p052841l956049K025705
9041g751596P271436J1507495J5311217J2430179k688444j9566390k0196953n352822
9033i035878N742544N796149P721299J5134555J0219966j3371374k9904483j6967712
9025b4664934P708838J1966541k499038p818525K837903Q665422P33931m450915
9017g520777K669732P843137L10060p555635k987680M880167K556649l993191
9009c797538j558785O318435O741825O31932q06694J987296k039509j2410411
9001d933449j4581574k833644J0249423J2688691P901812M054163J252947k059988
8993A1738381j081130O185063J0409049L571278o389529o372930J264908L048265
$$ plain form
8985 22373355 18992227 11880706 7469783 3013154 -7097518 -16698506 -13305907 2065540
8977 2065540 13219353 9507648 -2172794 -9261059 -7915521 -1776837 4823646 7954107
8969 7954107 5952567 4016724 9294472 18222273 17926924 4534369 -9895477 -14355876
8961 -14355876 -12235266 -10382945 -6101143 4560417 15319965 18630970 18112083 19527089
8953 19527089 17438520 5646501 -5841264 -1623374 14738650 24671292 21684756 17044757
8945 17044757 17996412 18615532 15594638 15202919 18582052 16731048 7753139 3351689 8658065
8936 8658065 10422891 -2530523 -19333919 -21295215 -7339911 7979499 15284011 16435373
8928 16435373 14498198 9789521 3912195 -1422040 -7477584 -13724989 -14505162 -7742313
$$ packed form
8985B2373355l381128p111521m410923m456629j0110672r600988L392599J5371447
8977B065540J1153813l711705j1680442p088265J345538O138684O600483L130461
8969G954107k001540j935843N277748Q927801k95349j3392555j4429846m460399
8961a4355876K120610J852321M281802J0661560J0759548L311005n18887J415006
8953A9527089k088569j1792019j1487765M217890J6362024R932642k986536m639999
8945A7044757R51655O19120l020894l91719L379133j851004q977909m401450N306376
8936H658065J764826j2953414j6803396j961296J3955304J5319410P304512J151362
8928A6435373j937175m708677n877326n334235o055544o247405p80173O762849
$$ plain form
8920 -7742313 -1506777 -3461651 -9228540 -10465584 -8820798 -10875313 -13914887 -9424160
8912 -9424160 1371411 7966921 6506384 3776940 4117534 2991523 -3516094 -11256523
8904 -11256523 -13404330 -7753074 2612688 11273734 12213444 7063940 5931071 14030382
8896 14030382 21422592 15886410 2606237 -1834565 5766297 11035910 5275884 -1846182
8888 -1846182 332009 5965592 2590756 -9639610 -18738200 -16656869 -6475305 3395372
8880 3395372 6530561 2598727 -1695232 1461335 11376231 18925122 18282721 13422285
8872 13422285 10434653 9405627 7395088 3559686 -2467331 -11265591 -18744120 -17163336
8864 -17163336 -5995475 4443221 5482778 163646 -4405729 -7799309 -12705229 -17219899
$$ packed form
8920g742313O235536j954874n766889j237044J644786k054515l039574M490727
8912i424160J0795571O595510j460537k729444L40594j126011o507617p740429
8904a1256523k147807N651256J0365762Q661046R39710n149504j132869Q099311
8896A4030382P392210n536182j3280173m440802P600862N269613n760026p122066
8888a846182K178191N633583l374836j2230366r098590K081331J0181564R870677
8880C395372L135189l931834m293959L156567R914896P548891o42401m860436
8872A3422285k987632j029026k010539l835402o027017q798260p478529J580784
8864a7163336J1167861J0438696J039557n319132m569375l393580m905920m514670
$$ plain form
8856 -17219899 -18587349 -19171038 -20914321 -19342110 -11365376 -3318760 -1701164 -1494355
8848 -1494355 5054100 12814290 10435609 243406 -3330796 3724391 8523660 1752795
8840 1752795 -8119011 -8262836 463024 7196472 6672180 3197640 1886817 2041343 -766109
8831 -766109 -8142578 -14548084 -11704032 -192558 7496852 2195926 -7643778 -7009117
8823 -7009117 2815889 5756993 -4004063 -13594970 -12854622 -9206030 -12577589 -18889086
8815 -18889086 -19966529 -18635112 -20705673 -21299954 -14108304 -6992996 -11635731 -21998625
8807 -21998625 -20956167 -7430917 1231554 -3408676 -8864454 -3612585 4795259 3925534
8799 3925534 -3210216 -4501602 1931087 6968274 5468635 1342700 -1323644 -3500684
$$ packed form
8856a7219899j367450n83689j743283J572211P976734Q046616J617596K06809
8848a494355O548455P760190k378681j0192203l574202P055187M799269o770865
8840A752795r871806j43825Q725860O733448n24292l474540j310823J54526k807452
8831g66109p376469o405506K844052J1511474P689410n300926r839704O34661
8823g009117R825006K941104r761056r590907P40348L648592l371559o311497
8815a8889086j077443J331417k070561n94281P191650P115308m642735j0362894
8807b1998625J042458J3525250Q662471m640230n455778N251869Q407844q69725
8799C925534p135750j291386O432689N037187j499639m125935k666344k177040
$$ plain form
8791 -3500684 -6827457 -10190483 -11837709 -10987815 -7097093 -652013 5536434 8463397
8783 8463397 8014394 6211881 4573184 3756274 3980529 3980145 1377688 -4335113 -11108517
8774 -11108517 -17316714 -22312818 -23524994 -18007671 -8844808 -4407861 -7892724 -13008238
8766 -13008238 -13766629 -12189097 -11323712 -8118058 -903737 3308628 -596735 -4193827
8758 -4193827 2495103 11871141 7775385 -7416002 -13053393 -1356524 10343782 7184664
8750 7184664 -1027878 1177715 8693402 6588328 -3486070 -8242379 -8034919 -14850969
8742 -14850969 -26146559 -24044785 -5757471 7054465 -87259 -11930893 -6945188 11173376
8734 11173376 22412960 20664489 16493109 15236300 11134376 2703763 -2950528 -3875193
$$ packed form
8791c500684l326773l363026j647226Q49894L890722O445080O188447K926963
8783H463397m49003j802513j638697q16910K24255l84k602457n712801o773404
8774a1108517o208197m996104j212176N517323R162863M436947l484863n115514
8766a3008238p58391J577532Q65385L205654P214321M212365l905363l597092
8758d193827O688930R376038m095756j5191387n637391J1696869J1700306l159118
8750G184664q212542K205593P515687k105074j0074398m756309K07460o816050
8742a4850969j1295590K101774J8287314J2811936p141724j1843634M985705J8118564
8734A1173376J1239584j748471m171380j256809m101924q430613n654291r24665
$$ plain form
8726 -3875193 -7083500 -14499792 -17478649 -10738510 -1353423 1977390 -202466 -3426462
8718 -3426462 -6781524 -8845057 -4607672 5563460 10562488 1017124 -17041462 -28861561
8710 -28861561 -28102752 -20129988 -11372143 -3492497 2747353 4842952 964718 -8124600
8702 -8124600 -18627762 -23512635 -17104092 -3540372 4505583 725930 -6578645 -7329190
8694 -7329190 -4259605 -5644087 -9338302 -6403621 2143811 5602586 839117 -3744310
8686 -3744310 -3738750 -5325442 -11652316 -14676687 -7961474 2012859 5674796 4061383 4198699
8677 4198699 6646460 6397048 2279321 -2684314 -7723451 -13729182 -17858374 -15540864
8669 -15540864 -7622890 -359504 1811540 84342 -1486846 -105873 3044608 2600824
$$ packed form
8726c875193l208307p416292k978857O740139R385087L330813k179856l223996
8718c426462l355062k063533M237385J0171132M999028r545364j8058586j1820099
8710b8861561P58809P972764Q757845P879646O239850K095599l878234r089318
8702h124600j0503162m884873O408543J3563720Q045955l779653p304575p50545
8694g329190L069585j384482l694215K934681Q547432L458775m763469m583427
8686c744310N560j586692o326874l024371O715213R974333L661937j613413J37316
8677D198699K447761k49412m117727m963635n039137o005731m129192K317510
8669a5540864P917974P263386K171044j727198j571188J380973L150481m43784
$$ plain form
8661 2600824 -5688461 -17804806 -23611120 -18620808 -9244621 -3615146 -2516060 -3020764
8653 -3020764 -4925167 -8035013 -8587182 -4861598 -1646095 -2491521 -2390574 4231376 12831381
8644 12831381 14798939 10424424 6380205 3458588 -2474963 -9181666 -9453394 -3990223
8636 -3990223 -1167216 -2276814 1038703 11023069 17529536 13965613 8841370 12362746
8628 12362746 19639545 18128634 7260635 -546127 2193461 8634961 8328793 590676
8620 590676 -6398514 -6080818 395130 7240724 10509989 10888083 10921024 10914029 8844027
8611 8844027 4060816 -670566 -1887541 279217 1421197 -2697906 -10548495 -15089147
8603 -15089147 -11776877 -4827994 -1085072 1428885 11139403 26883520 33900392 23241496
$$ packed form
8661B600824q289285j2116345n806314M990312R376187N629475J099086n04704
8653c020764j904403l109846n52169L725584L215503q45426J00947O621950Q600005
8644A2831381J967558m374515m044219k921617n933551o706703k71728N463171
8636c990223K823007j109598L315517R984366O506467l563923n124243L521376
8628A2362746P276799j510911j0867999p806762K739588O441500l06168p738117
8620E90676o989190L17696O475948O845594L269265L78094L2941o995k070002
8611H844027m783211m731382j216975K166758J141980m119103p850589m540652
8603a5089147L312270O948883L742922K513957R710518J5744117P016872j0658896
$$ plain form
8595 23241496 7114745 3874445 13008872 18178030 12580098 6116942 5647718 3641837
8587 3641837 -6813122 -18397897 -20303408 -13519627 -6051712 -343716 4509942 4002453
8579 4002453 -6708614 -21216805 -25932969 -16413947 -1964449 6730857 7814151 5000602
8571 5000602 712354 -3982983 -6012525 -877299 12415559 27178136 31436941 18124898
8563 18124898 -5829546 -23905761 -25674429 -15522741 -4558816 1650090 4243720 4733587
8555 4733587 3098780 482457 -791799 216481 2590142 4666757 4919235 4297818 7767997
8546 7767997 18576596 30004442 29939474 17303038 6555826 9807541 21106732 26497480
8538 26497480 23944027 22761120 26204448 26464385 18300592 7685737 3022213 4704522
$$ packed form
8595B3241496j6126751l240300R134427N169158n597932o463156m69224k005881
8587C641837j0454959j1584775j905511O783781P467915N707996M853658n07489
8579D002453j0711067j4508191m716164R519022J4449498Q695306J083294k813549
8571E000602m288248m695337k029542N135226J3292858J4762577M258805j3312043
8563A8124898k3954444j8076215j768668J0151688J0963925O208906K593630M89867
8555D733587j634807k616323j274256J008280K373661K076615K52478o21417L470179
8546G767997J0808599J1427846o4968j2636436j0747212L251715J1299191N390748
8538B6497480k553453j182907L443328K59937q163793j0614855m663524J682309
$$ plain form
8530 4704522 7495355 8263100 7330151 5381131 2581227 -638212 -3745939 -6143815 -6931488
8521 -6931488 -6378940 -7180271 -11571759 -17185623 -18642679 -14028883 -7541143 -4583568 -5442589
8512 -5442589 -4759740 2644926 15202601 24423182 22794593 11509967 -1517291 -10005917
8504 -10005917 -12158923 -7136158 4373932 15451495 16894801 9220345 3466588 5954548
8496 5954548 9951532 7859572 3203900 2539715 3361173 590402 -1108728 6026767 17498252
8487 17498252 20936115 14799638 9879685 11301480 11587254 4570860 -5449608 -13067735
8479 -13067735 -19713816 -26019768 -25296936 -12746624 4539476 14351759 12824417 5464279
8471 5464279 -1911202 -7329502 -9829749 -8347875 -3763014 1342250 5247751 7461131
$$ packed form
8530D704522K790833P67745r32949j949020k799904l219439l107727k397876p87673
8521f931488N52548q01331m391488n613864j457056M613796O487740K957575q59021
8512e442589O82849P404666J2557675R220581j628589j1284626j3027258q488626
8504a0005917k153006N022765J1510090J1077563J443306p674456n753757K487960
8496E954548L996984k091960m655672o64185Q21458k770771j699130P135495J1471485
8487A7498252L437863o136477m919953J421795K85774p016394j0020468p618127
8479a3067735o646081o305952P22832J2550312J7286100R812283j527342p360138
8471E464279p375481n418300k500247J481874M584861N105264L905501K213380
$$ plain form
8463 7461131 7025309 2815957 -3694546 -7251235 -2498720 9478235 19137132 16222720
8455 16222720 704288 -16589824 -25194620 -23685451 -16698804 -8880422 -4352233 -6092476
8447 -6092476 -11294148 -12465390 -7573063 -3262059 -3299173 -1749460 4976467 8009934 -651747
8438 -651747 -11347876 -7398261 10195307 22534216 17330330 1519566 -11343162 -15110260
8430 -15110260 -11206843 -4935481 -3163658 -7483239 -10070498 -4175942 4679974 8020137
8422 8020137 9477998 16460587 22042761 14015344 -279214 -235352 14787525 21953887
8414 21953887 11381549 2455760 11779724 26536354 26581568 15642620 11286904 16675452
8406 16675452 22080698 25632038 32915175 40510029 37549175 22570057 5347703 -7067700
$$ packed form
8463G461131m35822m209352o510503l556689M752515J1976955R658897k914412
8455A6222720j5518432j7294112q604796J509169O986647P818382M528189j740243
8447f092476n201672j171242M892327M311004l7114J549713O725927L033467q661681
8438f51747j0696129L949615J7593568J2338909n203886j5810764j2862728l767098
8430a5110260L903417O271362J771823m319581k587259N894556Q855916L340163
8422H020137J457861O982589N582174q027417j4294558M3862J5022877P166362
8414B1953887j0572338q925789R323964J4756630M5214j0938948m355716N388548
8406A6675452N405246L551340P283137P594854k960854j4979118j7222354j2415403
$$ plain form
8398 -7067700 -15164848 -19375326 -17551291 -9575291 1808139 12545747 16198032 7973313
8390 7973313 -5474629 -9163027 1023554 12097271 13828517 12711181 16598472 18788331
8382 18788331 10965069 299558 -2083642 -91235 -3676646 -9274567 -6605410 1798481
8374 1798481 5660410 5985023 10865424 16543395 11209022 -4419950 -17359787 -21245326
8366 -21245326 -19136619 -11095492 3677996 15943584 16574212 14526185 24311761 38387745
8358 38387745 35690004 17634312 9338828 20068758 28844124 19412447 5076411 4325155
8350 4325155 12543798 15098772 12094382 11805699 11714390 4502344 -4941455 -5438026 1824019
8341 1824019 4652762 -2308564 -12174195 -16796786 -14641765 -9024477 -4776543 -5016460
$$ packed form
8398g067700q097148m210478J824035P976000J1383430J0737608L652285q224719
8390G973313j3447942l688398J0186581J1073717J731246j117336L887291K189859
8382A8788331p823262j0665511k383200J992407l585411n597921K669157Q403891
8374A798481L861929L24613M880401N677971n334373j5628972j2939837l885539
8366b1245326K108707Q041127J4773488J2265588O30628k048027R785576J4075984
8358C8387745k697741j8055692q295484J0729930Q775366r431677j4336036p51256
8350D325155Q218643K554974l004390k88683r1309p212046r443799m96571P262045
8341A824019K828743o961326r865631m622591K155021N617288M247934k39917
$$ plain form
8333 -5016460 -7035531 -4163609 5295662 14813435 17380298 11713632 -222012 -14963097
8325 -14963097 -25133607 -23288076 -11464739 -443293 2604423 -442423 -5170056 -8031557
8317 -8031557 -4092561 7622905 16592851 11182007 -2749194 -7729706 -555260 4139717
8309 4139717 -410437 -2356612 6540236 16293244 17057350 15570141 20388459 25154004
8301 25154004 20616697 11131255 5196417 472062 -7976990 -14638815 -12496927 -5735123
8293 -5735123 -774743 5045083 12417704 9373140 -11590294 -35044552 -39274841 -24922346
8285 -24922346 -10446875 -5367556 -4979876 -5993601 -9390230 -10932346 -5407919 2057366
8277 2057366 3411260 2236497 6219672 10993500 8377879 4546176 10276821 18050716
$$ packed form
8333e016460k019071K871922R459271R517773K566863n666666j1935644j4741085
8325a4963097j0170510J845531J1823337J1021446L047716l046846m727633k861501
8317h031557L938996J1715466Q969946n410844j3931201m980512P174446M694977
8309D139717m550154j946175Q896848R753008P64106j487209M818318M765545
8301B5154004m537307r485442n934838m724355q449052o661825K141888O761804
8293e735123M960380N819826P372621l044564k0963434k3454258m230289J4352495
8285b4922346J4475471N079319L87680j013725l396629j542116N524427P465285
8277B057366J353894j174763L983175M773828k615621l831703N730645P773895
$$ plain form
8269 18050716 11204401 -6427275 -13943943 -7021692 -3123588 -9077402 -9282695 4592004
8261 4592004 16300648 11144949 -678645 -2614637 2781660 3589918 425366 1095820
8253 1095820 3069814 -1497321 -9457446 -10971214 -5959572 -2384905 -1366056 2620780
8245 2620780 8402510 7773615 -886543 -9212606 -10491509 -6195704 143542 7502482
8237 7502482 13963821 15795053 12584415 8149106 4482951 -170563 -5263623 -5471746
8229 -5471746 1717387 9755327 9631912 1652568 -4112166 86610 10954057 19213422
8221 19213422 19813338 14084386 5141071 -3652499 -7462277 -3840117 1720431 291416
8213 291416 -9115769 -18647513 -22969345 -23962533 -22558586 -15901405 -6915679 -5578127 -13019899
$$ packed form
8269A8050716o846315j7631676p516668O922251L898104n953814k05293J3874699
8261D592004J1708644n155699j1823594j935992N396297Q08258l164552O70454
8253A095820J973994m567135p960125j513768N011642L574667J018849L986836
8245B620780N781730o28895q660158q326063j278903M295805O339246P358940
8237G502482O461339J831232l210638m435309l666155m653514n093060k08123
8229e471746P189133Q037940j23415p979344n764734M198776J0867447Q259365
8221A9213422N99916n728952q943315q793570l809778L622160N560548j429015
8213B91416r407185r531744m321832r93188J403947O657181Q985726J337552p441772
$$ plain form
8204 -13019899 -15286168 -3859032 7461905 609484 -18756237 -27841960 -18150641 -3556104
8196 -3556104 2918650 3815313 5496506 6626309 4572970 2238981 2511932 3977962 5611311
8187 5611311 7597026 5800121 -4474212 -16850498 -17325590 -3542441 10134400 11816622
8179 11816622 5856194 1589464 -961616 -5915384 -10711095 -9917562 -4646431 -420601
8171 -420601 619886 -194244 -1677823 -1935158 1469184 6269728 5570613 -2316955 -9050694
8162 -9050694 -6084289 4607779 13602126 14348733 7673840 -251922 -2509129 2079375
8154 2079375 6482176 4280756 -159714 2168566 9604872 11046055 3698755 -2050280
8146 -2050280 491450 3680687 -2115501 -14670977 -24690849 -26864520 -21111626 -10686102
$$ packed form
8204a3019899k266269J1427136J1320937o852421j9365721r085723R691319J4594537
8196c556104O474754Q96663J681193J129803k053339k333989K72951J466030J633349
8187E611311J985715j796905j0274333j2376286m75092J3783149J3676841J682222
8179A1816622n960428m266730k551080m953768m795711P93533N271131M225830
8171d20601J040487q14130j483579k57335L404342M800544o99115p887568o733739
8162i050694K966405J0692068Q994347P46607o674893p925762k257207M588504
8154B079375M402801k201420m440470K328280P436306J441183p347300n749035
8146b050280K541730L189237n796188j2555476j0019872k173671N752894J0425524
$$ plain form
8138 -10686102 -3607879 -7397227 -17515776 -19816026 -9262117 3170072 7042636 5379913
8130 5379913 5371134 7232178 9044178 11599363 11502801 1618101 -13694144 -17276106 -3152372
8121 -3152372 12039559 13591157 10014665 14285074 18186503 6226684 -14616300 -22146384
8113 -22146384 -11784300 -440741 1427458 1105492 5046092 7750494 4155391 -1541705
8105 -1541705 -4361225 -4470623 -1959430 3549298 7100884 3845378 678792 9306318
8097 9306318 26155500 33151302 22156357 5544673 -2498954 -3105326 -4990638 -10055862
8089 -10055862 -13862423 -13159773 -7453970 1014854 5762975 1249731 -8189458 -12179006
8081 -12179006 -9116903 -8598843 -16263162 -25234673 -27000295 -22811700 -19026048 -17191253
$$ packed form
8138a0686102P078223l789348j0118549k300250J0553909J2432189L872564j662723
8130E379913q779J861044J812000K555185r6562r884700j5312245l581962J4123734
8121c152372J5191931J551598l576492M270409L901429j1959819k0842984p530084
8113b2146384J0362084J1343559J868199l21966L940600K704402l595103n697096
8105a541705k819520j09398K511193N508728L551586l255506l166586Q627526
8097I306318J6849182O995802j0994945j6611684q043627o06372j885312n065224
8089a0055862l806561P02650N705803Q468824M748121m513244r439189l989548
8081a2179006L062103N18060p664319q971511j765622M188595L785652J834795
$$ plain form
8073 -17191253 -13780301 -6093972 4241960 10937988 7158456 -5275026 -13717498 -9487519
8065 -9487519 -1689220 -5574350 -19182748 -25022170 -15730420 -3651468 -1318998 -6493676
8057 -6493676 -12228525 -18053725 -22988824 -19729967 -6312210 5463755 3724984 -7679679
8049 -7679679 -15842136 -15499123 -10947029 -6409270 -2456034 1273663 5412240 9665518
8041 9665518 9635258 1242473 -8923051 -7005410 8873657 22218806 18522735 3635905
$$ packed form
8073a7191253L410952P686329J0335932O696028l779532j2433482q442472M229979
8065i487519P798299l885130j3608398n839422R291750J2078952K332470n174678
8057f493676n734849n825200m935099L258857J3417757J1775965j738771j1404663
8049g679679q162457L43013M552094M537759L953236L729697M138577M253278
8041I665518l0260q392785j0165524J917641J5879067J3345149l696071j4886830
$$ [...]
##END NTUPLES=NMR SPECTRUM
##END=
