##TITLE=31Pdec_SR34_2
 CDCl3, 24 sc
 4.03.2021
##JCAMPDX= 6.0         $$ Bruker NMR JCAMP-DX V2.0
##DATA TYPE= NMR SPECTRUM
##DATA CLASS= NTUPLES
##ORIGIN= UXNMR, Bruker Analytische Messtechnik GmbH
##OWNER= root
$$ XWIN-NMR		Version 3.5
$$ Thu Mar  4 11:54:06 2021 Russian Standard Time (UT+4h)  she@DPX200
##.OBSERVE FREQUENCY= 81.013821
##.OBSERVE NUCLEUS= ^31P
##.ACQUISITION MODE= SIMULTANEOUS
##.ACQUISITION SCHEME= undefined
##.AVERAGES= 24
##.DIGITISER RES= 16
##SPECTROMETER/DATA SYSTEM= spect
##.PULSE SEQUENCE= zgpg30
##.SOLVENT NAME= CDCl3
##.SHIFT REFERENCE= (INTERNAL, CDCl3, 0, 248.564)
##AUDIT TRAIL= $$ (NUMBER, WHEN, WHO, WHERE, WHAT)
$$ ##TITLE= Audit trail, XWIN-NMR		Version 3.5
$$ ##JCAMPDX= 5.01
$$ ##ORIGIN= Bruker BioSpin GmbH
$$ ##OWNER= she
$$ F:/spectra/data/she/nmr/P31/1/pdata/1/auditp.txt
$$ ##AUDIT TRAIL=  $$ (NUMBER, WHEN, WHO, WHERE, WHAT)
(   1,<2021-03-04 11:52:56.21 +0400>,<she>,<DPX200>,
      <created by zg, POWCHK disabled, PULCHK disabled
       configuration hash MD5:
       00 E9 B6 7A A2 85 ED C7 34 08 36 98 17 FE 4E 26
       data hash MD5: 32K
       0B 08 CF 7C C9 AC 3D 4C E0 C3 37 07 CE CD BA 19>)
(   2,<2021-03-04 11:53:00.04 +0400>,<she>,<DPX200>,
      <Start of raw data processing
       efp BC_mod = 2 LB = 1 FT_mod = 6 PKNL = 1 PHC0 = -2988.025 PHC1 = 69.60088 SI = 64K 
       data hash MD5: 64K
       0C 3A 51 AF F8 CC AB DD 93 AF 48 28 77 5C 16 B1>)
(   3,<2021-03-04 11:53:37.64 +0400>,<she>,<DPX200>,
      <pk PHC0 = -33.07404 PHC1 = 109.6 
       data hash MD5: 64K
       21 D9 A4 D5 5B 62 DF C6 05 2A AE FA 9E D8 61 9B>)
$$ ##END=
$$ 
$$ hash MD5
$$ 0E A9 55 78 8D 62 9E 7B A5 B2 F5 2D 82 E6 A1 70
##$RELAX= 
##$RELAX= 
##$RELAX= 
##$RELAX= 
##$RELAX= 
##$RELAX= 
##$RELAX= 
##$RELAX= 
$$ Bruker specific parameters
$$ --------------------------
##$DU= <F:/spectra>
##$EXPNO= 1
##$NAME= <P31>
##$PROCNO= 1
##$TYPE= <nmr>
##$USER= <she>
##$AMP= (0..31)
100 100 100 100 100 100 100 100 100 100 100 100 100 100 100 100 100 100 
100 100 100 100 100 100 100 100 100 100 100 100 100 100 
##$AQSEQ= 0
##$AQ_mod= 1
##$AUNM= <au_zg>
##$AUTOPOS= <>
##$BF1= 81.014009
##$BF2= 200.13
##$BF3= 200.13
##$BF4= 200.13
##$BF5= 200.13
##$BF6= 200.13
##$BF7= 200.13
##$BF8= 200.13
##$BYTORDA= 1
##$CFDGTYP= 0
##$CFRGTYP= 5
##$CHEMSTR= <none>
##$CNST= (0..31)
1 1 145 1 1 1 1 1 1 1 1 1 1 1 1 1 1 1 1 1 1 1 1 1 1 1 1 1 1 1 1 1 
##$CPDPRG= <waltz16>
##$CPDPRG1= <>
##$CPDPRG2= <waltz16>
##$CPDPRG3= <>
##$CPDPRG4= <mlev>
##$CPDPRG5= <mlev>
##$CPDPRG6= <mlev>
##$CPDPRG7= <mlev>
##$CPDPRG8= <mlev>
##$CPDPRGB= <>
##$CPDPRGT= <>
##$D= (0..31)
0 1 0 0 0 0 0 0 0 0 0 0.03 2e-05 3e-06 0 0 0 0 0 0 0 0 0 0 0 0 0 0 0 0 
0 0 
##$DATE= 1614844375
##$DBL= (0..7)
120 120 120 11 120 120 24 19 
##$DBP= (0..7)
150 150 150 150 150 150 150 150 
##$DBP07= 0
##$DBPNAM0= <>
##$DBPNAM1= <>
##$DBPNAM2= <>
##$DBPNAM3= <>
##$DBPNAM4= <>
##$DBPNAM5= <>
##$DBPNAM6= <>
##$DBPNAM7= <>
##$DBPOAL= (0..7)
0.5 0.5 0.5 0.5 0.5 0.5 0.5 0.5 
##$DBPOFFS= (0..7)
0 0 0 0 0 0 0 0 
$$ [...]
##$SUBNAM2= <"">
##$SUBNAM3= <"">
##$SUBNAM4= <"">
##$SUBNAM5= <"">
##$SUBNAM6= <"">
##$SUBNAM7= <"">
##$SUBNAM8= <"">
##$SUBNAM9= <"">
##$SW= 501.771253377433
##$SWIBOX= (0..15)
0 1 3 0 0 0 0 0 0 0 0 0 0 0 0 0 
##$SW_h= 40650.406504065
##$TD= 32768
##$TD0= 1
##$TE= 0
##$TE2= 300
##$TE3= 300
##$TEG= 300
##$TL= (0..7)
0 120 53 12 22 120 120 120 
##$TP= (0..7)
150 150 150 150 150 150 150 150 
##$TP07= 0
##$TPNAME0= <>
##$TPNAME1= <>
##$TPNAME2= <>
##$TPNAME3= <>
##$TPNAME4= <>
##$TPNAME5= <>
##$TPNAME6= <>
##$TPNAME7= <>
##$TPOAL= (0..7)
0.5 0.5 0.5 0.5 0.5 0.5 0.5 0.5 
##$TPOFFS= (0..7)
0 0 0 0 0 0 0 0 
##$TUNHIN= 0
##$TUNHOUT= 0
##$TUNXOUT= 0
##$USERA1= <user>
##$USERA2= <user>
##$USERA3= <user>
##$USERA4= <user>
##$USERA5= <user>
##$V9= 5
##$VALIST= <valist>
##$VCLIST= <CCCCCCCCCCCCCCC>
##$VD= 0
##$VDLIST= <DDDDDDDDDDDDDDD>
##$VPLIST= <PPPPPPPPPPPPPPP>
##$VTLIST= <TTTTTTTTTTTTTTT>
##$WBST= 1024
##$WBSW= 4
##$XGAIN= (0..3)
0 0 0 0 
##$XL= 0
##$YL= 0
##$YMAX_a= 6935
##$YMIN_a= -6218
##$ZGOPTNS= <>
##$ZL1= 120
##$ZL2= 120
##$ZL3= 120
##$ZL4= 120
##$ABSF1= 0
##$ABSF2= 0
##$ABSG= 0
##$ABSL= 0
##$ALPHA= 0
##$AQORDER= 0
##$ASSFAC= 0
##$ASSFACI= 0
##$ASSFACX= 0
##$ASSWID= 0
##$AUNMP= <proc_1d>
##$AZFE= 0.1
##$AZFW= 0.5
##$BCFW= 0
##$BC_mod= 2
##$BYTORDP= 0
##$COROFFS= 0
##$CY= -3
##$DATMOD= 1
##$DC= 0
##$DFILT= <>
##$DTYPP= 0
##$F1P= 0
##$F2P= 0
##$FCOR= 1
##$FTSIZE= 65536
##$FT_mod= 6
##$GAMMA= 0
##$GB= 0
##$INTBC= 1
##$INTSCL= 5.30512e-09
##$ISEN= 30
##$LB= 1
##$LEV0= 0
##$LPBIN= 0
##$MAXI= 10000
##$MC2= 0
##$MEAN= 0
##$ME_mod= 0
##$MI= 50
##$NCOEF= 0
##$NC_proc= -7
##$NLEV= 6
##$NOISF1= 182.463
##$NOISF2= 159.3651
##$NSP= 0
##$NTH_PI= 0
##$NZP= 0
##$OFFSET= 248.5645
##$PC= 4
##$PHC0= -3021.099
##$PHC1= 179.2009
##$PH_mod= 1
##$PKNL= yes
##$PPARMOD= 0
##$PSCAL= 0
##$PSIGN= 0
##$REVERSE= no
##$SF= 81.014009
##$SI= 65536
##$SIGF1= 159.3651
##$SIGF2= -187.1042
##$SINO= 113.3802
##$SIOLD= 16384
##$SREGLST= <1H.CDCl3>
##$SSB= 0
##$STSI= 65536
##$STSR= 0
##$SW_p= 40650.406504065
##$SYMM= 0
##$S_DEV= 0
##$TDeff= 32768
##$TDoff= 0
##$TI= <>
##$TILT= no
##$TM1= 0
##$TM2= 0
##$TOPLEV= 0
##$USERP1= <user>
##$USERP2= <user>
##$USERP3= <user>
##$USERP4= <user>
##$USERP5= <user>
##$WDW= 1
##$XDIM= 65536
##$YMAX_p= 299340537
##$YMIN_p= -45846098
$$ End of Bruker specific parameters
$$ ---------------------------------
##NTUPLES= NMR SPECTRUM
##VAR_NAME=  FREQUENCY,     SPECTRUM/REAL,   SPECTRUM/IMAG
##SYMBOL=    X,             R,               I
##VAR_TYPE=  INDEPENDENT,   DEPENDENT,       DEPENDENT
##VAR_FORM=  AFFN,          ASDF,            ASDF
##VAR_DIM=   65536,         65536,           65536
##UNITS=     HZ,            ARBITRARY UNITS, ARBITRARY UNITS
##FACTOR=    0.620285442955139, 1,           1
##FIRST=     20137.2065510759, 0,            0
##LAST=      -20513.1999529892, 0,           0
##MIN=       -20513.1999529892, -45846098,   0
##MAX=       20137.2065510759, 299340537,    0
$$ Real data points
##PAGE= N=1
##DATA TABLE= (X++(R..R)), XYDATA
$$ [...]
##PAGE= N=2
##DATA TABLE= (X++(I..I)), XYDATA
13014c767718J0900330Q880212l01481o921385n874513j846944n62855j565957
13006a060311j851811j024165L9360J329454J939196l3409l501591m050464o4328
12997h278069M277251M657238J933363q02659k947336m844757m675075j027080
12989a1707124L346248M363177K202143N78684J076730J475168k74379l104778
12981b044131m340663k482016J604907N071631N052579J492906k382328l387233
12973a414348j554604O74747J303818J1406k015379k491351M7498L636571M267972
12964B466330J283498j195548l22690R90012r66796l965049k912782J718631M026432
12955A122038J413284k115315k685730j569279j173490o91736Q70095J327462
$$ plain form
13014 -3767718 7132612 16012824 15711343 8789958 2915445 1068501 505646 -1060311
13006 -1060311 -2912122 -3936287 -3896927 -2567473 -628277 -661686 -4163277 -8213741 -8278069
12997 -8278069 -4000818 656420 2589783 1787124 -1160212 -6004969 -10680044 -11707124
12989 -11707124 -8360876 -3997699 -1795556 -1216872 -140142 1335026 1060647 -2044131
12981 -2044131 -6384794 -8866810 -7261903 -2190272 2862307 4355213 1972885 -1414348
12973 -1414348 -2968952 -2294205 -990387 -978981 -2994360 -5485711 -5438213 -1801642 2466330
12964 2466330 3749828 2554280 2231590 3221602 2254806 -1710243 -4623025 -2904394 1122038
12955 1122038 2535322 420007 -2265723 -3835002 -5008492 -5700228 -4830133 -3502671
12947c502671p16166j753018J537615N294632K908968m032621o268120k32464
12939f763845N865789L773599k514908k940776L259681O564213J698549m839820
12931D102482m992626l96608J828487J10503j212776m18467m84582k453738k829505
12922f746830M19500M016365M272259K197953P09427l15922k596950m918453l887058
12913f849709J075968O366571Q113667N726275J652788r74357q56705M5781j591664
12904A2708615n828485q181102n171869K71558K198574k33296j876885O71672
12896e441218M472616N133539K736108J21963j850441l723609m073077j054556
12888c678675L160573L726103l35894m473894m709888k139178L03777K196674
$$ plain form
12947 -3502671 -4218837 -5971855 -4434240 860392 3769360 -263261 -6531381 -6763845
12939 -6763845 -898056 2875543 360635 -2580141 679540 7243753 8942302 4102482
12931 4102482 -890144 -1286752 541735 652238 -560538 -979005 -1463587 -3917325 -6746830
12922 -6746830 -6327330 -2310965 1961294 4159247 4868674 4552752 1955802 -2962651 -6849709
12913 -6849709 -5773741 592830 8706497 14432772 16085560 15111203 14254498 14300279 12708615
12904 12708615 6880130 -1300972 -6472841 -6201283 -4002709 -4236005 -6112890 -5441218
12896 -5441218 -968602 4164937 6901045 7023008 5172567 1448958 -2624119 -3678675
12888 -3678675 -518102 3208001 2872107 -1601787 -6311675 -8450853 -8147076 -5950402
12880e950402M037216M207154J369827j764786j314820J578954J642834k796785
12872A009192o871746n656669m65203L637573M345968L489221L138479K952114
12864E578929J470071j431317l840659l499749n26779K041648J680475j93312
12856A279307k82800J442352J635999r22743l118600k294682j01399O20621P0054
12847a671891L209K01727q30643l039094m806029m590894j528691L490677O599002
12838f172627M200223j265500l047954N02453L382453J620014p03129L03338Q29876
12829c50853k931020n798877j534886N010943M449491j501152k747136K083310
12821c320180L988075r0641k386462R88353L156514k76666k851285O34683M106513
$$ plain form
12880 -5950402 -1913186 2293968 3663795 1899009 584189 2163143 3805977 1009192
12872 1009192 -5862554 -11519223 -11984426 -8346853 -4000885 -511664 2626815 5578929
12864 5578929 7049000 5617683 1777024 -1722725 -2249504 -207856 1472619 1279307
12856 1279307 996507 2438859 4074858 3152115 33515 -2261167 -2362566 -1741945 -1671891
12847 -1671891 -1668682 -1466955 -2297598 -5336692 -10142721 -14733615 -16262306 -12771629 -6172627
12838 -6172627 -1972404 -3237904 -6285858 -5783405 -2400952 -780938 -1484067 -1180729 -350853
12829 -350853 -3281873 -9080750 -10615636 -5604693 -1155202 -2656354 -5403490 -3320180
12821 -3320180 667895 577254 -1809208 -820855 2335659 2058993 -792292 -157609 3948904
12812C948904R50973m111610l391327Q58604J773448N5151N94118J769434j263572
12803A184123n877255n027173P56903M069035K330079j42305j114017k704213
12795f524823m565126l146870J227732L800851K920187J718221J677867Q74234
12787b017727p88503q34087N49985L47495j655714k521954j439376J06245K580943
12778e672693O509919P642292J903983n394823m462084L918024P833336J366617
12770A3644571p118043p958873k778166J340490K594708K908876J841517r61451
12762C513629j790546J856645N362553K774685l802333o644572l070889J662417
12754a38411K065895j157985l262476j649166J207096Q49582l303194o662617
$$ plain form
12812 3948904 4899877 788267 -2603060 -1744456 28992 84143 678261 2447695 1184123
12803 1184123 -4693132 -9720305 -8963402 -4894367 -2564288 -2706593 -3820610 -6524823
12795 -6524823 -11089949 -14236819 -13009087 -9208236 -6288049 -4569828 -2891961 -2017727
12787 -2017727 -2806230 -3640317 -3090332 -2742837 -4398551 -6920505 -8359881 -8253636 -5672693
12778 -5672693 837226 8479518 10383501 4988678 526594 4444618 12277954 13644571
12770 13644571 6526528 -1432345 -4210511 -2870021 -275313 2633563 4475080 3513629
12762 3513629 1723083 3579728 8942281 11716966 7914633 1270061 -1800828 -138411
12754 -138411 1927484 769499 -2492977 -4142143 -2935047 -2085465 -5388659 -12051276
12746a2051276n485006j850570M58412K128955N231731O816266K969506k461231
12738d243213k110607K464288K774241j521299j452015M504394N788055k023232
12730D180612p671745k314458N062043K691292l925973k139927N289646M968862
12722F140352l528367o653776K20214N844788K765136j262882J829160O670269
12714A2024894M326228l059880o598562l967007l72094L63688q56260j999054
12706a38047k058169q90679K62420j85233j089277N71490M383734N765041K434705
12697I055985k170474m089369l641218k673285q95925J999047L805501K646692
12689D036954O9896j301655j181355o96114k66884j92495j097871k280703j977602
$$ plain form
12746 -12051276 -17536282 -19386852 -18928440 -16799485 -11567754 -4751488 -1781982 -4243213
12738 -4243213 -6353820 -3889532 -1115291 -2636590 -4088605 415789 6203844 4180612
12730 4180612 -3491133 -5805591 -743548 1947744 -1978229 -4118156 1171490 6140352
12722 6140352 2611985 -4041791 -3821577 2023211 4788347 3525465 5354625 12024894
12714 12024894 16351122 13291242 6692680 2725673 2353579 2717267 1861007 -138047
12706 -138047 -2196216 -3086895 -2824475 -3009708 -4098985 -3527495 856239 6621280 9055985
12697 9055985 6885511 2796142 -845076 -3518361 -4414286 -2415239 1390262 4036954
12689 4036954 4106850 2805195 1623840 927726 660842 468347 -629524 -2910227 -4887829
12680d887829m65360r1025j056929n33023K424006M604275L451773Q48519l07779
12671C986628k52948n30971q48489m43554j59519o65775r07962m95215j005400
12662a323205k660473k709740O6387K282796R15850j309584K02370M330991N229332
12653E024724P35434m358540m550289k72174L337750K794806l27036k274660k004769
12644a894754j605908j931650n80391L684704P056487N101704l87824l571973
12636E870395k879654j899411k092669r06149J660893J458336k005014k816787
12628c610060J963647O198853L442612l162029n921060l581379q27580R9457N98522
12619d799017P86430L8374P63218M903957P925041L604818n287335q641154k840799
$$ plain form
12680 -4887829 -5353189 -5444214 -6501143 -7034166 -4610160 -5885 3445888 4294407 3986628
12671 3986628 3733680 3202709 2354220 1910666 1751147 1085372 177410 -317805 -1323205
12662 -1323205 -3983678 -6693418 -6627031 -4344235 -3428385 -4737969 -4535599 -204608 5024724
12653 5024724 5760158 1401618 -3148671 -3420845 -83095 2711711 2384675 110015 -1894754
12644 -1894754 -3500662 -5432312 -6012703 -2327999 4728488 9830192 9442368 5870395
12636 5870395 2990741 1091330 -1001339 -1907488 -246595 1211741 -793273 -3610060
12628 -3610060 -1646413 4552440 7995052 4833023 -1088037 -4669416 -5496996 -5397539 -4799017
12619 -4799017 -4012587 -3974213 -3210995 1692962 9618003 13222821 7935486 -705668 -3546467
12610c546467L923034L070245l252757o324682k310751M373580P227560M139695
12602G299457j604990n021383m169403j446462n1071m37676j327161k194876k596259
12593a1549824j140317J965098L444072J467268n86538R27751L450898J944127
12585g7465k560684m182088j246239K138192L419940L913690L347354n97105n539395
12576a383800m602461L253115R551698P199373k94937m863171m341831k207140
12568B310846j005495j032959k402455l839018k182783K692012N312700J381795
12560A234643n392000p675012l649127K277810N694334N087386R39205l685010
12552e167771l914985J030897N068529L152909q26816n4642L838817L126728l082394
$$ plain form
12610 -3546467 376567 3446812 194055 -6130627 -8441378 -4067798 3159762 7299457
12602 7299457 5694467 673084 -3496319 -4942781 -4993852 -5431528 -6758689 -8953565 -11549824
12593 -11549824 -12690141 -10725043 -7280971 -5813703 -6400241 -5472490 -2021592 -77465
12585 -77465 -2638149 -6820237 -8066476 -5928284 -2508344 1405346 4752700 4155595 -1383800
12576 -1383800 -5986261 -2733146 6818552 14017925 13722988 8859817 4517986 2310846
12568 2310846 1305351 272392 -2130063 -5969081 -8151864 -5459852 -147152 1234643
12560 1234643 -4157357 -11832369 -15481496 -13203686 -7509352 -2421966 -1482761 -5167771
12552 -5167771 -9082756 -8051859 -2983330 169579 -657237 -711879 3126938 6253666 3171272
12543C171272o758212l347497J649932J848565j049611k039155j136701j395202
12535i056609k305203r75542K051467L427108K573934K017322K449153J864036
12527B045666L7597l95266J227192J508347j660186m589218k363452L388262N544131
12518D743073R86607m777635m889306k55809K306466j41878l139009j917144J951851
12509e132784L513810J428409j109047j256856M58974J701709Q30336j968886
12501a534335m561174m373138j364886J392235J568887O82655J345058K924801
12493c919897K878237J358078R01679J722184J153362j483207l189177k048635
12485b627376l63516p81475k036348j333737J023161K449266K258215J889107
$$ plain form
12543 3171272 -3586940 -6934437 -5284505 -3435940 -4485551 -6524706 -7661407 -9056609
12535 -9056609 -11361812 -12337354 -10285887 -6858779 -4284845 -2267523 181630 2045666
12527 2045666 2083263 1687997 2915189 4423536 2763350 -1825868 -4189320 -801058 4743073
12518 4743073 5729680 952045 -3937261 -4193070 -1886604 -2028482 -5167491 -7084635 -5132784
12509 -5132784 -1618974 -190565 -1299612 -2556468 -2097494 -395785 434551 -1534335
12501 -1534335 -6095509 -10468647 -11833533 -10441298 -8872411 -8189756 -6844698 -3919897
12493 -3919897 -1041660 316418 1218097 2940281 4093643 2610436 -578741 -2627376
12485 -2627376 -2990892 -3772367 -5808715 -7142452 -6119291 -3670025 -1411810 477297
12477D77297J521704l16386l396739m940359l306298l31321J517918K497199M045906
12468b231079N199596L369499j205045m456164l234502P33123L207460K400349
12460C783237j98363k689776m038282l229912j28414K730405K241055o69733j669109
12451c868892N16083J790687p05836l155545m19091N235986O022965n15877p287425
12442b386945o379666J082121O641252M821555q39432k539604K266357P534498
12434A0200136N680006k837867r393828p551827q29080K468063L3428k871346
12426e102315k047756J78030k00784k331431k081334J501069M589857L615993
12418a878671k95610k902985j780404J548261M164248M920928M150857J690427
$$ plain form
12477 477297 1999001 1682615 -1714124 -6654483 -9960781 -10292102 -8774184 -6276985 -2231079
12468 -2231079 2968517 6338016 5132971 676807 -2557695 -1824572 1382888 3783237
12460 3783237 3584874 895098 -3143184 -6373096 -6501510 -3771105 -1530050 -2199783 -3868892
12451 -3868892 -3352809 -1562122 -2267958 -5423503 -5842594 -606608 5416357 4900480 -2386945
12442 -2386945 -8766611 -7684490 -1043238 3778317 2938885 399281 2665638 10200136
12434 10200136 15880142 13042275 3648447 -3903380 -4732460 -2264397 -2230969 -5102315
12426 -5102315 -7150071 -6972041 -7172825 -9504256 -11585590 -10084521 -5494664 -1878671
12418 -1878671 -2174281 -5077266 -6857670 -5309409 -1145161 3775767 7926624 9617051
12410I617051k360181n310094l698766J316836L685766J09919m773665m316100
12402e729234J080523N050909M348693K075009J512373J430552n21362l246056
12394F001407l773860j635691O08327N42782j655217l540259k746398M70179L178237
12385b550493L002662Q23147q15809j037716p79964n58564r6604M50075P72315
12376g90951J219096J701760J064149o03545r10823J090025K353557L26593k363454
12367C086407j878508L74402L22892j524063j286378R15094J191558p99856j304524
12358i02976N49072J810251K074336L666595M895368J185003n638676p928634
12350b89661m365944j997925k816253O33029J0131067J3786425L225819j0484096
$$ plain form
12410 9617051 7256870 1946776 -1751990 -435154 3250612 3360531 -1413134 -5729234
12402 -5729234 -4648711 402198 4750891 6825900 8338273 9768825 9247463 6001407
12394 6001407 2227547 591856 1200183 1742965 87748 -3452511 -6198909 -5728730 -2550493
12385 -2550493 452169 1275316 459507 -578209 -1358173 -1916737 -2013341 -1563266 -790951
12376 -790951 428145 2129905 3194054 2590509 1679686 2769711 5123268 5449861 3086407
12367 3086407 1207899 1582301 1905193 381130 -905248 9846 1201404 401548 -902976
12358 -902976 -353904 1456347 3530683 7197278 12092646 13277649 7638973 -289661
12350 -289661 -4655605 -6653530 -9469783 -8836754 1294313 15080738 18306557 7822461
12342G822461j0735800Q10999P813473L543153k241450r73686L098945K563912
12334A1702007j899661m904883m265090j225228K402927M208665K216807j873067
12326F362477l900953k801598j323810p66252O24589L119358L767447P67249l715575
12317B132932o204420m941386m77559M043913M362997K91262k306016J004776
12309b093501N889895M954005j050719m443770k153620J226762K000519J587580
12301E917151J252722j67764j756275o32279J768899M64775m245937n971291k414848
12292e784847J176925J393739J446566L086334K225414k420445m507020j39859
12284c523193M630289L483730K04011J293601M185239K082290l748326o160687
$$ plain form
12342 7822461 -2913339 -2102340 5711133 9254286 7012836 6039150 9138095 11702007
12334 11702007 9802346 4897463 632373 -592855 1810072 6018737 8235544 6362477
12326 6362477 2461524 -340074 -1663884 -2430136 -1805547 1313811 5081258 5848507 2132932
12317 2132932 -4071488 -9012874 -9490433 -5446520 -1083523 -792261 -3098277 -2093501
12309 -2093501 3796394 8750399 7699680 3255910 1102290 2329052 4329571 5917151
12301 5917151 7169873 7002109 5245834 4613555 6382454 6847229 2601292 -3369999 -5784847
12292 -5784847 -4607922 -3214183 -1767617 1318717 3544131 1123686 -3383334 -3523193
12284 -3523193 1107096 4590826 4794837 6088438 10273677 12355967 8607641 2446954
12276B446954l928770k012699j639704N83121M000570L458386j274499l777119
12268b143760r26791K440850J725015o11018l6674K815013L885548J860859q04749
12259H204293j644319o39878M91374L51566o28472r48534n85331j240130k996060
12250C64509l169353p25332Q82027j228817l856879j843209L740147O567404L865816
12241D596313n99680k674436k390562j491361m53668O53284J455321K323696L403322
12232D822229K569388k097378p578998p869845j854964M565803N792246K564392
12224I12873q64278k138676j381069M85467J604882l8570l375074m113643k66971
12215i175059M346143M807051J473084j379788j914007k090883k896095k134670
$$ plain form
12276 2446954 -1481816 -3494515 -5134219 -4551098 -550528 2907858 1633359 -2143760
12268 -2143760 -3070551 -629701 1095314 484296 447622 3262635 7148183 9009042 8204293
12259 8204293 6559974 5920096 6411470 6763036 6134564 5186030 4600699 3360569 364509
12250 364509 -2804844 -3530176 -2648149 -3876966 -7733845 -9577054 -5836907 730497 4596313
12241 4596313 3996633 1322197 -1068365 -2559726 -3013394 -2360110 -904789 1418907 4822229
12232 4822229 7391617 5294239 -2284759 -10154604 -12009568 -7443765 -1651519 912873
12224 912873 48595 -2090081 -3471150 -2985683 -1380801 -1419371 -4794445 -8908088 -9175059
12215 -9175059 -4828916 -21865 1451219 71431 -1842576 -3933459 -6829554 -8964224
12207h964224J281925L742557R09327n493660q366852l888059L379179O454314
12199a0945493M701133K860400K813039J668535j433165k552526K80495K781976
12191A74394J005068k205761k249272l15006o3900j73497K749279O079483L966221
12182H967009k455948n730003l506043j233652j908144j577784J742100K965007
12174b737458j116966m870998k294625L049488L712598k4559j742584L13795J606393
12165d104916j01002j390960N31935L494410L926276J255264k371202m244496
12157c004691k817642M46937J667469m46212j704727J744431O283315M719754
12149F888634k920755q301135n971812l34318J415861j111997k812610r98894
$$ plain form
12207 -8964224 -7682299 -3939742 -3030415 -8524075 -16890927 -20778986 -17399807 -10945493
12199 -10945493 -6244360 -3383960 -570921 1097614 -335551 -2888077 -2607582 174394
12191 174394 1179462 -1026299 -3275571 -3590577 -3654477 -3827974 -1078695 5000788 8967009
12182 8967009 6511061 781058 -2724985 -3958637 -5866781 -7444565 -5702465 -2737458
12174 -2737458 -3854424 -8725422 -11020047 -7970559 -4257961 -4282520 -6025104 -5711309 -4104916
12165 -4104916 -4205918 -5596878 -5064943 -1570533 2355743 3611007 1239805 -3004691
12157 -3004691 -5822333 -5375396 -3707927 -4154139 -5858866 -4114435 2168880 6888634
12149 6888634 3967879 -4333256 -10305068 -10639386 -9223525 -10335522 -13148132 -14147026
12141a4147026K179188L830653L293080J524751J61863P44475K753333L077676
12133C417993l82176n206586o889331m406856r51317P52296J228988J968067K975737
12124g493185L635106L836250L105197O85527k199147k443531N74139K785758
12116B486114L50207m576778o093067k038289L695884O214414M251389j72221
12108D117653l873340m181864j393075L88993j949126n100322l082881L186502
12100a1887460N732546J059681m159088k984453J713800K832330K41326o81418
12092h132736J108935J686079K43298K04914K053003K217021J38417l82899J514365
12083F50397J799613q95084k385320n77254M97717j772056l151279K46715M569488
$$ plain form
12141 -14147026 -11967838 -8137185 -4844105 -3319354 -3157491 -2413016 340317 3417993
12133 3417993 3035817 -2170769 -9060100 -13466956 -14418273 -13665977 -12436989 -10468922 -7493185
12124 -7493185 -3858079 -21829 3083368 3768895 1569748 -873783 -299644 2486114
12116 2486114 2836321 -1740457 -7833524 -9871813 -6175929 38485 4289874 4117653
12108 4117653 244313 -3937551 -5330626 -4941633 -6890759 -11991081 -15073962 -11887460
12100 -11887460 -6154914 -5095233 -9254321 -12238774 -10524974 -7692644 -7451318 -8132736
12092 -8132736 -7023801 -5337722 -5094424 -4889510 -2836507 -619486 -481069 -863968 650397
12083 650397 2450010 1554926 -830394 -1407648 -909931 -2681987 -5833266 -5586551 -1017063
12074a017063L931558m07461k617161j226497M19504O82983R45709J458791R20459
12065C090822l15582p71357q94373j820936k132703J95917L458626L783285N90594
12056E184293k947739m320107l436577r69498J847303K813106J247615l97568
12048i79172k10860R9891r58514r04903K087125M154496J371127k501767j251976
12039I05447K864960K045077l909048o806129l504731l53321j257814j042495
12031a1058054M077731Q084745M398136l007566n552458k566491k38423j245107
12023g107487k720200k585595j350377J040054M319408N204007J225204l941391
12015e916377m572848j255034N87473m16134m76122J706123K836127J698832J586651
$$ plain form
12074 -1017063 2914495 2507034 -110127 -1336624 -917120 -234137 711572 2170363 3090822
12065 3090822 2775240 2003883 1109510 -711426 -2844129 -2648212 810414 4593699 5184293
12056 5184293 2236554 -2083553 -5520130 -6489628 -4642325 -1829219 -581604 -979172
12048 -979172 -1190032 -1090141 -2048655 -2953558 -866433 3288063 4659190 2157423 905447
12039 905447 3770407 5815484 1906436 -4899693 -8404424 -8757745 -10015559 -11058054
12031 -11058054 -6980323 1104422 5502558 2494992 -3057466 -5623957 -5862380 -7107487
12023 -7107487 -9827687 -12413282 -13763659 -12723605 -8404197 -3200190 -1974986 -5916377
12015 -5916377 -10489225 -11744259 -11156786 -11572920 -12049042 -10342919 -7506792 -5807960 -4221309
12006d221309L796286M368426O25459l551527k957162J351433L559239P60976
11998C731821l891688n272671j727818L422674N241743K373754j562345k655183
11990c39713j333765k44253N93498K699639M425130K418472k005516l406614n64216
11981B242662J165473j589272m605375k938576J195779K493995J058080R50388
11973b6846K312622J273723k511852m281345j615506J506997Q21173j649603p06546
11964d877183M042320O994874L799212k762209n986259l451279M38581Q75786
11956i26157j042190j239788P4448j016728m248834l843230K186806O956415L967396
11947H68138k731345m144796M47910L386687J119282j299521L0502J333335j408168
$$ plain form
12006 -4221309 -425023 3943403 4568862 1017335 -1939827 -588394 2970845 3731821
11998 3731821 -159867 -5432538 -7160356 -3737682 1504061 3877815 2315470 -339713
11990 -339713 -1673478 -1917731 -1324233 1375406 5800536 8219008 6213492 2806878 2242662
11981 2242662 3408135 1818863 -2786512 -5725088 -4529309 -2035314 -977234 -26846
11973 -26846 2285776 3559499 1047647 -3233698 -4849204 -3342207 -2521034 -4170637 -4877183
11964 -4877183 -834863 6160011 9959223 7197014 1210755 -2240524 -1801943 -926157
11956 -926157 -1968347 -3208135 -3133687 -4150415 -8399249 -12242479 -10055673 -3099258 868138
11947 868138 -1863207 -6008003 -5560093 -2173406 -1054124 -2353645 -2323143 -989808 -2397976
11938b397976m733168l281194J050221K053588q05638j936842J081739L903275
11930e065995K625568n05809j402408l39249k23405j026994j16991K484636L189873
11921c80774K38554l084903k679034R07961L638519L359656J273570j295620m188101
11912b210172n920724l561525K715195P637320O358035M68494m182440m360329
11904c056146j358943K563621N995323P048594M089589j396157n465525n950449
11896B469907l897344j031932J397030J683322p13677k580817k04700M314947
11888A436736M833654M30368k537959n9269L456965K573303q18103j596808K50898
11879G969785J089727K81813m41388j608787l964930m207243M98852N587527M153622
$$ plain form
11938 -2397976 -7131144 -10412338 -9362117 -7308529 -8114167 -10051009 -8969270 -5065995
11930 -5065995 -2440427 -2946236 -4348644 -4687893 -4911298 -5938292 -6055283 -3570647 -380774
11921 -380774 -142220 -3227123 -5906157 -4998196 -1359677 1999979 3273549 1977929 -2210172
11912 -2210172 -8130896 -11692421 -8977226 -1339906 5018129 5486623 1304183 -3056146
11904 -3056146 -4415089 -1851468 4143855 11192449 15282038 13885881 8420356 2469907
11896 2469907 -1427437 -2459369 -1062339 620983 -92694 -2673511 -2878211 1436736
11888 1436736 6270390 6700758 4162799 4103530 7560495 10133798 9315695 7718887 7969785
11879 7969785 9059512 9341325 8899937 7291150 3326220 -881023 -382171 5205356 9358978
11870I358978k018365m565529j665328j31847k833838l553803J478886N704161
11862A773315K281686m739824o648763k624713J359930K600398K963199K361689
11854f73083j273793n842525n703428N47523P824520J0680790P866870J319601
11846A4746475n147506o923916l014253J316199R11061j660368n30127L043153
11838B740718K300717l212611o257071l950190k034500l621505l063864L071517
11830a4026789P627931L698213l110993l001412K439622L743472l35335j751931
11822d717222K221976M720822J654812j952175j679507o37697j849899j852847
11814d091737K030395M848566J499228m044042m297952M53008L542464K260371
$$ plain form
11870 9358978 7340613 2775084 1109756 977909 -1855929 -5409732 -3930846 1773315
11862 1773315 4055001 -684823 -7333586 -9958299 -8598369 -5997971 -3034772 -673083
11854 -673083 -1946876 -7789401 -13492829 -12945306 -5120786 5560004 13426874 14746475
11846 14746475 9598969 2675053 -339200 976999 1888060 227692 -302435 2740718
11838 2740718 5041435 1828824 -4428247 -8378437 -10412937 -14034442 -17098306 -14026789
11830 -14026789 -6398858 -2700645 -5811638 -8813050 -6373428 -2629956 -2965291 -4717222
11822 -4717222 -2495246 2225576 3880388 1928213 248706 -388991 -2238890 -4091737
11814 -4091737 -2061342 2787224 4286452 242410 -4055542 -3602534 -60070 2200301
11806B200301L3330m89047l59529p01152j211339j992076k798381j645633J707371
11797e256155K975848p94188m851730k718680L171387M580982N97700j280401
11789c575237J672274K874572j259863m021422J99962N295516K765589m140489
11781a89098n374104J88738M210037L035396J961674L786313L080663l467783
11773G231836r039286n872370K585425O160255K098831k542042k231968L01026
11765a308293N24192o74913j48276J102351k58029l334876l394171Q22366M577472
11756b092177L621151k55191k535759k132920j207045p10011L98613K145794K913328
11747A45783J923853M5112j766000k770450j848369Q76718K542208Q17069j783807
$$ plain form
11806 2200301 2233631 1744584 1385055 683903 -527436 -2519512 -5317893 -6963526 -5256155
11797 -5256155 -2280307 -3074495 -7926225 -10644905 -7473518 -2892536 -2294836 -3575237
11789 -3575237 -1902963 971609 -288254 -4309676 -4109714 1185802 3951391 -189098
11781 -189098 -5563202 -5374464 -1164427 1870969 3832643 7618956 10699619 7231836
11773 7231836 -1807450 -7679820 -5094395 1065860 3164691 622649 -1609319 -1308293
11765 -1308293 -784101 -1459014 -1607290 -504939 -762968 -4097844 -7492015 -6669649 -2092177
11756 -2092177 1528974 1273783 -1261976 -3394896 -4601941 -5311952 -4913339 -2767545 145783
11747 145783 2069636 2114748 348748 -2421702 -4270071 -3393353 -851145 -34076 -1817883
11738a817883n65775M217132O910270M018733j666372n724295o874569n425024
11730f927783j287472L696401N281202K114732j512585j581540j9790o23364k149272
11721c009471m13015M225450O583089L896351q07854l236035k524896o58296K97872
11712D353195m45894k112539k911547j889902q2525R14119P15092j85561j120503
11703b766065q91010J230547L155795J471297l001352m433309L76001O594895
11695A736799P223215K024136l230947m548252k835524p24436n1873j407012l030205
11686d844099j670570K602463M869009J999143k229448k858141j171702j080950
11678d384295j558221N54436K951843R86736l194516l053250J297215L105629
$$ plain form
11738 -1817883 -2383658 1833474 8743744 12762477 11096105 5371810 -1502759 -6927783
11730 -6927783 -8215255 -4518854 762348 2877080 1364495 -217045 -236835 -860199 -3009471
11721 -3009471 -3422486 802964 7386053 11282404 10474550 7238515 4713619 4055323 4353195
11712 4353195 3907301 1794762 -1116785 -3006687 -3089212 -2175093 -1460001 -1645562 -2766065
11703 -2766065 -3657075 -2426528 729267 2200564 -800788 -5234097 -4858096 1736799
11695 1736799 8960014 10984150 7753203 3204951 369427 -355009 -406882 -1813894 -4844099
11686 -4844099 -6514669 -3912206 956803 2955946 726498 -2131643 -3303345 -4384295
11678 -4384295 -5942516 -5388080 -2436237 -1449501 -4644017 -7697267 -6400052 -3294423
11670c294423M72069j088327R54871K199569M01155l00576K026478K650899j008416
11661C013299l822022j589267J712054J071931j504439k049448j702342k457076
11653g327310j684606K262345M484859J034648l106201j627053K225687J420365
11645b317266k157550j065904L969218M678701o07068m164531j867150R87253
11637b544297l1030j352139R17622L713872K809542J00410m43231K96161q13739
11628B653171k773501j981221J573824M147369L584815J505974M14017Q25748
11620I950196J119148o91311m258172o051384l348446J034675J551417j792650
11612b486527k529602K536901P397717M970115k381620o027921k970486J330544
$$ plain form
11670 -3294423 -2822354 -3910681 -2955810 -756241 -355086 -655662 1370816 4021715 3013299
11661 3013299 -808723 -2397990 -685936 385995 -1118444 -3167892 -4870234 -7327310
11653 -7327310 -9011916 -6749571 -2264712 -1230064 -4336265 -5963318 -3737631 -2317266
11645 -2317266 -4474816 -5540720 -1571502 3107199 2500131 -1664400 -3531550 -2544297
11637 -2544297 -2575327 -3927466 -3009844 704028 3513570 3613980 3170749 3466910 2653171
11628 2653171 -120330 -2101551 -527727 3619642 7204457 8710431 9124448 9950196
11620 9950196 11069344 10378033 6119861 68477 -3279969 -2245294 -693877 -2486527
11612 -2486527 -5016129 -2479228 4918489 9888604 7506984 1479063 -1491423 -160879
11604a60879J844443p7197j123337j391814k361821k959771j225654J869177L458110
11595b128743K837619J884598J791065J663101M34512j580974l156531k921142
11587a176495j52951L603772M534603O65799m362160m732381o7621L811037K905031
11578E028634M6838m33590P11201K04360j525941j536802j96158o05317k593243
11569i00018k474671N40663K571537J167852j167901j530019q00634r66313j600717
11560e160221j477402q25358K04935K363566M437660L001779k089903n367577
11552d912521k668532K446034L592749P48713n15639J937549L902207J810406
11544F340966j904334k728457m96527Q96960q16022l318942l030775k2000K054147
$$ plain form
11604 -160879 1683564 1606367 483030 -908784 -3270605 -6230376 -7456030 -5586853 -2128743
11595 -2128743 708876 2593474 4384539 6047640 6482152 4901178 1744647 -1176495
11587 -1176495 -1329446 2274326 6808929 7474728 3112568 -1619813 -1687434 2123603 5028634
11578 5028634 5075472 4641882 5353083 5557443 4031502 2494700 2298542 1693225 -900018
11569 -900018 -3374689 -2834026 -262489 905363 -262538 -1792557 -2593191 -3559504 -5160221
11560 -5160221 -6637623 -7462981 -7258046 -4894480 -456820 2544959 455056 -4912521
11552 -4912521 -7581053 -5135019 -1542270 -793557 -1309196 628353 4530560 6340966
11544 6340966 4436632 1708175 1211648 2108608 1292586 -2026356 -5057131 -5079131 -3024984
11535c024984J040973q35598q10090k11146j905293m396923l233044J460963M162656
11526g752486K428426Q11381L048340N387299K656675k790041m220951p30885
11518a162242J718279o32442m343897m045898P82322N743022O401875K513226
11510F974245j834360k589401m12605O77188n77364j158748O10472K135753J452524
11501E277704N88592R22478k5914l072514l769364J79467K955813q26263o023236
11492c793237m066134K972065N232171N58253l238407j870922K32065K03975J696099
11483b074072N612239N670159r75611o882582m853032J294036L491916J375955
11475B659008K6712K82042p17242k223666r97178J715514J528659j257503j798629
$$ plain form
11535 -3024984 -1984011 -2819609 -3629699 -3840845 -5746138 -10143061 -13376105 -11915142 -7752486
11526 -7752486 -5324060 -4512679 -1464339 3922960 6579635 3789594 -431357 -1162242
11518 -1162242 556037 -76405 -4420302 -8466200 -7683878 -1940856 4461019 6974245
11510 6974245 5139885 2550484 2137879 2815067 2237703 1078955 1689427 3825180 5277704
11501 5277704 5866296 6788774 6762860 3690346 -79018 100449 3056262 2229999 -3793237
11492 -3793237 -7859371 -4887306 344865 903118 -2335289 -4206211 -3974146 -3770171 -2074072
11483 -2074072 3538167 9208326 8232715 1350133 -3502899 -2208863 1283053 2659008
11475 2659008 2685720 2967762 2250520 26854 -970324 745190 2273849 1016346 -782283
11466g82283J096333L049423J435351q68792q26028L43400M53774L26473J589398
11457E817049K979983J864761j543103l932999l005312l37752O92488o12859j252511
11448F69745J019759L536609J759961l552306n893782j517999M966584O585661
11440G574232K902523r92106k368685k808352l015519j222200K116121L048049
11432E234063m5545l418051l631918k528964k872303k586561J397426N907233
11424b544620M770228r95595l356576N07377L306446p59099o017067l848341L385499
11415e551748N679471O84508l739077k669386k16659J80311J922079O375848O612238
11406I277585j908111j0969893r583904k28799N025229K394824l32779J663834
$$ plain form
11466 -782283 314050 3363473 4798824 3930032 3104004 3447404 3901178 4227651 5817049
11457 5817049 8797032 10661793 9118690 5185691 2180379 1842627 2535115 1922256 669745
11448 669745 1689504 5226113 6986074 3433768 -2460014 -3978013 988571 7574232
11440 7574232 10476755 9484649 7115964 4307612 1292093 69893 2186014 5234063
11432 5234063 5188518 1770467 -1861451 -4390415 -7262718 -9849279 -8451853 -2544620
11424 -2544620 2225608 1230013 -2126563 -1619186 1687260 928161 -5088906 -8937247 -5551748
11415 -5551748 127723 812231 -2926846 -5596232 -5812891 -5632580 -3710501 2665347 9277585
11406 9277585 7369474 -3600419 -13184323 -13413122 -8387893 -5993069 -6325848 -4662014
11398d662014L446419R12587j677036Q3825K725976J242122k282931k723424m20358
11389c354834N92863j11086J13122J116029M88057r90380J8476L264322M358529
11380E495098J280822k698856l949370k823837j369792J89388K154281K705720
11372I83454j66876m577807n616196j310840M297494N662964K075105k387784
11364a040486m319732l779605j788049J627964N522016P037307M610679K93326
11356H163420l003829m538609m278385j388209K982737M426217P29261l805613
11348g13010l818987m49714J410347J200727K117270L989764L461073P68735o00664
11339G365541j023378l912619p108684l852890N056734R098040K824355n273257
$$ plain form
11398 -4662014 -1215595 -303008 -1980044 -1896219 829757 2071879 -211052 -2934476 -3354834
11389 -3354834 -2761971 -2873057 -2759935 -1643906 -1155849 -2146229 -2127753 1136569 5495098
11380 5495098 6775920 4077064 127694 -2696143 -4065935 -3876547 -1722266 983454
11372 983454 816578 -3761229 -9377425 -10688265 -6390771 -727807 1347298 -1040486
11364 -1040486 -5360218 -9139823 -10927872 -9299908 -3777892 3259415 7870094 8163420
11356 8163420 5159591 620982 -3657403 -5045612 -2062875 2363342 3092603 -713010
11348 -713010 -4531997 -4981711 -3571364 -2370637 -253367 3736397 7197470 7966205 7365541
11339 7365541 6342163 2429544 -4679140 -8532030 -3475296 5622744 8447099 3173842
11331C173842n057188J092516M003401J896278P2102K27963o34282k312583j274544
11322A187505J661574J559042j833582k973506K2600J908299p35709l475245j352258
11313d031280K722751K330522k653763o152620m692141j070276J109993K072452
11305a0364362L228412L451165J192870j537635j122699J857614K518107j275275
11297b051803n111002l955488P63477L623684K969814J795620J640871O66624
11289C41797j485834j919582M06253K133423Q65396o72973P15423K936357J602463
11280D922723l010577o069235m585763l65423L222916M571114L816882J870140
11272D372777m7895j305641k420992l828774m677400m015149k439968j128751
$$ plain form
11331 3173842 -1883346 -790830 3212571 5108849 5180951 5408914 4774632 2462049 1187505
11322 1187505 2849079 4408121 2574539 -398967 -376367 1531932 796223 -2679022 -4031280
11313 -4031280 -1308529 1021993 -1631770 -7784390 -12476531 -13546807 -12436814 -10364362
11305 -10364362 -7135950 -3684785 -2491915 -4029550 -5152249 -3294635 -776528 -2051803
11297 -2051803 -7162805 -11118293 -10354816 -6731132 -3761318 -1965698 -324827 341797
11289 341797 -1144037 -3063619 -2657366 -523943 341453 -331520 383903 3320260 4922723
11280 4922723 1912146 -4157089 -8742852 -9108275 -5885359 -1314245 2502637 4372777
11272 4372777 4324882 3019241 598249 -3230525 -7907925 -11923074 -14363042 -15491793
11264a5491793J70462K484986N126325N646759K994038m82289j526210k49025
11256a326747j55383k792201m225426J5115P123831Q812430K406759m797194n606865
11247e45681k502929j965156l635788k470961J022095J297057k036976l091820
11239a3930159K61982L341887L402815L448927M727642L357810j903020n831779
11231c123895m776443j791607R9931K564525N650467M793647l94026k452011K054403
11222B624991N054691l54216p457183o250681L39559K252663o22547j43708M007457
11213e48974L685601k172400m675912l22063K765832j491509p355414o864784
11205a6979623j118528L901120O174230O489086L985593j101992m299748k130220
$$ plain form
11264 -15491793 -15321331 -12836345 -7710020 -2063261 930777 448488 -1077722 -1326747
11256 -1326747 -1482130 -4274331 -8499757 -8484642 -1360811 7451619 9858378 5061184 -545681
11247 -545681 -3048610 -5013766 -8649554 -11120515 -10098420 -8801363 -10838339 -13930159
11239 -13930159 -13668177 -10326290 -6923475 -3474548 1253094 4610904 2707884 -3123895
11231 -3123895 -7900338 -9691945 -9592014 -7027489 -1377022 3416625 3022599 570588 2624991
11222 2624991 7679682 7325466 -131717 -6382398 -6042839 -3790176 -4412723 -4556431 -548974
11213 -548974 3136627 964227 -3711685 -4033748 -1267916 -2759425 -10114839 -16979623
11205 -16979623 -18098151 -14197031 -8022801 -1533715 2451878 1349886 -2949862 -5080082
11197e080082K320128L743097J960251N49894M24547n33257k585165l258838j470315
11188c929740P00069J029942j40562j015015q51027l30468K07052J598289L902305
11179A170845M642686J587792k627218k339372K941122O170154K069633m841831
11171H773811o484609k730210m43362k295796l495978m63503L647893M415506
11163I23752K080746o97240k951503m462680m024196j505744Q09353J333722J432476
11154g061314K465083K854638O94720k360549k691375K46115K884486K130432
11146h37764n55812j090214J467581L055995K18556l961621l159998K835828O607368
11137D579919L086592l235380m842032j555309M88802j661931m315754k943177
$$ plain form
11197 -5080082 -2759954 983143 2943394 3493288 3917835 3384578 799413 -2459425 -3929740
11188 -3929740 -3229671 -2199729 -2340291 -3355306 -4206333 -4536801 -4329749 -2731460 1170845
11179 1170845 5813531 7401323 4774105 2434733 5375855 11546009 13615642 8773811
11171 8773811 2289202 -441008 -884370 -3180166 -6676144 -7139647 -3491754 923752
11163 923752 3004498 2307258 -644245 -5106925 -9131121 -10636865 -9827512 -8493790 -7061314
11154 -7061314 -4596231 -1741593 -1046873 -3407422 -6098797 -5852682 -2968196 -837764
11146 -837764 -1393576 -2483790 -1016209 2039786 2258342 -1703279 -4863277 -2027449 4579919
11137 4579919 7666511 4431131 -410901 -1966210 -1477408 -3139339 -7455093 -10398270
11129a0398270K286066P004720O675340R97706m472014l634804J833178L756545
11121D048467n80757l827129n80606K916036r98362p452805o055601J723117M462260
11112f345380p25423m357224j074877K526667R98888n72024K868807O082205K490648
11103A892287l762899m109207P10596K553023p77627k934595J16315M098133L379570
11094A165596j180126m272779l304936o92696K77400m24719o58250j9375r6633
11085i206518o62238Q75171M427442N597118K437301k93846J431798L380587j48227
11076G838588n498592m568766J275373K507752k871472n635110j82216O786334
11068c48109P041052J886161k690124m631869m349919j285499K728496K673283
$$ plain form
11129 -10398270 -8112204 -1107484 5567856 6565562 2093548 -1541256 291922 4048467
11121 4048467 3467710 -359419 -940025 1976011 977649 -6475156 -12530757 -10807640 -6345380
11112 -6345380 -7070803 -11428027 -12502904 -9976237 -8977349 -9549373 -6680566 -598361 1892287
11103 1892287 -1870612 -5979819 -5269223 -2716200 -3493827 -6428422 -6312107 -2213974 1165596
11094 1165596 -14530 -4287309 -7592245 -8284941 -8007541 -8432260 -9090510 -9109885 -9206518
11085 -9206518 -9868756 -8993585 -4566143 1030975 3468276 3174430 4606228 7986815 7838588
11076 7838588 2339996 -2228770 -953397 1554355 -1317117 -6952227 -7134443 -348109
11068 -348109 6692943 8579104 5888980 1257111 -3092808 -4378307 -1649811 1023472
11060A023472k032164m924599k196657J341035R98061l1118K276292M769537L330124
11051D553983Q92920J494621K026738j553240m929336j876880L899075L481546
11043G989427k969638o536237l242010J755853L574864K698096L00896l459295
11035A11956n650916k625455K951335M188401L63444j762700J274644M515756
11027C366465K900787j479551l788840l056776j084634J038399K205854P51231
11019H52935k352715k946518O73616M290012L087644j521754l667766q59141K849065
11010D05378K207685k421941n382022k995229J495873K470302k5505q49466J663819
11001c431106L111157R51152p96094J240184L319434J056246k207388o39144L609006
$$ plain form
11060 1023472 -1008692 -5933291 -8129948 -6788913 -5790852 -5821970 -3545678 1223859 4553983
11051 4553983 5446903 6941524 8968262 7415022 2485686 608806 4507881 7989427
11043 7989427 5019789 -1516448 -4758458 -3002605 572259 3270355 3571251 111956
11035 111956 -5538960 -8164415 -5213080 -1024679 -661235 -2423935 -1149291 3366465
11027 3366465 6267252 4787701 998861 -2057915 -3142549 -2104150 101704 852935
11019 852935 -1499780 -4446298 -3772682 517330 3604974 2083220 -1584546 -2443687 405378
11010 405378 2613063 191122 -5190900 -8186129 -6690256 -4219954 -4245459 -5094925 -3431106
11001 -3431106 -319949 631203 -164891 1075293 4394727 5450973 3243585 2604441 6213447
10992F213447L151935k749992o921524m941091M803L508069M568465L031058j093180
10983D771990m464954k786189K101569L417874o37718m166082k661845J285453
10975c139902L731558M627896M337776J070891m224989n954971j556942L439590
10967B330907K795850j823728m290075k635476M96567L017236M115936K267413
10959F274630k488644n933070m019985J224141M260123L420258J662012Q36214
10951E235679l86256k668983l908324k126678J732763M643794M083946K42317
10943F848258l387423k971991P90145K722479l1780l676769l081495Q21764K787023
10934H20211R68401j414962j727129r73256o10220n8217J192902J804483O14944
$$ plain form
10992 6213447 9365382 6615390 -306134 -5247225 -5242422 -1734353 2834112 5865170 4771990
10983 4771990 307036 -2479153 -377584 3040290 2402572 -1763510 -4425355 -3139902
10975 -3139902 591656 5219552 9557328 10628219 6403230 448259 -1108683 2330907
10967 2330907 5126757 3303029 -987046 -3622522 -3125955 -108719 4007217 6274630
10959 6274630 3785986 -2147084 -6167069 -4942928 -682805 2737453 4399465 5235679
10951 5235679 4849423 2180440 -1727884 -3854562 -2121799 2521995 6605941 6848258
10943 6848258 3460835 488844 1278989 4001468 3969688 292919 -2788576 -1966812 820211
10934 820211 1788612 373650 -1353479 -2326735 -2936955 -2995172 -1802270 2213 617157
10925F17157j272722j751389j00849K429296L632201K064556j217606l093887
10917A306757j795405P66664J512680J58151j070611p58545O36315K132138K594259
10908E482403Q93582k064855k998751o91310J142369q67832l674361k134224K104597
10899b808382K592950j209334k721761O48876L059666M61333k341370l85160K432321
10890b70861K74986l985386l538662M67125R77684k651549l719157K10379L651487
10881h583954K921652J400029K163180K645625N12383j360102k15048J351977
10873H35742L4597k467491k760682j294766n16176o06794p34467j352382j746944
10864a0609363J023713O676836R021398L779436m077823o392268k799957K35935
$$ plain form
10925 617157 -655565 -2406954 -2507803 -78507 3553694 5618250 4400644 1306757
10917 1306757 -488648 278016 1790696 1948847 878236 119691 756006 2888144 5482403
10908 5482403 6375985 4311130 1312379 621069 1763438 895606 -2778755 -4912979 -2808382
10899 -2808382 -215432 -1424766 -4146527 -3497651 -437985 23348 -2318022 -2703182 -270861
10890 -270861 4125 -3981261 -7519923 -7052798 -6075114 -8726663 -12445820 -12235441 -8583954
10881 -8583954 -5662302 -4262273 -2099093 546532 1058915 -301187 -516235 835742
10873 835742 870339 -1597152 -4357834 -5652600 -6168776 -6775570 -7510037 -8862419 -10609363
10864 -10609363 -9585650 -2908814 6112584 9892020 5814197 -578071 -3378028 -3142093
10856c142093l06063j038501P63420K998258K773206K76331k531190l961975k933281
10847g101888q1490J572745p6180k664249k071413J811390N072462N072002K785889
10838D319268L25140j124067j389374j569376l051457m422305j939801M237543
10830d614429P856202M762683l58652r01440J504122O78681l019927l623922l36963
10821A946355J483482L20827M39553K390317Q53191m853463o998264j196919N598621
10812a6300N044403n93698l104964o46641J659219J027487J79081J429379K770755
10803G748721J152926k971374n688801l884984P09097K887111P11061j223644
10795e59887J497828N449790L852111k550807n966591l237693K97164L01102o90184
$$ plain form
10856 -3142093 -3448156 -4486657 -3723237 -724979 2048227 2324558 -206632 -4168607 -7101888
10847 -7101888 -7183378 -5610633 -5686813 -8351062 -10422475 -8611085 -3538623 1533379 4319268
10838 4319268 4644408 3520341 2130967 561591 -2489866 -6912171 -8851972 -4614429
10830 -4614429 3241773 8004456 7645804 6744364 8248486 8927167 5907240 2283318 1946355
10821 1946355 3429837 3750664 4190217 6580534 7433725 2580262 -4418002 -5614921 -16300
10812 -16300 5028103 4434405 1329441 682800 2342019 3369506 3548587 4977966 7748721
10803 7748721 8901647 5930273 241472 -3643512 -2934415 -47304 663757 -559887
10795 -559887 937941 6387731 10239842 7689035 1722444 -1515249 -1218085 -916983 -1607167
10786a607167J20383N72990q70616r43799K045146L539648k5974m443251m039294
10777e651934l88539J218400J88539n25179o88787j737483k107902K63325K812245
10768f617315J693249j272205r22333K784195M423652J450529k211738k138373
10760b810339Q11784K398018O23202k079905k070443O13486J987762R7200j064275
10751a493510K510531P017315N269080j619124m848681j456870J560512l27379
10743F611874k059501N03271K346370q78344l400976P25871N497067K085934n270514
10734F161052n138823K313942N546044L49641m493416k498267J230117L76028
10726C846318k603314k579660m86468K0118o99735m33725r1129j420535k596147
$$ plain form
10786 -1607167 -1486784 -913794 -1784410 -2728209 -683063 2856585 2830611 -1612640 -5651934
10777 -5651934 -6040473 -4822073 -4633534 -5158713 -5847500 -7584983 -9692885 -9429560 -6617315
10768 -6617315 -4924066 -6196271 -7118604 -4334409 89243 1539772 -671966 -2810339
10760 -2810339 -1998555 399463 1022665 -1057240 -3127683 -2514197 -526435 -429235 -1493510
10751 -1493510 1017021 8034336 13303416 11684292 6835611 5378741 6939253 6611874
10743 6611874 4552373 5055644 7402014 6523670 3122694 3848565 9345632 11431566 6161052
10734 6161052 1022229 3336171 8882215 9231856 4738440 2240173 3470290 3846318
10726 3846318 1243004 -1336656 -1823124 -1803006 -2502741 -2936466 -3027595 -4448130 -7044277
10717g044277q16683K352521K431640j542015n109539l508913K761435Q158211
10709b317620P745739K404318k273937k418562J79987J282069m26897k614594
10701A560503k522685M36765M001822M338905J20888m338193l455438J385024
10693A527591K788052j547989m583288p27606N073715N134834R92485j46633K332009
10684A0843170K494178r10311k177473J049198L145713n12124o018706o788450
10676A125195k970961k37969r40382j197339K282632N924869L321165m922246
10668B384964r758616m954939L815943O309033J787194j271870J153399L808418
10660C273526K675321J304189K609152K721294j295537m947632l956075j694690
$$ plain form
10717 -7044277 -7860960 -5508439 -3076799 -4618814 -9728353 -13237266 -10475831 -2317620
10709 -2317620 5428119 7832437 5558500 3139938 3319925 4601994 4175097 1560503
10701 1560503 -962182 -525417 3476405 7815310 7936198 3598005 142567 1527591
10693 1527591 4315643 2767654 -1815634 -2543240 2530475 7665309 8657794 8511161 10843170
10684 10843170 13337348 12427037 10249564 11298762 14444475 13932351 7913645 1125195
10676 1125195 -1845766 -2083735 -3024117 -4221456 -1938824 3986045 7307210 2384964
10668 2384964 -7373652 -12328591 -8512648 -2203615 -416421 -1688291 -534892 3273526
10660 3273526 5948847 7253036 9862188 12583482 11287945 6340313 2384238 689548
10652F89548k093904j749839K876447O543234K853042m008454n003217j99496
10644i2639K819866J785811R17983R64148j720450o298595p075398k868164J285573
10635a0281865K546823L058018L810042K917801P41801O8793N70871o56869k807281
10626c1866k032593J258873K222009n51078k968568k185695j9243J244185J626618
10617a437358J345234M4959j551279k434233k914953k664680L62403N578830P828768
10608D157691M246462p59632k270208k051326l239671l166359J027209M562622
10600B506788J645233l989497m387442n7721K050099N19851k27681N43481k62547
10591a659436j748896l42044K454541K433579R97880K281600M300938K332422
$$ plain form
10652 689548 -1404356 -3154195 -277748 6265486 9118528 5110074 106857 -92639
10644 -92639 2727227 4513038 5431021 6395169 4674719 -1623876 -8699274 -11567438 -10281865
10635 -10281865 -7735042 -4677024 -866982 2050819 2792620 2861413 3432284 2775415 -31866
10626 -31866 -2064459 -805586 1416423 865345 -2103223 -4288918 -4308161 -3063976 -1437358
10617 -1437358 -92124 -47165 -1598444 -4032677 -6947630 -9612310 -9249907 -3671077 4157691
10608 4157691 8404153 7644521 5374313 3322987 83316 -3083043 -2055834 2506788
10600 2506788 4152021 162524 -4224918 -4282639 -2232540 -1712689 -1940370 -1396889 -1659436
10591 -1659436 -3408332 -3750376 -1295835 1137744 2135624 4417224 8718162 11050584
10583A1050584j352818j029132J670952Q57503k144204j404436J756080J084202
10575A0488731k291987j871901J395690P38997l076756k870418J076322J472695
10567E061373j753151j296855K903080K891523j975820l041093J768130L891494
10559H448681m51898l967227j776254R53436l14458k105520r96535N34865L63919
10550F89009K96002O60576n69261j988401l49643K188564J251596p35439J359801
10541B802804M627126K725954j581764j049921K044174L50253l422896j077368
10533E418362M574087M234431k0900Q55346L942706n45407q062542n314279M471846
10524I553650M922222m854915q817151k313500K440515J123088K597930O925505
$$ plain form
10583 11050584 9697766 8668634 10339586 11197089 9052885 7648449 9404529 10488731
10575 10488731 8196744 6324843 7720533 8459530 5382774 2512356 3588678 5061373
10567 5061373 3308222 2011367 4914447 7805970 5830150 2789057 4557187 8448681
10559 8448681 7996783 4029556 2253302 3206738 2892280 786760 -209775 325090 689009
10550 689009 985011 1645587 1076326 -912075 -1261718 926846 2178442 1443003 2802804
10541 2802804 7429930 10155884 8574120 7524199 9568373 9918626 6495730 5418362
10533 5418362 9992449 14226880 14205980 15061326 19004032 18458625 10396083 5081804 9553650
10524 9553650 14475872 9620957 803806 -1509694 930821 2053909 4651839 11577344
10516A1577344L768159m206881k785047N897811M794824n622735o467227M138793
10508A1095041P038955j469793l440990M325692M303237m430192k560802Q038292
10500B2899440L442641j2399534p163321J7440590J9986577n071526j1026411
10493B8108456J4464751K0496291p734760m184762N6593257P6772345k5768182
10486A58747396j58747405j59648128k8314925P4027739N6142020k141734n994124
10479f5929161K0592419J4869271j0184914q176394J1144071J0054840m088093
10472c1717961n94145J2562233P745142o840048m332351Q461578N386034q723271
10464a8052789q299855M766930O585113l743259m911170N852178R569947J019272
$$ plain form
10516 11577344 15345503 11138622 8353575 14251386 19046210 13423475 6956248 11095041
10508 11095041 18133996 16664203 13223213 17548905 21852142 17421950 14861148 22899440
10500 22899440 26342081 13942547 6779226 24219816 44206393 39134867 28108456
10493 28108456 42573207 63069498 55334738 51149976 107743233 184515578 158747396
10486 158747396 -9 -159648137 -187963062 -113935323 -57793303 -59935037 -65929161
10479 -65929161 -45336742 -30467471 -40652385 -48828779 -37684708 -27629868 -31717961
10472 -31717961 -32312106 -19749873 -12004731 -18844779 -23177130 -14715552 -9329518 -18052789
10464 -18052789 -26352644 -21585714 -15000601 -18743860 -23655030 -17802852 -8232905 -7213633
10456g213633n028382k658950j401748l781594j590646M829323N798692J098536
10448i948402L1971L413987L456016N5769L9043K025768j329498p604303p011277
10439a6870926L82575M381783J264110k076894m83049L486260N500111L598316
10431h17714j521525m867945r12289O302961N232779n418068j1996995o251500
10423b0250296K296320L613251K851184O721174Q199555k1228q979109o892547
10415a2461696J023488K787100K95042K535087O547113L156265m725328o923621
10407g766550l790509k827893l013941J159143N418728K269422l096592n12467
10399a2160659N967558M192389m311660o787231j263599J965598j9909M19279
$$ plain form
10456 -7213633 -12242015 -14900965 -16302713 -20084307 -21674953 -16845630 -11046938 -9948402
10448 -9948402 -9916431 -6502444 -3046428 -2990659 -2951616 -925848 -2255346 -9859649 -16870926
10439 -16870926 -16488351 -12106568 -10842458 -12919352 -13402401 -9916141 -4416030 -817714
10431 -817714 -2339239 -7207184 -8119473 -1816512 3416267 -2001801 -13998796 -20250296
10423 -20250296 -17953976 -14340725 -11489541 -4768367 3431188 3409960 -5569149 -12461696
10415 -12461696 -11438208 -8651108 -8356066 -5820979 726134 3882399 -842929 -7766550
10407 -7766550 -11557059 -14384952 -17398893 -16239750 -10821022 -8551600 -11648192 -12160659
10399 -12160659 -6193101 -2000712 -6312372 -13099603 -14363202 -12397604 -12417513 -11998234
10391a1998234M440496L840374k571826n599620j674697K005217J255954M65533
10383i836803J583250M61297k729735j780438L414103M625079r62270n495841
10375a0721358l057620K122274M181471L765998L514312K686075K69487j968873
10367G91766k236862n75520K427835M897330L255731k658008o698779m124035
10359d920542J219405L298733K814438K776918R69293m342642p056304k039182
10351g279883M180001L058939j062760J113721O054898K966986n963251p768825
10343d700174o54363L267974r68234l997038l8980L560151P88890k696326r51701
10334f389801J991066P40225j992326j597778M76713J023304P29954Q17155J27167
$$ plain form
10391 -11998234 -7557738 -3717364 -6289190 -11888810 -13563507 -11558290 -10302336 -9836803
10383 -9836803 -8253553 -7792256 -10521991 -12302429 -8888326 -4263247 -5225517 -10721358
10375 -10721358 -13778978 -11656704 -7475233 -3709235 -194923 2491152 2760639 791766
10367 791766 -1445096 -2020616 407219 5304549 8560280 5902272 -796507 -4920542
10359 -4920542 -3701137 -402404 2412034 5188952 6158245 1815603 -5240701 -7279883
10351 -7279883 -3099882 -40943 -1103703 10018 6064916 9031902 3068651 -4700174
10343 -4700174 -5354537 -2086563 -3054797 -7051835 -7090815 -3530664 -2741774 -5438100 -6389801
10334 -6389801 -4398735 -3658510 -5650836 -7248614 -6771901 -5748597 -5018643 -4201488 -4074321
10325d074321j073996o29911J42734k153302m921795j742052N468012O520765
10317b463866j308141p717366m576234K615115M557172J380788p17290K25688
10309h004134J539122J400269k72656k748268l248212R04431O898174Q416864
10301D885590M524635M73522j446740m207544p428893n450726K267166P367478
10293I84488M189314k217867m605158l096197j297239L39834J989027J636975
10285b076823o8605J515631O454937P179484j17071p851475p735575k827196j122983
10276f649676k595003j476168K310516L206207r6259k870492k122235L06774K159424
10267g826912K911219K001733l47291j465603J82863J328704j279435m217501
$$ plain form
10325 -4074321 -5148317 -5778228 -5635494 -7788796 -12710591 -14452643 -8984631 -2463866
10317 -2463866 -3772007 -11489373 -16065607 -13450492 -8893320 -7512532 -8229822 -8004134
10309 -8004134 -6465012 -5064743 -5337399 -8085667 -11333879 -10429448 -3531274 4885590
10301 4885590 9410225 9883747 8437007 4229463 -3199430 -8650156 -6382990 984488
10293 984488 5173802 2955935 -1649223 -4745420 -6042659 -5702825 -3713798 -2076823
10285 -2076823 -2145428 -629797 5825140 13004624 12887553 5036078 -2699497 -5526693 -6649676
10276 -6649676 -9244679 -10720847 -8410331 -5204124 -5300383 -8170875 -10293110 -9986336 -7826912
10267 -7826912 -4915693 -2913960 -3261251 -4726854 -4543991 -3215287 -4494722 -8712223
10259h712223j608481M909624P161943K085606l993961m781070j996260o75386
10251g610208j178709l98817J942239L104933K419558K077685K564441J348209
10243D269331k384358n095617l586748N4181J325544l61589j653908p03659J108840
10234g027983K711384M540856N609707L490873j356001m913050m808858k781460
10226d534532q12217J101121K017678j15299l554884l019169K140503N410399
10218a366400K451217k423169l388561j322159m85M85078J028036l83429l805504
10209h725376l975917J542117O220557L780399j880301l714785k622177k682240
10201a2057723j519887L913869P627351K990889l752084j939038N095153M972919
$$ plain form
10259 -8712223 -10320704 -5411080 1750863 3836469 -157492 -4938562 -6934822 -7610208
10251 -7610208 -8788917 -9187734 -7245495 -4140562 -1721004 356681 2921122 4269331
10243 4269331 1884973 -3210644 -6797392 -6743211 -5417667 -5779256 -7433164 -8136823 -7027983
10234 -7027983 -4316599 224257 5833964 9324837 7968836 3055786 -1753072 -4534532
10226 -4534532 -5346749 -4245628 -2227950 -2343249 -5898133 -8917302 -6776799 -1366400
10218 -1366400 1084817 -1338352 -4726913 -6049072 -6049557 -5564479 -4536443 -4919872 -8725376
10209 -8725376 -12701293 -11159176 -4938619 -1158220 -3038521 -6753306 -9375483 -12057723
10201 -12057723 -13577610 -9663741 -2036390 954499 -2797585 -4736623 358530 5331449
10193E331449k453959n080059Q5150K547752j950128m237258N03965L764749q1992
10184a570331l182594J170714O166894L806836j352876j257021K055828K211806
10176H049256K9494m31332l92927k000294k252955L46726M43562m317961o191023
10167f717454J87577O465688L184173l843813k974642L530519M019238j985747
10159A865539l430202K577707N901632P12858n607433n331434j210953P41018
10151c781268M26977L15890K4390q02271M2670K745914L450076M12667k732936
10142A02109l142268l002859l974346k781667K655142P088524M063072m070935
10134c063228q082245l400079M848722Q749225N971649L15467l420035l602069
$$ plain form
10193 5331449 2877490 -2202569 -2117419 430333 -1519795 -5757053 -5253088 -1488339 -1570331
10184 -1570331 -4752925 -3582211 2584683 6391519 5038643 3781622 5837450 8049256
10176 8049256 8078750 7647418 7254491 5254197 3001242 3347968 3791530 -526431 -6717454
10167 -6717454 -6529877 -64189 3119984 -723829 -3698471 -167952 3851286 1865539
10159 1865539 -1564663 1013044 6914676 7627534 2020101 -3311333 -4522286 -3781268
10151 -3781268 -3354291 -3038401 -3014011 -3816282 -3773612 -1027698 2422378 2835045 102109
10142 102109 -3040159 -6043018 -10017364 -12799031 -10143889 -3055365 1007707 -3063228
10134 -3063228 -11145473 -14545552 -9696830 -947605 5024044 5339511 1919476 -1682593
10126a682593k046371j310220j705310j262841J016062L020273K170510n39223
10118b339713j521096J61675J303021k39211j649094M86597L972882L673668j51913
10109C696816j539298J845293M583608J910087k791160l695673j660211j576276
10101G73186l439718l008078q0868J077376l15261k42220K244992K628681j207507
10092a569417m781058l879343m90942J584874K512924L966122M665851K540851
10084D549862j131921l260366k837717q11246J898537L957925L322086j88921
10076E498239l502376l353662K83935M539858O031901L125561j981065m109621
10068F532770j071142K293048K00831n112977o183543j623032K156667J308866
$$ plain form
10126 -1682593 -3728964 -5039184 -6744494 -8007335 -6991273 -3971000 -1800490 -2339713
10118 -2339713 -3860809 -3699134 -2396113 -2635324 -4284418 -3797821 175061 3848729 3696816
10109 3696816 2157518 4002811 8586419 10496506 7705346 4009673 2349462 773186
10101 773186 -2666532 -5674610 -5755478 -4678102 -4993363 -5235583 -2990591 -361910 -1569417
10092 -1569417 -6350475 -10229818 -10720760 -9135886 -6622962 -2656840 2009011 4549862
10084 4549862 3417941 157575 -2680142 -3491388 -1592851 2365074 5687160 5498239
10076 5498239 1995863 -1357799 -1073864 3465994 9497895 12623456 10642391 6532770
10068 6532770 5461628 7754676 7955507 2842530 -3341013 -4964045 -2807378 -1498512
10060a498512p06595p51395q15909j981197j064152K348989K743940k023027n121584
10051h869442j022617M837160M453801J15999j75668L350339K859468l356709
10043B192331p328926l430330L618153N949796K503119j587789k178307L70038
10035A08085L121674L672594J676252j535920m257356n087334l256117Q1637J609632
10026c866853m86608l164873k290891P71976J094725j309409j117552K799408
10018g570077M563211J121808k159656m42910K616787J755003r44822q69906M07044
10009a523518j089721l292012j601980K106528K334633k10971k9869K997906L200058
10000B891054j024443m603323l896117p68707K130842L994495L377555o26526
$$ plain form
10060 -1498512 -2205107 -2956502 -3772411 -5753608 -6817760 -4468771 -1724831 -3747858 -8869442
10051 -8869442 -9892059 -5054899 -601098 -485099 -660767 2689572 5549040 2192331
10043 2192331 -5136595 -8566925 -4948772 1001024 3504143 1916354 -261953 108085
10035 108085 3229759 6902353 8578605 7042685 2785329 -2302005 -5558122 -5476485 -3866853
10026 -3866853 -4353461 -7518334 -9809225 -9037249 -7942524 -9251933 -10369485 -7570077
10018 -7570077 -3006866 -1885058 -4044714 -4487624 -1870837 -115834 -1060656 -1930562 -1523518
10009 -1523518 -2613239 -5905251 -7507231 -5400703 -3066070 -3277041 -3306910 -309004 2891054
10000 2891054 1866611 -2736712 -6632829 -7401536 -5270694 -1276199 2101356 1474830
9992A474830m353121l097743R51436J100205k983933m344157j63494L811820L092794
9983d511363R81431J210817J202785j916471m493341j856820L502786N439789
9975d40387K981699O5621j238651j814577j537658L57624J815754o6671l750913
9966c628159m488708j149084K304203K782827J616762R81539M26540j035030k134860
9957d323970j117817J220035K359398J164554j214176k808894k219590M53876
9949f486584L031992K826899O2851j683643j85306J904762Q83672j994538k196763
9940c836658P17049K083940k66977k298399n46131J875449N07326k787323l094184
9931g645908j060247j546328m322831l312566L374266R210188Q201919K883025
$$ plain form
9992 1474830 -2878291 -5976034 -5024598 -3924393 -6908326 -11252483 -11415977 -7604157 -4511363
9983 -4511363 -3529932 -2319115 -1116330 -3032801 -7526142 -9382962 -5880176 -440387
9975 -440387 2541312 2606933 1368282 -446295 -1983953 -1626329 189425 122754 -3628159
9966 -3628159 -8116867 -9265951 -6961748 -4178921 -2562159 -1580620 -1154080 -2189110 -4323970
9957 -4323970 -5441787 -4221752 -1862354 -697800 -1911976 -4720870 -6940460 -6486584
9949 -6486584 -3454592 -627693 -564842 -2248485 -2433791 -529029 354643 -1639895 -3836658
9940 -3836658 -3119609 -1035669 -1302646 -3601045 -4147176 -2271727 -1764401 -4551724 -7645908
9931 -7645908 -8706155 -10252483 -14575314 -17887880 -14513614 -5303426 2898493 5781518
9923E781518m29408k76090K30484o07527j614575j665536p17632R65491K304079
9914C970804J644270n70606j471294q8468O43731j328727l402279k630146q90366
9905d123081j493262l019979j692780J460054J527207k086617l991529r01797
9897a4321784L474720M207703J863100K09790K19134J18580n20677p05097r16935
9888f371466k066007k273773N02895K717482j384401q394333n603770J1153474
9880a1719899K6071042K0554152r56866j5061600j0270620N4870P49106l641883
9872E778302j312023M801294L262486m358699n601519J166907M073157j578038
9864F231867n902201k261683K100010K31636k505106N13936M659767K683968k226502
$$ plain form
9923 5781518 5352110 5076020 5306504 4698977 3084402 1418866 701234 1666725 3970804
9914 3970804 5615074 5044468 3573174 3484706 4128437 2799710 -602569 -3232715 -4123081
9905 -4123081 -5616343 -8636322 -10329102 -8869048 -7341841 -9428458 -13419987 -14321784
9897 -14321784 -10847064 -6639361 -4776261 -4566471 -4347337 -4228757 -4749434 -5454531 -6371466
9888 -6371466 -8437473 -10711246 -10208351 -7490869 -8875270 -17269603 -22873373 -11719899
9880 -11719899 14351143 34905295 33948429 18886829 8616209 8671079 9420185 5778302
9872 5778302 4466279 9267573 12530059 8171360 2569841 3736748 7809905 6231867
9864 6231867 329666 -1932017 167993 399629 -2105477 -1591541 3068226 5752194 3525692
9855C525692k441701R16681Q80608l152674n344055l222292J51491K141878K472732
9846d071640J115586o48698L03773L820650M503098k23394m561788k843495J003167
9837a602741k05291m790603m751048J431996O594850N454990P75857j821354m75331
9828F11325K159142J949260k382079o499537m727006J511197M319925Q28924k295355
9819d524204Q4600L244796J546234j430759K1632K604526k74961o076478o645193
9810a1449807j324154L257486M367561M597082L914136K300m526892m607917j578088
9801g348293n99857o87883K763083O765495L479686n426580q916983l260791K685999
9792a0546124K263485J97640K052230M366776J954882k522936l201356k9157K655293
$$ plain form
9855 3525692 1083991 2000672 2881280 -271394 -5615449 -8837741 -8686250 -6544372 -4071640
9846 -4071640 -2956054 -3604752 -3300979 519671 5022769 4799375 237587 -2605908 -1602741
9837 -1602741 -1808032 -6598635 -11349683 -9917687 -3322837 2132153 2908010 1086656 611325
9828 611325 2770467 4719727 2337648 -4161889 -8888895 -7377698 -3057773 -2228849 -4524204
9819 -4524204 -4439604 -1194808 351426 -1079333 -1057701 1546825 1271864 -4804614 -11449807
9810 -11449807 -12773961 -9516475 -5148914 -551832 3362304 3364604 -1162288 -5770205 -7348293
9801 -7348293 -7948150 -8636033 -5872950 892545 4372231 -1054349 -9971332 -13232123 -10546124
9792 -10546124 -8282639 -8084999 -6032769 -1665993 288889 -2234047 -5435403 -5464560 -2809267
9783b809267K697161Q92675j386664k152707J89065L592540L850599O99214j830609
9774C742007j904498j554542j335575M52811K325410M23463l795266m293392q32018
9765f771600j39585l737346l973634K811158Q481860N655663j47402J51881M213492
9756F544487K994369l680325p161055m154831n31378k43312J11254K987352M370776
9747A237337J123365k409015r78970K444062Q32491n234454p166294r78797O067533
9738e062742N509244m01016k896557o4408J594871j249296l812351k146685P57299
9729g771641J856392L578957O911923O250656j321347p962436n374502J910635
9721a921363L604709j89600j280341J138036J94685m183382l926701K335187N950105
$$ plain form
9783 -2809267 -112106 780569 -606095 -2758802 -2569737 1022803 4873402 5572616 3742007
9774 3742007 1837509 282967 -1052608 -599797 1725613 2149076 -1646190 -5939582 -6771600
9765 -6771600 -6911185 -10648531 -14622165 -11811007 -3329147 2326516 2179114 2330995 6544487
9756 6544487 9538856 5858531 -1302524 -5457355 -5988733 -6232045 -6120791 -3133439 1237337
9747 1237337 2360702 -48313 -1027283 1416779 2249270 -2985184 -10151478 -11130275 -5062742
9738 -5062742 446502 45486 -2851071 -2915479 -1320608 -2569904 -6382255 -8528940 -7771641
9729 -7771641 -5915249 -2336292 4575631 10826287 9504940 1542504 -3831998 -1921363
9721 -1921363 1683346 1493746 213405 1351441 1546126 -2637256 -6563957 -4228770 1721335
9712A721335L031661K05379J132313k55908o601941r103918j555009P473618O784008
9703B831538o25416l585334q5170K372879M96581j338141o00902m41609k834779
9694c810353m643275k508446K371272N712900M492555O214k644413j03909L806085
9685B678630K141615m668916p959915l055509L773989M808874J415724m78413
9677a343921j37331m53373p04786J681151M566003L423935j005834l632501k750500
9668c57157j277028j040922j165207j522451k655410k703336N23933M573370M493335
9659a130873L23581k353099l58943K849317K538932j085552m055691l854145j515223
9650h641696N65760J533808K483407M055882M501236J789026k525129m087587
$$ plain form
9712 1721335 4752996 4958375 6090688 5834780 -767161 -9871079 -11426088 -3952470 2831538
9703 2831538 2206122 -1379212 -1464382 908497 1405078 66937 -533965 -975574 -3810353
9694 -3810353 -8453628 -10962074 -8590802 -2877902 1614653 1620867 -1023546 -1127455 2678630
9685 2678630 4820245 151329 -7808586 -10864095 -7090106 -2281232 -865508 -1343921
9677 -1343921 -1481252 -1934625 -2639411 -958260 3607743 7031678 6025844 2393343 -357157
9668 -357157 -1634185 -2675107 -3840314 -5362765 -8018175 -10721511 -10197578 -5624208 -1130873
9659 -1130873 -807292 -3160391 -3519334 -670017 1868915 783363 -3272328 -7126473 -8641696
9650 -8641696 -8075936 -6542128 -4058721 -2839 4498397 6287423 3762294 -325293
9642c25293j221407K879159M559230L681606J797795p07581l459968m626822l207674
9633f30955j040562l05957n24605Q7111J633105K460594J053087k552875n888825
9624e709882n136446K51604M790243K867227k929427m554097j1149M016211K760018
9615c655698o8531K64893J792463O14248j557057m41498L359661N296233L369290
9606H974004m10740l418555m178175k578893n47987k52038n45412J117712K698911
9597H58827m97151o258931n631104L322586J0033934O085028k048317l155753
9589B709119J962853L769420j17811k962416j301882P25015q0153j561354j688365
9580A454426j553486j430968M45811L825263N683391M284267N85502l687411o064302
$$ plain form
9642 -325293 -1546700 1332459 5891689 9573295 11371090 10663509 7203541 2576719 -630955
9633 -630955 -1671517 -1977474 -2502079 -2414968 -781863 1678731 2731818 178943 -5709882
9624 -5709882 -10846328 -10594724 -5804481 -2937254 -5866681 -10420778 -10431927 -6415716 -3655698
9615 -3655698 -3724229 -3459336 -1666873 -1052625 -2609682 -3051180 308481 5604714 8974004
9606 8974004 8563264 5144709 966534 -1612359 -2160346 -2412384 -2957796 -1840084 858827
9597 858827 361676 -5897255 -11528359 -8205773 1828161 7913189 5864872 2709119
9589 2709119 4671972 8441392 8323581 5361165 4059283 4784298 4704145 3142791 1454426
9580 1454426 -99060 -1530028 -1084217 2741046 8424437 12708704 13294206 9606795 3542493
9571C542493l728926J850842L852570r41854n866193l922767N47796r71547n684065
9562a1321651l133718O210181R349884R66849p302508m167869N136389Q218329
9554C955886L164860k274705l647265k777475j070883J684236L448206K089391
9546D572251K42748J485746L059064l42188o144297n603428K464486P941008L556526
9537A1231916m252901m956396P35160L291144k41251k472617J432540N675302
9529A0442897L209799l194055n709696l275713j450248k363933k365016J24274
9521d581691J590178J68571q83935O22923J648444l96328k587474j465554Q48218
9512e036648L50338j986132k083155M96602K574979K894594K926996K735987O15517
$$ plain form
9571 3542493 -186433 1664409 5516979 4575125 -1291068 -5213835 -4666039 -5637586 -11321651
9562 -11321651 -14455369 -8245188 1104696 2071545 -5230963 -9398832 -4262443 3955886
9554 3955886 7120746 4846041 1198776 -1578699 -2649582 -965346 2482860 4572251
9546 4572251 4814999 6300745 9359809 9017621 2873324 -2730104 -265618 7675390 11231916
9537 11231916 6979015 2022619 2757779 6048923 5807672 3335055 4767595 10442897
9529 10442897 13652696 10458641 4748945 1473232 22984 -2340949 -4705965 -4581691
9521 -4581691 -2991513 -2822942 -3706877 -3083954 -1435510 -1831838 -4419312 -5884866 -5036648
9512 -5036648 -4686310 -6672442 -8755597 -8258995 -5684016 -2789422 137574 2873561 3489078
9503C489078k797365m068828j817607R62327R97523p60698n46645K793975N400279
9494C652039K769334l652921o777002k718644L204915L253478j821284m283442
9486f373527j310098J529164J48178j867190l61404K497324K941657J754679Q59009
9477a82208j126189m656893n527985j326697K827503J468544k266386j807284
9469a2597595K258514M260626L187492K328459J376006k447303o345801l969042
9461a1948644L896395Q863716O677851J966698n13342j939603l934189m008850
9453i39968o74871K294598J225947j695330k130369q1594J133264K73233r18169
9444a513259r60941n7414J026445J510692N54876j817749m001493m098376k052634
$$ plain form
9503 3489078 691713 -3377115 -5194722 -4232395 -3234872 -3995570 -4542215 -1748240 3652039
9494 3652039 6421373 2768452 -4008550 -6727194 -3522279 -268801 -2090085 -6373527
9486 -6373527 -7683625 -6154461 -6006283 -7873473 -8234877 -5737553 -2795896 -1041217 -182208
9477 -182208 -1308397 -5965290 -11493275 -12819972 -9992469 -8523925 -10790311 -12597595
9469 -12597595 -10339081 -6078455 -2890963 -562504 813502 -1633801 -7979602 -11948644
9461 -11948644 -8052249 811467 7489318 9456016 8942674 7003071 3068882 -939968
9453 -939968 -1614839 679759 1905706 210376 -1919993 -2001587 -868323 -595090 -1513259
9444 -1513259 -2474200 -2531614 -1505169 5523 560399 -1257350 -5258843 -9357219 -11409853
9435a1409853q517j11817j797807k040043O41075L403553K624487m49536j133469
9426a0281927J414574K775445N81626j495648J52892L326324L984025K307722
9418B765033R29426K52722o33656j188174j031068j430358k192774p30141K721166
9409e37824L529932J1957k850925j485656K56140j342324k550058N21874L462598
9400i84286J009675k553980m21930L955152K411424k955518k835678K716520L861682
9391D203061k054588n966383k480169K045766J440007o94908Q09810L506453K787156
9382C596205n7552j286285j160632j726321k269486j426758l97964m75325l81593
9373e585711J162757K916817L081999J454574r88804k229515L8754M359597M586682
$$ plain form
9435 -11409853 -11418370 -11530187 -13327994 -15368037 -14726962 -11323409 -8698922 -9148458 -10281927
9426 -10281927 -8867353 -6091908 -5510282 -7005930 -6853038 -3526714 457311 2765033
9418 2765033 3694459 3947181 3313525 2125351 1094283 -336075 -2528849 -3258990 -537824
9409 -537824 2992108 3004065 153140 -1332516 -1076376 -2418700 -4968758 -4446884 -984286
9400 -984286 25389 -2528591 -2950521 1004631 3416055 460537 -2375141 341379 4203061
9391 4203061 2148473 -3817910 -6298079 -4252313 -2812306 -3507214 -2697404 809049 3596205
9382 3596205 3538653 2252368 1091736 -634585 -2904071 -4330829 -4728793 -5204118 -5585711
9373 -5585711 -4422954 -1506137 1575862 3030436 2041632 -187883 -149129 4210468 8797150
9364H797150j748536p071863l245166N039633N918123j628922o523932l347538
9356c811051O30686l28063j110637L051810O518563K821201l522455l872949J092393
9347A469498L378055j24023m862897o239215m046780l45332K761159L928571L677668
9338d03296L542838L310804J683330k16710k0096J119679r9383k914745l499238
9329B503183k105885k207236k577881J051805N799835L634177m100924n987500
9321c990426J036994N106847j237033p537808k204577P679880P208311k634323
9313C427865p165395r69938N756986M356635j246604l607004k239903r47712j191536
9304c826606j880799j858830m28921J945266L016713J358879j032166j391334
$$ plain form
9364 8797150 7048614 -23249 -3268415 1771218 7689341 6060419 -463513 -3811051
9356 -3811051 -3180365 -3508428 -4619065 -1567255 4951308 7772509 4250054 377105 1469498
9347 1469498 4847553 4723530 -139367 -6378582 -10425362 -10770694 -8009535 -4080964 -403296
9338 -403296 3139542 6450346 8133676 7916966 7896870 9016549 8917166 6002421 2503183
9329 2503183 397298 -1809938 -4387819 -3336014 2463821 6097998 1997074 -3990426
9321 -3990426 -2953432 2153415 916382 -6621426 -8826003 -1146123 6062188 3427865
9313 3427865 -3737530 -4707468 1049518 5406153 4159549 552545 -1687358 -2635070 -3826606
9304 -3826606 -5707405 -7566235 -7995156 -6049890 -3033177 -1674298 -2706464 -4097798
9296d097798j30638O70860Q61957J206778R20071m64217j047820K38155R88776
9287h53876n90413j938785m86156J427783O54663p46005J009073M240915L895328
9278F612527m30717m010328m092074k673244k088808j909327q98936P10126J630896
9269g149885J126935L20394J456306M064242L305299l514545r974403p003323
9261a7368980L230503Q404315L453388k550089j513610J743678J21754k594815
9253g073856N75298O170594N895437R74232q44052O72415q62358n204582n150301
9244d847173K01242K974015p59917n312483m956517j089347K587651M877316M891735
9235a433478J628686k271692k364553N60124J300161q77379r44527K592761M149466
$$ plain form
9296 -4097798 -4228436 -3557576 -2695619 -1488841 -568770 -1032987 -2080807 -1842652 -853876
9287 -853876 -1444289 -3383074 -3869230 -2441447 -1786784 -2532789 -1523716 2717199 6612527
9278 6612527 6181810 2171482 -1920592 -4593836 -6682644 -8591971 -9490907 -8780781 -7149885
9269 -7149885 -6022950 -5702556 -4246250 -182008 3123291 -391254 -10365657 -17368980
9261 -17368980 -14138477 -5734162 -2280774 -4830863 -6344473 -4600795 -4479041 -7073856
9253 -7073856 -6498558 -327964 5567473 6541705 5697653 6370068 5507710 303128 -4847173
9244 -4847173 -4645931 -1671916 -2431833 -7744316 -12700833 -13790180 -11202529 -6325213 -1433478
9235 -1433478 195208 -2076484 -4441037 -3880913 -2580752 -3458131 -4402658 -1809897 2339569
9226B339569n8481n573020o067262j881398J540796J043626j278436j221562K557000
9217h599168O149712M355764j604504l885911R25273N062553K58841q604824r292935
9208a5235199p0122P841170O365268o6123l607590l046841j065463J467080L956166
9199c461654M030437J084866j893455k681260k280196j458376O08143K698454
9191c353041J735707j357701j365894L031533O063574L233781j829535k858330
9183C300094L40507K671549R59825k874193m628022k164979J936166K253522k731396
9174i36927p045174m368606K573272N442388K469909J21539J834718L048006K09807
9165C348932l000309k916809k498822m979701o562651k191421N217466Q118654
$$ plain form
9226 2339569 2281088 -3291932 -9359194 -11240592 -9699796 -8656170 -9934606 -11156168 -8599168
9217 -8599168 -2449456 1906308 301804 -3584107 -2658834 2403719 2662560 -5942264 -15235199
9208 -15235199 -15305321 -7464151 -1098883 -1165006 -4772596 -7819437 -8884900 -7417820 -3461654
9199 -3461654 568783 1653649 -239806 -2921066 -5201262 -6659638 -6051495 -3353041
9191 -3353041 -1617334 -2975035 -4340929 -1309396 4754178 7987959 6158424 3300094
9183 3300094 3640601 6312150 7271975 4397782 -230240 -2395219 -459053 1794469 -936927
9174 -936927 -7982101 -12350707 -9777435 -4335047 -1865138 -1743599 91119 3139125 3348932
9165 3348932 348623 -2568186 -5067008 -10046709 -16609360 -18800781 -13583315 -5464661
9157e464661M786792L78879j194359r20419n99828r2600O62143N69190o33319
9148b508182j696310j873931j859775k152343j790665M46716L844401N424153
9140b165936K820952k199891m693067k317734J584022K744821J763531J990156
9132d73146L447329L089871K74973k357727l178525k722421j068188J673371K926601
9123A612138M89833k771040k264476R01389J704479j25017j43022K025624J855237
9114C285145q81850n87647L763618N239040J98593n032800m110285j20131R94150
9105B747833p7887L2579l13865l741379o578918l775500J777942K766586j261880
9096h424489l463418j23863M878492O455617M060546L54813k093433k184433p55597
$$ plain form
9157 -5464661 -677869 -298990 -1493349 -2413768 -3013596 -3106196 -2444053 -1874863 -2508182
9148 -2508182 -4204492 -6078423 -7938198 -10090541 -11881206 -11434490 -7590089 -2165936
9140 -2165936 655016 -1544875 -6237942 -8555676 -6971654 -4226833 -2463302 -473146
9132 -473146 2974183 6064054 6339027 3981300 802775 -1919646 -2987834 -1314463 1612138
9123 1612138 2101971 -669069 -2933545 -2032156 -327677 -452694 -595716 1429908 3285145
9114 3285145 2403295 1815648 5579266 10818306 11016899 5984099 1873814 1753683 2747833
9105 2747833 2669946 2702525 2388660 -1352719 -7931637 -11707137 -9929195 -7162609 -8424489
9096 -8424489 -11887907 -12011770 -7133278 -677661 3382885 3737698 1644265 -540168 -1295765
9087a295765L54058O68205Q93373J50179k806337m919423j257151N736706O729908
9078D253753n23314n754066j452010M522131J324816o616094o263617K907937
9070g600464Q292654M248129q19191K8457K258547L79694k319681j269017N66712
9061C765840j279743m157581k885032J551249M342650M351303L427412J370831
9053A0486929k627948n813493m673424o06945J832686J240297j21258q54401j444594
9044b582151j629911n81633P25596N91968l95329l52265M70389J51994j439859
9035e041201k427587j864958m12152J504715L738842N089309M448255K885411
9027G920634K105250J400476r78159l852646l967753j101378J222591J149239
$$ plain form
9087 -1295765 -941707 -273502 619871 770050 -2036287 -6955710 -8212861 -2476155 4253753
9078 4253753 3730439 -2023627 -3475637 1046494 2371310 -4244784 -10508401 -7600464
9070 -7600464 692190 4940319 4121128 4149585 6408132 6787826 4468145 3199128 3765840
9061 3765840 2486097 -1671484 -4556516 -3005267 1337383 5688686 9116098 10486929
9053 10486929 7858981 2045488 -2627936 -3234881 -1402195 -161898 -283156 -1137557 -2582151
9044 -2582151 -4212062 -4793695 -4068099 -3476131 -3871460 -4223725 -3753336 -3601342 -5041201
9035 -5041201 -7468788 -9333746 -9745898 -8241183 -4502341 586968 5035223 7920634
9027 7920634 10025884 11426360 10448201 6595555 2627802 1526424 2749015 3898254
9019C898254J099009K999945M091428P58913n093299p142118k410768M605796
9011B807160O801722K300811l820925n553768k584586K15015l66530j799287k32437
9002b232825L032936L163810m29656k460578K57880L365740J229606m178975n621088
8993c873150q76132M336829M458274P17261k169828k360264j313805k99616O12050
8984g68381J186147R37727M57j145651k132709k246513q15835J292273K231437
8975a461048J798175J295536L27653k805250o176406m317759L358912Q685887
8967G05700M717302l686092o007367r11697K991976J198236p39362J859223M311969
8958D439888Q17378n041070n415589k35359L384302K161985j55440n52192p75224
$$ plain form
9019 3898254 4997263 7997208 12088636 12847549 7754250 612132 -1798636 2807160
9011 2807160 9608882 11909693 8088768 2535000 -49586 165429 -201101 -2000388 -2232825
9002 -2232825 800111 3963921 3534265 1073687 1331567 4697307 5926913 1747938 -3873150
8993 -3873150 -4749282 -412453 4045821 4763082 2593254 232990 -1080815 -1380431 -768381
8984 -768381 417766 1355493 1355950 210299 -1922410 -4168923 -4984758 -3692485 -1461048
8975 -1461048 337127 1632663 1960316 -844934 -7021340 -11339099 -7980187 705700
8967 705700 5423002 1736910 -4270457 -5182154 -2190178 -991942 -1731304 127919 4439888
8958 4439888 5257266 216196 -5199393 -5434752 -2050450 111535 -43905 -596097 -1371321
8949a371321k051909j926068O53983K006111o67116l974693l066793P28049J858911
8940g810846p51822j967858J612018O173169N784800N22495l680531k665735J216433
8931a567877K722857K76562k662533k397083M52269K231481J302201j68890k8220
8922A60767M78190p28819k222680p51660L027734M499154J839673j206158j464546
8913C631655j169259l191834n222092l632980l07473L01236q87359P66995M754579
8904d956532N507424K002878k97542R37594J021681k705984n444316l235054K10219
8895f959632O21212N54008L016622M016440l67839m913318k752470K322432J734154
8886b728391k632693j170963O099658P883101j40242p610255n324445J551551
$$ plain form
8949 -1371321 -3423230 -5349298 -4695315 -2689204 -3356320 -7331013 -10397806 -9669757 -7810846
8940 -7810846 -8562668 -10530526 -8918508 -2745339 3039461 3561956 -118575 -2784310 -1567877
8931 -1567877 1154980 1431542 -1230991 -3628074 -3175805 -944324 357877 188987 160767
8922 160767 638957 -89862 -2312542 -3064202 -36468 4462686 6302359 5096201 3631655
8913 3631655 2462396 -729438 -5951530 -9584510 -9891983 -9590747 -10478106 -9711111 -4956532
8904 -4956532 550892 2553770 2256228 3193822 4215503 1509519 -3934797 -7169851 -6959632
8895 -6959632 -6338420 -5784412 -2767790 1248650 880811 -4032507 -6784977 -4462545 -2728391
8886 -2728391 -5361084 -6532047 -432389 7450712 7310470 -299785 -5624230 -4072679
8878d072679L079968q30024l240981j672897J066017L462223N461564M817293
8870H070484j62477n859280o786293k673137J991963L827604K327974j815210
8862a078372o022355n798536R6417O274180O761122K583559q36679j603038j721635
8853a345337j551309K55261K058574M26533l624039m979298j973002J323315J620365
8844g788937N24855L63194L40559o19094r35572Q06457K976370L606578L436564
8835B710974L523326K448265p24430l033832j404487J625546Q73552l077360l879390
8826i37836P81372M815264K507425k838414l944463k04763K557599J503628l61677
8817C878135q30728j635462l380987l267700n14246J241149O4881q12616Q71871
$$ plain form
8878 -4072679 -992711 -1822735 -5063716 -6736613 -5670596 -2208373 3253191 8070484
8870 8070484 7908007 2048727 -4737566 -7410703 -5418740 -1591136 736838 -1078372
8862 -1078372 -7100727 -12899263 -12802846 -6528666 232456 2816015 1979336 376298 -1345337
8853 -1345337 -2896646 -2641385 -582811 -156278 -3780317 -8759615 -10732617 -9409302 -7788937
8844 -7788937 -7264082 -6900888 -6560329 -7179423 -8114995 -7308538 -4332168 -725590 2710974
8835 2710974 6234300 8682565 7958135 4924303 3519816 5145362 6018914 2941554 -937836
8826 -937836 -156464 4658800 7166225 4327811 383348 178585 2736184 4239812 3878135
8817 3878135 3047407 1411945 -1969042 -5236742 -5750988 -4509839 -4444958 -5257574 -4385703
8808d385703K099159N90002l52354J733602K800535l82486k711746J229599O430284
8799G050892M564239j807775l420459m60493j728671p594710p653882J259076
8791i791783P950485L851957m289455o172408k544384K50003J681664L825764
8783e238157L936052j04646k682638J441059O643886M057749l892964o809273
8775b648932k118431K478904J910571j90265N99727L132665M078420K210150j798826
8766G653983n750208o305806k690247J376703K962928M077181O143629M954500
8758A2422663k070183q064817n145568K494843M126856p56823k641206J173022
8750A538787K474317k394696n379797p69773M456885K371392k476064j010623
$$ plain form
8808 -4385703 -2286544 -1696542 -2048896 -315294 2485241 2102755 -608991 620608 7050892
8799 7050892 11615131 9807356 6386897 5926404 4197733 -3396977 -11050859 -9791783
8791 -9791783 -1841298 2010659 -2278796 -8451204 -10995588 -10745585 -9063921 -5238157
8783 -5238157 -1302105 -1406751 -4089389 -2648330 3995556 8053305 4160341 -2648932
8775 -2648932 -4767363 -2288459 -377888 -568153 31574 3164239 7242659 9452809 7653983
8766 7653983 1903775 -4402031 -7092278 -5715575 -2752647 1324534 7468163 12422663
8758 12422663 10352480 2287663 -2857905 -363062 3763794 3006971 365765 1538787
8750 1538787 4013104 1618408 -3761389 -4531162 -74277 2297115 -178949 -1189572
8742a189572M891281N362432j612772p221180n076382O77763K853529P64225j290380
8733a841056j312820j153077j923966j710304R14580L497219K484784j322362
8725b367002l270480j385232J061015J204405R79230K687651L894842J505632
8717D310061j880693j460748J650915K039813j054510k973231j922464j176566
8709b467423j896459p25616L083474M759570J694240j806460j555971o4870j303905
8700b83420l344182j828101K229594L823246J576410j137780k016420k166685
8692c147338k479539j689124P59574K690742J810671p99093j374119J889696N554195
8683C215665M073857k743414p594622m075437M135538P004639J259383n324037
$$ plain form
8742 -1189572 3701709 9064141 7451369 230189 -4846193 -4168430 -1314901 -550676 -1841056
8733 -1841056 -3153876 -4306953 -6230919 -7941223 -7026643 -3529424 -1044640 -2367002
8725 -2367002 -5637482 -7022714 -5961699 -4757294 -3778064 -1090413 2804429 4310061
8717 4310061 2429368 968620 2619535 4659348 3604838 631607 -1290857 -2467423
8709 -2467423 -4363882 -5089498 -2006024 2753546 4447786 2641326 1085355 1020485 -283420
8700 -283420 -3627602 -5455703 -3226109 597137 2173547 1035767 -980653 -3147338
8692 -3147338 -5626877 -7316001 -6556427 -3865685 -2055014 -2854107 -4228226 -2338530 3215665
8683 3215665 7289522 4546108 -3048514 -7123951 -2988413 4016226 5275609 -48428
8675d8428m754672Q92037L849474J750394p89313l07475J038855K09571j494890
8666C45553q14075J596983J234593l423091p158522m314948K552600N083661Q06404
8657d090842l116897p03543L970709L971069O55761K05210K322418J282080k967580
8648A528385m106470m85862K246863J398185J088138L021335K574984j672373
8640E593185l532383L0398K338589j771206o230663l859314Q71619n45977n614561
8631a2720313m875109J989749N867035L397169J157752L290318N296355L271353
8623F674309L96145K9965k33015k773510m226105q88375M328979N441480J417858
8614A0167731l274307m537925k334620J66381m02027l897755n676683k017560
$$ plain form
8675 -48428 -4803100 -3911063 -61589 1688805 899492 592017 1630872 1840443 345553
8666 345553 -468522 1128461 2363054 -1060037 -8218559 -12533507 -9980907 -4897246 -4090842
8657 -4090842 -7207739 -7911282 -3940573 30496 686257 891467 3213885 4495965 1528385
8648 1528385 -2578085 -3063947 -817084 581101 1669239 4690574 7265558 5593185
8640 5593185 2060802 2091200 4429789 2658583 -3572080 -7431394 -6559775 -7105752 -12720313
8631 -12720313 -17595422 -15605673 -9738638 -6341469 -5183717 -1893399 3402956 6674309
8623 6674309 7070454 7100419 6867404 4093894 -132211 -1020586 3308393 8749873 10167731
8614 10167731 6893424 2355499 20879 187260 -214767 -4112522 -9789205 -11806765
8606a1806765L632303M200726o60287l426290n5180L737566J897320j968339o13714
8597e062660M599903N487965M2543m329173k137357K464136K793256o48085k338509
8588H72019n59142J156775M38955r39578j292002k058315m264110m934848p48887
8579a2329133N752645P648382K373150m284884n219937o80540L288750L571772
8571A20205K797423L172503K329702j889239o110252n321613n63249J995876j90355
8562c658999k764759j539199J268610J043216j846761k789611J41456M020211
8554f125836N711392M954956K321059k087114o371330o785803k500691K085147
8546h798220K498827k79038k096476j504576j60807J066490K605231L547535K428675
$$ plain form
8606 -11806765 -8174462 -3973736 -4634023 -8060313 -8115493 -4377927 -2480607 -4448946 -5062660
8597 -5062660 -462757 5025208 5067751 738578 -1398779 1065357 3858613 3210528 872019
8588 872019 312877 1469652 1908607 969029 -322973 -2381288 -6645398 -11580246 -12329133
8579 -12329133 -6576488 1071894 3445044 -839840 -6059777 -6740317 -3451567 120205
8571 120205 2917628 6090131 8419833 6530594 420342 -4901271 -5464520 -3468644 -3658999
8562 -3658999 -6423758 -7962957 -6694347 -5651131 -7497892 -10287503 -10146047 -6125836
8554 -6125836 -414444 4540512 6861571 4774457 -1596873 -8382676 -10883367 -8798220
8546 -8798220 -6299393 -6578431 -8674907 -10179483 -10340290 -9273800 -6668569 -3121034 -692359
8537f92359N77635Q42561K565518J774447k551939o286320n938353l022317m49452
8528a3180579J850623M614196N739008L246468k62746o22692J361645J026180
8520C772103k425931m150509j251515K227739J193443k624232l087091J146136
8512e199857M516096K612554j779840l305706j679867p87511j671993j163121
8504h459245K067345M651683L732643J233641J04577m14456k167667l507129j870192
8495d628800R26210J034539p17413P9077L567528M612324R43370l173398l770896
8486a127459k678833k982531l433492j471849J596979K840961K631860L046509
8478a577855L328435J367124j672616k681908j816537j940107l096210k189949
$$ plain form
8537 -692359 -114724 727837 3293355 5067802 2515863 -3770457 -9708810 -12731127 -13180579
8528 -13180579 -11329956 -6715760 -976752 2269716 2006970 1384278 2745923 3772103
8520 3772103 1346172 -2804337 -4055852 -1828113 -634670 -3258902 -6345993 -5199857
8512 -5199857 -683761 1928793 148953 -3156753 -4836620 -5624131 -7296124 -8459245
8504 -8459245 -6391900 -1740217 1992426 3226067 3330644 2916188 748521 -2758608 -4628800
8495 -4628800 -3702590 -2668051 -3385464 -3306387 261141 4873465 5816835 2643437 -1127459
8486 -1127459 -3806292 -6788823 -10222315 -11694164 -10097185 -7256224 -4624364 -1577855
8478 -1577855 1750580 3117704 1445088 -1236820 -3053357 -4993464 -8089674 -10279623
8470a0279623J024308K166829j354568n565770m602832J626201P335332P788616
8462a861507L934504J6447j352118p00238L36747Q29808N61707j40970k13713
8453A410667R93826J899017J02317l290456l557099R23379M672464J991913m173159
8444I72869n673957p29504M044101L737753Q01606j265701l140271n081880l499370
8435i834354K735945P646521N672028l6496k575288j006039Q32166J755748K716433
8426G906664J800004k627207n767293j617540O434532Q619130K662754l654843
8418A3756201m809049l690876l243196r43807M072012O374306K473468k593424
8410A1395635k870507l96685m45205k557105k899285j775489j896621j973698
$$ plain form
8470 -10279623 -9255315 -7088486 -8443054 -14008824 -18611656 -16985455 -9650123 -1861507
8462 -1861507 2072997 2089444 737326 37088 373835 1203643 1765350 1624380 1410667
8453 1410667 2404493 4303510 4405827 1115371 -2441728 -1518349 3154115 5146028 972869
8444 972869 -4701088 -5430592 -1386491 2351262 3152868 1887167 -1253104 -6334984 -9834354
8435 -9834354 -7098409 548112 6220140 6183644 3608356 2602317 3434483 5190231 7906664
8426 7906664 9706668 7079461 1312168 -305372 6129160 14748290 17411044 13756201
8418 13756201 8947152 5256276 2013080 1069273 5141285 11515591 13989059 11395635
8410 11395635 8525128 8128443 7683238 5126133 2226848 451359 -1445262 -3418960
8402c418960R51641M602156L828892r18420l940927k915700j126493q95403o95229
8393d528443L64108O32591k61629n27803k08487j275064k762727j021698L693810
8384e895342O228096M131497R54934l39361j421999k949714j378845L639668M925594
8375G894528k177437j0332677r240803r02485L604643J126104l79306L157402
8367g250031M765661q18196o698515l990916L898538O248123J021940l249713
8359f073109j146005K506503J403436k774213l614243Q45514N962043O328703
8351C438629J488717l964918n254183k485821j50370q35519j501951J373900N017954
8342b873562L465472k881633o405701k836712K543619K925474o6564J18758L799803
$$ plain form
8402 -3418960 -2467319 2134837 5963729 5045309 1104382 -1811318 -2937811 -3833214 -4528443
8393 -4528443 -4164335 -3531744 -3793373 -4321176 -4529663 -5804727 -8567454 -9589152 -5895342
8384 -5895342 332754 4464251 5419185 5079824 3657825 708111 -670734 2968934 7894528
8375 7894528 5717091 -4615586 -13856389 -14758874 -11154231 -10028127 -10407433 -7250031
8367 -7250031 -2484370 -3302566 -10001081 -13991997 -10093459 -3845336 -2823396 -6073109
8359 -6073109 -7219114 -4712611 -3309175 -6083388 -9697631 -8852117 -2890074 3438629
8351 3438629 4927346 962428 -4291755 -6777576 -6927946 -7763465 -9265416 -7891516 -2873562
8342 -2873562 591910 -2289723 -8695424 -11532136 -8988517 -6063043 -6129607 -6010849 -2211046
8333b211046M080204k091572p844854n205246L431078P784924L160038l621175
8325b517649l897219J220875L452457k08602l598807j263161L368476L705411
8317B61781j0544j946961n2665J741455O82315j017139q74117K25052J094311
8308A03488K596573M319262K950435k456385o763715m597160J851066N133080
8300C136644K141192k437840k835949O84144L053041J237951k019990j782664
8292A176529K506744N602775K714554m062749p839611n115501O15771L634971
8284g66517J909814k177681m579737k584827K545138N757254L691761l22463m32171
8275C040571K881054L272506j334200n241429m142181j558396j912206k879185
$$ plain form
8333 -2211046 1869158 -222414 -8067268 -13272514 -9841436 -2056512 1103526 -2517649
8325 -2517649 -6414868 -5193993 -1741536 -1950138 -5548945 -6812106 -3443630 261781
8317 261781 251237 -1695724 -1748389 -6934 675381 -341758 -1215875 -990823 103488
8308 103488 2700061 7019323 9969758 7513373 749658 -3847502 -1996436 3136644
8300 3136644 5277836 2839996 4047 688191 3741232 4979183 2959193 1176529
8292 1176529 3683273 9286048 12000602 7937853 98242 -5017259 -4401488 -766517
8284 -766517 1143297 -1034384 -5614121 -8198948 -5653810 103444 3795205 3472742 3040571
8275 3040571 5921625 9194131 7859931 2618502 -1523679 -3082075 -4994281 -7873466
8267g873466l89105L268596L001447m13923j867441j71135J570217K314090L352704
8258B791984L269816n95203n750279o321421j985397J197141J43818j327822n465
8249h582828J406771j86321k479661j535994K232854N573349O990599O332307
8241I751076K430739m684453j0610566r836008k588667M495649N656846K196006
8233c189378n5667J522299L479853K051566p73942l21552K801067K935049j424702
8224G024593m461436k277383M49992j632269n067076l269734J932019L019292
8216d282002p76297k830675o86750R84297J48011Q45019M158445M644428m6656
8207B157820l934301k096717J702132K122630N33623M06067M05479j568827k726586
$$ plain form
8267 -7873466 -8262571 -4993975 -1992528 -2406451 -4273892 -4445027 -2874810 -560720 2791984
8258 2791984 6061800 5466597 -283682 -6605103 -8590500 -7393359 -7249541 -8577363 -8582828
8249 -8582828 -7176057 -7362378 -9842039 -11378033 -9145179 -3571830 3418769 9751076
8241 9751076 12181815 7497362 -3113204 -12949212 -15537879 -11042230 -5385384 -3189378
8233 -3189378 -3245045 -1722746 1757107 3808673 3034731 2713179 5514246 8449295 7024593
8224 7024593 2563157 285774 735766 -896503 -5963579 -9233313 -7301294 -4282002
8216 -4282002 -5058299 -7888974 -8575724 -7591427 -7443416 -6598397 -2439952 2204476 2157820
8207 2157820 -1776481 -3873198 -2171066 -48436 485187 891254 1296733 -272094 -2998680
8198b998680m12475J907627M82974j337904J122306M706231L070565k495025n143547
8189a097928l265657j094572k26914J097148J509703j737836m955000j445379
8181a1216435O367296Q016904O46750n991605m247494P57190R52025k100425j922380
8172h738174J411291K735726J220196M83817J091306R0187k458827k774894L26874
8163f612498L491001L946959K410115L03727j946811l102926j426410J973188
8155i63655L416187J637098m98846o74406m22252j681124k901491j619448R33271
8146b774666J303816p29357j670336K50986K398261K068338P76152J511670L450571
8137F585435K896312q14301l910200l572632j519924n84335o50326l00127J54484
$$ plain form
8198 -2998680 -3411155 -1503528 -1020554 -2358458 -1236152 3470079 6540644 4045619 -1097928
8189 -1097928 -4363585 -5458157 -5685071 -4587923 -3078220 -4816056 -9771056 -11216435
8181 -11216435 -4849139 3167765 3814515 -2177090 -6424584 -5667394 -4715369 -6815794 -8738174
8172 -8738174 -7326883 -4591157 -3370961 -2887144 -1795838 -1705651 -4164478 -6939372 -6612498
8163 -6612498 -3121497 825462 3235577 3539304 1592493 -1510433 -2936843 -963655
8155 -963655 2452532 4089630 3590784 2916378 2494126 813002 -2088489 -3707937 -2774666
8146 -2774666 -1470850 -2200207 -3870543 -3619557 -1221296 847042 1623194 3134864 6585435
8137 6585435 9481747 8667446 4757246 1184614 -335310 -919645 -1569971 -1870098 -1715614
8128a715614J33339Q00502K257472J356621l216838o192489k173604M639057M821795
8119G10241j879837n177202J57788O287787N076548L70841k22582J396057j075448
8110E644193n070757k964631L105240L020297m057151p047881j018536M527996
8102c861230J688334k854217m3918N532523L416168m801525p813929k477047K544379
8093h670462J296640j944216j861526K69909J482977K224414K891453J512701
8085b798110j451406j642680K049292M199983J030889l010513j994926K129363
8077a488108K821322q46248l320297j244719K331707L147144J064770j221778
8069A243793k080153j763251o72174J464457M309167N551182K440212m145215
$$ plain form
8128 -1715614 -1582275 -781773 1475699 2832320 -384518 -6577007 -8750611 -4111554 710241
8119 710241 -1169596 -6346798 -6189010 98777 5175325 5546166 5323584 6719641 5644193
8110 5644193 573436 -2391195 714045 3734342 -322809 -7370690 -8389226 -3861230
8102 -3861230 -2172896 -5027113 -5071031 461492 3877660 -923865 -8737794 -11214841 -8670462
8093 -8670462 -7373822 -9318038 -11179564 -10909655 -9426678 -7202264 -4310811 -2798110
8085 -2798110 -4249516 -5892196 -3842904 357079 1387968 -1622545 -3617471 -1488108
8077 -1488108 1333214 486966 -2833331 -4078050 -1746343 1400801 2465571 1243793
8069 1243793 -836360 -2599611 -3271785 -1807328 2501839 8053021 10493233 6348018
8061F348018q578593n983475J569645P063010O562792K319175j880385m543153
8053B877034n098663k948684M85970K272433J918412J452320R28776j567662m496406
8044d176470l282484J665863L728593L04275k364699N13770L787502R06384m714625
8035c631891n092124l48323K825923K709652L414822N418937M341487m20309m016031
8026E202143m218404l861141m037754k064704K066377M049223K276611L35114
8018b52535L97145J63365j389811j325383J444171L387017K392724J227072J898203
8009G941968J896400m72540k103531m99872J268267n78347m182846m870326j840163
8000c440990J601213K655745J169923j183047k082783o55358R56263M54194o37603
$$ plain form
8061 6348018 -2230575 -8214050 -6644405 418605 6981397 9300572 7420187 2877034
8053 2877034 -2221629 -5170313 -4684343 -2411910 -493498 958822 1887598 319936 -4176470
8044 -4176470 -7458954 -5793091 -2064498 -1760223 -4124922 -3611152 176350 1082734 -3631891
8035 -3631891 -8724015 -9072338 -6246415 -3536763 -121941 5296996 9638483 9218174 5202143
8026 5202143 983739 -2877402 -6915156 -8979860 -6913483 -2864260 -587649 -252535
8018 -252535 144610 307975 -1081836 -2407219 -963048 2423969 4816693 6043765 7941968
8009 7941968 9838368 9365828 7262297 6762425 8030692 7452345 3269499 -1600827 -3440990
8000 -3440990 -1839777 815968 1985891 802844 -1279939 -1935297 -979034 -524840 -1162443
7991a162443L77382J650755o35711m312427l114061K459083M447384K57629k561681
7982b594090J123907N317611L170663j660745j840728J577352K456873L23265
7974G874108p62731n44791j461743k067996K66848K492924p1431m724197m688107
7965c687116r3457K637904J534087P25571J509244M23376k744501l299882m0957
7956c035731K063632J79132j922462o09752J936767J848721q94834l450682l413090
7947g298299k21038L588614L264030j912043n252152j461165L823404J844545
7939c624104l949589k071714O927070Q491307k830576j2225782o125545O803727
7931h605206R141622Q19006l573184O08230K609698l583851q909259m650295L562746
$$ plain form
7991 -1162443 -785061 865694 229983 -4082444 -7196505 -4737422 -290038 -32409 -2594090
7982 -2594090 -1470183 3847428 7018091 5357346 3516618 5093970 7550843 7874108
7974 7874108 7111377 6566586 5104843 3036847 3303695 5796619 5725188 1000991 -3687116
7965 -3687116 -3780573 -1142669 391418 1116989 2626233 3049609 305108 -2994774 -3035731
7956 -3035731 -972099 -792967 -2715429 -3325181 -1388414 460307 -434527 -3885209 -7298299
7947 -7298299 -7519337 -3930723 -666693 -2578736 -7830888 -9292053 -5468649 -3624104
7939 -3624104 -7573693 -9645407 -2718337 5772970 2942394 -9283388 -15408933 -8605206
7931 -8605206 536416 1355422 -2217762 -1609532 1000166 -2583685 -11492944 -16143239 -12580493
7922a2580493N281335Q59804j285170J491184L661091J665124r20064L50866M242580
7913B766257N833399K675019k809806o133273m970882q66653K831437M254053
$$ plain form
7922 -12580493 -7299158 -6439354 -7724524 -6233340 -2572249 -907125 -1827189 -1476323 2766257
7913 2766257 8599656 11274675 8464869 2331596 -2639286 -3505939 -674502 3579551
$$ [...]
##END NTUPLES=NMR SPECTRUM
##END=
