##TITLE=31Pdec_SR34
 CDCl3, 24 sc
 3.03.2021
##JCAMPDX= 6.0         $$ Bruker NMR JCAMP-DX V2.0
##DATA TYPE= NMR SPECTRUM
##DATA CLASS= NTUPLES
##ORIGIN= UXNMR, Bruker Analytische Messtechnik GmbH
##OWNER= root
$$ XWIN-NMR		Version 3.5
$$ Wed Mar  3 13:36:55 2021 Russian Standard Time (UT+4h)  she@DPX200
##.OBSERVE FREQUENCY= 81.013821
##.OBSERVE NUCLEUS= ^31P
##.ACQUISITION MODE= SIMULTANEOUS
##.ACQUISITION SCHEME= undefined
##.AVERAGES= 24
##.DIGITISER RES= 16
##SPECTROMETER/DATA SYSTEM= spect
##.PULSE SEQUENCE= zgpg30
##.SOLVENT NAME= CDCl3
##.SHIFT REFERENCE= (INTERNAL, CDCl3, 0, 248.564)
##AUDIT TRAIL= $$ (NUMBER, WHEN, WHO, WHERE, WHAT)
$$ ##TITLE= Audit trail, XWIN-NMR		Version 3.5
$$ ##JCAMPDX= 5.01
$$ ##ORIGIN= Bruker BioSpin GmbH
$$ ##OWNER= she
$$ F:/spectra/data/she/nmr/P31/1/pdata/1/auditp.txt
$$ ##AUDIT TRAIL=  $$ (NUMBER, WHEN, WHO, WHERE, WHAT)
(   1,<2021-03-03 13:35:56.92 +0400>,<she>,<DPX200>,
      <created by zg, POWCHK disabled, PULCHK disabled
       configuration hash MD5:
       00 E9 B6 7A A2 85 ED C7 34 08 36 98 17 FE 4E 26
       data hash MD5: 32K
       5E 7D 4C 96 5B AB 49 3B C4 64 39 AE BF A7 A6 42>)
(   2,<2021-03-03 13:35:59.90 +0400>,<she>,<DPX200>,
      <Start of raw data processing
       efp BC_mod = 2 LB = 1 FT_mod = 6 PKNL = 1 PHC0 = -3121.031 PHC1 = 427.001 SI = 64K 
       data hash MD5: 64K
       D5 BF 62 2F 90 8D 85 8C BF 45 C4 6C 62 CF 0B 7D>)
(   3,<2021-03-03 13:36:29.76 +0400>,<she>,<DPX200>,
      <pk PHC0 = 37.16125 PHC1 = -113.6 
       data hash MD5: 64K
       75 92 AB AA 7B 8E 8A 66 90 75 A5 BB FD B8 6B 38>)
(   4,<2021-03-03 13:36:33.23 +0400>,<she>,<DPX200>,
      <abs ABSG = 5 
       data hash MD5: 64K
       98 30 FE 45 8A FD C3 3E 04 66 AE 1D 87 3D 16 31>)
$$ ##END=
$$ 
$$ hash MD5
$$ DF 88 64 EA 19 2E 11 15 2B B8 53 27 EC 77 97 08
##$RELAX= 
##$RELAX= 
##$RELAX= 
##$RELAX= 
##$RELAX= 
##$RELAX= 
##$RELAX= 
##$RELAX= 
$$ Bruker specific parameters
$$ --------------------------
##$DU= <F:/spectra>
##$EXPNO= 1
##$NAME= <P31>
##$PROCNO= 1
##$TYPE= <nmr>
##$USER= <she>
##$AMP= (0..31)
100 100 100 100 100 100 100 100 100 100 100 100 100 100 100 100 100 100 
100 100 100 100 100 100 100 100 100 100 100 100 100 100 
##$AQSEQ= 0
##$AQ_mod= 1
##$AUNM= <au_zg>
##$AUTOPOS= <>
##$BF1= 81.014009
##$BF2= 200.13
##$BF3= 200.13
##$BF4= 200.13
##$BF5= 200.13
##$BF6= 200.13
##$BF7= 200.13
##$BF8= 200.13
##$BYTORDA= 1
##$CFDGTYP= 0
##$CFRGTYP= 5
##$CHEMSTR= <none>
##$CNST= (0..31)
1 1 145 1 1 1 1 1 1 1 1 1 1 1 1 1 1 1 1 1 1 1 1 1 1 1 1 1 1 1 1 1 
##$CPDPRG= <waltz16>
##$CPDPRG1= <>
##$CPDPRG2= <waltz16>
##$CPDPRG3= <>
##$CPDPRG4= <mlev>
##$CPDPRG5= <mlev>
##$CPDPRG6= <mlev>
##$CPDPRG7= <mlev>
##$CPDPRG8= <mlev>
##$CPDPRGB= <>
##$CPDPRGT= <>
##$D= (0..31)
0 1 0 0 0 0 0 0 0 0 0 0.03 2e-05 3e-06 0 0 0 0 0 0 0 0 0 0 0 0 0 0 0 0 
0 0 
##$DATE= 1614764156
##$DBL= (0..7)
120 120 120 11 120 120 24 19 
##$DBP= (0..7)
150 150 150 150 150 150 150 150 
##$DBP07= 0
##$DBPNAM0= <>
##$DBPNAM1= <>
##$DBPNAM2= <>
$$ [...]
##$SUBNAM3= <"">
##$SUBNAM4= <"">
##$SUBNAM5= <"">
##$SUBNAM6= <"">
##$SUBNAM7= <"">
##$SUBNAM8= <"">
##$SUBNAM9= <"">
##$SW= 501.771253377433
##$SWIBOX= (0..15)
0 1 3 0 0 0 0 0 0 0 0 0 0 0 0 0 
##$SW_h= 40650.406504065
##$TD= 32768
##$TD0= 1
##$TE= 0
##$TE2= 300
##$TE3= 300
##$TEG= 300
##$TL= (0..7)
0 120 53 12 22 120 120 120 
##$TP= (0..7)
150 150 150 150 150 150 150 150 
##$TP07= 0
##$TPNAME0= <>
##$TPNAME1= <>
##$TPNAME2= <>
##$TPNAME3= <>
##$TPNAME4= <>
##$TPNAME5= <>
##$TPNAME6= <>
##$TPNAME7= <>
##$TPOAL= (0..7)
0.5 0.5 0.5 0.5 0.5 0.5 0.5 0.5 
##$TPOFFS= (0..7)
0 0 0 0 0 0 0 0 
##$TUNHIN= 0
##$TUNHOUT= 0
##$TUNXOUT= 0
##$USERA1= <user>
##$USERA2= <user>
##$USERA3= <user>
##$USERA4= <user>
##$USERA5= <user>
##$V9= 5
##$VALIST= <valist>
##$VCLIST= <CCCCCCCCCCCCCCC>
##$VD= 0
##$VDLIST= <DDDDDDDDDDDDDDD>
##$VPLIST= <PPPPPPPPPPPPPPP>
##$VTLIST= <TTTTTTTTTTTTTTT>
##$WBST= 1024
##$WBSW= 4
##$XGAIN= (0..3)
0 0 0 0 
##$XL= 0
##$YL= 0
##$YMAX_a= 5847
##$YMIN_a= -7570
##$ZGOPTNS= <>
##$ZL1= 120
##$ZL2= 120
##$ZL3= 120
##$ZL4= 120
##$ABSF1= 248.5645
##$ABSF2= -253.2056
##$ABSG= 5
##$ABSL= 3
##$ALPHA= 0
##$AQORDER= 0
##$ASSFAC= 0
##$ASSFACI= 0
##$ASSFACX= 0
##$ASSWID= 0
##$AUNMP= <proc_1d>
##$AZFE= 0.1
##$AZFW= 0.5
##$BCFW= 0
##$BC_mod= 2
##$BYTORDP= 0
##$COROFFS= 0
##$CY= -3
##$DATMOD= 1
##$DC= 0
##$DFILT= <>
##$DTYPP= 0
##$F1P= 0
##$F2P= 0
##$FCOR= 1
##$FTSIZE= 65536
##$FT_mod= 6
##$GAMMA= 0
##$GB= 0
##$INTBC= 1
##$INTSCL= 5.30512e-09
##$ISEN= 30
##$LB= 1
##$LEV0= 0
##$LPBIN= 0
##$MAXI= 10000
##$MC2= 0
##$MEAN= 0
##$ME_mod= 0
##$MI= 50
##$NCOEF= 0
##$NC_proc= -8
##$NLEV= 6
##$NOISF1= 182.463
##$NOISF2= 159.3651
##$NSP= 0
##$NTH_PI= 0
##$NZP= 0
##$OFFSET= 248.5645
##$PC= 4
##$PHC0= -3083.87
##$PHC1= 313.401
##$PH_mod= 1
##$PKNL= yes
##$PPARMOD= 0
##$PSCAL= 0
##$PSIGN= 0
##$REVERSE= no
##$SF= 81.014009
##$SI= 65536
##$SIGF1= 159.3651
##$SIGF2= -187.1042
##$SINO= 113.3802
##$SIOLD= 16384
##$SREGLST= <1H.CDCl3>
##$SSB= 0
##$STSI= 65536
##$STSR= 0
##$SW_p= 40650.406504065
##$SYMM= 0
##$S_DEV= 0
##$TDeff= 32768
##$TDoff= 0
##$TI= <>
##$TILT= no
##$TM1= 0
##$TM2= 0
##$TOPLEV= 0
##$USERP1= <user>
##$USERP2= <user>
##$USERP3= <user>
##$USERP4= <user>
##$USERP5= <user>
##$WDW= 1
##$XDIM= 65536
##$YMAX_p= 567749938
##$YMIN_p= -79866023
$$ End of Bruker specific parameters
$$ ---------------------------------
##NTUPLES= NMR SPECTRUM
##VAR_NAME=  FREQUENCY,     SPECTRUM/REAL,   SPECTRUM/IMAG
##SYMBOL=    X,             R,               I
##VAR_TYPE=  INDEPENDENT,   DEPENDENT,       DEPENDENT
##VAR_FORM=  AFFN,          ASDF,            ASDF
##VAR_DIM=   65536,         65536,           65536
##UNITS=     HZ,            ARBITRARY UNITS, ARBITRARY UNITS
##FACTOR=    0.620285442955139, 1,           1
##FIRST=     20137.2065510759, 0,            0
##LAST=      -20513.1999529892, 0,           0
##MIN=       -20513.1999529892, -79866023,   0
##MAX=       20137.2065510759, 567749938,    0
$$ Real data points
##PAGE= N=1
##DATA TABLE= (X++(R..R)), XYDATA
$$ [...]
40212B0380537K217532J900826Q43112n748269j2925519j0727395m15524M393680
40204h1020l082199j2233011r986886K077302J2845440J6318262J2832952K747822
40196B1438662j0790271j7901211j2089081j520631P21414m209699l217040P442678
40188b0125179J5854326J2694460M062425j41955r37180m637215r127780o207147
40180h565245M205312J1409515P425453k681905p124859j296174P464537Q616326
40172A9452960L56993q329536p986607K96605O532084M212259k485173n419645
40164F629940k846794N42074J710786K434875M195143M694921J873550j808354
40156A7426141k385379q8013J149660q50210m504290p471665q431616o006315
$$ plain form
40212 20380537 22598069 24498895 25342007 19593738 6668219 -4059176 -4474700 -81020
40204 -81020 -3163219 -15396230 -25383116 -23305814 -10460374 5857888 18690840 21438662
40196 21438662 10648391 -7252820 -19341901 -20862532 -20141118 -24350817 -27567857 -20125179
40188 -20125179 -4270853 8423607 12486032 12344077 11406897 6769682 -2358098 -8565245
40180 -8565245 -4359933 7049582 14475035 11793130 4668271 3372097 10836634 19452960
40172 19452960 19809953 11480417 3493810 3790415 10322499 14534758 12049585 6629940
40164 6629940 3783146 4325220 6036006 8470881 12666024 17360945 19234495 17426141
40156 17426141 15040762 14952749 16102409 15252199 10747909 3276244 -5155372 -11161687
40148a1161687P0980N801293N409063o59527m522141j191016M028644L572777
40140A348386n31979k1306N969956R001658M436524j440606j330921K281823J809779
40131B1523314l799025q055431o238472q16277K671629J862048j098028k662074
40123C387684j460532Q94329K120231J318864j701641o658764j0122129o005233
40115a8227191O156790J5889867J2202593r83286q241837l054262M400947L714266
40107A1857887j245439j583693J197061n70782n973726o413942j21733M487466
40099A633099J508208m331553m885356J397561Q747784R916361K450975p692332
40091H744747j0248358k483028N650130M196248j873872M91345J1374354J5070504
$$ plain form
40148 -11161687 -11090707 -5289414 119649 -539878 -5062019 -6253035 -2224391 1348386
40140 1348386 816407 795101 6765057 15766715 20203239 18762633 17431712 19713535 21523314
40131 21523314 17724289 9668858 3430386 2614109 5285738 7147786 6049758 3387684
40123 3387684 1927152 2821481 4941712 6260576 4558935 -2099829 -12221958 -18227191
40115 -18227191 -12070401 3819466 16022059 15038773 6796936 3742674 8143621 11857887
40107 11857887 10612448 9028755 10225816 9655034 3681308 -2732634 -2854367 1633099
40099 1633099 3141307 -1190246 -6075602 -4678041 4069743 13986104 16437079 8744747
40091 8744747 -1503611 -3986639 1663491 5859739 3985867 4477212 15851566 30922070
40083C0922070K384496j4320800j6451076l530661P117606L353158p625913j0389509
40075h540629r49424R551231R817289K272641j625723K056905M428457k214266
40067A4796481j1440669j0912412j97318Q547440P438579J379656k352686m132849
40059C126222o829228q019833m142996K217062N808669O381003O837443O485733
40051A1864075K759940k030030k856223p51794k083053p291898p661488K033911
40043f016560J3158365J2551380J61923j0130603q312726K18850M625013L641215
40035I896857L343554M052473o0967p969520r653625j748054M865285J260745
40027C986748m542793l33449R065213Q261844l324995r297912k268830M455754
$$ plain form
40083 30922070 33306566 18985766 2534690 -995971 6121635 9474793 1848880 -8540629
40075 -8540629 -9490053 61178 9878467 12151108 10525385 12582290 17010747 14796481
40067 14796481 3355812 -7556600 -7753918 793522 8232101 9611757 7259071 3126222
40059 3126222 -3703006 -11722839 -15865835 -13648773 -7840104 -1459101 5378342 11864075
40051 11864075 14624015 12593985 9737762 8985968 6902915 -388983 -8050471 -6016560
40043 -6016560 7141805 19693185 19855108 9724505 1411779 1630629 6255642 9896857
40035 9896857 13240411 17292884 17231917 9262397 -391228 -2139282 2726003 3986748
40027 3986748 -556045 -889494 8175719 16437563 13112568 3814656 1545826 6001580
40019F001580j070385r995045p237850M704441J0518177N013815k437364m272855
40011A224514k931994k058230k55234L691061P091424P412484M645147j104094
40003A7715078q865080j3679815j0472585j560825N432977P131921N865576K444819
39995D012066m557988j1659954j1189761j980954P673990J0582410P899415L758624
39987D537848l20872l099154k815763j505306k972548m434887P49655R276312
39979e84715Q420534l851953j1825020m603337O114592M007492o078642o953419
39971a5354468K692190P752950K706954r46423L816853Q089165L734227k940983
39963I550465k993328P70775N28775l465534n208477k906256K38292J191223j038494
$$ plain form
40019 6001580 4931195 -5063850 -12301700 -7597259 2920918 7934733 5497369 1224514
40011 1224514 -1707480 -3765710 -4020944 -329883 6761541 14174025 18819172 17715078
40003 17715078 8849998 -4829817 -15302402 -16863227 -11430250 -4298329 1567247 4012066
39995 4012066 -545922 -12205876 -23395637 -25376591 -17702601 -7120191 779224 4537848
39987 4537848 4216976 1117822 -1697941 -3203247 -6175795 -10610682 -9861027 -584715
39979 -584715 7835819 3983866 -7841154 -12444491 -6329899 -2322407 -8401049 -15354468
39971 -15354468 -12662278 -4909328 -2202374 -3148797 668056 8757221 12491448 9550465
39963 9550465 6557137 7327912 7856687 4391153 -817324 -3723580 -3485288 -2294065 -3332559
39954c332559m196411j986276Q378947J7200032J1611122l956197j0247263j224870
39946A2246525N976495j613221j1876663q702961N69713j262155j0275649p322461
39938b2260377Q702172J6896966O174320r324656j2685111n388979J499645L792329
39930a2593691L690638K993890L684807P416197J0194505N864442k458893m408051
39922A4383844J320741L905198k325527r325868r541887p018399p237835o691102
39914b2530835j091950M950399N174836J638217L4038J150236K768771L826511
39906d079777K559127k142513m960290M18477Q054761N250693n434795o521355
39898f855672N605273J1778201J123586r456499l640219N933489K4627j2630809
$$ plain form
39954 -3332559 -7528970 -9515246 -1136299 16063733 27674855 23718658 13471395 12246525
39946 12246525 18223020 16609799 4733136 -3969825 -3400112 -4662267 -14937916 -22260377
39938 -22260377 -13558205 3338761 9513081 188425 -12496686 -17885665 -16386020 -12593691
39930 -12593691 -8903053 -5909163 -2224356 5191841 15386346 21250788 18791895 14383844
39922 14383844 15704585 19609783 17284256 7958388 -1583499 -8601898 -15839733 -22530835
39914 -22530835 -23622785 -18672386 -13497550 -11859333 -11825295 -10675059 -7906288 -4079777
39906 -4079777 -1520650 -3663163 -8623453 -8204976 -150215 5100478 -334317 -6855672
39898 -6855672 -1250399 10527802 11651388 2194889 -1445330 4488159 4512786 -8118023
39890h118023j0051252M685700R140567l8596m062756L325963P233370J252921
39882C367894j942134L115579L533647o435080j1971993k673900R110454Q897082
39874E001549J552076k132051m237500r439855j0052897J256845J4233867J3649610
39866I831644K040548n441686l187938J909686M770791N817775L756959k827489
39858A6670290q727865p542194j796947J458769K057356M327284O527657K927328
39850A5901678n144393r793895p648797k622831J676372N058903O724076M660780
39842H811893m71055n053515n784713j384757N959703R466232L848438n112070
39834A0280156m968685N385607J1565791M024035p469980q889325k129792J416345
$$ plain form
39890 -8118023 -18169275 -13483575 -4343008 -4381604 -8444360 -5118397 2114973 3367894
39882 3367894 1425760 4541339 8074986 1639906 -10332087 -13005987 -3895533 5001549
39874 5001549 6553625 4421574 184074 -9255781 -19308678 -18051833 -3817966 9831644
39866 9831644 11872192 6430506 3242568 5152254 9923045 15740820 19497779 16670290
39858 16670290 7942425 400231 -1396716 62053 2119409 6446693 12974350 15901678
39850 15901678 10757285 963390 -6685407 -9308238 -7631866 -2572963 4151113 8811893
39842 8811893 8340838 3287323 -2497390 -3882147 2077556 11543788 15392226 10280156
39834 10280156 5311471 10697078 22262869 26286904 18816924 9927599 7797807 9214152
39826I214152m35915j590567j300945k858350k933599L261993Q853050K466696
39818A4676515j1826365j6542643m938499R813654J2946991M710070m624369o851546
39810b636192n4473J0809354J5423913P942160m025366q318529n175310m948009
39802I017548r610190r581146j217446N811192L779159j844146k612963R35059
39794e322933L696119M146086K458100j909685n776483l053228N263346R717155
39786I218477N654862k77526j549302o61164j118685j15974L506428L235870m199289
39777A3693697r831566m570988N655442P412690j346545r500280p706770K580815
39769c613505J2921846J4483505L986407j0981845j6454214p709940M354140Q203265
$$ plain form
39826 9214152 8778237 7187670 5886725 3028375 94776 3356769 12209819 14676515
39818 14676515 2850150 -13692493 -18630992 -8817338 4129653 8839723 4215354 -2636192
39810 -2636192 -2690665 8118689 23542602 31484762 27459396 19140867 13965557 9017548
39802 9017548 -592642 -10173788 -11391234 -5580042 -1800883 -3645029 -6257992 -5322933
39794 -5322933 -1626814 2519272 4977372 3067687 -2708796 -5762024 -498678 9218477
39786 9218477 14873339 14595813 13046511 12385347 11266662 11150688 14657116 17892986 13693697
39777 13693697 3862131 -708857 4946585 12359275 11012730 1512450 -6194320 -3613505
39769 -3613505 9308341 23791846 27778253 16796408 342194 -7367746 -3013606 5189659
39761E189659N984808M922122K889097m902125j1226886m876649Q683188J1455383
39753A8118597k67208r401545l936715N825006N289156j929470k742186K599180
39745A3554815K093327o170233r410276q04976Q323360M980784n944923r565193
39737b943315l610894r2102m133899n313059L502642J1583724O876727k441745
39729C428079m7918R676306N978649j2912417k1468899m422902J7570286J7063749
39721A4864933p89626r507765j954686M597876M64659m229731k017472p9238k682369
39712a333419j387326P368780J1819389L540574p638381r490133n481106m234141
39704f835763k916456L972114R330329L756400n979663n922473K464718O066456
$$ plain form
39761 5189659 11174467 16096589 18985686 14083561 2856675 -2019974 6663214 18118597
39753 18118597 17851389 8449844 4513129 10338135 15627291 13697821 10955635 13554815
39745 13554815 15648142 9477909 67633 -737343 7586017 12566801 6621878 -2943315
39737 -2943315 -6554209 -6646311 -10780210 -16093269 -12590627 -1006903 5869824 3428079
39729 3428079 3380161 13056467 19035116 6122699 -15346200 -19769102 -2198816 14864933
39721 14864933 14075307 4567542 2612856 7210732 7675391 3445660 1428188 1348950 -1333419
39712 -1333419 -2720745 4648035 16467424 20007998 12369617 2879484 -2601622 -6835763
39704 -6835763 -9752219 -5780105 3550224 7306624 1326961 -4595512 -2130794 3935662
39696C935662L163075L960202Q671433N187018p410009j2482633j630149R931273
39688A3325872N905400o232899p431006M322197J2796397P657099l634078q715929
39680A7993053n216880k54083p63636o105341q102544K383J2958512J6853183
39672B7364647O978912m146855l683787K906714O42999j1476002j8615392j1900870
39664a1929634N73876P938063J0247515J1809945J0411865K147126q551817j2595534
39656A0051405p898078q23517K673958K056891n04737k956630l648623k213900
39648c263231J03488K800708O721017J0196146Q245864j99511p565683o013610
39640A1025188J166363L172281l144796q516033m332404M924675P280258q46094
$$ plain form
39696 3935662 7098737 11058939 19730372 24917390 17507381 5024748 3394599 13325872
39688 13325872 19231272 12998373 5567367 9889564 22685961 30343060 26708982 17993053
39680 17993053 12776173 12522090 11758454 5653113 -2449431 -2447048 10511464 27364647
39672 27364647 34343559 30196704 26512917 29419631 30062630 18586628 -28764 -11929634
39664 -11929634 -11355758 -3417695 6829820 18639765 29051630 31198756 22646939 10051405
39656 10051405 2153327 1329810 4003768 6060659 5555922 2599292 -1049331 -3263231
39648 -3263231 -3159743 -359035 6361982 16558128 24803992 24604481 17038798 11025188
39640 11025188 12191551 15363832 12219036 3703003 -629401 4295274 11575532 10729438
39632A0729438r570397p936816J798823O557135l11337r186888o723770M874179
39624i769633R885172J323627q913566p541118J774194O651674N196589M864878
39616C471817O526739L663622l221558n561516k267764k466420q241644q604677
39608a6701401J718226J0605950O537495k707863k742836M332410M962313k558907
39600C445387o331042j676518K237673m62139k829803J524906P180725O391093
39592I480282J006605k624130l763547m784053m025701J112847P383286Q843236
39584A2628825M800602m92200l767373l994207q01664L495972L420103k718345
39576A2571713q195703o099587K07298J375449m654921j0436460r581860l002968
$$ plain form
39632 10729438 1159041 -6777775 -4978952 1578183 1266846 -7920042 -14643812 -9769633
39624 -9769633 115539 1439166 -7474400 -15015518 -13241324 -6589650 -1393061 3471817
39616 3471817 9998556 13662178 10440620 4879104 2611340 144920 -8096724 -16701401
39608 -16701401 -14983175 -4377225 2160270 -547593 -3290429 1041981 6004294 3445387
39600 3445387 -2885655 -4562173 -2324500 -2786639 -5616442 -4091536 3089189 9480282
39592 9480282 10486887 7862757 4099210 -684843 -4710544 -3597697 3785589 12628825
39584 12628825 17429427 16937227 13169854 9175647 8373983 11869955 15290058 12571713
39576 12571713 4376010 -1723577 -1516279 -140830 -4795751 -15232211 -24814071 -27817039
39568b7817039N345895J2150256J3492244P075624k314194o156843l384586j474179
39560c082822l504447k299095O752519J4789530J0647742j748679p758536k261101
39552A1535111N086402N726494K668117J270232n05408n562075q889509m479150
39544F850214L199376M123462k430457o929432l744117K155298M384912L141973
39536A0751229J012700j807113l753400j70571Q728008J3716950P413618m633482
39528C1257939j0938972r067951n798163m675883k740103M24694J18131m325861
39520e746169o330895k241822K543715K747523K011490N844552J0734854Q448436
39512A8011684r29479q194583p596091l435560k041637k626725j18295N744174
$$ plain form
39568 -27817039 -22471144 -10320888 3171356 10246980 7932786 1775943 -1608643 -3082822
39560 -3082822 -6587269 -8886364 -2133845 12655685 23303427 21554748 13796212 11535111
39552 11535111 16621513 22348007 25016124 26286356 25780948 20218873 11329364 6850214
39544 6850214 10049590 14173052 11742595 4813163 1069046 3224344 7609256 10751229
39536 10751229 11763929 9956816 6203416 6032845 14760853 28477803 35891421 31257939
39528 31257939 20318967 11251016 5452853 776970 -1963133 -1538439 -1420308 -5746169
39520 -5746169 -12077064 -14318886 -11775171 -9027648 -7016158 -1171606 9563248 18011684
39512 18011684 17082205 8887622 1291531 -2144029 -4185666 -6812391 -6930686 -1186512
39504a186512Q883568N052894j771985m104088j070124L62837l941650p798442
39496e573502k888681Q139235J3606244P879929k205306p448381o272903k207447
39488C029188K103718M681143L615508N67110j32888J136928r82598o448383p028882
39479E40844R42145R141427R127981L391742k849260j1111736k0650253k0366024
39471c1833134m375613J2331382J1090654k824944q385023r69253M768842L363278
39463a6833811N760208J3615955J1364897n137025j4753332j787255J7862262
39456A0091899J9515514M021953r829645j4704761j5556473j0767954M164491
39449a3064976J8595735J5407899k002634j1760490m890798M046599J880339n300214
$$ plain form
39504 -1186512 7697056 12749950 10977965 6873877 5803753 6166590 2224940 -5573502
39496 -5573502 -8462183 -322948 13283296 21163225 18957919 11509538 5236635 3029188
39488 3029188 5132906 9814049 13429557 13996667 13863779 15000707 14018109 7569726 540844
39479 540844 1482989 10624416 19752397 23144139 20294879 9183143 -11467110 -31833134
39471 -31833134 -36208747 -23877365 -12786711 -15611655 -23996678 -24965931 -20197089 -16833811
39463 -16833811 -11073603 2542352 13907249 8770224 -5983108 -7770363 10091899
39456 10091899 29607413 33629366 23799721 9094960 -6461513 -17229467 -13064976
39449 -13064976 5530759 20938658 18936024 7175534 2284736 6331335 8211674 2911460
39441B911460o371898k439738o06629j079572M03859L845972N475649K922274
39433E061377l134375q376618o216050L878948J1203340O131243m122568l971561
39425D53736O720185J1656484L409692n745417m340612J613109J573027k458391
39417A2881813k806109k80697j03053j190433k40437r4879l687319n584558l11444
39408a417116N910099L096173o151126r539595l012530M514243M583312j287640
39400c304180o570622p340084l639782J797888N337152N806362N156349M100461
39392A343544Q47297l333408l057518K324152N321752J689618j779392J359520
39384D715565N273720J815678l779868m83172Q580916Q691844l224709j2210606
$$ plain form
39441 2911460 -3460438 -5900176 -6506805 -7586377 -7182518 -3336546 2139103 5061377
39433 5061377 1927002 -6449616 -12665666 -8786718 2416622 8547865 4425297 453736
39425 453736 7173921 18830405 22240097 16494680 12154068 13767177 15340204 12881813
39417 12881813 10075704 9795007 9691954 8501521 8261084 8166205 4478886 -1105672 -1417116
39408 -1417116 4492983 7589156 1438030 -8101565 -11114095 -6599852 -2016540 -3304180
39400 -3304180 -9874802 -17214886 -20854668 -19056780 -13719628 -7913266 -2756917 1343544
39392 1343544 2190841 -1142567 -4200085 -1875933 3445819 5135437 3356045 4715565
39384 4715565 9989285 11804963 8025095 7541923 16122839 24814683 21589974 9379368
39376I379368o648985N581163Q984624M73467r286193r898855j449754O872473
39368D007308O021883k947495q757578l487442O082537P453603O21069k633716
39360F360169J830662L562569n021480j4645508j1537528K360345J1229709N674320
39352a86742o660255j1778467n515606L539636N557523J220943j96706N713862
39344h305812J1473301P962946k122759p747797m746723K11649J175106M33165
39336a666924K139230N272518O326087L989103j156356o791746p605618j1111
39328D95183J0480551J3488420P134298k71464l480372n771514q344664n910805
39320G819633J078169K062071o068143q710758N401568K2327846J9759803P21681
$$ plain form
39376 9379368 2730383 8311546 17296170 17769637 8483444 -1415411 -2865165 4007308
39368 4007308 10029191 7081696 -1675882 -5163324 919213 8372816 8993885 6360169
39360 6360169 8190831 11753400 6731920 -7913588 -19451116 -17090771 -5861062 -186742
39352 -186742 -6846997 -18625464 -24141070 -20601434 -15043911 -13822968 -14019674 -8305812
39344 -8305812 3167489 11130435 9007676 1259879 -3486844 -3275195 -2100089 -1666924
39336 -1666924 472306 5744824 12070911 16060014 14903658 8111912 506294 495183
39328 495183 10975734 24464154 31598452 31326988 27846616 22075102 13730438 7819633
39320 7819633 8897802 10959873 4891730 -3819028 1582540 23910386 43670189 44391870
39312D4391870r497729o30331Q618906O33823j5017931j7854781o166120M520695
39304H998402N727265L685063M470762M877048O86988n472949q523022p262025
39296G187532l452027P23235K270564p76136m937268l542821L738751Q468048
39288I679878M554492k642114l878480O75864K835162k96816k681153n44311R54952
39279H657474l000705p467292m683080L542514Q433149P294483N058774K899165
39271B0734482l941736j3118216j1476497N742841K0521149J1856774j2665947
39264A7652850k2445676n232478J4510135J0321221q114042j1160154M687643
39257B19499J2331092k088235j6845566r187628R052662J1380831j629268n917949
$$ plain form
39312 44391870 34894141 34263810 42882716 43516539 28498608 10643827 4477707 8998402
39304 8998402 14725667 18410730 22881492 27758540 28445528 22972579 14449557 7187532
39296 7187532 3735505 4458740 6729304 5953168 1015900 -2526921 1211830 9679878
39288 9679878 14234370 11592256 7713776 8389640 11224802 10927986 8246833 7702522 8657474
39279 8657474 5656769 -1810523 -6493603 -2951089 5482060 12776543 17835317 20734482
39271 20734482 16792746 3674530 -7801967 -2059126 18462023 30318797 17652850
39264 17652850 -4792826 -10025304 4484831 14806052 6692010 -4468144 219499
39257 219499 12550591 10462356 -6383210 -15570838 -6518176 4862655 3233387 -2684562
39249b684562O094522J5449550R225996j013894k015010O22307k609930o485483
39241A6583496k737403K430831q31739o938082l623576O412092R532070L287226
39233B4114915j802211j155051j207949n095627p652582o469420n053957l352045
39225g673927K202172P721998M723322l465525k965423Q080607J3277516K345952
39217B4246692j2057456j2704948j866696N352508L659884O13896J671642M089328
39209A3004850M013498O55026n263125j0530795r613395k060890M054734K916470
39201b823627N01936M874763J1459422R010852j803623q017031l869367J043325
39193A0376650k237029p914466n168442M457876Q982457L449902l591224l261448
$$ plain form
39249 -2684562 3409960 18859510 28085506 27071612 25056602 25678909 23068979 16583496
39241 16583496 13846093 16276924 15445185 8507103 4883527 11295619 20827689 24114915
39233 24114915 22312704 21157653 19949704 14854077 7201495 732075 -4321882 -7673927
39225 -7673927 -5471755 2250243 6973565 3508040 542617 8623224 21900740 24246692
39217 24246692 12189236 -515712 -2382408 2970100 6629984 7243880 8915522 13004850
39209 13004850 17018348 17673374 12410249 1879454 -7733941 -9794831 -5740097 -2823627
39201 -2823627 -2321691 2553072 14012494 23023346 21219723 13202692 9333325 10376650
39193 10376650 8139621 225155 -4943287 -485411 8497046 11946948 8355724 5094276
39185E094276J259354J156359l444613l607710L414341Q046828K219038p478223
39177F659650q515555l66650N732130L716590m93568l90211K153853K395973n11731
39168A0380481n482736j1216117j3289092p095504L509462Q727608O917990O584010
39160i63898J0498071R548236p37159r533699o738496Q90093J762759j621113
39152C104794J6062M109460J441279m711577k391257P230262R561922J73093q117328
39143A0416710o429229k516051m988403q589076m990269K289536M459659J596300
39135h750823J73371J778789L424402M884842P077691O638566Q59490m578755
39127A1507573k098440M597996L672127o960842j4316758p677722O094980J1729226
$$ plain form
39185 5094276 6353630 7509989 4065376 457666 3872007 11918835 14137873 6659650
39177 6659650 -1855905 -2222555 3509575 7226165 6732597 6342386 8496239 10892212 10380481
39168 10380481 4897745 -6318372 -19607464 -26702968 -23193506 -14465898 -7547908 -963898
39160 -963898 9534173 19082409 18345250 8811551 2073055 2963148 4725907 3104794
39152 3104794 3120856 7230316 8671595 3960018 1568761 8799023 18360945 18534038 10416710
39143 10416710 3987481 1471430 -3516973 -12106049 -17096318 -14806782 -10347123 -8750823
39135 -8750823 -8577452 -6798663 -3374261 1510581 8588272 15226838 16086328 11507573
39127 11507573 9409133 14007129 17679256 10718414 -3598344 -11276066 -5181086 6548140
39119F548140N648509j697063k658229k116826o669088j1907415q394074L215728
39111a8030318J1769446J0302884L409362j540645l236750l662153l180007k186362
39103f354543k018318r17055M632599J1250817R487213j448911q700625l270912
39095B660265O110130O562270L44707j822567L39259n41273k761941J240399P182173
39086A9313422L084720q045380r428713J318245N798351m634528j2344230j800907
39078f739020J3148781R908289p327996j4884022o043762K666399J003172j178262
39070i446421N134007J2099101R588602K001511o76775P96989j132334o502676
39062A1862004q353889m740240p56281O56018J972146M636990N877969L427391
$$ plain form
39119 6548140 12196649 10499586 7841357 5724531 -944557 -12851972 -21246046 -18030318
39111 -18030318 -6260872 4042012 7451374 5910729 2673979 -988174 -4168181 -6354543
39103 -6354543 -8372861 -9289916 -4657317 6593500 16080713 14631802 5931177 2660265
39095 2660265 8770395 15332665 15677372 13854805 14194064 13652791 10890850 12131249 19313422
39086 19313422 22398142 14352762 4924049 6242294 12040645 7406117 -4938113 -6739020
39078 -6739020 6409761 16318050 8990054 -5893968 -11937730 -9271331 -8268159 -9446421
39070 -9446421 -4312414 7786687 17375289 19376800 18700025 19497014 18364680 11862004
39062 11862004 3508115 -1232125 -1988406 -1332388 639758 5276748 11154717 14582108
39054A4582108j272632n580539p381062m300275L616063R774254N995759n591258
39046I842418j1986601n664480M082139L459239o064836r909559j632958Q407027
39038i467611Q868371K620494k80441J895804K317511k340538p437805p487287
39030a1311502k047129N257700R183383N445511m233405j0614948o073408M752826
39022i640972R160955K427441n860663m389562N125696J0119131K957933r245054
39014F54905j2448736k234479J0468788J2231715K998256n707298o883648m612568
39006e533065l251707K62239P586968J1173705M507999n758702q148151k859510
38998b020224O22176o16944j205087k60846l000355q149691o424930M123761J2182091
$$ plain form
39054 14582108 13309476 7728937 347875 -3952400 -336337 9437917 15433676 9842418
39046 9842418 -2144183 -7808663 -3726524 -267285 -6332121 -16241680 -17874638 -9467611
39038 -9467611 -599240 2021254 1740813 3636617 5954128 3613590 -3824215 -11311502
39030 -11311502 -13358631 -8100931 1082452 6527963 2294558 -8320390 -14393798 -9640972
39022 -9640972 -480017 1947424 -3913239 -8302801 -3177105 6942026 9899959 654905
39014 654905 -11793831 -14028310 -3559522 8672193 11670449 5963151 -920497 -5533065
39006 -5533065 -8784772 -8522533 -935565 10238140 14746139 8987437 839286 -2020224
38998 -2020224 -1398048 -2014992 -3220079 -3480925 -6481280 -14630971 -21055901 -16932140 -4750049
38989d750049Q589015r27528m816769p91019M380669N115845J421352l548511
38981D673005o217644n264101l301589k967683j876671L305357Q849249P725466
38973D925389J320552j628861J135506K548633o90636l005232j481091j252621
38965A871639m292198m273763Q61223K860335k083857m212231L627715J1551958
38957E910821P329708l406768o180329l78586K314118j981465o128790o729963
38949i251254p082014n926402J880082J2195860J3523400N076520p59890J738257
38941A1394559K976916m254503j1411140q305152k67419Q89971l528145j719732
38933a4224645Q573594J5258722R476851j804044n943879j045129M156241L625521
$$ plain form
38989 -4750049 3838966 2911438 -1905331 -2696350 1684319 6800164 8221516 4673005
38981 4673005 -1544639 -6808740 -10110329 -13078012 -14954683 -11649326 -2800077 4925389
38973 4925389 6245941 4617080 5752586 8301219 7610583 4605351 3124260 1871639
38965 1871639 -2420559 -6694322 -5833099 -2972764 -5056621 -9268852 -5641137 5910821
38957 5910821 13240529 9833761 3653432 3274846 5588964 3607499 -2521291 -9251254
38949 -9251254 -16333268 -22259670 -20379588 -8183728 5339672 10416192 9656302 11394559
38941 11394559 14371475 10116972 -1294168 -9599320 -9866739 -8976768 -12504913 -14224645
38933 -14224645 -5651051 9607671 19084522 17280478 11336599 10291470 14447711 18073232
38925A8073232L50688p82818j52775m68346j310647j191809j918939n187844o761302
38916F49440j087536Q331302J0813798K703571p398787j0404399o607038l91216
38908c390865O716003J2114722R493285j507108r408824m542641N765410O173597
38900B1413579m861507j3113836q578587K566906Q306446N095820j468717m611333
38892D748771j933177L304924M700473o18085p387526p312743J036018J0050919
38884F589574J0848045J888339q850472r986474J348552J3290621J1142470l049017
38876B3221638j1637451n756383K657518O84303n914685n119082L2549j099218
38868b930811n661836k483341N942658O685212L56392Q62419R175556R205926
$$ plain form
38925 18073232 18423920 17641102 17488327 17019981 15709334 14517525 12598586 7410742 649440
38916 649440 -438096 7893206 18707004 21410575 14011788 3607389 -2999649 -3390865
38908 -3390865 3325138 15439860 24933145 23426037 14017213 9474572 15239982 21413579
38900 21413579 16552072 3438236 -5140351 -2573445 5733001 10828821 9360104 4748771
38892 4748771 2815594 6120518 10820991 10202906 2815380 -4497363 -3461345 6589574
38884 6589574 17437619 19325958 10475486 489012 1837564 15128185 26270655 23221638
38876 23221638 11584187 5827804 8485322 9169625 3254940 -1864142 -1831593 -2930811
38868 -2930811 -8592647 -11075988 -5133330 1551882 1908274 2770693 11946249 21152175
38860B1152175l692933j1233266m65588J4329922J2485590l504525j4320683j0687048
38852D063644o7302P377909P636450J905009l990926l200499K713192L782397
38844B0219874l446610r256026n602006J776906M195391L285596L857753K926167
38836A7957045l126584q689950p434663l039959q75861K074246P507147O631563
38828A1002984m783822j2622473l401896J1720450J2035216m23059o003227m98608
38820G025565J537961m169465n198230J354251K061082n891289o119052P226291
38812b172886J5193578M985301o834798j744377Q919604L359040j2911052j5089403
38804f294993J380835J4769552J0508811j308299n769211k616878L05688o9959
$$ plain form
38860 21152175 17459242 6225976 5760388 20090310 32575900 29071375 14750692 4063644
38852 4063644 3996342 11374251 19010701 20915710 16924784 13724285 16437477 20219874
38844 20219874 16773264 7517238 1915232 3692138 7887529 11173125 15030878 17957045
38836 17957045 14830461 6140511 -1294152 -4334111 -5209972 -3135726 4371421 11002984
38828 11002984 6219162 -6403311 -9805207 1915243 13950459 13527400 7524173 7025565
38820 7025565 8563526 4394061 -804169 550082 2611164 -3280125 -9399177 -2172886
38812 -2172886 13020692 18005993 11171195 9426818 18346422 21705462 8794410 -6294993
38804 -6294993 -4914158 9855394 20364205 19055906 13286695 10669817 10975505 10905546
38796A0905546k116828l885506l405934p38306k28165m328963p241999k929177
38788a3969332L691457L983778P69576L245536Q754293N291392o591074j0967911
38780e792285o64567J1052096J0481253J825158l500113m072996m486822l860979
38772I80745K73929L562064R19066m192378n641130m457650m233779k591491L397662
38763a1982962Q787265P754646M162585M769899O478976J818040o333388p884093
38755G570968j826534K720904J526016l88555j34008j276684m708691n660781
38747b177365k614676J9778M62061J695362L080058j31465o003464n267836L818774
38738g118773J0025207M933924m388465n820602J380097P891641P197868O39830
$$ plain form
38796 10905546 8788718 4903212 1497278 758972 530807 -3798156 -11040155 -13969332
38788 -13969332 -10277875 -6294097 -5524521 -2278985 6475308 11766700 5175626 -5792285
38780 -5792285 -6456852 4595244 15076497 16901655 13401542 9328546 4841724 980745
38772 980745 1254674 4816738 5735804 1543426 -4097704 -8555354 -12789133 -15380624 -11982962
38763 -11982962 -3195697 4558949 8721534 13491433 19970409 21788449 15455061 7570968
38755 7570968 5744434 8465338 9991354 9602799 9468791 8192107 3483416 -2177365
38747 -2177365 -4792041 -4772263 -4310202 -2614840 465218 333753 -5669711 -10937547 -7118773
38738 -7118773 2906434 7840358 3451893 -2368709 -988612 6903029 14100897 14740727
38730A4740727o751761j0107301p189262q44424L323504L196871P72760k659678
38722e518564o007497m589900M026357J1252377O415796m938027o219029L983206
38714a595281Q266335m58889n932317K887061R793104k754796k1397604j9904153
38706c1096540K25896J3263305R143802L470216O724357R160228K770595m104907
38698I556952l735032k114871m785036n491237J74407M000323m95356n295241
38690h185091j266624O319259P350193K585966j520729m705132p932146n457440
38682a2811744N101545J2612197O742933l883573l493453N402271N787971n770663
38674I687484j3083573n984584M656258N153338j373586l787016j218363o94466
$$ plain form
38730 14740727 7988966 -2118335 -9307597 -10152021 -6828517 -3631646 -2858886 -5518564
38722 -5518564 -11526061 -16115961 -12089604 -837227 5578569 640542 -5578487 -1595281
38714 -1595281 6671054 6212165 279848 3166909 12960013 10205217 -11192387 -31096540
38706 -31096540 -30870644 -17607339 -8463537 -4993321 1731036 10891264 13661859 9556952
38698 9556952 5821920 3707049 -1077987 -6569224 -6394817 -2394494 -2889850 -8185091
38690 -8185091 -9451715 -3132456 4217737 6803703 5282974 577842 -7354304 -12811744
38682 -12811744 -7710199 4901998 11644931 7761358 4267905 9670176 15458147 9687484
38674 9687484 -3396089 -9380673 -4724415 428923 -944663 -4731679 -5950042 -6644508
38666f644508k629046j001656M120294N604326J712272m10694L068740N679083
38658I498811J455138m257835k737036L869687N665091N82986l410195k432678
38650H233969k116670n430536o157037r51579K738522j44333j411720N920869
38642F81485J1742515L492909j0081507r322371M818502J1074154J637301o571997
38634G470991j440737N029690p20895j0310607q519982J821450O976795M374053
38626D680758J354223k17641k561793k033080M137582P262317j069671j2012683
38618d59988j0374483J711776Q589497N389194J437884J318739K85998j618269
38610F280348J258625N582658J442395q126128q323509K402904P337983j497510
$$ plain form
38666 -6644508 -9273554 -10275210 -6154916 -550590 1161682 750988 3819728 9498811
38658 9498811 10953949 6696114 3959078 7828765 13493856 14076842 10666647 8233969
38650 8233969 6117299 686763 -5470274 -6421853 -3683331 -3827664 -5239384 681485
38642 681485 12424000 15916909 5835402 -3486969 1331533 12405687 14042988 7470991
38634 7470991 6030254 11059944 10339049 28442 -8491540 -6670090 306705 4680758
38626 4680758 6034981 5817340 3255547 1222467 5360049 12622366 11552695 -459988
38618 -459988 -10834471 -9122695 -533198 4855996 6293880 7612619 7898617 6280348
38610 6280348 7538973 13121631 14564026 6437898 -1885611 517293 7855276 6357766
38602F357766r784850m555421N346893N403040j903768n159788m019013n676295
38594a3991436q480591m173321O728349J4299723J2851738O063803k46997l336847
38586I714421l015362j215076k63245Q95349M375819O319911O25546q108477o942681
38577B386205N118674J2314462N516856l415284j737537L643148L98242p027374
38569A7197392p061278k369722k166765k312385N113714J0129656j755833j8884111
38561b109332j5071578P149456J5585817j882004j7074662n550714J6490452J9813134
38553A7350569M794942o998152p441101l606068K921597J3452052J7078152L133216
38545D0685207j5603772j6090940M28234J0272935L676207m494171l325930j026387
$$ plain form
38602 6357766 -3427084 -7982505 -2635612 2767428 863660 -4296128 -8315141 -13991436
38594 -13991436 -22472027 -26645348 -19916999 -5617276 7234462 13298265 13051268 9714421
38586 9714421 6699059 5483983 5220738 6116087 10491906 16811817 17437363 9328886 2386205
38577 2386205 7504879 19819341 25336197 21920913 20183376 23826524 24224766 17197392
38569 17197392 10136114 7766392 5599627 3287242 8400956 18530612 16774779 -2109332
38561 -2109332 -17180910 -10031454 5554363 3672359 -13402303 -18953017 -2462565 17350569
38553 17350569 22145511 15147359 7706258 4100190 7021787 20473839 37551991 40685207
38545 40685207 25081435 8990495 9418729 19691664 23367871 18873700 15547770 14521383
38537A4521383m167392m397400K843049O077819j979728q902702k790120O481603
38529G686512L699879n775076n969679K074682L497376l494107n212646K218046
38521a275013N484559k496534r580718m167525O108159P188756M7868l546736
38513b237184n42210J456876l58140O15352P404959J2280164P767170k147815
38505B4239172q070387p962665o851276o137036j607164O472423R445080J979630
38497A1507777p776803p440647K773008J0849779J0090849N981072L835574o7652
38489B9752957q707329j4497562r050257K498734P591708M105382J279519L384273
38481A6357425L866340j778372p845465q163010n514657n122904n361847j830758
$$ plain form
38537 14521383 10353991 5956591 8799640 14877459 12897731 3995029 1204909 7686512
38529 7686512 11386391 5611315 -358364 1716318 5213694 1719587 -3493059 -1275013
38521 -1275013 4209546 1713012 -7867706 -12035231 -5927072 1261684 1309552 -2237184
38513 -2237184 -2779394 -1322518 -1680658 -1065306 6339653 18619817 26386987 24239172
38505 24239172 16168785 8206120 1354844 -4782192 -6389356 83067 9528147 11507777
38497 11507777 3730974 -3709673 -936665 9913114 20003963 25985035 29820609 29752957
38489 29752957 21045628 6548066 -2502191 -3457 7588251 11693633 12973152 16357425
38481 16357425 20223765 18445393 10599928 2436918 -3077739 -8200643 -13562490 -15393248
38473a5393248M117452P656298P761688O057707J841280m973339q817512m297453
38465f047127M018583N790204l76683m364502O15929P979815P626149M24391l904225
38456A1762534q97027L652037L198147j075503l988602m320691m760779n756276
38448b186160m208308Q50803N060898L875044j045626l720862j710575J026812
38440b057974J22359k945882l016029J303039N170537L505551k377797o174588
38432f470784m149467J067677M902546O405784P063712O122029J199173o443068
38424I697602j1329287j0005871m814627J08245L616953O448864Q182874P637523
38416I542276M365742j336835p146919p401716J412602J2394298J2881199J407349
$$ plain form
38473 -15393248 -11275796 -3619498 4142190 10199897 12041177 7067838 -1749674 -6047127
38465 -6047127 -2028544 3761660 3384977 -979525 -363596 7616219 15242368 15666759 11762534
38456 11762534 10865507 14517544 17715691 16640188 12651586 8330895 3570116 -2186160
38448 -2186160 -6394468 -5543665 -482767 3392277 2346651 -1374211 -3084786 -2057974
38440 -2057974 -1935615 -4881497 -7897526 -6594487 -1423950 2081601 -296196 -6470784
38432 -6470784 -10620251 -9552574 -4650028 1755756 8819468 14941497 16140670 9697602
38424 9697602 -1631685 -11637556 -16452183 -16343938 -12726985 -6278121 1904753 9542276
38416 9542276 13908018 12571183 5424264 -1977452 -564850 11829448 24710647 26117996
38408B6117996q111785n706417q8498l655763j0726606o055011Q626947J4537665
38400A4938528M358190o573804m327053L699322L403787l545778m963336J616694
38392H606550P097949N790923J087511k518994m218830m178494k747819j670149
38384G248647j386310M28804L405231K168302m690907q642529k137174Q855659
38376E249723J2252839O602542Q15519o60605j950648n238401o402516l256539
38368G411914J28457J23591j604853k053914q55425P23806Q37582k151560o133474
38359c573876n438668M21478L079882k149956o038459J239133J1950308J0651124
38351A0140966r35343o283612j166708J197010m275820n105872L824850P321285
$$ plain form
38408 26117996 18006211 12299794 12211296 8555533 -2171073 -8226084 400863 14938528
38400 14938528 19296718 12722914 8395861 12095183 15498970 11953192 6989856 8606550
38392 8606550 15704499 21495422 22582933 20063939 15845109 11666615 8918796 7248647
38384 7248647 5862337 6291141 9696372 11864674 7173767 -1468762 -3605936 5249723
38376 5249723 17502562 24105104 24920623 24260018 22309370 17070969 10668453 7411914
38368 7411914 7540371 7663962 6059109 4005195 3149770 3873576 4711158 2559598 -3573876
38359 -3573876 -9012544 -8591066 -5511184 -7661140 -13699599 -12460466 -510158 10140966
38351 10140966 9205623 2922011 1755303 2952313 -1323507 -6429379 -2604529 4716756
38343D716756l559727j1448237N61484J7477638J2832048q686826j6801166j954020
38335f862050J1857012O046540o384077n945227K833431L367225m262620n765301
38327e115067K573770R147859O194700l61358k354074k21070R95752o38470l552370
38318F669672n468440m521426q49277K189453J528432r79676r78140J828651L772049
38309C191298L618374L841307M883061L615283m86847k809454m63173K671401
38301A8061250J809999j285128j495446J275379K116479j144450m923895n202944
38293I211244k319827M51607O34164j631577l593931j975725K997244O569235
38285A0342434M830289k55990m051441n328385n087126k010981M529109Q764112
$$ plain form
38343 4716756 1157029 -10291208 -9729724 7747914 20579962 11893136 -4908030 -6862050
38335 -6862050 4994962 11041502 4657425 -1287802 1545629 4912854 650234 -5115067
38327 -5115067 -2541297 6606562 12801262 12439904 10085830 9864760 10860512 10222042 6669672
38318 6669672 1201232 -3320194 -4169471 -1980018 -451586 -1431262 -2409402 -580751 3191298
38309 3191298 6809672 10650979 15534040 19149323 18662476 15853022 15389849 18061250
38301 18061250 19871249 18586121 17090675 18366054 20482533 19338083 14414188 9211244
38293 9211244 6891417 7343024 7977188 6345611 2751680 775955 3773199 10342434
38285 10342434 15172723 14916733 10865292 5536907 449781 -1561200 2967909 11732021
38277A1732021M196975m918273p102615n11702L943345J97963l410551Q59345
38269D986508O563308M723000l96171L8094K612979j300481p042383k704980Q152523
38260A5632397Q679391m012496j2423251n755690M015861K889536l826620l791263
38252A407865J069311N02216m892744n173411K596657J1653237J5640391J1589348
38244C4392870j706385j7613090k0596207m482734J3904333J4420742K129428
38237B0448957j479198P128513R361094k670154j1767321m031177P642528L742690
38229B8375932j1452423j6817077m746897J1063672J5551997P412293m841909
38222B4545588j1954500r263583o11904L740407r78058o706014l475851N744260
$$ plain form
38277 11732021 15928996 11010723 3908108 3396406 7339751 7537714 4127163 4986508
38269 4986508 11549816 16272816 15876645 15914739 18527718 17227237 10184854 7479874 15632397
38260 15632397 24311788 20299292 7876041 2120351 6136212 9025748 5199128 1407865
38252 1407865 2477176 2979392 -1913352 -7086763 -4490106 7163131 22803522 34392870
38244 34392870 32686485 15073395 -5522812 -10005546 3898787 18319529 20448957
38237 20448957 18969759 26098272 35459366 32789212 21021891 16990714 24633242 28375932
38229 28375932 16923509 106432 -4640465 6423207 21975204 29387497 24545588
38222 24545588 12591088 3327505 2715601 6456008 5477950 -1228064 -4703915 1040345
38214A040345R193360L030053m645441n787534p42915N336462P780455M344165
38206A9548950k271178m877062m39066M082399J167559n317041o317233k571335
38198C005993k279042n432124l488790M365209Q324327M747519K129128M718533
38190A6090753M061715m578277j0494522l934032O659823P511033J081018m58679
38182A5938832K845920K74699q608933j1747531m684060K699210L049886J061015
38174H29038J285541o3042m245072l349641O214825J3674012Q047137m919425
38166A7473373j0766853o031790O42060L243522L323701K052955j848153n683183
38158B405632l675037L645282Q406381O006805N33623k393770k332145j452163
$$ plain form
38214 1040345 10233705 13263758 8618317 2830783 2087868 7424330 15204785 19548950
38206 19548950 17277772 12400710 11961644 16044043 17211602 11894561 5577328 3005993
38198 3005993 726951 -4705173 -8193963 -3828754 4495573 9243092 11372220 16090753
38190 16090753 20152468 15574191 5079669 1145637 7805460 15316493 16397511 15938832
38182 15938832 18784752 19059451 10450518 -1297013 -5981073 -3281863 -231977 829038
38174 829038 2114579 2051537 -2193535 -5543176 671649 14345661 22392798 17473373
38166 17473373 6706520 674730 1316790 4560312 7884013 9936968 8088815 2405632
38158 2405632 -1269405 2375877 10782258 16789063 17322686 14928916 12596771 11144608
38150A1144608p92962j386594l934786n178974k92946Q212207J0268879J676286
38142A9715718p999671p564564J13808K846803k541184o188230r51527O820444
38134D251597P185498P27708l942452k944689m7127J532384K604171K772791n72328
38125A1567553n159065l046896P468486J5078753Q726239n704539j1697223m758303
38117A2475005K007471j540026p158252j831227J0856291J5018382N756402m265862
38109C1318184l742101K696332M300202j60780m399142o065388p047568n991882
38101A0907857l65694N348082L578946l558352n570624J2981L330697j026217
38093A2657676m271308J314676Q021838N543155m72698K053016R201406O233320
$$ plain form
38150 11144608 10351646 8965052 5030266 -148708 -441654 7770553 18039432 19715718
38142 19715718 11716047 4151483 4265291 7112094 4570910 -1617320 -2568847 4251597
38134 4251597 11437095 12164803 8222351 5277662 5230535 6762919 9367090 12139881 11567553
38125 11567553 6408488 3361592 10830078 25908831 34635070 28930531 17233308 12475005
38117 12475005 14482476 12942450 5784198 3952971 14809262 29827644 35584046 31318184
38109 31318184 27576083 30272415 34572617 34411837 30012695 23947307 16899739 10907857
38101 10907857 10542163 15890245 19469191 15910839 10340215 10353196 13683893 12657676
38093 12657676 8386368 9701044 17722882 23266037 22793339 24846355 34047761 40281081
38085D0281081o229751j0764548j241174O914466J943519o977506q272770o407856
38077I245461p820875m720340Q886931J8602729Q862860q836557j0682767K297962
38069A5835404P013558l665808j1901631o678330J184681K732978N118157J1764333
38061B1403342J1180642p74405q069194m7201Q517139J183231j2195614j1684872
38053I513068J071415Q839683P277933N838067O305483J611636o972031j0763235
38045B2722019r985907j1458075j2141337l386970R505820J1221063J186754m284386
38037C378981K213547R175868P047594K259069L088433N738931K900109m593647
38029C1208885j1568857j5001349j2219572k112438Q416398R473779K704960k47177
$$ plain form
38085 40281081 34051330 23286782 22045608 28960074 30903593 23926087 15653317 9245461
38077 9245461 1424586 -3295754 5591177 24193906 33056766 24220209 13537442 15835404
38069 15835404 22848962 19183154 7281523 603193 1787874 4520852 9639009 21403342
38061 21403342 32583984 31809579 23740385 23693184 32210323 33393554 21197940 9513068
38053 9513068 10584483 19424166 26702099 32540166 38845649 40457285 33485254 22722019
38045 22722019 12736112 1278037 -10863300 -14250270 -4744450 6476613 7663367 3378981
38037 3378981 5592528 14768396 21815990 24075059 27163492 32902423 35802532 31208885
38029 31208885 19640028 4638679 -7580893 -9693331 -1276933 8196846 10901806 10654629
38021A0654629L640965M731559r35004l901162J513675O476424K962000k916116
38013B2226970k969041r65515l635909p487769o002912j668013L32231K735009
38005B565051R087644J3119650P556957j916845l968254J021076L020333q99758
37997B9585854l859480k176657J82332O97133J828929L723317J957591m465004
37989B7474015r224823o280881K053508P074357K777319p137411j1542954l696264
37981A496866R271052J3445628N519004l644079n132136l146320m694741o672252
37973F443022j987274P215125J2096514R794624M995537R68344k984915o212834
37965C0328143n976751k144775K199291M283018K742895k183887o452183m218418
$$ plain form
38021 10654629 14295594 19027153 18092149 14190987 15704662 22181086 25143086 22226970
38013 22226970 19257929 18292414 14656505 7168736 1165824 -502189 -169958 2565051
38005 2565051 11652695 24772345 32329302 30412457 26444203 27465279 30485612 29585854
37997 29585854 25726374 23549717 23732049 24429182 26258111 29981428 31939019 27474015
37989 27474015 18249192 11968311 14021819 21096176 23873495 16736084 5193130 1496866
37981 1496866 10767918 24213546 29732550 26088471 20956335 17810015 13115274 6443022
37973 6443022 4455748 11670873 23767387 33562011 38557548 39525892 36540977 30328143
37965 30328143 24351392 22206617 24405908 28688926 31431821 29247934 22795751 18577333
37957A8577333M082647J0092417P913446J117856m260726o984563o462703j71
37949B4075536R215513J0706382K079196l637656K991295J0954580N048737r114289
37941E2319294j3437978n548852P5014k491797l372482K833645P702982N188886
37933D3268712J506289K256193L145184M21903j385201J004998L154947K199803
37925E5572828K000443L153565o98934r675434j2451830k835831R044945J1284346
37917E5394098O029536J436643j941851n931345n788096R88054N465694K89284
37909E5942017n948395j860827O590925N901242r46696K36937Q295190O937329
37901G5147722o690864j5070126p952535L061236O467632Q154530J4370030J5337071
$$ plain form
37957 18577333 22659980 32752397 40665843 41783699 37522973 30538410 24075707 24075536
37949 24075536 33291049 43997431 46076627 42438971 45430266 56384846 61433583 52319294
37941 52319294 38881316 33332464 33407478 30915681 27543199 30376844 38079826 43268712
37933 43268712 44775001 47031194 50176378 50598281 49213080 50218078 53373025 55572828
37925 55572828 57573271 60726836 60027902 50352468 37900638 35064807 44109752 55394098
37917 55394098 61423634 62860277 60918426 54987081 49198985 50187039 55652733 55942017
37909 55942017 49993622 48132795 54723720 60624962 59678266 59915203 68210393 75147722
37901 75147722 68456858 53386732 45434197 48495433 54963065 63117595 77487625 92824696
37893I2824696K701671j0842078q689619L102036O494353J064796J067909P266886
37885I4990650N406392o491017j2571686n898559P42358j507796l423991K492779
37877G3739130P177445L017758o83776M570309R070384K276240o730020n103219
37869H7334251M83779k561589p782696k227613O162473J140811r011326k261942
37861G1276148J6117121J7265362k703913j2941084K355699J8165517J0477677
37854A20012527o366932p527185K355636M005486j207030N06879N854066J729850
37846A19363297p310344n778885M848735R845230P406295O876585O114470l585192
37838A37780191j3471359n892182J3004759J7159502J189920j0385862k439551
$$ plain form
37893 92824696 95526367 84684289 75994670 79096706 85591059 86655855 87723764 94990650
37885 94990650 100397042 93906025 81334339 75435780 76178138 74670342 71246351 73739130
37877 73739130 80916575 83934333 83250557 87820866 96891250 99167490 92437470 87334251
37869 87334251 87818030 85256441 77473745 75246132 81408605 82549416 73538090 71276148
37861 71276148 87393269 104658631 101954718 89013634 91369333 109534850 120012527
37854 120012527 113645595 106118410 108474046 112479532 111272502 111779381 117633447 119363297
37846 119363297 112052953 106274068 111122803 120968033 128374328 135250913 141365383 137780191
37838 137780191 124308832 118416650 131421409 148580911 149770831 139384969 136945418
37831A36945418Q575443M322618o643211o560049K567950O035434J375353p46413
37823A45872543M904946J1579498J0514963N50827r818478q435411O285932J7880400
37815A79335220R545243j0672772j7226528k328248J3300987J1466841M75836
37808A83896579k813589J372305K717964Q49632K136864M894488L066417r63073
37800A95157587m18243L884607O925257R029925J0931159O526393o221069j3973110
37792B11842506l458649J5832093K1118317P468711o805309p168798O31314N061474
37784B44521659M873898L517859k20164o643906r000388k832718M201237J633016
37776B40050493p757105j0694287j987078Q281679Q778993J267911m169741l794406
$$ plain form
37831 136945418 145520861 149843479 143200268 136640219 139208169 145243603 146618956 145872543
37823 145872543 150777489 162356987 172871950 173422777 163604299 155168888 161454820 179335220
37815 179335220 188880463 178207691 160981163 158652915 171953902 183420743 183896579
37808 183896579 181082990 182455295 185173259 186022891 188159755 193054243 196120660 195157587
37800 195157587 194739344 198623951 205549208 214579133 225510292 232036685 225815616 211842506
37792 211842506 208383857 224215950 245334267 252802978 245997669 238828871 239460185 244521659
37784 244521659 249395557 252913416 252693252 246049346 237048958 234216240 238417477 240050493
37776 240050493 232293388 221599101 219612023 227893702 236672695 237940606 233770865 229976459
37768B29976459k811918m214408l387039K374187N938383m28761j1487161j3906757
37760B02052985m611464M900452N052396L66399R8709L874504M024296j817421
37752B13940856q045680r826657q318457o731812n683947l874960j013399J232930
37744A71678874Q34387k130509n131483o234976o253167n947253l347659K142318
37736A45610532N132782Q8547q676208j0362709k750907L566843l90555r887017
37728A22331308j3695958q394902j54637M160781K674567k306581o528655o737752
37720I1348171m159891l211750n004442n155383l76307N794664O729285M22792
37712H6387139q245087j1576957n474542N664385J1357237O159514k828884m555527
$$ plain form
37768 229976459 227164541 222950133 219563094 221937281 227875664 227446903 215959742 202052985
37760 202052985 197441521 202341973 207394369 207760768 207859477 211733981 215758277 213940856
37752 213940856 205895176 196068519 187750062 181018250 175334303 171459343 170445944 171678874
37744 171678874 172513261 170382752 165251269 159016293 152763126 146815873 143468214 145610532
37736 145610532 150743314 150831861 142155653 131792944 129042037 132608880 132218325 122331308
37728 122331308 108635350 100240448 100085811 104246592 106921159 104614578 98085923 91348171
37720 91348171 87188280 83976530 78972088 73816705 73440398 79235062 85964347 86387139
37712 86387139 78142052 66565095 61090553 66754938 78112175 84271689 81442805 76887278
37704G6887278J439141N806217L621302p27461l300199n712860q182988o917338
37696F2913092k122991K44180j133063J59520O030068P988138K45964r828872
37688F4496036j2328674q668744o375466o128274l133359K691530O459827N937006
37680D2949882K980458k84315j937760l29251K292500R03439l704126l862414
37672C9008413K571124O375941M40830q321733r172692l340442Q0568r41422r03846
37663B5796741J877621L429301K245090Q38546J65624o11263m82825J048999O09982
37654C4917816l737579p217947n231060j628014k271476m292233j073052M974157
37646A4440612M988810j911302o879082m782051l09552J242771J312839L193642
$$ plain form
37704 76887278 78326419 84132636 87753938 87026477 83726278 78013418 69830430 62913092
37696 62913092 60790101 61034281 59901218 60060738 66090806 74078944 74324908 64496036
37688 64496036 52167362 43498618 37123152 30994878 27861519 30553049 37012876 42949882
37680 42949882 45930340 45646025 43708265 43379014 45671514 46574953 42870827 39008413
37672 39008413 41579537 47955478 48396308 40074575 30901883 27561441 27642009 26700587 25796741
37663 25796741 27674362 31103663 33348753 34187299 34352923 33741660 33258835 34307834 34917816
37654 34917816 31180237 23962290 18731230 17103216 14831740 10539507 9466455 14440612
37646 14440612 19429422 17518120 10639038 5856987 5547435 6790206 8103045 11296687
37638A1296687N935278O514203M238909M98370l377496o368702p239098m678228
37630F819923J545913Q376326R816164L433997m266989m723259O14508K475703
37622B4092286j515415l906656j400497n70837m873834p507949m144199j414159
37614a241260m119041n224325R67239O397801K234021n254737n034117Q97648
37606a0376771L752566M016780O761931Q464457M059257J49603M572145R400862
37598C0800830K589384r234397r826146r53591J177286m785276l731923O402826
37590A2438993Q548149l383959j1903667m434674O224627L919513n181333m781289
37582A446360N688150J2915528R769263O06703p841681j0523596m200868P475700
$$ plain form
37638 11296687 17231965 23746168 27985077 28483447 25105951 18737249 11498151 6819923
37630 6819923 8365836 16742162 26558326 29992323 25725334 21002075 21616583 24092286
37622 24092286 22576871 18670215 17269718 16698881 11825047 4317098 172899 -1241260
37614 -1241260 -5360301 -10584626 -9617387 -3219586 -985565 -6240302 -11274419 -10376771
37606 -10376771 -6624205 -2607425 4154506 12618963 16678220 16827823 21399968 30800830
37598 30800830 33390214 24155817 14329671 13376080 14553366 9768090 6036167 12438993
37590 12438993 20987142 17603183 5699516 1264842 7489469 11408982 6227649 1446360
37582 1446360 7134510 20050038 29819301 30426004 22584323 12060727 7859859 15335559
37574A5335559J3609058Q142777k264679q109020q689724p911716n328777Q86565
37566E670043P061888P691535L059189k066734m284182k505611K602126O606358
37558B3834612L622398n513177j1899960q951760o7932O596448O702379J391808
37550A5714816m630091n393589O14149O496036M706714j818223m005348j018941
37542A0665523K582j547860J710741R558944J0825237J228499q232270q118247
37534A6093149l785609k964662j777111N364816J1574630O949804l776711o986220
37526B0692086j011043J857470n194536j3396747j1518091j282841N857776L943289
37518e2637r02568N6529N865797P780555L005221q27927J200096K065024m537859
$$ plain form
37574 15335559 28944617 37087394 34822715 26713695 18023971 10112255 4783478 5670043
37566 5670043 12731931 20423466 23482655 21415921 17131739 14626128 17228254 23834612
37558 23834612 27457010 21943833 10043873 1092113 1024181 7620629 14323008 15714816
37550 15714816 11084725 5691136 6305285 12801321 17508035 15689812 11684464 10665523
37542 10665523 10668105 9120245 10830986 20389930 31215167 32443666 24211396 16093149
37534 16093149 12307540 9342878 7565767 12930583 24505213 31455017 27678306 20692086
37526 20692086 19681043 21538513 16343977 2947230 -8570861 -9853702 -3995926 -52637
37518 -52637 -955205 -898676 4967121 12747676 15752897 14924970 16125066 18190090 13652231
37509A3652231r868856k075954J1922261J3216287m39664j0327361m978122M505995
37501A5606817M462173k011816n504170n885600n986207k010631P007688J0637040
37493A6315294J596684r459961p678332L820544R355383L762264l494577m764703
37485I452596k168196K29862J510659R24989j758924l163853m30335K996329K193284
37476I786411j050726j755560n91428j479949k911259l97967L499654P82866q860666
37467b978624j4347546o579135Q803475J6489613Q862230m649402q115969J485958
37459a029400J0257042N749019o467084j1517657n514227K692820O395546N797065
37451F363124M97590q746594j2040366m82082J5093945J3957891k984781j2032803
$$ plain form
37509 13652231 3783375 1707421 13629682 26845969 26406305 16078944 11100822 15606817
37501 15606817 20068990 18057174 12553004 6667404 681197 -1329434 5678254 16315294
37493 16315294 17911978 8452017 773685 4594229 13949612 17711876 14217299 9452596
37485 9452596 7284400 7514262 9024921 9949910 8190986 5027133 4596798 7593127 9786411
37476 9786411 8735685 6980125 6388697 4908748 1997489 1599522 5099176 5882042 -2978624
37467 -2978624 -17326170 -23905305 -15101830 1387783 10250013 5600611 -2515358 -1029400
37459 -1029400 9227642 14976661 8509577 -3008080 -8522307 -5829487 566059 6363124
37451 6363124 6860714 -1885880 -13926246 -14408328 685617 14643508 11658727 -374076
37443c74076l035059N752377j04686p335873j6331J1958743J0348487j443013
37435A5750569p746420p120459p512925o225613K558170R797848M505175l455860
37427E50485K446916J5227205J3806449j982276j2005992r102772n231493m858709
37419a150187L83161Q209416M651680q064072r728674L735368J0858222N0794
37411H945708j1300764p123345K125392J707494j655739L463300Q849029J560125
37403F571200j0233225r221871K256859P228107K044161j343857J880694L731669
37395B913737N01036j389552J315548L386055J654603m39734j006344k446854
37387D488495m122549j427057N362797Q897259L993247o219255j4270977j4149723
$$ plain form
37443 -374076 -3409135 2343242 2238556 -5097317 -5113648 6845095 17193582 15750569
37435 15750569 8004149 883690 -6629235 -12854848 -10296678 -498830 4006345 550485
37427 550485 2997401 18224606 32031055 30048779 18042787 8940015 3708522 -1150187
37419 -1150187 -767026 7442390 12094070 4029998 -5698676 -1963308 8894914 8945708
37411 8945708 -2355056 -9478401 -7353009 -5645515 -7301254 -3837954 5011075 6571200
37403 6571200 -3662025 -12883896 -10627037 -3398930 -1354769 -2698626 -817932 2913737
37395 2913737 3414773 2025221 3340769 6726824 8381427 7941693 6935349 4488495
37387 4488495 365946 -1061111 4301686 13198945 17192192 10972937 -3298040 -17447763
37379a7447763m568825Q192517J3136140O745341o87410J153179O397586J965436
37371A4886201r599629j1422350R98161J0424797L508952q301898o545088N858320
37363a92534J0456793K267025n111499l423058p45358l322984l152558N985304
37355B761131J3628443P673559n024069q528577k381538J43440m533549o057267
37347b318427j92858M069976J727898J23620L505791M087166k718373p583133
37339G01660k378779N539885N563476K87533j927217j500043k509950j934544
37331A842021K904353M587369k556397q875437l326962O279142M548013n612015
37323b09913p660994J118398O876845L404137p74002q64977j665784k180579N282475
$$ plain form
37379 -17447763 -22016588 -13824071 -687931 6057410 5370000 6523179 12920765 14886201
37371 14886201 5286572 -6135778 -5137617 5287180 8796132 494234 -6050854 -192534
37363 -192534 10264259 12531284 7419785 3996727 3251369 -71615 -3224173 2761131
37355 2761131 16389574 24063133 19039064 10510487 8128949 8272389 3738840 -2318427
37347 -2318427 -2511285 1558691 3286589 3410209 6916000 11003166 8284793 701660
37339 701660 -1677119 3862766 9426242 9713775 7786558 6286515 3776565 1842021
37331 1842021 4746374 9333743 6777346 -2098091 -5425053 854089 5402102 -209913
37323 -209913 -7870907 -6752509 124336 3528473 2754471 1889494 223710 -1956869 3325606
37314C325606J5672710J1859291o851070j7227684n276043J1441940R984207m791265
37306A8137692j1246549m075826L068983K122657j024838j535047k663062n449994
37298b665984m242888L084406R383354P387780r91214q107730r292405n069850
37290a0514531K194269R890401J3983185J0202048p17261j0641786j1276902m187201
37282a067778J266895J022773O02233L684253N278798K050949k05697J952858
37274A4585284R19580p328315j0624992R44820J3499276P292157j0277956j4229891
37266e220037j828182M899006j575779k881299Q837323J3854263O4110j2745561
37258C403844n377598P816635M033940r140806q700606L720839P063311j786671
$$ plain form
37314 3325606 18998316 30857607 24006537 6778853 1502810 12944750 22928957 18137692
37306 18137692 6891143 2815317 5884300 8006957 6982119 5447072 2784010 -2665984
37298 -2665984 -6908872 -3824466 5558888 12946668 11955454 3847724 -5444681 -10514531
37290 -10514531 -8320262 1570139 15553324 25755372 25038111 14396325 3119423 -1067778
37282 -1067778 199117 1221890 1824123 5508376 10787174 12838123 12632426 14585284
37274 14585284 15504864 8176549 -2448443 -1503623 11995653 19287810 9009854 -5220037
37266 -5220037 -7048219 -2149213 -3724992 -6606291 2231032 16085295 16149405 3403844
37258 3403844 -1973754 5842881 9876821 736015 -7964591 -4243752 2819559 1032888
37250A032888n854500m76692R25983m919042m062755P590932J3984478N098124
37242A3319416o109802m212452O219108J0177977L554114n485951r348167p089819
37234A024424k108774J279677J999735L660459P554839P026278k964596j3713154
37226C758888j1911019J70139O951933K974000l50561M938042J0764393P756039
37218B5051854J49404k934571j600703j585791l769541n378250n958331n588592
37210a614521k707513R07219m24001o379913p673519L97871R079167Q788094L348733
37201C721617K161917M586138L428647l27205J134761P461056Q409628j013234
37193B9563325j3236682j8532045j4987116o004577M302326J0292197P048423
$$ plain form
37250 1032888 -4821612 -5298304 -4372321 -9291363 -13354118 -5763186 8221292 13319416
37242 13319416 7209614 2997162 9216270 19394247 22948361 17462410 8114243 1024424
37234 1024424 -1084350 195327 2195062 5855521 13410360 20436638 17472042 3758888
37226 3758888 -8152131 -7981992 -1030059 1943941 1593380 6531422 17295815 25051854
37218 25051854 25201258 22266687 20665984 19080193 15310652 9932402 3974071 -1614521
37210 -1614521 -4322034 -3414815 -3838816 -10218729 -17892248 -17494377 -8415210 372884 3721617
37201 3721617 5883534 10469672 13898319 13571114 14705875 22166931 30576559 29563325
37193 29563325 16326643 -2205402 -17192518 -23197095 -18894769 -8602572 -1554149
37186a554149k096066o504646j506860M707582K746474m412394o195294M47938
37178a4367415Q012095R550695O182265K910744K375821M031816N424681L434608
37170B7555310k124293o296638m947419k329699n894790j2747600j0316317M849162
37162a2252284J7778558J3229508k918688j1203970m599532M855222N844376J908842
37154A2642032J060651J822127j685229p074815o259751J001573N223033P55535
37146G485156n553965l558837O054490J2134152P094637m205769j1419641j0457276
37138b427053m622503K337048P969808P879399n17920j0033283r240041M31370
37130h223175L744610n500262j2067214j293433J6129226J7572330J607742j0368683
$$ plain form
37186 -1554149 -3650215 -10154861 -11661721 -6954139 -4207665 -8620059 -14815353 -14367415
37178 -14367415 -6355320 3195375 9377640 12288384 14664205 18696021 24120702 27555310
37170 27555310 25431017 19134379 14186960 11857261 5962471 -6785129 -17101446 -12252284
37162 -12252284 5526274 18755782 15837094 4633124 33592 4888814 10733190 12642032
37154 12642032 13702683 15524810 13839581 6764766 505015 1506588 6729621 7485156
37146 7485156 1931191 -1627646 4426844 16560996 23655633 19449864 8030223 -2427053
37138 -2427053 -7049556 -4712508 3257300 11136699 10618779 585496 -8654545 -8223175
37130 -8223175 -4478565 -9978827 -22046041 -23339474 -7210248 10362082 11969824 1601141
37122A601141n513236N119902O478756r89219q173442j0419605o602124L392373
37114a5105454J2790452J0149366m529199j5372053j0446602K663208R115268
37107a0735014O101515J108226j386953j965662q25919J211270J040469r69170
37099f421238L81157N015813M355147m619628j1121843n650376M971604Q072210
37091e017154L328376m88306m60990J27879Q13743K206543N68006n019732o035545
37082i977180L256513J3248230J1705883K924898n62023L10769m703276j2698949
37074C504865r421606M995619J1744108Q86580j3457775j4065776l390957M430918
37066a4774024M198827J766525J820435L116398L447119K865512K581817L392596
$$ plain form
37122 1601141 -3912095 1207807 7686563 6697344 -1476098 -11895703 -18497827 -15105454
37114 -15105454 -2315002 7834364 3305165 -12066888 -22513490 -19850282 -10735014
37107 -10735014 -4633499 -3525273 -4912226 -6877888 -7703807 -6492537 -5452068 -6421238
37099 -6421238 -6040081 -1024268 3330879 -1288749 -12410592 -18060968 -13089364 -5017154
37091 -5017154 -1688778 -2177084 -2638074 -2510195 -1696452 510091 1078097 -3941635 -9977180
37082 -9977180 -6720667 6527563 18233446 21158344 20596321 20907090 16203814 3504865
37074 3504865 -5916741 -921122 10822986 11709566 -1748209 -15813985 -19204942 -14774024
37066 -14774024 -10575197 -8808672 -6988237 -3871839 -424720 2440792 5022609 8415205
37058H415205M114128J618919m622657r103917o162154J314080M586679P09957
37050H70240l750351j506929O826906J3405911J0388445j900706j2744526j1342824
37042B46166j065747L829594j336889n169631l26392L294924k878932p903025
37034a1309932Q44854J2478779P231989j0066326j5399888k839051Q495982P349928
37026c213665N164303J0571049J2658543K148075r999867r944950k591274j416936
37018C375278p294897j0404411n584966M139496J2455769J1637776j437809j5609511
37010h723275j3361755M788305J6722350Q182550p426231r622712J073226Q713832
37002C46290N832691j665618o607283n848972P74648P492134N153391n405770
$$ plain form
37058 8415205 12529333 14148252 9525595 421678 -5740476 -4426396 160283 870240
37050 870240 -2880111 -4387040 2439866 15845777 26234222 24333516 11588990 246166
37042 246166 -819581 3010013 1673124 -3496507 -3822899 -527975 -3406907 -11309932
37034 -11309932 -10465078 2013701 9245690 -820636 -16220524 -19059575 -10563593 -3213665
37026 -3213665 1950638 12521687 25180230 27328305 17328438 7383488 4792214 3375278
37018 3375278 -3919619 -14324030 -19908996 -15769500 -3313731 8324045 6886236 -8723275
37010 -8723275 -22085030 -17296725 -574375 7608175 181944 -9440768 -8367542 346290
37002 346290 6178981 4513363 -2093920 -7942892 -7168244 323890 5477281 71511
36994G1511j0975357m654396L560900L714430J168301L617192N541310Q694n279362
36985c226777p3006R366822R922405K646351k333418m546994r584419j3388234
36977a1217270q171591J239029M607875M385641Q455322J1107517K167241r956501
36969B617263p744493N397329R156773J40855m263862J526913K146737q389235
36961E88280j4084474n705493K900510J032825J57976R957813J7055699P881616
36953A9784752n370940l941186O536239P230298k347331o911297k237069K325006
36945A5068472L107513L650327J388735p255151j2526342k949736J1573107J0526075
36937B2583000m065020q929599L210521J2094045L291136r713569r195209m7662
$$ plain form
36994 71511 -10903846 -15558242 -11997342 -8282912 -7114611 -3497419 2043891 2052585 -3226777
36985 -3226777 -3299783 6067039 15989444 18635795 16302377 11755383 2170964 -11217270
36977 -11217270 -19388861 -18149832 -13541957 -9156316 -700994 10406523 12573764 2617263
36969 2617263 -5127230 270099 9426872 9567727 5303865 6830778 8977515 588280
36961 588280 -13496194 -19201687 -16301177 -15268352 -15110376 -5152563 11903136 19784752
36953 19784752 14413812 10472626 17008865 24239163 21891832 14980535 12743466 15068472
36945 15068472 18175985 21826312 23215047 15959896 3433554 483818 12056925 22583000
36937 22583000 18517980 9588381 12798902 24892947 28184083 18470514 9275305 9227643
36929I227643K134865m184886q961451p922219l720057K750483J0283799J2957970
36921A2566147P927688J520645o81995k170215n977974o668563j548672Q21539
36913E788600m828802q407813j146142O665740K147828n900792n69222J2348009
36905F097406J1687833l380924j0983059k194107O804713M680530J654831N572421
36897A9939644N490770n614281j3206125m912663O073699K161284q833159p808946
36889f709777K937274N553665j756285l814210L104991N645602j914892q317194
36881e270826n185738J412018M297687M684392L541915k147112r297410q207842
36873a6172916K159600J0100270P589879P0537m452605n258658l837051K7092
$$ plain form
36929 9227643 11362508 7177622 -1783829 -9706048 -13426105 -10675622 -391823 12566147
36921 12566147 20493835 22014480 21332485 19162270 13184296 6515733 4967061 5788600
36913 5788600 959798 -7448015 -8594157 -1928417 219411 -5681381 -6250603 6097406
36905 6097406 17785239 14404315 3421256 1227149 8031862 12712392 14367223 19939644
36897 19939644 25430414 19816133 6610008 1697345 7771044 9932328 1099169 -6709777
36889 -6709777 -3772503 1781162 24877 -3789333 -684342 4961260 3046368 -5270826
36881 -5270826 -10456564 -9044546 -4746859 -62467 3479448 1332336 -7965074 -16172916
36873 -16172916 -14013316 -3913046 3676833 3747370 -705235 -5963893 -9800944 -9773852
36865i773852L051005K98359m210587n86699R508466J1782798Q99394j0471751
36857D97133j0907325m990034r21327K713696P739714P307488j469396p132691
36849g162742P0679J0946189J0415556L51818n389468l152503j445946l744810
36841H88773m247146q84155L50879l643793p574872o005338l76122M260349N103119
36832a2128306L334716K291534K959085J190842n999860j1716312n808738P722976
36824a8154063J1987445J620174p189313p38851J0887538J0044974j560828q239121
36816a342045n053127l54801J495996L280390L799960l83261m082615J12074O295601
36807C768172K200283r142594j1609134r76965Q910974P742195P30141m601199
$$ plain form
36865 -9773852 -6722847 -6424488 -10635075 -11221774 -1713308 10069490 10968884 497133
36857 497133 -10410192 -15400226 -16321553 -13607857 -5868143 1439345 -30051 -7162742
36849 -7162742 -7092063 3854126 14269682 14621500 9232032 6079529 4633583 888773
36841 888773 -3358373 -4242528 -3891649 -7535442 -15110314 -21115652 -21491774 -17231425 -12128306
36832 -12128306 -8793590 -6502056 -3542971 -2352129 -8351989 -20068301 -25877039 -18154063
36824 -18154063 -6166618 -4546444 -11735757 -12474608 -1587070 8457904 6897076 -1342045
36816 -1342045 -6395172 -6749973 -5253977 -1973587 1826373 1443112 -2639503 -2527429 3768172
36807 3768172 5968455 -3174139 -14783273 -15760238 -6849264 892931 1623072 -2978127
36799b978127q210931r300736l070988P988719J2520452O283306j804421m493479
36791c066205m754874m685838L85551R902850J3427734O137356k899789n717346
36783H729439o444772r042187p419537J434707P115308J552460n783092k576822
36775a2434496N797105N890177j117516l057891J484971K205776l425870n886565
36767a0544309n86534M745269L194180j988236n029395n521458m910599k551782
36759b3192864J255602L940916M593064M586931L908231J917349R82677L235899
36751A227805M971351J646199k861800j096107M344768L030656n596404q868748
36743c202280n37434P807380L818174o417223p840153Q41705O972090M549792
$$ plain form
36799 -2978127 -11189058 -20489794 -23560782 -15572063 -3051611 3231695 1427274 -3066205
36791 -3066205 -7821079 -12506917 -12121366 -2218516 11209218 17346574 14446785 8729439
36783 8729439 2284667 -6757520 -14177057 -12742350 -5627042 -4074582 -9857674 -12434496
36775 -12434496 -6637391 -747214 -1864730 -4922621 -3437650 -1231874 -4657744 -10544309
36767 -10544309 -11130843 -6385574 -3191394 -5179630 -10209025 -15730483 -20641082 -23192864
36759 -23192864 -21937262 -17996346 -13403282 -8816351 -4908120 -2990771 -2008094 1227805
36751 1227805 6199156 7845355 4983555 3887448 8232216 11262872 5666468 -3202280
36743 -3202280 -3739714 4067666 7885840 1468617 -6371536 -5529831 1442259 5992051
36735E992051J638736M698259P317862J061058j0573700j6983778j4558315q246851
36727b9654678j921973M720216J0300389J0872433O767382L736285M439451M514872
36719A3774377N27220l764227l727716j451826j248057j824475J19556J781014
36711D185866k024558q543222r246988k761118K710272J592367k270088l616539
36703a9974008k993512k325286k52603L484878M964398K300698j49038J441975
36695a3502498M203076L883021J528290n1051j592395l817162l478718J028393
36687a1799044M735564L182450o3314K37198J877461K86276j949920J36702L573530
36678B16903K200430j554506j099325R38996k739247p687590k138728J0364951
$$ plain form
36735 5992051 7630787 12329046 19646908 20707966 10134266 -6849512 -21407827 -29654678
36727 -29654678 -31576651 -26856435 -16556046 -5683613 1083769 4820054 9259505 13774377
36719 13774377 14301597 10537370 6809654 5357828 4109771 2285296 2404852 4185866
36711 4185866 2161308 -6381914 -15628902 -18390020 -15679748 -14087381 -16357469 -19974008
36703 -19974008 -22967520 -25292806 -25545409 -22060531 -17096133 -14795435 -14944473 -13502498
36695 -13502498 -9299422 -5416401 -3888111 -3939162 -5531557 -9348719 -12827437 -11799044
36687 -11799044 -7063480 -3881030 -3944344 -3707146 -1829685 -1543409 -3493329 -3356627 216903
36678 216903 2417333 862827 -236498 702498 -2036749 -9724339 -11863067 -1498116
36670a498116J1090679m299565j4604118l973809J2101439R409081p805047j3717417
36662a3296873j85721J2999088R063477m120707r955176n124088K863504Q158258
36654D01762P852474N05399q317142p897283K199928P961856J490739m567271
36646c69538L835580J7399247J5092838l580753j6702811j1433257N75443M449306
36638I266055K113301J685966Q80804n752023j2134347p864986L720459Q070354
36630a4417J129r200215p632171K517084R860385Q091028J255187l054965k509907
36621f86862j182245k478583l488226K69424O039447O077089l37614m484334j110723
36612a382627L698807K779945j237652k406646k233630n038126p648946l888456
$$ plain form
36670 -1498116 9592563 5292998 -9311120 -13284929 -1183490 8225591 420544 -13296873
36662 -13296873 -13482594 -483506 8579971 4459264 -5495912 -10620000 -7756496 401762
36654 401762 8254236 8759635 442493 -7454790 -5254862 2706994 4197733 -369538
36646 -369538 3466042 20865289 35958127 32377374 15674563 4241306 4816749 9266055
36638 9266055 11379356 13065322 13946126 8194103 -3940244 -11805230 -8084771 -14417
36630 -14417 -13288 -9213503 -16845674 -14328590 -4468205 3622823 4878010 1823045 -686862
36621 -686862 -1869107 -4347690 -7835916 -7566492 -1527045 4550044 4212430 -271904 -1382627
36612 -1382627 2316180 5096125 3858473 1451827 -781803 -5819929 -13468875 -17357331
36604a7357331L755543P065312M885779L222578L869564K977279N15657R27650
36596I862031L670098K999354j394519l078859j39284J492945j508004m734773
36588G168989m080455r59980K546198N628222M484915m388389j4708692j4586434
36580a8895626l232111O940008Q116841N562649M394838J102896n145479o086542
36572g242526J421266O826837K316845l449665m10142M677138o330r640646r599321
36563a5106544P36289P598253M524138q58657j824320n07276L63947J526274J541590
36554b006306k011760m903581n80640P406188Q577079J803712l505217l713182
36546A066293n410201j0531404j0378705k56176J1318714J4527125R793348J935477
$$ plain form
36604 -17357331 -13601788 -6536476 -1650697 1571881 5441445 8418724 8934381 9862031
36596 9862031 13532129 16531483 15136964 12058105 11918821 13411766 11903762 7168989
36588 7168989 3088534 2128554 4674752 10302974 14787889 10399500 -4309192 -18895626
36580 -18895626 -22127737 -15187729 -7070888 -1508239 2886599 3989495 -1155984 -7242526
36572 -7242526 -5821260 1005577 3322422 -127243 -537385 4139753 4133423 -5507223 -15106544
36563 -15106544 -14370255 -6772002 -2247864 -3106521 -4930841 -5438117 -5074170 -3547896 -2006306
36554 -2006306 -4018066 -8921647 -9502287 -2096099 6480980 8284692 4779475 1066293
36546 1066293 -4343908 -14875312 -25254017 -25510193 -14191479 335646 10128994 12064471
36538A2064471o972842j2658428p511466O844339J5168254O889932q382473j3684323
36530h242536o938211J37229O06446j426546r44088J851013N208180P500400N567088
36521C318975j659405q723959r333115m904506p43984L646661J1502000J7697518
36513A0800185J2016151m380573j6257237j3012109j745647M317133L296008K787992
36505b178097N449415N840143R77410m136875m107770j072950j327527o275128
36497f831379j0151818o974897K079834R564895R953129N554326K840494L817281
36489I851865M104739M85129l237363j481450L939890N032245j077086o905093
36481A0712876m258496L962074O884256K46207p653863p075367L59210M604447
$$ plain form
36538 12064471 5091629 -7566799 -15078265 -8233926 6934328 13824260 5441787 -8242536
36530 -8242536 -15180747 -15043518 -14437072 -15863618 -16807706 -14956693 -9748513 -2248113 3318975
36521 3318975 1659570 -7064389 -16397504 -21302010 -22045994 -18399333 -6897333 10800185
36513 10800185 22816336 18435763 2178526 -10833583 -12579230 -8262097 -4966089 -2178097
36505 -2178097 3271318 9111461 10088871 5951996 1844226 771276 -556251 -6831379
36497 -6831379 -16983197 -23958094 -21878260 -12313365 -2360236 3194090 6034584 9851865
36489 9851865 13956604 14441733 11204370 9722920 13662810 18695055 17617969 10712876
36481 10712876 6454380 10416454 17300710 17546917 9893054 2817687 3176897 7781344
36473G781344J010291m357306m157923K95559J893139k124546o966128o870205
36465a3495775j520460M887550Q375406P527839L103600k507102o187349o345660
36457f161951m110034j115490K867890P904905J0495474O184933l346243r706139
36449C013345p067171P79813N640785M452516K4431m643220p530483n540465J938058
36440h932391Q486779P216488J697345J646297O853074O239200l349997r569937
36432A0286858l643173M537037K183516n221202m032024L058463J536435p990401
36424G15509q270381N232313J3876199M549929q807856o826368N583722Q690142
36416A4743209r64556p510459j477618Q165626R479193J807177q449116j5598136
$$ plain form
36473 7781344 8791635 4434329 276406 571965 2465104 340558 -6625570 -13495775
36465 -13495775 -15016235 -10128685 -1753279 5774560 8878160 6371058 183709 -6161951
36457 -6161951 -10271985 -11387475 -8519585 -614680 9880794 16065727 12719484 3013345
36449 3013345 -4053826 -3274013 2366772 6819288 6843719 2200499 -5329984 -10870449 -8932391
36440 -8932391 -445612 6770876 8468221 10114518 16967592 23206792 19856795 10286858
36432 10286858 6643685 11180722 13364238 8143036 4111012 7169475 8705910 715509
36424 715509 -7554872 -2322559 11553640 16103569 7295713 469345 6053067 14743209
36416 14743209 13778653 6268194 4790576 12956202 22435395 24242572 15793456 195320
36408A95320j5070026n440477O402977R836916L322626l889616m468081j98578
36400i308939M537457P827941P006199r945p258523m988319M501060O850293k138754
36391G018470p077696L467966J5868087R735116j0069122j8472509n898852R386671
36383C958131Q566159l910036j1446230q061736m06424M789447N569826J872003
36375I31140l823631n680692p99510N786515P240566L387006j204269m083731
36367A753394n049782l057551J326182L361890m0992m417637l685604L71083J273676
36358h165341j246990j094252L676773P699048O891090L566724J011072j156442
36350A1181682l791424n469509n421053m942169l964090o53011L829295N174138
$$ plain form
36408 195320 -14874706 -20315183 -13912206 -4075290 -752664 -4642280 -9110361 -9308939
36400 -9308939 -4771482 3056459 10062658 10052713 2794190 -2194129 2306931 9157224 7018470
36391 7018470 -59226 3408740 19276827 29011943 18942821 470312 -5428540 3958131
36383 3958131 12524290 8614254 -2831976 -10893712 -11300136 -6510689 -940863 931140
36375 931140 -2892491 -8573183 -9372693 -3586178 3654388 7041394 5837125 1753394
36367 1753394 -3296388 -6353939 -5027757 -1665867 -1706859 -6124496 -9810100 -9439017 -8165341
36358 -8165341 -9412331 -10506583 -6829810 869238 7760328 11327052 12338124 11181682
36350 11181682 7390258 1920749 -3500304 -8442473 -12406563 -13059574 -9230279 -4056141
36342d056141K759812J276473K581308J751811m230697r346887o494922J224447
36334a4534796M602662J954575Q17450N269908Q919582M308030n523892j0148249
36326d334730m911095L875335P880660O868647O256657O648038J981464r547207
36318A4717769j8437077j4141755M8229R787471P522216K95491k060769Q78094
36310a390331L566392L462173J097000l587000q852852r248510k436853N377100
36302a2012881P075967M189426J987364p21803p269623j1544427l488924J2489956
36294i294945J7957936N431506q530774n122931J0054201J4898021J783807j3206228
36286A3970593j3880232m274368J250988r84076l093550j324393q94409m029889
$$ plain form
36342 -4056141 -1296329 -19856 2561452 4313263 82566 -9264321 -15759243 -14534796
36334 -14534796 -9932134 -7977559 -7160109 -1890201 7029381 11337411 5813519 -4334730
36326 -4334730 -9245825 -5370490 2510170 9378817 15635474 22283512 24264976 14717769
36318 14717769 -3719308 -17861063 -17812834 -8025363 -503147 -207656 -2268425 -1390331
36310 -1390331 2176061 5638234 6735234 3148234 -5704618 -14953128 -17389981 -12012881
36302 -12012881 -4936914 -747488 1239876 518073 -6751550 -18295977 -21784901 -9294945
36294 -9294945 8662991 14094497 5563723 440792 10494993 25393014 27176821 13970593
36286 13970593 90361 -4184007 -2933019 -3917095 -7010645 -8335038 -9229447 -13259336
36278a3259336l822174M230675J2221730R828887m518n043163j909854L65749
36270B607996l459206o242296j515864M887229N052594K792803N666113Q652444
36262A8441813L07603j5515521j9500796l441710J5836168J7778110M101718o869888
36254A1137497n874787r45139j619482o207586p788664n043679j996005p22827
36246a9060672R39686M989278R343309R426227L529274m179650p545935n599665
36238h158148l518413n105628p134415m119700L476266R833781J1490521J0007512
36230F771776P024836J755826m715549p200009k339393N622263R020038N784863
36222B1724651N74690k824145n845366j0172411j2444500q262727l8682M222543
$$ plain form
36278 -13259336 -17081510 -12850835 -629105 9199782 9195264 4152101 2242247 2607996
36270 2607996 -851210 -7093506 -8609370 -3722141 1330453 4123256 9789369 18441813
36262 18441813 18749416 3233895 -16266901 -19708611 -3872443 13905667 18007385 11137497
36254 11137497 5262710 4317571 2698089 -3509497 -11298161 -16341840 -18337845 -19060672
36246 -19060672 -18120986 -13131708 -3788399 5637828 9167102 4987452 -2558483 -8158148
36238 -8158148 -11676561 -16782189 -23916604 -28036304 -24560038 -14726257 -3235736 6771776
36230 6771776 13796612 15552438 10836889 3636880 1297487 6919750 15939788 21724651
36222 21724651 22299341 19475196 13629830 3457419 -8987081 -17249808 -17288490 -13065947
36214a3065947J245749k759133q66180M365760M665201j135575m547518Q5275
36206a2012368O277499L897769o046068j1703098n656216N946085J1796405Q363881
36198H63889J001661m220194n019322j321883N111205R280697O494404p98104
36190A1392353m084221N83823O805540O180972p76981o482436o592000l272282
36182C754768L80940L260364L730125L87486l540914k733622J254438J92659p922629
36173a236385j2905681n647350P773611J3291025P448562K93038K27300M369497
36165A3613617N639026K035512m232350j0671789j3640119q855572K206395J0140563
36157c764717P313300k178444p195199l179110L678309N760024K597194j507072
$$ plain form
36214 -13065947 -11820198 -14579331 -15445511 -11079751 -6414550 -7550125 -12097643 -12012368
36206 -12012368 -5734869 -1837100 -7883168 -19586266 -25242482 -19296397 -7499992 863889
36198 863889 1865550 -2354644 -7373966 -8695849 -3584644 5696053 12190457 11392353
36190 11392353 7308132 7891955 14697495 20878467 20101486 13619050 7027050 3754768
36182 3754768 4135708 7396072 11126197 11513683 7972769 5239147 6493585 6686244 -1236385
36173 -1236385 -14142066 -19789416 -12015805 1275220 8723782 9016820 9244120 13613617
36165 13613617 19252643 21288155 17055805 6384016 -7256103 -16111675 -13905280 -3764717
36157 -3764717 3548583 1370139 -5825060 -9004170 -5325861 434163 3031357 1524285
36149A524285m279020o296590o821391l138170M589292J0541454Q483615l54208
36141D249267p484396o540979j56220M609521N376993N132552M896812J252853
36133A1336403o625977j2068319p871668L311979J0464959P083461j154378m040333
36125D36127L14893M092347R52045n516353o871074o43841P545641J1533751J0074098
36116B1917634M640463l409506j1248096j4121940j0038775k700671L016091O097318
36108e847482P259734N338996K51132l458673j804491J792250J172251k325662
36100B378055j775219L215398M993226P50020k185296R43560K870381l973609
36092G216516j2469066q764002O539168J6582461J0208561l703853r129417l113853
$$ plain form
36149 1524285 -2754735 -9051325 -15872716 -19010886 -14421594 -3880140 4603475 4249267
36141 4249267 -3235129 -9776108 -9932328 -5322807 54186 5186738 10083550 11336403
36133 11336403 4710426 -7357893 -15229561 -11917582 -1452623 5630838 4476460 436127
36125 436127 751020 4843367 5795412 279059 -6592015 -7235856 309785 11843536 21917634
36116 21917634 26558097 23148591 11900495 -2221445 -12260220 -14960891 -11944800 -5847482
36108 -5847482 1412252 6751248 7002380 3543707 1739216 3531466 4703717 2378055
36100 2378055 602836 3818234 8811460 9561480 7376184 8319744 11190125 7216516
36092 7216516 -5252550 -14016552 -7477384 9105077 19313638 15609785 6480368 3366515
36084C366515M037031M623656J325200l98240j43116k19352o50258k52772K55157
36075A1943821l11180j000677n72117q1914m84617K34773L431519N270762J398678
36066A9829048m736568n003204J121804M716941O88404m502970l447967L88769
36058I054257j335559q319503j2029592p804617L01654N889089N805735O22876
36050g815660n142565m914041K363608Q485955N609003k757933o724040l132475
36042a4028148L508203R559596J2564020O949282q258337j9621817j2031131P943682
36034a3414650J7288356Q409827j471632N51696L336532o042401j6989870j1250644
36026a9582786O458256J4309892N277476o075910p559766k230568L869108R765377
$$ plain form
36084 3366515 7403546 12027202 13352402 12954162 12811046 12591694 11941436 11688664 11943821
36075 11943821 11632641 10631964 10059847 9977933 9493316 9728089 13159608 18430370 19829048
36066 19829048 15092480 10089276 11211080 15928021 16616425 12113455 8665488 9054257
36058 9054257 7718698 -600805 -12630397 -20435014 -20133360 -14244271 -8438536 -7815660
36050 -7815660 -12958225 -17872266 -15508658 -7022703 -1413700 -4171633 -10895673 -14028148
36042 -14028148 -10519945 -960349 11603671 18552953 10294616 -9327201 -21358332 -13414650
36034 -13414650 3873706 12283533 10811901 11363597 14700129 8657728 -8332142 -19582786
36026 -19582786 -13124530 1185362 6462838 386928 -7172838 -9403406 -5534298 4231079
36018D231079J1583602K443767j3142424j8425139o285461R160929J1704827M054049
36010E325229m60951J026689O78234l633618n050871j275783K06969n502479j1591339
36001b0277920q729361J809707J0602027J2672338J0727126O787584j185325j1518912
35993H87264j5433408q080003K221603M258241R7838P44755P172109Q462285R58412
35984A289096m596789j206052K525424j677111o342404j723677N873929M981238
35976h76346j64799K192586Q171311L998038p504472q816491J995110O360242
35968E355179k982164q878209j81141P175508k780424j6580132j1438079P693061
35960b2616401J5840740O470740k372913L78414M480162J68627n930207n241738
$$ plain form
36018 4231079 15814681 18258448 5116024 -13309115 -19594576 -10433647 1271180 5325229
36010 5325229 4864278 5890967 6569201 2935583 -2115288 -3391071 -3184102 -8686581 -20277920
36001 -20277920 -29007281 -27197574 -16595547 -3923209 6803917 13591501 12406176 887264
35993 887264 -14546144 -22626147 -20404544 -16146303 -16048465 -15303710 -8131601 330684 1289096
35984 1289096 -3307693 -4513745 -1988321 -3665432 -10007836 -11731513 -5857584 -876346
35976 -876346 -1041145 1151441 9322752 13320790 5816318 -3000173 -1005063 5355179
35968 5355179 2373015 -6505194 -6686335 489173 -2291251 -18871383 -30309462 -22616401
35960 -22616401 -6775661 -304921 -2677834 -2299420 2180742 2349369 -3580838 -8822576
35952h822576j814037k210453k615867L183530J1034803J1826741M718476l295238
35944A2005379p325040p176863l377552K627762O563233N739575L899766O066910
35936A9023170R654365O773930l883406j3074011j1932231l371057J733678j262776
35928C661662n291871k301176M949793P214142K776534n31912J458656K545647
35920A4481475k625645q542330p723723l182561k135318k352352K897383R173107
35912i964M963628p550693j1554561p86913R141135L746613q910341j1999409
35904b2960505m733634J277639L205469P746123J3745366J1503104J070648m700857
35896F153353k70988L604783j605923p377033k497874P211484O815524m640001
$$ plain form
35952 -8822576 -10636613 -12847066 -15462933 -12279403 -1244600 10582141 15300617 12005379
35944 12005379 4680339 -2496524 -5874076 -3246314 3316919 9056494 12956260 19023170
35936 19023170 28677535 35451465 31568059 18494048 6561817 3190760 4924438 3661662
35928 3661662 -1630209 -3931385 1018408 8232550 11009084 10477172 11935828 14481475
35920 14481475 11855830 3313500 -4410223 -7592784 -9728102 -12080454 -9183071 -9964
35912 -9964 4953664 -2597029 -14151590 -14938503 -5797368 -2050755 -10961096 -22960505
35904 -22960505 -27694139 -26416500 -23211031 -15464908 -1719542 9783562 10854210 6153353
35896 6153353 5882365 9487148 7881225 504192 -1993682 5217802 12033326 7393325
35888G393325j2118925n733402O950675J2418286O941298k844715r200980r021765
35880e216203m123411M58215N55013k423684k900519J233443N326351M577397
35872b513398Q61549n96656Q62498J336144l40527l43644L345839N944480J498060
35863A0054345p875159j2421938n815975O483316J2490221P188527j688411l122131
35855E292795L534528P940920K548299p084286r572060k927449L324785J822024
35847D879556l003005k716916K381525M469699K87673m693574n038660k323664
35839e757366o77167k65997O64207Q06228j908725m635616j761963O649843J2910225
35830F023669R924018j247862j2987043j7643971j2006705P46901J1430178J1001844
$$ plain form
35888 7393325 -4725600 -10459002 -3508327 8909959 15851257 13006542 3805562 -5216203
35880 -5216203 -9339614 -8881399 -8326386 -10750070 -13650589 -12417146 -7090795 -2513398
35872 -2513398 -1651849 -2248505 -1386007 -49863 -390390 -734034 2611805 8556285 10054345
35863 10054345 2179186 -10242752 -16058727 -9575411 2914810 10103337 8414926 5292795
35855 5292795 8827323 16768243 19316542 12232256 2660196 -267253 3057532 4879556
35847 4879556 1876551 -840365 1541160 6010859 6298532 1604958 -3433702 -5757366
35839 -5757366 -6434533 -6700530 -6036323 -5230095 -7138820 -11774436 -13536399 -6886556 6023669
35830 6023669 15947687 14699825 1712782 -15931189 -27937894 -27190993 -15760815 -4758971
35822d758971J36623r671596q430391Q00331O897542N242740J295701J31759k8952
35813h385214j351246p32793M040998P974518N542916R9880q68224K391971L067642
35804A1780448j0924n90114L086681L957255k214640r135226r615360n949558
35796h691438m001682k981385R52546N488516N289600J547285J45J265250J293249
35787A62086p8816M74208J891715K42507k397855l13301M325366L103402l646080
35778C763232n210705J920667O670278P29031p281713m932017M545528P348842
35770G553143m30470q331463o694986K226198R201898Q520613K560434j602388
35762A3002979n44275P57601l660456r726794q090196o96327n84350j0226617
$$ plain form
35822 -4758971 -4622348 -14293944 -22724335 -21924004 -15026462 -9783722 -8488021 -8356262 -8385214
35813 -8385214 -9736460 -10469253 -6428255 1546263 7089179 7189059 6320835 8712806 11780448
35804 11780448 11769524 11179410 14266091 18223346 16008706 6873480 -2741880 -8691438
35796 -8691438 -12693120 -15674505 -14721959 -9233443 -3943843 -2396558 -2396413 -1131163 162086
35787 162086 83270 557478 2449193 2691700 293845 -19456 4305910 7409312 3763232
35778 3763232 -1447473 473194 7143472 7872503 590790 -4341227 204301 7553143
35770 7553143 7122673 -1208790 -7903776 -5677578 3524320 12044933 14605367 13002979
35762 13002979 12458704 13216305 9555849 -170945 -8261141 -8957468 -9541818 -19768435
35754a9768435j3696121l85055J6022563J6259533L212838n330203m159043k571528
35746a0415451l405914K2189O527416N887311k169953n250752J112904O162661
35738a529589K417042l567803m907811m526598m824780r53351P689918J1667060
35730A464088N600158k793178n436799n096442o375740o010823j51851P586480
35722a1214107J1754265J0350370J596018j2716520j9007366m339500J8545283
35715e031557J9866793m379287k1494045q681035J3067428J2911156l551729r552392
35707f844668k264730o08670p196377n569846O546462J1908951M421748j810806
35699a417936J210135M268988J761863J141228M986105M418601k553100n427912
$$ plain form
35754 -19768435 -33464556 -33849611 -17827048 -1567515 1645323 -3684880 -7843923 -10415451
35746 -10415451 -13821365 -13799176 -7271760 -1384449 -3554402 -8805154 -7692250 -1529589
35738 -1529589 887453 -2680350 -7588161 -12114759 -16939539 -17892890 -10202972 1464088
35730 1464088 7064246 4271068 -1165731 -6262173 -12637913 -18648736 -18800587 -11214107
35722 -11214107 540158 10890528 12486546 -229974 -19237340 -23576840 -5031557
35715 -5031557 14835236 10455949 -11038096 -19719131 -6651703 6259453 2707724 -6844668
35707 -6844668 -9109398 -9718068 -16914445 -22484291 -15937829 -4028878 392870 -1417936
35699 -1417936 -207801 4061187 5823050 6964278 11950383 16368984 13815884 8387972
35691H387972o98843J859272j117504j34638O338555M873322q774391j7670853
35683f937108q723056O592749J0149038K365054l692470k371563K244626N109467
35675D736737K393422o214374j1753356m044341J0217616J2479165M76683p010014
35667A281538r11681L900415l208252q607388L83580J0864972O308577m111491
35659E900270k128418P270121N735594n645433r323499j764331L433817N93006
35651D071127j921291R0317J786769J941629L134189J561341o224379j0444559
35643f004857r20578J1613441Q524222n584722q726603K132568O587461l887501
35635C733431j2419441o620423K438227K663676N30258M171764N875120k193545
$$ plain form
35691 8387972 7689129 9548401 8430897 8296259 14634814 19508136 10733745 -6937108
35683 -6937108 -15660164 -9067415 1081623 3446677 -245793 -2617356 -372730 4736737
35675 4736737 7130159 915785 -10837571 -14881912 -4664296 7814869 8291552 1281538
35667 1281538 369857 4270272 1062020 -7545368 -7161788 3703184 10011761 5900270
35659 5900270 3771852 11041973 16777567 11132134 1808635 44304 3478121 4071127
35651 4071127 2149836 2240153 4026922 5968551 9102740 10664081 4439702 -6004857
35643 -6004857 -6925435 4688006 13212228 7627506 -1099097 1033471 7620932 3733431
35635 3733431 -8686010 -15306433 -12868206 -10204530 -9674272 -5502508 372612 -1820933
35627a820933r936499m463230P515593R336383m95047q002124m768678L252115
35619i382420O374879J713599n756317p388742R56498J1540814J0966175k503117
35611F521369j4458756j1872236J349672J1264813J0285860J865656n655744n603425
35603f302791J822356Q266305O157088q15523l326047j321138k448831n923758
35595c892339k300957P909678J1272287L131511l583275j9264L729048k915657
35587A3331032j2054667j1152920l745265n17910K06779N858563J1208778N142483
35579H276873q049155j1992583k301419Q016977P995635N32540o050009o871101
35571a0442242o45240Q522478J0203916p77570j3204717j1685216J136918P800648
$$ plain form
35627 -1820933 -11757432 -16220662 -8705069 631314 136267 -7865857 -12634535 -9382420
35619 -9382420 -3007541 -1293942 -7050259 -14439001 -13482503 -1941689 9024486 6521369
35611 6521369 -7937387 -19809623 -18459951 -7195138 3090722 4956378 -699366 -6302791
35603 -6302791 -4480435 3785870 9942958 9127435 5801388 4480250 2031419 -3892339
35595 -3892339 -6193296 1716382 12988669 16120180 12536905 12517641 16246689 13331032
35587 13331032 1276365 -9876555 -13621820 -14139730 -13932951 -8074388 3134390 8276873
35579 8276873 227718 -11764865 -14066284 -6049307 1946328 2478868 -3571141 -10442242
35571 -10442242 -11087482 -2565004 7638912 6861342 -6343375 -18028591 -16891673 -9091025
35563i091025J624380n375519k990411L151210M106463J767225K101431L392737
35555a313509M27106m953132n539603J201798R836037J2635776O767741k291161
35547A6771053m971946J230492O741006J907731q367331j0864649l834590R29741
35539d58493k198460l529534N081288J5280896J3969108K802789m840427l019996
35531B3087171O40508k158707r260594j2141801p005381P05428K484445k893068
35523f541999o969957k396967N953628O797695j159846p067017m255301P32672
35515a4907092N25888j021144K490401O845880L623453m554318o507302J091040
35507a2413194R871125J2213100Q349502Q73469q227714j3499429q573332L655235
$$ plain form
35563 -9091025 -7466645 -12842164 -15832575 -12681365 -8574902 -6807677 -4706246 -1313509
35555 -1313509 -886403 -5839535 -11379138 -10177340 -341303 12294473 19062214 16771053
35547 16771053 11799107 13029599 19770605 21678336 13311005 2446356 -1388234 -458493
35539 -458493 -2656953 -6186487 -1105199 14175697 28144805 30947594 26107167 23087171
35531 23087171 23727679 21568972 12308378 166577 -6838804 -6133376 -3648931 -6541999
35523 -6541999 -13511956 -15908923 -9955295 -3157600 -4317446 -11384463 -15639764 -14907092
35515 -14907092 -14381204 -15402348 -12911947 -6066067 -2442614 -6996932 -13504234 -12413194
35507 -12413194 -2542069 9671031 18020533 18894002 10666288 -2833141 -11406473 -7751238
35499g751238J1369279Q230679M35241m080464n673129p380521p069653k222599
35491a4142405L331403N013380N295390Q272398J0302086M675514o313797j2382687
35483D051282q270379R44828P307567O805955k79349r255553j1978484m781807
35475a5455940N050242P491712L116436J60170J19553k631852o875492l713071
35467a2738242O650853J1056164L351321m599340j468364N694898M299839l197902
35459I049227n949186m020477m822152n869683P15469Q939654L884168j2126137
35451a0199117j7862128m107461J1636786J1440366K334816J677991Q975889R098406
35443A2995548k060048j1520431q843368R09634O491453L902011k430892n731611
$$ plain form
35499 -7751238 3618041 11848720 12283961 8203497 2530368 -4850153 -11919806 -14142405
35491 -14142405 -10811002 -5797622 -502232 7770166 18072252 22747766 16433969 4051282
35483 4051282 -4219097 -3274269 4033298 10839253 10559904 1304351 -10674133 -15455940
35475 -15455940 -10405698 -2913986 202450 362620 482173 -2149679 -9025171 -12738242
35467 -12738242 -6087389 4968775 8320096 3720756 2252392 7947290 12247129 9049227
35459 9049227 3100041 -920436 -5742588 -11612271 -10896802 -1957148 1927020 -10199117
35451 -10199117 -28061245 -32168706 -20531920 -9091554 -6756738 -5078747 3897142 12995548
35443 12995548 10935500 -584931 -9428299 -8518665 -2027212 1874799 -556093 -6287704
35435f287704j750770P862054J5265047J3035299K329211q230621j2054074r986156
35427A82286o215490k744990K74771J735115M49074j698344o90745L872070O289838
35418A453585J576323o167334p434033n04034N412331L738943P373J102102K387647
35409A572903l501969j0212644m632731J0430543J6298873N040491q573855q856362
35401b434751p7880M041675J154331q42413J428383M341538N139209L319387j645870
35392A4423609o614089m500122M501127Q298206j005453j3332003j4175410n422854
35384a7826989N76800K066403O873461J3216730R906954k179814o656005L661636
35376I639176J3696283P532874q593941j6079234r148475J198203M519036J604654
$$ plain form
35435 -6287704 -8038474 -176420 15088627 28123926 30453137 22222516 10168442 182286
35427 182286 -6033204 -8778194 -8503423 -6768308 -6319234 -8017578 -8708323 -4836253 1453585
35418 1453585 3029908 -3137426 -10571459 -11075493 -5663162 -1924219 -1916846 -814744 1572903
35409 1572903 -1929066 -12141710 -16774441 -6343898 9954975 14995466 6421611 -2434751
35401 -2434751 -2512631 1529044 2683375 1840962 3269345 7610883 12750092 16069479 14423609
35392 14423609 7809520 3309398 7810525 16108731 15103278 1771275 -12404135 -17826989
35384 -17826989 -17250189 -15183786 -8310325 4906405 14813359 12633545 5977540 9639176
35376 9639176 23335459 30868333 22274392 6195158 -2953317 -1755114 2763922 4368576
35368D368576j782805l542672n125397o817393n816181O16899R690666J2663222
35360D254915L991610r356980j3400157l900945P772803Q908477P59283n074741
35352f045735k053075N149471Q584541N862351K15875m615657p412679q516676
35344h831584p778098m769499j100613m15075l727018n989907j109678R067728
35336b4653744J4747872R628175n04660m321482R58372O270984K918633n470009
35328d25859p296689J502962J1362341J0835282L82273r740034j2263560p972246
$$ plain form
35368 4368576 2585771 -956901 -6082298 -12899691 -18715872 -18098973 -8408307 4254915
35360 4254915 8246525 -1110455 -14510612 -18411557 -10638754 -1730277 -970994 -6045735
35352 -6045735 -8098810 -2949339 5635202 11497553 11713428 7097771 -314908 -8831584
35344 -8831584 -16609682 -21379181 -22479794 -22894869 -26621887 -32611794 -33721472 -24653744
35336 -24653744 -9905872 -277697 -782357 -5103839 -4145467 2125517 5044150 -425859
35328 -425859 -7722548 -6219586 5142755 15978037 16360310 6620276 -5643284 -13615530
$$ [...]
##END NTUPLES=NMR SPECTRUM
##END=
