##TITLE=31Pdec_SR34+C
 CDCl3, 24 sc
 4.03.2021
##JCAMPDX= 6.0         $$ Bruker NMR JCAMP-DX V2.0
##DATA TYPE= NMR SPECTRUM
##DATA CLASS= NTUPLES
##ORIGIN= UXNMR, Bruker Analytische Messtechnik GmbH
##OWNER= root
$$ XWIN-NMR		Version 3.5
$$ Thu Mar  4 11:06:24 2021 Russian Standard Time (UT+4h)  she@DPX200
##.OBSERVE FREQUENCY= 81.013821
##.OBSERVE NUCLEUS= ^31P
##.ACQUISITION MODE= SIMULTANEOUS
##.ACQUISITION SCHEME= undefined
##.AVERAGES= 24
##.DIGITISER RES= 16
##SPECTROMETER/DATA SYSTEM= spect
##.PULSE SEQUENCE= zgpg30
##.SOLVENT NAME= CDCl3
##.SHIFT REFERENCE= (INTERNAL, CDCl3, 0, 248.564)
##AUDIT TRAIL= $$ (NUMBER, WHEN, WHO, WHERE, WHAT)
$$ ##TITLE= Audit trail, XWIN-NMR		Version 3.5
$$ ##JCAMPDX= 5.01
$$ ##ORIGIN= Bruker BioSpin GmbH
$$ ##OWNER= she
$$ F:/spectra/data/she/nmr/P31/1/pdata/1/auditp.txt
$$ ##AUDIT TRAIL=  $$ (NUMBER, WHEN, WHO, WHERE, WHAT)
(   1,<2021-03-04 11:05:29.85 +0400>,<she>,<DPX200>,
      <created by zg, POWCHK disabled, PULCHK disabled
       configuration hash MD5:
       00 E9 B6 7A A2 85 ED C7 34 08 36 98 17 FE 4E 26
       data hash MD5: 32K
       CB 76 4E AA A6 E0 AC F4 8E 5A 6C 3A 5B A0 39 79>)
(   2,<2021-03-04 11:05:32.26 +0400>,<she>,<DPX200>,
      <Start of raw data processing
       efp BC_mod = 2 LB = 1 FT_mod = 6 PKNL = 1 PHC0 = -3011.187 PHC1 = 99.80084 SI = 64K 
       data hash MD5: 64K
       2E A8 49 04 53 BE 22 34 5E E9 D1 18 26 98 82 D3>)
(   3,<2021-03-04 11:05:58.53 +0400>,<she>,<DPX200>,
      <pk PHC0 = 49.03652 PHC1 = -66.39999 
       data hash MD5: 64K
       24 40 0E 02 AC A9 4B A4 8B 42 65 C5 33 38 5A A4>)
(   4,<2021-03-04 11:06:02.09 +0400>,<she>,<DPX200>,
      <abs ABSG = 5 
       data hash MD5: 64K
       D6 1D 56 59 62 E8 0B 9A 89 E2 3B 4B 3D 24 F5 29>)
$$ ##END=
$$ 
$$ hash MD5
$$ D4 40 81 FF 32 6D 07 7F DC 77 FA 17 8B F4 36 BE
##$RELAX= 
##$RELAX= 
##$RELAX= 
##$RELAX= 
##$RELAX= 
##$RELAX= 
##$RELAX= 
##$RELAX= 
$$ Bruker specific parameters
$$ --------------------------
##$DU= <F:/spectra>
##$EXPNO= 1
##$NAME= <P31>
##$PROCNO= 1
##$TYPE= <nmr>
##$USER= <she>
##$AMP= (0..31)
100 100 100 100 100 100 100 100 100 100 100 100 100 100 100 100 100 100 
100 100 100 100 100 100 100 100 100 100 100 100 100 100 
##$AQSEQ= 0
##$AQ_mod= 1
##$AUNM= <au_zg>
##$AUTOPOS= <>
##$BF1= 81.014009
##$BF2= 200.13
##$BF3= 200.13
##$BF4= 200.13
##$BF5= 200.13
##$BF6= 200.13
##$BF7= 200.13
##$BF8= 200.13
##$BYTORDA= 1
##$CFDGTYP= 0
##$CFRGTYP= 5
##$CHEMSTR= <none>
##$CNST= (0..31)
1 1 145 1 1 1 1 1 1 1 1 1 1 1 1 1 1 1 1 1 1 1 1 1 1 1 1 1 1 1 1 1 
##$CPDPRG= <waltz16>
##$CPDPRG1= <>
##$CPDPRG2= <waltz16>
##$CPDPRG3= <>
##$CPDPRG4= <mlev>
##$CPDPRG5= <mlev>
##$CPDPRG6= <mlev>
##$CPDPRG7= <mlev>
##$CPDPRG8= <mlev>
##$CPDPRGB= <>
##$CPDPRGT= <>
##$D= (0..31)
0 1 0 0 0 0 0 0 0 0 0 0.03 2e-05 3e-06 0 0 0 0 0 0 0 0 0 0 0 0 0 0 0 0 
0 0 
##$DATE= 1614841529
##$DBL= (0..7)
120 120 120 11 120 120 24 19 
##$DBP= (0..7)
150 150 150 150 150 150 150 150 
##$DBP07= 0
##$DBPNAM0= <>
##$DBPNAM1= <>
##$DBPNAM2= <>
$$ [...]
##$SUBNAM3= <"">
##$SUBNAM4= <"">
##$SUBNAM5= <"">
##$SUBNAM6= <"">
##$SUBNAM7= <"">
##$SUBNAM8= <"">
##$SUBNAM9= <"">
##$SW= 501.771253377433
##$SWIBOX= (0..15)
0 1 3 0 0 0 0 0 0 0 0 0 0 0 0 0 
##$SW_h= 40650.406504065
##$TD= 32768
##$TD0= 1
##$TE= 0
##$TE2= 300
##$TE3= 300
##$TEG= 300
##$TL= (0..7)
0 120 53 12 22 120 120 120 
##$TP= (0..7)
150 150 150 150 150 150 150 150 
##$TP07= 0
##$TPNAME0= <>
##$TPNAME1= <>
##$TPNAME2= <>
##$TPNAME3= <>
##$TPNAME4= <>
##$TPNAME5= <>
##$TPNAME6= <>
##$TPNAME7= <>
##$TPOAL= (0..7)
0.5 0.5 0.5 0.5 0.5 0.5 0.5 0.5 
##$TPOFFS= (0..7)
0 0 0 0 0 0 0 0 
##$TUNHIN= 0
##$TUNHOUT= 0
##$TUNXOUT= 0
##$USERA1= <user>
##$USERA2= <user>
##$USERA3= <user>
##$USERA4= <user>
##$USERA5= <user>
##$V9= 5
##$VALIST= <valist>
##$VCLIST= <CCCCCCCCCCCCCCC>
##$VD= 0
##$VDLIST= <DDDDDDDDDDDDDDD>
##$VPLIST= <PPPPPPPPPPPPPPP>
##$VTLIST= <TTTTTTTTTTTTTTT>
##$WBST= 1024
##$WBSW= 4
##$XGAIN= (0..3)
0 0 0 0 
##$XL= 0
##$YL= 0
##$YMAX_a= 7923
##$YMIN_a= -6661
##$ZGOPTNS= <>
##$ZL1= 120
##$ZL2= 120
##$ZL3= 120
##$ZL4= 120
##$ABSF1= 248.5645
##$ABSF2= -253.2056
##$ABSG= 5
##$ABSL= 3
##$ALPHA= 0
##$AQORDER= 0
##$ASSFAC= 0
##$ASSFACI= 0
##$ASSFACX= 0
##$ASSWID= 0
##$AUNMP= <proc_1d>
##$AZFE= 0.1
##$AZFW= 0.5
##$BCFW= 0
##$BC_mod= 2
##$BYTORDP= 0
##$COROFFS= 0
##$CY= -3
##$DATMOD= 1
##$DC= 0
##$DFILT= <>
##$DTYPP= 0
##$F1P= 0
##$F2P= 0
##$FCOR= 1
##$FTSIZE= 65536
##$FT_mod= 6
##$GAMMA= 0
##$GB= 0
##$INTBC= 1
##$INTSCL= 5.30512e-09
##$ISEN= 30
##$LB= 1
##$LEV0= 0
##$LPBIN= 0
##$MAXI= 10000
##$MC2= 0
##$MEAN= 0
##$ME_mod= 0
##$MI= 50
##$NCOEF= 0
##$NC_proc= -7
##$NLEV= 6
##$NOISF1= 182.463
##$NOISF2= 159.3651
##$NSP= 0
##$NTH_PI= 0
##$NZP= 0
##$OFFSET= 248.5645
##$PC= 4
##$PHC0= -2962.15
##$PHC1= 33.40086
##$PH_mod= 1
##$PKNL= yes
##$PPARMOD= 0
##$PSCAL= 0
##$PSIGN= 0
##$REVERSE= no
##$SF= 81.014009
##$SI= 65536
##$SIGF1= 159.3651
##$SIGF2= -187.1042
##$SINO= 113.3802
##$SIOLD= 16384
##$SREGLST= <1H.CDCl3>
##$SSB= 0
##$STSI= 65536
##$STSR= 0
##$SW_p= 40650.406504065
##$SYMM= 0
##$S_DEV= 0
##$TDeff= 32768
##$TDoff= 0
##$TI= <>
##$TILT= no
##$TM1= 0
##$TM2= 0
##$TOPLEV= 0
##$USERP1= <user>
##$USERP2= <user>
##$USERP3= <user>
##$USERP4= <user>
##$USERP5= <user>
##$WDW= 1
##$XDIM= 65536
##$YMAX_p= 307298201
##$YMIN_p= -64857708
$$ End of Bruker specific parameters
$$ ---------------------------------
##NTUPLES= NMR SPECTRUM
##VAR_NAME=  FREQUENCY,     SPECTRUM/REAL,   SPECTRUM/IMAG
##SYMBOL=    X,             R,               I
##VAR_TYPE=  INDEPENDENT,   DEPENDENT,       DEPENDENT
##VAR_FORM=  AFFN,          ASDF,            ASDF
##VAR_DIM=   65536,         65536,           65536
##UNITS=     HZ,            ARBITRARY UNITS, ARBITRARY UNITS
##FACTOR=    0.620285442955139, 1,           1
##FIRST=     20137.2065510759, 0,            0
##LAST=      -20513.1999529892, 0,           0
##MIN=       -20513.1999529892, -64857708,   0
##MAX=       20137.2065510759, 307298201,    0
$$ Real data points
##PAGE= N=1
##DATA TABLE= (X++(R..R)), XYDATA
$$ [...]
13018E584140n046355o638873j881145L045097K368894j948882k607397L229684
13010c894837R095702P123663p68463m755831q00735L763206J621094l651939
13002G731860m063940Q3453J811076n53560j614438P83862J827533j422685m643859
12993f0698l421965j66058N25506q29783o15304J392828K147387N20079j509956
12984b017964k308399k181828j590569j00598K419832M765473N029803K356755
12976F372505j513892l060007q09348K089166J322699k573907m375846j135918
12968c684548L636022M378614K92068l935102l433752J657386N933183M096931
12960H940802k503219o290146k697078L043266K587917l386007n860027r36397
$$ plain form
13018 5584140 537785 -6101088 -7982233 -4937136 -2568242 -4517124 -7124521 -3894837
13010 -3894837 5200865 12324528 11556065 6800234 5999499 9762705 11383799 7731860
13002 7731860 3667920 3751373 5562449 5008889 3394451 4178313 6005846 4583161 -60698
12993 -60698 -3482663 -3648721 -3123215 -3952998 -4568302 -3175474 -1028087 -508008 -2017964
12984 -2017964 -4326363 -6508191 -8098760 -8199358 -5779526 -1014053 4015750 6372505
12976 6372505 4858613 1798606 989258 3078424 4401123 1827216 -2548630 -3684548
12968 -3684548 -48526 4330088 4622156 687054 -2746698 -1089312 4843871 8940802
12960 8940802 6437583 147437 -2549641 493625 3081542 -304465 -6164492 -7100889
12952g100889M320028K792767k174271k710834J488445L734675J058568k283365
12944h74876k222138k34207L85601l36650n447K053567L639862K309365j407212
12935C307865l787441k015682J574023J846180j659567l147443R45899N596431
12927B660265L951449k173118m612422r18758K450478L85750l475884k924672
12919d656912J692406M799281L567049M62818j207283r71543l90801p80658k079243
12910D35114l026957k618486j557606j157301p23019J726431N300930N739562
12902D118668J308539l381160k783832K034567N091688L823961J362291L11657
12894A1886379r20444l611347m796302j557051L255866L833159p00914m903333
$$ plain form
12952 -7100889 -2780861 11906 -2162365 -4873199 -3384754 349921 1408489 -874876
12944 -874876 -3097014 -3331221 -2945620 -3282270 -3287717 -1234150 2405712 4715077 3307865
12935 3307865 -479576 -2495258 -921235 924945 -734622 -3882065 -2936166 2660265
12927 2660265 6611714 4438596 -173826 -1092584 1357894 1743644 -1732240 -4656912
12919 -4656912 -2964506 1834775 5401824 5864642 4657359 3685816 3295015 2514357 435114
12910 435114 -2591843 -5210329 -6767935 -7925236 -8648255 -6921824 -1620894 4118668
12902 4118668 5427207 2046047 -737785 1296782 6388470 10212431 11574722 11886379
12894 11886379 10965935 7354588 2558286 1001235 4257101 8090260 7389346 2486013
12886B486013m007620N69372L730583K547465j632888n313411n688429k423846
12878i732761J993467M129145K833969L50706m46097N79189J091255l61559k374181
12869a936867k498374l51396J961050K557339J922371J515490J144927l40863
12861C973677j864263m78135L647323N482355J434250m665216n957446j930592
12853c58047J374147O24152p18021P11820K510514J221735j484399j794390q3442
12844B004069K84011j343419k667202k643257k054375r80681P47863J838863J664159
12835c149969K198484L995153K935942l527085r298813o120232L615174Q532848
12827h18498L794604k996059l808520l00671K023417K601207L293461K749544
$$ plain form
12886 2486013 -1521607 -952235 2778348 5325813 3692925 -1620486 -7308915 -9732761
12878 -9732761 -7739294 -3610149 -776180 -425474 -871571 -292382 798873 437314 -1936867
12869 -1936867 -4435241 -4786637 -2825587 -268248 1654123 3169613 4314540 3973677
12861 3973677 2109414 1631279 5278602 10760957 12195207 7529991 1572545 -358047
12853 -358047 1016100 1640252 922231 1634051 4144565 5366300 3881901 2087511 2004069
12844 2004069 2288080 944661 -1722541 -4365798 -6420173 -7400854 -6652991 -4814128 -3149969
12835 -3149969 -951485 3043668 5979610 2452525 -6846288 -12966520 -9351346 -818498
12827 -818498 2976106 -19953 -3828473 -4129144 -2105727 495480 3788941 6538485
12819F538485o35908m119047m397652k647054j179532R13676L908176L919554
12811B300698o60962l790058l17249M107215P78038o980817p035413L166990J2003192
12802C571634J0181518K468322j594236q29066l30179j896502l046458k563787
12794E961246j712350j415118j664046k263206k092166J05642K739653K476858
12786B136513j48590n45364K329832L310673n57275m259666k489009J681556K077173
12777C535843m10075k15946K765194L318085L30413j771089j515093k668054o156091
12768b786813o846664j684690M811429O959048N020370K234108o44475l573856
12760C488457m130711j212375J228034p02344m288396l964275J84903L165525
$$ plain form
12819 6538485 5902577 1783530 -2614122 -5261176 -6440708 -5527032 -1618856 2300698
12811 2300698 1639736 -2150322 -2467571 1639644 2417682 -4563135 -11598548 -8431558 3571634
12802 3571634 13753152 16221474 14627238 13798172 13467993 11571491 8525033 5961246
12794 5961246 4248896 2833778 1169732 -1093474 -3185640 -3079998 -340345 2136513
12786 2136513 1987923 1442559 3772391 7083064 6525789 2266123 -222886 1458670 3535843
12777 3535843 3125768 2909822 5675016 8993101 9323514 7552425 6037332 3369278 -2786813
12768 -2786813 -9633477 -11318167 -6506738 452310 5472680 7706788 7062313 3488457
12760 3488457 -642254 -1854629 -626595 -1328939 -5617335 -9581610 -9396707 -6231182
12752f231182L147598K871355L198209J548646j996451l113952l92059J304763
12744C36927j592989m862425k429650M118694P288513L754114k136281m791488
12736c14585l099229P98866M652176O617117N408362J719165j862842l315832
12728A0603198k744255j578742j347280k573393l409627p34643M994110P799842
12720A1009210L057831m943479p532338l488402q9763j277340k147154J283437
12712d127998M226682J296720l311541j941166L759997M983256n90641n751879
12704a456570m835712k86358L163701M103173K577493j030607l409678p88819
12696a963377M125341M183391j117782l916332n17379K411939p35899m789197
$$ plain form
12752 -6231182 -3083584 -212229 2985980 4534626 2538175 -575777 -967836 336927
12744 336927 -1256062 -6118487 -8548137 -4429443 2859070 6613184 4476903 -314585
12736 -314585 -3413814 -2614948 2037228 8654345 14062707 15781872 13919030 10603198
12728 10603198 7858943 6280201 4932921 2359528 -1050099 -1784742 3209368 11009210
12720 11009210 14067041 9123562 1591224 -1897178 -1986941 -3264281 -5411435 -4127998
12712 -4127998 98684 1395404 -1916137 -3857303 -97306 4885950 4295309 -1456570
12704 -1456570 -6292282 -6578640 -3414939 688234 3265727 2235120 -1174558 -1963377
12696 -1963377 2161964 6345355 5227573 1311241 793862 3205801 2469902 -2319295
12688b319295k780613J961427J673909k458905k532426K753158O434989M466605
12680G198849R8524l244272n628949o198961k544913L577326O260753L324680
12672B843037j116844l369769l983249l620626j122776K307622K743720j99045
12664e517930j976661l06639J514511Q32751k98547J4347M1020j188170j451927
12655h337245k56007l16655j015448K606946R847417J1099159J511280r049006
12647F090441q541734P5980M299687R91277j526792Q85521K397284p24156k972351
12638I75157M42221M650244K632007l526093n570821r28960M148807L304378j982446
12629D144494m762287j612130K735550J417428m599495o528769J85278Q228554
$$ plain form
12688 -2319295 -5099908 -3138481 -1464572 -3923477 -6455903 -3702745 2732244 7198849
12680 7198849 7297373 4053101 -1575848 -7774809 -10319722 -6742396 -481643 2843037
12672 2843037 1726193 -1643576 -5626825 -9247451 -10370227 -8062605 -5318885 -5517930
12664 -5517930 -7494591 -7801230 -6286719 -5453968 -5752515 -5738168 -5697148 -6885318 -8337245
12655 -8337245 -8593252 -8909907 -9925355 -7318409 2529008 13628167 15139447 6090441
12647 6090441 -2451293 -2375313 1924374 2915651 1388859 2274380 4671664 3947508 975157
12638 975157 1417378 6067622 8699629 5173536 -397285 -1326245 2822562 6126940 4144494
12629 4144494 -617793 -2229923 505627 1923055 -2676440 -9205209 -9019931 -791377
12621g91377P741150R4813m400271j308364K976148K052787j947457l583000k025750
12612a191321Q8993J530409K385611K021787L00958j260957j608665j309088n66510
12603C91217R65130J669733o95048m019839l115497J987481M461343P63742l209978
12594h01716j070495L707862L018576l103912o230561j704146N318474P334207
12586F468289L294909j977951l976410k178156O08595J144927j194744l840195
12578a650736l924419j303861J836518L338854K356892j72155j431221R24702
12570b5426N057863N937851J833639k760173l186815j050202j126322l768984
12562I11431m603714j349838K827950L476501j9747m064110m334288J02353N254647
$$ plain form
12621 -791377 6949773 7044586 2644315 1335951 4312099 6364886 4417429 834429 -1191321
12612 -1191321 -1102328 428081 2813692 4835479 5136437 3875480 2266815 957727 391217
12603 391217 1356347 3026080 2331032 -1688807 -4804304 -2816823 1644520 2408262 -801716
12594 -801716 -1872211 1835651 4854227 1750315 -4480246 -6184392 -865918 6468289
12586 6468289 9763198 7785247 3808837 1630681 2239276 3384203 2189459 -1650736
12578 -1650736 -5575155 -6879016 -5042498 -1703644 653248 481093 -950128 -25426
12570 -25426 5032437 10970288 12803927 10043754 6856939 5806737 4680415 911431
12562 911431 -3692283 -5042121 -2214171 1262330 1242583 -2821527 -7155815 -7053462 -1798815
12553a798815N870363J533354k775806l303473j797128j155620m16807K293221
12545a550711M924712M269581J344942p64980k287120m532834m506798J103833
12537a999375P445761N500391l927179q823179k530082O100891N379654k542061
12529D604821n910192q95826M305857K926774j332286j852402O83563Q04407k370644
12520I64072l915272q94998L195855L397073j74255l091983k523841J52096K304888
12511e86365L040791K455856K34816l071041m782590k616547J748363L858760
12503B82043J710870j973534l412184k154424o92743p94319j633659j229070J351672
12494h545348N125097P677199O645498J855073l602384n479732k653007J185979
$$ plain form
12553 -1798815 4071548 5604902 2829096 -474377 -2271505 -3427125 -3843932 -1550711
12545 -1550711 3374001 7643582 8988524 8223544 5936424 1403590 -3103208 -1999375
12537 -1999375 5446386 10946777 7019598 -1803581 -4333663 1767228 7146882 4604821
12529 4604821 -1305371 -2201197 2104660 5031434 3699148 1846746 2530309 3334716 964072
12520 964072 -2951200 -3846198 -650343 2746730 2572475 -519508 -3043349 -2891253 -586365
12511 -586365 2454426 4910282 5145098 2074057 -2708533 -5325080 -3576717 282043
12503 282043 1992913 19379 -3392805 -5547229 -6239972 -7034291 -8667950 -9897020 -8545348
12494 -8545348 -3420251 4256948 10902446 12757519 9155135 3675403 1022396 2208375
12486B208375J398119k115882m796337l191956Q47752K866403J216825j844697
12478c411398l404861k387883M55281L148665L542598J469602o61701q97145k62134
12469b408976m35680n51363Q94452K436383J475724j270921k866572k746657k194723
12460g668333m67257L526723O669013M868668N72137J21366L183622K775554k487659
12451A1093834n033424q80381L253822R34172l853653m276931j350393L20771
12443B07817J071061K488928J314083m137774p119767j885741N029431L814995
12435G83033k625498l765954P24270J828384j525454p42469N491403P302041Q83933
12426H353689m000521k07871N114860L028817l115371m972077k482185p82008
$$ plain form
12486 2208375 3606494 1490612 -3305725 -6497681 -5649929 -2783526 -1566701 -3411398
12478 -3411398 -6816259 -9204142 -8748861 -5600196 -2057598 -587996 -1249697 -2146842 -2408976
12469 -2408976 -2844656 -3396019 -2501567 -65184 1410540 139619 -2726953 -5473610 -7668333
12460 -7668333 -8135590 -4608867 2060146 6928814 7500951 7622317 10805939 13581493 11093834
12451 11093834 6060410 5180029 8433851 9368023 5514370 1237439 -112954 207817
12443 207817 1278878 3767806 5081889 944115 -6175652 -8061393 -3031962 783033
12435 783033 -1842465 -5608419 -4884149 -3055765 -4581219 -5323688 167715 7469756 8353689
12426 8353689 4353168 4145297 9260157 12288974 9173603 4201526 1719341 937333
12418I37333k03784J784391L582297K581526J158227K112698K235264k130963
12410A2056989p107868o738974k909027j566187k138452J81706L740439K197840
12402b283534l134115l230989L994940Q810136M227602k899576k435962L323852
12394F372354L383268m830005j1203153p425349J719111N959017L440849Q90804
12386a693104K121911L402478J247727j555214j184839O67573J46467k058615
12378A094384k474682j272379j514515k895741j655173K923296O539897N376924
12370F122011L29220m509689n017894J37706O729406P195304r8513o553032m015794
12361C18725L108719M060652k060393n746439k505715J494741J138783l91042
$$ plain form
12418 937333 733549 2517940 6100237 8681763 9839990 11952688 14187952 12056989
12410 12056989 4949121 -1789853 -4698880 -6265067 -8403519 -8221813 -4481374 -2283534
12402 -2283534 -5417649 -8648638 -4653698 4156438 8384040 5484464 3048502 6372354
12394 6372354 9755622 4925617 -6277536 -13702885 -11983774 -6024757 -2583908 -1693104
12386 -1693104 428807 3831285 5079012 3523798 2338959 3006532 3152999 1094384
12378 1094384 -1380298 -2652677 -4167192 -7062933 -8718106 -5794810 745087 6122011
12370 6122011 6451231 1941542 -3076352 -2938646 3790760 10986064 10887551 4334519 318725
12361 318725 3427444 7488096 5427703 -318736 -2824451 -1329710 -190927 -581969
12353e81969L01575Q09349l98131J69696L347510L620984j202330m449180j094953
12344E22551L529650K599760j361453k088166l5391O48615L37838J159262Q11851
12335F124517k783254n130272j795270K715333J472310l050417k946879J958224
12327c435708M467924K127375k91421j02990R4062r74397j086564J90923O23873
12318A613077L01313J544731L626100L264899L55292k177966l644765n189235
12310c06554n196572j320530L626517M284696J005554p60068Q34071K214882J310693
12301E692689L5470n24167j559551k822031k846470k677760l900187l869671O94592
12292a1777086O273530O112736R83817j642842K82747Q03609k641898m295283
$$ plain form
12353 -581969 -280394 528955 130824 300520 3648030 7269014 6066684 1617504 522551
12344 522551 4052201 6651961 5290508 3202342 3166951 3815566 4153404 5312666 6124517
12335 6124517 3341263 -1789009 -3584279 -868946 603364 -2447053 -5393932 -3435708
12327 -3435708 1032216 3159591 2868170 2765180 2859242 1884845 798281 989204 1613077
12318 1613077 1914390 3459121 7085221 10350120 10705412 8527446 4882681 -306554
12310 -306554 -5503126 -6823656 -3197139 1087557 2093111 1333043 2167114 4381996 5692689
12301 5692689 5728159 5203992 3644441 822410 -2024060 -4701820 -8602007 -12471678 -11777086
12292 -11777086 -5503556 609180 1592997 -49845 232902 1036511 -1605387 -5900670
12284e900670m95115L206281J120269k822463j329892M294799N732184J3424n931312
12275b112495m526467K518081O450717K718361l277656l803901K69057J311096
12267d53207k467636l555075K387989Q062221N227711k091987l900835K25936
12259C435117J857163j733870l972728o89720L667951L784417L22867l149588
12251C521609m411253k493231J586206L776969J669599q64832N67310K706978
12243F059355k17851n321905m472289J953979N017548J523793k055214j607417
12235H79999p74950j555597M1185M855515O686213K349891k818560m105435l960622
12226A597639m931824m199181j45288L067293K318626J45013j231132l093177
$$ plain form
12284 -5900670 -6395785 -3189504 -2069235 -4891698 -6221590 -1926791 3805393 3818817 -2112495
12275 -2112495 -6638962 -4120881 2329836 5048197 1770541 -2033360 -1764303 -453207
12267 -453207 -2920843 -6475918 -4087929 3974292 9202003 7110016 3209181 3435117
12259 3435117 5292280 3558410 -414318 -1104038 2563913 6348330 6671197 3521609
12251 3521609 -889644 -3382875 -1796669 1980300 3649899 2785067 3352377 6059355
12243 6059355 5841504 519599 -3952690 -1998711 3018837 4542630 2487416 879999
12235 879999 105049 -1450548 -1409363 3446152 10132365 12482256 9663696 5558261 1597639
12226 1597639 -3334185 -7533366 -7678654 -4611361 -2292735 -2147722 -3378854 -6472031
12218f472031m272605p02918N452093N981334L92585j241795M967797Q656966
12210A2761426J960663o772409o213303O10958L445605J062440j283119l338090
12202B234171o550626n788470K556355R568930M834877n470785o129700L606276
12194a138972R136099L402842m139146m308295n12805O72097l4550K94268J21585
12185C493123j875089k346241O67943K780007j17868m635694m542961L64698M662084
12176a549998M757941K244384M86505L70700k05728k999879n802262l965447K918058
12167c745726Q296520N882402k113882p744495p031734k858377Q11757K975919
12159e527616L856999L350984K005419P03675o85044k032178j536078J327197
$$ plain form
12218 -6472031 -10744636 -11447554 -5995461 -14127 378458 -863337 4104460 12761426
12210 12761426 14722089 7949680 1736377 2347335 5792940 6855380 5572261 2234171
12202 2234171 -4316455 -10104925 -7548570 2020360 6855237 1384452 -4745248 -1138972
12194 -1138972 7997127 11399969 7260823 2952528 2439723 3111820 3077270 3371538 3493123
12185 3493123 1618034 -728207 -60264 2719743 2601875 -2033819 -6576780 -6212082 -1549998
12176 -1549998 3207943 5452327 5938832 6309532 6103804 3103925 -2698337 -6663784 -3745726
12167 -3745726 4550794 10433196 8319314 574819 -6456915 -9315292 -8503535 -5527616
12159 -5527616 -1670617 1680367 3685786 4389461 3704417 1672239 136161 1463358
12151A463358L032187K87095m052034m047042O99482M326520L125552O1541n12605
12142D384054J246851K200604J020186p76053j388672p87243l37325q52727j450455
12133C259220j068048n08138j043828j451327M59565L315884L309356O47383j24683
12124F795384J916146J512036l955763q745342o815482q51584K483593K363421
12116e297591K583512L584355K377280j157348l848996m213002l068218n66513
12108i606521K883721M483159K426057l52585j96881J607475J588742K0458n80794
12099B272831k79291k77842M20885J984953R11557m161344p634483m498078R99435
12090a0261377J563072j772110k605680k98012R80047J746527N595003R420512
$$ plain form
12151 1463358 4495545 4782640 730606 -3316436 -2616954 1709566 4835118 4896659 4384054
12142 4384054 5630905 7831509 8851695 8075642 6686970 5899727 5562402 4709675 3259220
12133 3259220 2191172 1683034 639206 -812121 -352556 2963328 6272684 6920067 6795384
12124 6795384 8711530 10223566 6267803 -2477539 -9293021 -10144605 -7661012 -5297591
12116 -5297591 -2714079 870276 3247556 2090208 -1758788 -5971790 -9040008 -9606521
12108 -9606521 -6722800 -2239641 186416 -166169 -363050 1244425 2833167 2853625 2272831
12099 2272831 1993540 1715698 2136583 4121536 5033093 871749 -6762734 -11260812 -10261377
12090 -10261377 -8698305 -10470415 -13076095 -13374107 -12394060 -10647533 -5052530 4367982
12082D367982O118765k485914o025697r12401M454571K787077k533472m705576
12074A065335k848327j50694J357735R09112j249345k324487o861K555567P00242
12065H277l075493j886527L803742N938069J868595j608597o4898J937479K45927
12056G166574j581190J39755J922933m15411m222947n059492l942623l636480
12048i628881k542375J548085N455625M473691k79485l471507k658949K03482
12040f900314K557039L281336K476763J368706Q80072k45998l125098m932568
12032d640062k096150K803093L451668j21376j060184K813939M905911Q46482
12024F903321m092300l634431J78443K031334J839571K136747K023615p7170j865796
$$ plain form
12082 4367982 10486747 8000833 1975136 1062735 5517306 8304383 5770911 1065335
12074 1065335 -1782992 -1933686 -575951 333161 -916184 -3240671 -3247532 -691965 8277
12065 8277 -3067216 -4953743 -1150001 4788068 6656663 5048066 4983168 6920647 7166574
12056 7166574 5585384 5725139 7648072 7232661 3009714 -2049778 -5992401 -9628881
12048 -9628881 -12171256 -10623171 -5167546 -693855 -973340 -4444847 -7103796 -6900314
12040 -6900314 -4343275 -1061939 1414824 2783530 3663602 3417604 292506 -4640062
12032 -4640062 -6736212 -3933119 -481451 -602827 -1663011 1150928 6056839 6903321
12024 6903321 2811021 -823410 -644967 1386367 3225938 5362685 7386300 7309130 5443334
12015E443334j195101o73417k701670m101167j551037J766943J351524n89285
12007b249876P78380L949725L584315j34831k022601p25440r5474j945146l671182
11998b532130l442946k383858j208626N51520J833401J138690L24575K518355
11990c201019O021873N405399j80081m666093l225886J273305K928314R25823
11982E281635o57164K18028Q24286j299987l748311k441099J866855L863929J040727
11973D948899k839473l526420j912825p35953O62748L508206M676831R34622l868664
11964A847971l054686K196009M113580N26957k427989j168629L38600p60031r72184
11955F39598J977900M071231K335186J85874L21623o53809m650490o117351p70323
$$ plain form
12015 5443334 4248233 3574816 873146 -3228021 -4779058 -3012115 -1660591 -2249876
12007 -2249876 -1471496 2478229 6062544 5927713 3905112 3179672 3084198 1139052 -2532130
11998 -2532130 -5975076 -8358934 -9567560 -9016040 -7182639 -6043949 -5719374 -3201019
11990 -3201019 2820854 8226253 8046172 3380079 154193 1427498 4355812 5281635
11982 5281635 4624471 4842499 5666785 4366798 618487 -1822612 44243 3908172 4948899
11973 4948899 2109426 -1416994 -3329819 -4065772 -3403024 105182 4782013 5716635 1847971
11964 1847971 -1206715 989294 5102874 5629831 3201842 2033213 2371813 1611782 639598
11955 639598 2617498 6688729 9023915 9209789 9531412 8877603 4227113 -1890238 -2660561
11946b660561N696284N454225L04921k318674j116882n31888j552711j092775
11938B181939J006173J607580R5334j362581k202409k917608j985616J430269
11930b146919L932756K452176j02390N54595K523313J150697k371963k897910
11922C094355k70745P72927j040884k132681j028836l37582j207276j418255J27918
11913c441059J616280J666088Q17691k58054r60418k09833J388251R48222j943293
11904c76125l077843k14188K198828J41311k447532m0420M407110L826371j230865
11895C186647l868626k285072j221822k592270l100893j307358P11214K687750
11887g790430N520337N915056K27729o631605n627554K371755O870220L571717
$$ plain form
11946 -2660561 3035723 8489948 8794869 6476195 5359313 4827425 3274714 2181939
11938 2181939 3188112 4795692 4891026 3528445 1326036 -1591572 -3577188 -2146919
11930 -2146919 1785837 4238013 4135623 4690218 7213531 8364228 5992265 3094355
11922 3094355 2823610 3596537 2555653 422972 -605864 -943446 -2150722 -3568977 -3441059
11913 -3441059 -1824779 -158691 659000 400946 -559472 -769305 618946 1567168 -376125
11904 -376125 -3453968 -3668156 -1469328 -1328017 -3775549 -3815969 591141 4417512 3186647
11895 3186647 -681979 -2967051 -4188873 -6781143 -9882036 -11189394 -10478180 -7790430
11887 -7790430 -2270093 3644963 3872692 -2758913 -8386467 -6014712 855508 4427225
11879D427225n13153m72853p88233m252725m578454K184473P916823L704910n522622
11870B105391p776865j552232L574803K465200O57672L448443O938487M494208
11862A4355107k568533o224216k708335K328866J601026l639817n226831L09577
11854a773156O515242N814109n95532n642098n907682l372503k08856K610004
11846b560472L241536J134375j82113K011189L961050J081808l136525k015926
11838C534922K271313J457365m242467n527686m0852K775034k352523o883151
11830i008045k266390N958999P092198J353519k814871k738032k706141l696462
11822h825225j640990L976367P696357N708306M03057l822292n071140l572326
$$ plain form
11879 4427225 3914072 3441219 2652986 -1599739 -6178193 -3993720 3923103 7628013 2105391
11870 2105391 -5671474 -7223706 -3648903 -1183703 -526031 2922412 9860899 14355107
11862 14355107 11786574 5562358 2854023 5182889 6783915 3144098 -2082733 -1773156
11854 -1773156 4742086 10556195 9960663 4318565 -1589117 -4961620 -5170476 -2560472
11846 -2560472 681064 1815439 1633326 3644515 7605565 8687373 5550848 3534922
11838 3534922 5806235 7263600 3021133 -2506553 -2547405 227629 -2124894 -9008045
11830 -9008045 -11274435 -5315436 1776762 3130281 315410 -2422622 -5128763 -8825225
11822 -8825225 -10466215 -6489848 1206509 6914815 7317872 3495580 -1575560 -5147886
11814e147886m86005K067522K386518J084628K2181j40536J15216M72984M47408
11805H22030p55460k406941k056558R97363L805959L284768J12884k548232k781523
11796a525710j073620P52383R48820k14238K9422L115812N588739L172735k156949
11787H637394m273858k151796q83058k477426k763544Q7662J502993r09488k024204
11778e255325J915457N662700L126069k280811l135092L16048J965441L25333
11770B639820q65039o30917j535936l312758k894118n40410M80807N2091R28420
11761e678040K684392K157076k09872p05621Q48326Q60660j174606j945293r51497
11752d114475j152411k042796O11569O128288P585682K585331j938682m86266
$$ plain form
11814 -5147886 -5633891 -3566369 -1179851 -95223 -73042 -213578 -98362 374622 822030
11805 822030 66570 -2340371 -4396929 -3399566 406393 3691161 3804045 1255813 -1525710
11796 -1525710 -2599330 -1846947 -898127 -1112365 -1082943 2032869 7621608 10794343 8637394
11787 8637394 4363536 2211740 1328682 -1148744 -3912288 -3824626 -2321633 -3231121 -5255325
11778 -5255325 -3339868 2322832 5448901 3168090 32998 349046 2314487 2639820
11770 2639820 1774781 1143864 -392072 -3704830 -6598948 -7139358 -6658551 -6606460 -5678040
11761 -5678040 -2993648 -836572 -1046444 -1752065 -903739 -43079 -1217685 -3162978 -4114475
11752 -4114475 -5266886 -7309682 -6698113 -569825 7015857 9601188 7662506 7176240
11744G176240K194130m91699n430841m877685M10720K344548j032028k635543
11736b342158J128517L731337n98718o277434m059247M616745R418305O231374
11728A1848721J851741J888571K389877j701539o649559n733123o63844R86131
11720D216976k161077m057548j880411K56262k77813k59199K321579L677496Q15421
11711B651686k881270l058476q01466N27836P22726J036388J001809O21515J583245
11702A403993K874995L08129n478706o593617O46876P690690M930291l706176
11694B076475o312639k47868N682998N258447J697056l33233j122185k030116
11686D668935j938764l72636P54949N84608M88572P02531k36223j972065k202551
$$ plain form
11744 7176240 9370370 8878671 3447830 -1429855 -1019135 1325413 293385 -2342158
11736 -2342158 -1213641 2517696 1918978 -4358456 -8417703 -3800958 5617347 11848721
11728 11848721 13700462 15589033 17978910 16277371 9627812 3894689 3230845 4216976
11720 4216976 2055899 -2001649 -3882060 -3625798 -3903611 -4162810 -1841231 1836265 2651686
11711 2651686 -229584 -3288060 -4089526 -3561690 -2838964 -1802576 -800767 -179252 1403993
11702 1403993 4278988 4587117 -891589 -7485206 -6838330 852360 5782651 2076475
11694 2076475 -4236164 -4484032 1198966 6457413 8154469 7821236 6699051 4668935
11686 4668935 2730171 2357535 3112484 3697092 4185664 4888195 4651972 2679907 477356
11677D77356o35186N14418N7320j426901l494537m882956k544900L663709P529196
11668g42481L616807l995251o739047l606180o40326J32608K249952N447143M592635
11659C15860l18641k577259O8185J677107j057880l179996q90806J986022J839695
11650b137713J329731K343880J215310k999482l843251J772304O173126K622799
11642F476704l094709k322356J970556J231456l476556m277498r91814m49309
11634d933526k966321j991093K605575L201958j571197l168968K621285Q189707
11626A987420O201742M22192j659960J30645J356366R05701q2420k431868n834072
11617I95746n676981N36489O876285N868568n28825l746234j219710J074236q14354
$$ plain form
11677 477356 -157830 356588 413908 -1012993 -4507530 -9390486 -11935386 -8271677 -742481
11668 -742481 2874326 -1120925 -7859972 -11466152 -12106478 -11973870 -9723918 -4276775 315860
11659 315860 -2781 -2580040 -2511855 -834748 -1892628 -5072624 -5963430 -3977408 -2137713
11650 -2137713 -807982 1535898 2751208 -248274 -4091525 -2319221 3853905 6476704
11642 6476704 3381995 1059639 3030195 4261651 785095 -3492403 -4484217 -4933526
11634 -4933526 -7899847 -9890940 -7285365 -4083407 -5654604 -8823572 -6202287 1987420
11626 1987420 8189162 8611354 6951394 7082039 8438405 9344106 9261686 6829818 995746
11617 995746 -4681235 -4144746 2731539 8600107 8071282 4325048 3105338 4179574 3365220
11608C365220k908049p29360L199655L714185J140405R03J279129J139818k242464
11599G959442n080662l359370J201426L455602J427633k278629m607885m499409
11591e781852j788789K715618N716401L786763j428759l942650j256528K126882
11583A47086J669107m37959M91912L570919L691553l76911m433667n267603l919202
11574d864765k062187L33702K525738K372705J45750n03828K241769M954974L468748
11565H612606j123541l856732k476630n688l37743l052084m015642r03909L493714
11556c665649M865887L150685J880883J878927k13806n275765q077026m324518
11548i780382K159165M453461K231478N82048R18428q3732k858513l560282j446132
$$ plain form
11608 3365220 457171 -272189 2927466 6641651 7782056 7782959 9062088 10201906 7959442
11599 7959442 2878780 -480590 720836 4176438 5604071 3325442 -1282443 -5781852
11591 -5781852 -7570641 -4855023 861378 4648141 3219382 -723268 -1979796 147086
11583 147086 1816193 1378234 1870146 5441065 9132618 8755707 4322040 -945563 -4864765
11574 -4864765 -6926952 -6593250 -4067512 -1694807 -1549057 -2052885 188884 5143858 8612606
11565 8612606 7489065 3632333 1155703 1150015 812272 -2239812 -6255454 -7159363 -3665649
11556 -3665649 1200238 4350923 6231806 8110733 7896927 2621162 -5455864 -9780382
11548 -9780382 -7621217 -3167756 -936278 -354230 564198 480466 -2378047 -5938329 -7384461
11539g384461n63162j813999l50423N448840Q938186M479576l204302n081069
11531D69186j07282M521749L813399J54846j798968j055647j63299j478451m234792
11522A20741m904944j435840K975275L008752j335181m068766j498796K778302
11514d360457L553939Q77821j720403k460464j625097K95111J934112J602504
11506a902934O43453K144515M401646J718430n085393o638192P21495O633931
11498B636951J448076p659577o745572L406794R099422N238906J005412K523585
11490A0953997L539301j667621p489194o079874R27951O362195O915199L260219
11482A6722173l235117q847351q288942k071810K394360J419885M35167L851975
$$ plain form
11539 -7384461 -7947623 -9761622 -10112045 -4663205 4274981 8754557 5550255 469186
11531 469186 361904 4883653 8697052 8851898 7052930 5997283 5833984 4355533 120741
11522 120741 -4784203 -6220043 -3244768 -236016 -1571197 -5639963 -7138759 -4360457
11514 -4360457 -806518 71303 -1649100 -4109564 -5734661 -5439550 -3505438 -1902934
11506 -1902934 -1259481 885034 5286680 7005110 1919717 -4718475 -3996980 2636951
11498 2636951 4085027 -3574550 -10320122 -6913328 2186094 7425000 8430412 10953997
11490 10953997 14493298 12825677 5336483 -743391 184560 6546755 13461954 16722173
11482 16722173 13487056 4639705 -3649237 -5721047 -3326687 -1906802 -1471635 2380340
11474B380340O666525L044340l035031l963644n99017M41753j858076k991156
11466H6034k117114k477594l618979j577281K943056M263256Q39539j972543j19226
11457c750852L642841M491183J613270k118694l436263r77638K997786L736124
11449F197757j30082l412331j237571K883406J641426m557707p546455l300733
11441i462290K982507N371938M262758K392990k4083k516778k056136J902943
11433B853849M194778O58520m859590n251418j96717L462703J172553l726425
11425a691747m999487j395852K388603J896837j540973k605310Q25094M459375
11417b663460L462202l40071q32447L193297N713991J978351m509839o589543
$$ plain form
11474 2380340 9046865 12091205 9056174 5092530 4493513 4935266 3077190 86034
11466 86034 -2031080 -4508674 -8127653 -9704934 -6761878 -2498622 -1659083 -3631626 -3750852
11457 -3750852 -108011 4383172 5996442 3877748 441485 -536153 2461633 6197757
11449 6197757 6067675 2655344 1417773 4301179 5942605 1384898 -6161557 -9462290
11441 -9462290 -6479783 -1107845 3154913 5547903 5523820 3007042 950906 2853849
11433 2853849 7048627 7707147 2847557 -2403861 -2600578 862125 2034678 -1691747
11425 -1691747 -6691234 -8087086 -5698483 -3801646 -5342619 -7947929 -7122835 -2663460
11417 -2663460 798742 458671 -373776 2819521 8533512 10511863 6002024 -587519
11409e87519k708231J867955K347623j92747j390621M13383K397597J294255k197367
11400A244328m320373l102658k66368K046544L814233N018331L989198N68719
11392H991954j749576m53808J472891m4116l282757l501555j119413p13544k193207
11383b593131l93814M915258O222495n60845q456764q396661j348216M364604
11375f247074M745718K987997K196090J393418o06097k073664j028833J494854
11367B862409K578905R73097j360310j483458N79523J211391j759886m608841
11359a007170j936205M791974P762823L381064k747058m274819k514676k027157
11351A428776k458784q28106J324213J45865k725540j883334K393230L724046
$$ plain form
11409 -587519 -3295750 -1427795 919828 727081 -663540 -250157 2147440 3441695 1244328
11400 1244328 -3076045 -6178703 -6445071 -4398527 -584294 4434037 8423235 8991954
11392 8991954 7242378 6788570 8261461 8217345 4934588 1433033 313620 -399924 -2593131
11383 -2593131 -2986945 1928313 8150808 7589963 -866801 -9263462 -10611678 -6247074
11375 -6247074 -1501356 1486641 3682731 5076149 4470052 2396388 1367555 2862409
11367 2862409 5441314 6414411 5054101 3570643 4150166 5361557 3601671 -1007170
11359 -1007170 -2943375 1848599 9611422 12992486 10245428 5970609 3455933 1428776
11351 1428776 -1030008 -1858114 -533901 -388036 -3113576 -4996910 -2603680 1120366
11343A120366P9308k485563L66258M137145K920307j144387j881607O89867R47295
11334D748989k499732m315317j140040K845324K141812k130773m290054j910253
11326f550044K138293M453195M344295K389867q60370l702320l450592M14117
11318h23559M675455N483284K361839j707579l514183k393237m64966l46045k064184
11309A206825k831931r64550J397680J815148K021635M721399P177722M123651
11301A8667579k561824m591771k99873J275689n287039j1406980o970161L104160
11293h070220N777700j45524l294610J387097N556474K258221l390188l835848
11285c756898n84479O01184m85878k65353J462332K141169J265771q1639j789828
$$ plain form
11343 1120366 1199674 -1285889 -919631 3217514 6137821 4993434 3111827 3801694 4748989
11334 4748989 2249257 -2066060 -3206100 -360776 1781036 -349737 -4639791 -6550044
11326 -6550044 -4411751 41444 4385739 6775606 5915236 2212916 -1237676 -823559
11318 -823559 3851896 9335180 11697019 9989440 6475257 4082020 3617054 3271009 1206825
11309 1206825 -1625106 -2589656 -1191976 623172 2644807 7366206 14543928 18667579
11301 18667579 16105755 11513984 11214111 12489800 7202761 -4204219 -11174380 -8070220
11293 -8070220 -2292520 -2438044 -5732654 -4345557 1210917 3469138 78950 -3756898
11285 -3756898 -4341377 -3740193 -4226071 -4491424 -3029092 -887923 377848 296209 -1493619
11276a493619l220784k222842J167263L381516K578999J462328K002177J764448
11268E419486j107253l759484l328293j472369m01834J049140L363494L410683
11260C173570K96281j087238K108818M576510J133650l897832l397118O75136
11252C581777J001391k365840k651644J329700L173270N3872k853848j349948
11244h1270J767622K468681J189679j49106j718892l471927l457568j184972O49440
11235c988313N5966j346287j024396J217371L840459N309765M601397J979953
11227A0645915n82085j631056k327269m229683o107088n519653k365351J657330
11219a0458940N276869O650104L146087l827181p075332k283869M360247L984909
$$ plain form
11276 -1493619 -4714403 -6937245 -5769982 -2388466 190533 1652861 3655038 5419486
11268 5419486 4312233 552749 -2775544 -4247913 -4649747 -3600607 -237113 3173570
11260 3173570 3469851 2382613 4491431 9067941 10201591 6303759 2906641 3581777
11252 3581777 4583168 2217328 -434316 895384 4068654 4122526 1268678 -81270
11244 -81270 1686352 4155033 5344712 5195606 3476714 4787 -3452781 -4637753 -3988313
11235 -3988313 -3932347 -5278634 -6303030 -5085659 -1245200 4064565 8665962 10645915
11227 10645915 10063830 8432774 6105505 1875822 -4231266 -9750919 -12116270 -10458940
11219 -10458940 -5182071 1468033 4614120 786939 -6288393 -8572262 -4212015 -227106
11211b27106j639981k740136L054727P004328K928000l782438m891340o35167
11203i29113K571564J453978j639819l052754j354827J777547K615136o94230
11195G47482m721218m189386Q43696M819426M240015J481365J74070P26606J677866
11186E799922J996011R64307j199407k412370j576502j405509m115012n901138
11178g849698j928233M236496M158418j964595m320336J354722O706753L785396
11170D178923k958418m490754p74234J284040m82386j706633J52697K251935J416577
11161a128253j507953k961683n28060L946411M940610l64174o508341n449740
11153i561183J595087M810644N99838k417158K604116Q748920N687950l792187
$$ plain form
11211 -227106 -1867087 -4607223 -1552496 5451832 8379832 4597394 -293946 -929113
11203 -929113 1642451 3096429 1456610 -1596144 -2950971 -1173424 1441712 747482
11195 747482 -3973736 -8163122 -7319426 -2500000 1740015 3221380 3395450 4122056 5799922
11186 5799922 7795933 8760240 7560833 5148463 3571961 2166452 -1948560 -7849698
11178 -7849698 -9777931 -5541435 -1383017 -3347612 -7667948 -6313226 393527 4178923
11170 4178923 1220505 -3270249 -4044483 -2760443 -3242829 -4949462 -4796765 -2544830 -1128253
11161 -1128253 -2636206 -5597889 -6125949 -2179538 2761072 2396898 -4111443 -9561183
11153 -9561183 -7966096 -3155452 -2555614 -4972772 -2368656 6380264 12068214 8276027
11145H276027p697291k500704L199655K500365j552984l356863k659459j759159
11137e550413m56684K233189M606642L918109J98628l402316l582924J9319M008232
11128A991782M207463L93176l297453l699373k076822p11803P59376K796114L020626
11119C383086j33599l410978k856249P4966J152328K27941L21319J381168P57638
11110H97620p87306L21766L537342L946652K95482k530431j322313M26330j389812
11101C395330m639155m350690m33218K063970k90137n043082o532969j845803
11093a7675754N658372Q946259M693747k408607m865514j398048K408258K508599
11085b132688J184186J745726K726307R69579k254251k621749O30851L362318
$$ plain form
11145 8276027 578736 -1921968 1277687 3778052 2225068 -1131795 -3791254 -5550413
11137 -5550413 -6007097 -3773908 832734 4750843 4949471 1547155 -2035769 -2016450 1991782
11128 1991782 6199245 6592421 3294968 -404405 -2481227 -3193030 -2433654 362460 3383086
11119 3383086 3249487 -161491 -3017740 -2942774 -1790446 -1562505 -1241186 139982 897620
11110 897620 110314 432080 3969422 7916074 8211556 5681125 4358812 4785142 3395330
11101 3395330 -1243825 -5594515 -6027733 -3963763 -4253900 -9296982 -15829951 -17675754
11093 -17675754 -12017382 -3071123 1622624 -785983 -5651497 -7049545 -4641287 -2132688
11085 -2132688 -948502 797224 3523531 4493110 2238859 -382890 247961 3610279
11077C610279K110644j883220m845751m439940j103491K475144K842139q49267
11069b083463m330809k067646M926514Q609751M274318j990586j278626M912537
11061A0971990O500664Q413o210975n143903j518778k688744n725865k803556
11053f610754M359812O106378L50015m029719j381425K795736K182602o72232
11045C100413p65063K32004j783105m857136l923245O66024L926267L812194K629436
11036C037789K141936J813666J035785k38039j778551j807188J713242O217913
11028A2136553N383578j622885o878310m707101n22871j815115n417184k954598
11020f397933M293865O654893J578391k772936j183305J344365k76242k589137
$$ plain form
11077 3610279 5720923 3837703 -1008048 -5447988 -6551479 -4076335 -1234196 -2083463
11069 -2083463 -6414272 -8481918 -3555404 5054347 9328665 7338079 6059453 10971990
11061 10971990 17472654 17481067 11270092 6126189 4607411 1918667 -3807198 -6610754
11053 -6610754 -2250942 3855436 4205451 175732 -1205693 1590043 3772645 3100413
11045 3100413 2335350 2567354 784249 -4072887 -7996132 -7330108 -3403841 408353 3037789
11036 3037789 5179725 6993391 8029176 7791137 6012586 4205398 5918640 12136553
11028 12136553 17520131 15897246 9018936 4311835 3788964 1973849 -3443335 -6397933
11020 -6397933 -2104068 4550825 6129216 3356280 2172975 3517340 3241098 651961
11012F51961o99882K694803J951605k043644l409875k36743L334111L408919O55782
11003F307037j988471l112624l308242l108032j771468J192153L882062L471269
10995A563684M73753j116204M36984J881424N21361j208586n07805M09628j064002
10986A390237j834371J518443M704312J646091l942148l103766K981253L767617
10978G127668k916165o337726o81379M776252J144466m995767k585801N487715
10970A019263P046594m04768p099744o167388j047535K701994M159717M034487
10962D242620K101462l88296j219360j300277l254399n552013l704159J829225
10954g245197M805362K092469j883437j912068J362524M094507M529780L029815
$$ plain form
11012 651961 -47921 2646882 4598487 2554843 -855032 -1091775 2242336 5651255 6307037
11003 6307037 4318566 1205942 -2102300 -5210332 -6981800 -5789647 -1907585 1563684
10995 1563684 2037437 921233 1358217 3239641 3761002 2552416 2044611 2454239 1390237
10986 1390237 -444134 1074309 5778621 7424712 3482564 378798 3360051 7127668
10978 7127668 4211503 -2126223 -2807602 1968650 3113116 -1882651 -4468452 1019263
10970 1019263 8065857 7661089 561345 -5606043 -6653578 -3951584 208133 4242620
10962 4242620 6344082 5955786 4736426 3436149 181750 -5370263 -9074422 -7245197
10954 -7245197 -2439835 -347366 -2230803 -4142871 -2780347 1314160 5843940 8873755
10946H873755K39176k161926j743126J262307L277571K008221p40975k416417
10938H598586k940439k859277j564610L66962L82437j717548j980614J692457
10930b2046M934397K770606k426158m154121j464898M93044o07068j150951J082849
10921e44346K500472r2452l683102l733038j082015N11948R49527K549796L966095
10912A342885J428716l906384n779967j614023L581993M488017K204231O09383
10904B354851m1041j747849l775640l612255j595652m54021p48100l59428J535128
10895h444007L042471K414332J57652j747469j374362J387084L294728L69859
10887h99712n656656o871328O44435R321157Q874763N92319m544729j612979K690164
$$ plain form
10946 8873755 9112931 6951005 5207879 6470186 9747757 11755978 11015003 8598586
10938 8598586 5658147 2798870 1234260 1601222 1983659 266111 -1714503 -22046
10930 -22046 4912351 7682957 5256799 1102678 -362220 130824 -476244 -1627195 -544346
10921 -544346 1956126 1863674 -1819428 -5552466 -6634481 -6122533 -5173006 -2623210 1342885
10912 1342885 2771601 -1134783 -6914750 -8528773 -4946780 -458763 1745468 2354851
10904 2354851 2313810 565961 -3209679 -6821934 -8417586 -8871607 -9619707 -9979135 -8444007
10895 -8444007 -5401536 -2987204 -2829552 -4577021 -5951383 -4564299 -1269571 -899712
10887 -899712 -6556368 -13427696 -12783261 -3462104 5412659 6004978 1460249 -152730 2537434
10878B537434J956758r14637q01400Q12687R069j919246j440076L05641j58373
10869C87857k026168j917185k75169k67853j595667j005481J670825L198522K422755
10860E92436J351874Q91377q3826j443744j665312p65828L67414K550523N828995
10851G623909O014894l24628q161899q386832p33775M926632K466935k464197
10843I61039k092681K238778L858304J102705k003101k599938j358234K43359
10835C50231Q83498p28610l600884m095671q42834K627736L294099L134555M115203
10826E137323K898773l235798q529476m905913N013875R561380L974654l196840
10818F717978k771778K832558M874358Q39962l991673n016405l068327j218595
$$ plain form
10878 2537434 4494192 3579555 2778155 3590842 3599911 1680665 240589 546230 387857
10869 387857 -1638311 -3555496 -3830665 -4098518 -5694185 -6699666 -5028841 -1830319 592436
10860 592436 1944310 2835687 2751861 1308117 -357195 -1123023 -755609 1794914 7623909
10851 7623909 13638803 13314175 5152276 -3234556 -3968331 958301 3425236 961039
10843 961039 -1131642 1107136 4965440 6068145 4065044 1465106 106872 350231
10835 350231 1233729 505119 -3095765 -7191436 -8034270 -5406534 -2112435 1022120 5137323
10826 5137323 8036096 4800298 -3729178 -8635091 -3621216 5940164 9914818 6717978
10818 6717978 3946200 6778758 11653116 12493078 8501405 3485000 416673 -801922
10810h01922o55813m01670P12112K233511K073298q01406l863702l434867K7841
10801d912618J890496k29043k910986j783792K531611N687010N056499J780643
10793G109820j256403j814203n0959R42375j753401o312531p449356l622743N32355
10784a3675046J185616P35143K643166M639655K324397k811684m790065j749038
10776a1497856K250988L921358M085582L823109K253352n12620k393781k652561
10768g22429k486895j525303J877916N703140M815350j061440n056436k688360
10760a144457R56596j063556o190263n696415J719898P124530M002859k611464
10752b902272l871926L77391K673053j88773k878613o48474K988200K019556k190649
$$ plain form
10810 -801922 -1457735 -1859405 -1147293 1086218 3159516 2358110 -1505592 -4940459 -4912618
10801 -4912618 -3022122 -3251165 -6162151 -7945943 -5414332 272678 5329177 7109820
10793 7109820 5853417 4039214 3988255 4930630 3177229 -3135302 -10584658 -14207401 -13675046
10784 -13675046 -12489430 -11754287 -9111121 -4471466 -2147069 -4958753 -9748818 -11497856
10776 -11497856 -9246868 -5325510 -1239928 2583181 4836533 4323913 1930132 -722429
10768 -722429 -3209324 -4734627 -2856711 2846429 7661779 6600339 1543903 -1144457
10760 -1144457 -187861 -1251417 -7441680 -13138095 -11418197 -4293667 -290808 -2902272
10752 -2902272 -6774198 -6396807 -3723754 -3912527 -6791140 -7439614 -4451414 -2431858 -4622507
10743d622507k767642J877833N523781L906292R58210J583880L222332K50898
10735I933077o180445r047355n298643Q86467M698718N287556L345379m28772
10727C195982l108777j067052M030603N525863Q54053m137989l435487P00870
10719B558066J984806m70258k324037j784056j484081k628003k560968J72932
10711f535599K461423J024831k366745l109414m5088L396164M265228L508433
10703B599233L238378L074421J559798m04775q08371n51614k272733m795756l459090
10694a820509K084505N334396J920767l314427l424618N1209K27597l556504m895665
10685g393249r68044L312579L381573R43059n40581r14647j222085r89624k03201
$$ plain form
10743 -4622507 -7390149 -5512316 11465 3917757 4875967 6459847 9682179 9933077
10735 9933077 3752632 -5294723 -10593366 -9706899 -5008181 279375 3624754 3195982
10727 3195982 87205 -979847 3050756 8576619 9430672 5292683 1857196 2558066
10719 2558066 4542872 4072614 1748577 -35479 -1519560 -4147563 -6708531 -6535599
10711 -6535599 -4074176 -3049345 -5416090 -8525504 -8570592 -5174428 -909200 2599233
10703 2599233 5837611 8912032 10471830 10067055 9258684 8707070 6434337 1638581 -1820509
10694 -1820509 263996 5598392 7519159 4204732 780114 831323 1058920 -2497584 -7393249
10685 -7393249 -8361293 -5048714 -1667141 -724082 -1264663 -2179310 -3401395 -4391019 -4594220
10676d594220l30050j412289j565513n63255j04260J71435K285297M844307L858944
10667B590396j85106k119614o33807l81016l122770l966865j23563L684271L242514
10658a015560J501267J847221J456195k179964m447093j051082L102297J111049
10650C24330l935980l442331K730837O160599K998647j459139k005677J17307
10642A488593J564361J623858R76256J29680J8853Q01428M71104k001219l736780
10633A336134k182778l7774r16602k495401k94502L490457K398150l369047o148582
10624h219945k323940K455805K267077p74073q30329L119047O712728N991231
10616H397601J278985l501642m405200j451744J222154O57859q83428K41249K901016
$$ plain form
10676 -4594220 -4924270 -6336559 -7902072 -8465327 -8569587 -8398152 -6112855 -1268548 2590396
10667 2590396 2405290 285676 -348131 -729147 -3851917 -7818782 -7942345 -4258074 -1015560
10658 -1015560 485707 2332928 3789123 1609159 -2837934 -3889016 -786719 324330
10650 324330 -3611650 -7053981 -4323144 1837455 4836102 3376963 1371286 1488593
10642 1488593 3052954 4676812 5653068 5782748 5801601 6603029 7074133 5072914 1336134
10633 1336134 -846644 -884418 -1801020 -4296421 -4590923 -1100466 1297684 -2071363 -8219945
10624 -8219945 -10543885 -8088080 -5821003 -6595076 -7425405 -4306358 2406370 8397601
10616 8397601 9676586 6174944 1769744 318000 1540154 2198013 1314585 1555834 4456850
10607D456850K836772l84246k520919j109410J231007J044739j480895l582104
10599D91794l378712j223420J162742K309678K138777J275476l54801k598082
10591a76548l268727m17073L506157L835141P68075n66107J549321K686781K26807
10582H143827k106663j134343M61154p9049n56155O50757J90457l621566n833330
10573c884911k551693K280466L906296M136537N064710K701233m777529r519738
10565b644629m661591L540391M782612M75779q11131J265843M10263k860340k263139
10556b765942J478415J296442l222378m779045n14470M593860O369464M906538
10548G362884P76455m007974m009054K069350N896367J002136n621646m421225
$$ plain form
10607 4456850 7293622 6909376 4388457 3279047 4510054 5554793 4073898 491794
10599 491794 -2886918 -4110338 -2947596 -637918 1500859 2776335 2421534 -176548
10591 -176548 -3445275 -3862348 -356191 3478950 4247025 3680918 5230239 7917020 8143827
10582 8143827 6037164 4902821 5363975 5284926 4728771 5379528 5569985 1948419 -3884911
10573 -3884911 -6436604 -4156138 -249842 3886695 8951405 11652638 6875109 -2644629
10565 -2644629 -7306220 -3765829 1016783 1492562 681431 1947274 2357537 -502803 -2765942
10556 -2765942 -1287527 8915 -3213463 -7992508 -8506978 -3913118 2456346 7362884
10548 7362884 8139339 4131365 122311 2191661 8088028 9090164 3468518 -952707
10540i52707M60603q00124n425647l510617K774402K668486l178242l802657K172645
10531i593858N150191K679175J797334L359563J239944k829880j148114L319682
10523C974037L91976p252479o601351K635020P335721M086820K349598L612972
10515A0532314o85808q678678q202576J94461L258104k12681J211895O543122
10507C960153L615030l755431J69298J0419612O261740q886270j0178382K195276
10499C801026K126906j0601626p027110J1893732R847569j3585542j1632624K1474858
10491F297189K6128458j2144994j0157163P7823459J46764988P2586264q8155472
10484B19142729j56453304p7262442J9711691K3197268k0112906j9458227J4564167
$$ plain form
10540 -952707 -492104 -1292228 -6717875 -10228492 -7454090 -4785604 -7963846 -11766503 -9593858
10531 -9593858 -4443667 -1764492 32842 3392405 4632349 1802469 654355 3974037
10523 3974037 4366013 -2886466 -9487817 -6852797 482924 4569744 6919342 10532314
10515 10532314 9846506 1167828 -7034748 -6840287 -3582183 -3794864 -2582969 3960153
10507 3960153 7575183 3819752 3989050 14408662 20670402 11784132 1605750 3801026
10499 3801026 5927932 -4673694 -11700804 192928 10040497 -3545045 -15177669 6297189
10491 6297189 32425647 20280653 10123490 87946949 234711937 307298201 219142729
10484 219142729 62689425 -14573017 5138674 28335942 8223036 -11235191 3328976
10477C328976J7734132r026620j6013512K132514Q283734m520944q702443J502949
10469e281214M957158j733464j444938N986635M172705n479113o005912J898479
10461b929664K211804m269184k138673O725843M808223p799829j1596084j099845
10453a6087409P372637M866824J414655L599606L663162k418103o060611k450488
10445f099727J143434J9225Q0793M914434P933080L860056k443941m197766j639471
10436C570117J086702J473781q66963l899722l597176M31242K477011o09946l119899
10427c054853J70460M342900K782955j027768m89516J514437j202347m897266
10419a860998j954282M171555L855687j911422l645962k94082K09300l288020
$$ plain form
10477 3328976 21063108 12036488 -3977024 -1844510 6439224 1918280 -6784163 -5281214
10469 -5281214 -324056 -2057520 -3502458 2484177 6656882 1177769 -4828143 -2929664
10461 -2929664 -717860 -4987044 -7125717 -399874 4408349 -3391480 -14987564 -16087409
10453 -16087409 -8714772 -3847948 -2433293 1166313 4829475 2411372 -3649239 -6099727
10445 -6099727 -4956293 -4937068 -4856275 58159 7991239 11851295 9407354 5209588 3570117
10436 3570117 4656819 6130600 5263637 1363915 -2233261 -1802019 674992 65046 -3054853
10427 -3054853 -2884393 1458507 4241462 3213694 2724178 4238615 3036268 -1860998
10419 -1860998 -3815280 356275 4211962 2300540 -1345422 -1639504 -1430204 -4718224
10411d718224k963130L209626P443107N243616J355803J83223N4814q21556j252836
10402G734443j284945j965956j012247L570160O854725K725344n165043p507606
10394C948875l187275N51632N24711J54858N75383n37955j807604J54058K702801
10385C079484Q94745k204618k9790M243909J614355o133638p461914P8461N873217
10376d5789L809373K77857O38867Q15835k149588l235143L22676K480654j043195
10367A871547m806141k968794J434908K825670J496857J52345j153246j755673
10359b902527J023726N557404N394035m86896m323839j124184L905402M358517
10351A1401638J600807m23674j992538l690945k773860Q11300J476930l158036
$$ plain form
10411 -4718224 -7681354 -4471728 2971379 8214995 9570798 9754021 9808835 8987279 7734443
10402 7734443 6449498 4483542 3471295 7041455 13896180 16621524 11456481 3948875
10394 3948875 761600 1313232 1837943 1992801 2568184 2030229 222625 376683 3079484
10385 3079484 3974229 1769611 1739821 5983730 7598085 1464447 -5997467 -5919006 -45789
10376 -45789 3763584 4041441 4680308 5496143 3346555 111412 434088 2914742 1871547
10367 1871547 -2934594 -5903388 -4468480 -1642810 -145953 6392 -1146854 -2902527
10359 -2902527 -1878801 3678603 9072638 8585742 4261903 3137719 7043121 11401638
10351 11401638 13002445 12578771 10586233 6895288 4121428 4932728 6409658 3251622
10343C251622o938508m409632R74111L496840L506670L322883J613280j838519
10335B978747k470119J239773K955198j406152n597328l067601J689400J026126
10327b651956k658379j951659K090990K531172n28873o67786K858885M384504
10319C406898K432601J109533J029999j429921n304293n037629o22352J484560
10311b930604n31050r69670K415688L776027k57649l831930j451929K760513K155743
10302A135139j455882j339383K853119M690212J089626l251124k558216K700638
10294C864129O590083M227593k897769p854741n541186J055999M314404J860888
10286E619400r60964M1794J552705r52555m883411m297200M09987K955790P86291
$$ plain form
10343 3251622 -3686886 -8096518 -7122407 -3625567 -118897 3203986 4817266 2978747
10335 2978747 508628 1748401 4703599 3297447 -2299881 -5367482 -3678082 -2651956
10327 -2651956 -5310335 -7261994 -5171004 -2639832 -3168705 -3836491 -977606 3406898
10319 3406898 5839499 6949032 7979031 6549110 1244817 -3792812 -4415164 -2930604
10311 -2930604 -3461654 -4431324 -2015636 1760391 1502742 -2329188 -3781117 -1020604 1135139
10302 1135139 -320743 -1660126 1192993 5883205 6972831 3721707 1163491 3864129
10294 3864129 10454212 14681805 11784036 3929295 -1611891 -555892 3758512 5619400
10286 5619400 4658436 4700230 6252935 5300380 416969 -3880231 -3470244 -514454 271837
10277B71837j885083j516933j15335n96402j908583j579139K55277J960861K830117
10268b283383K348579p0409k684840k094803J414762K978985N13864j327249J227746
10259B3252L875343P42904n241768o035733j032841K158541j45757k725158o80427
10250i061644L458586N044487L817904J641049j155735l719530l574996q09631
10242d359510R82954N73357R26656K680634K044133j371581j809705K571301M482820
10233F721059p91981n943107k916902K899527J031004o159696o774769J249139
10225a0685726P361252N765916K680596L173012K874081j773412n385223k719422
10217A291074K112464K599824l10731j993611k340837l574828m399357k708291
$$ plain form
10277 271837 -1613246 -3130179 -3245514 -3841916 -5750499 -7329638 -7074361 -5113500 -2283383
10268 -2283383 65196 -5213 -2690053 -4784856 -3370094 -391109 122755 -1204494 23252
10259 23252 3898595 4641499 -600269 -6636002 -7668843 -5510302 -5656059 -8381217 -9061644
10250 -9061644 -5603058 -558571 3259333 4900382 3744647 25117 -3549879 -4359510
10242 -4359510 -3376556 -2803199 -1876543 804091 2848224 1476643 -333062 2238239 6721059
10233 6721059 5929078 -14029 -2930931 -31404 999600 -5160096 -11934865 -10685726
10225 -10685726 -3324474 2441442 5122038 8295050 11169131 9395719 4010496 1291074
10217 1291074 3403538 6003362 5692631 3699020 1358183 -2216645 -6616002 -9324293
10209i324293m26959N8103O24952L126942M433768J751646j115802L86258L067251
10200B581866J024257l663274l900193K94277J933244n16489n72171M061657O153206
10191G396380P10657n802899m897878Q90690K341681k095851m608517n46758M806646
10182a805849M441899o70324l740424j279573L345895M614445Q71947m267518
10174A510498n593217j630271L527889M549550Q79896l137227m068604k834704
10166f796190j644403n31093J056996J936898J353632J260029K968994L416404
10158C021267p89946o536963o615678L38132P105984O914189J294582l242635
10150A488932l082381L09275L347025L148815m96545m245053m299017j324850
$$ plain form
10209 -9324293 -9751252 -9693149 -9068197 -5941255 -1507487 244159 -871643 -485385 2581866
10200 2581866 3606123 -57151 -3957344 -3663067 -1729823 -2246312 -2818483 1243174 7396380
10191 7396380 8107037 2304138 -2593740 -1703050 638631 -1457220 -6065737 -6612495 -1805849
10182 -1805849 2636050 1965726 -1774698 -3054271 291624 4906069 5778016 1510498
10174 1510498 -4082719 -5712990 -2185101 2364449 3244345 107118 -3961486 -6796190
10166 -6796190 -8440593 -8971686 -7914690 -5977792 -4624160 -3364131 -395137 3021267
10158 3021267 2231321 -4305642 -10921320 -10583188 -3477204 3436985 4731567 1488932
10150 1488932 -1593449 -1284174 2062851 5211666 4715121 470068 -3828949 -5153799
10142e153799N13402M2078M39471K696150K896614q30830l679670j156202L350440
10133h82346L538862j49445j790200P33839L538221L394573J402506l44782j502199
10124G939029k154710j941623j084390j71735Q54302J859992J848370Q11765L74494
10115H335494P94957m545k243651k576496M25281K868112J426730j171500r56914
10106F897468Q32420J030062L08107K04206j365803n283337o338545p62952N387722
10097I09348M069941j915578l444854L87644K735761K002689K810853M612029
10089A2167833J568134n100221o758008j713246J782638p5500j125687J863471
10081B609414K844009j414274m414116j772967Q87852q02425j494772K784536
$$ plain form
10142 -5153799 -4640397 -4598319 -4158848 -1462698 1433916 603086 -3076584 -4232786 -882346
10133 -882346 2656516 2507071 716871 1450710 4988931 8383504 9786010 9441228 7939029
10124 7939029 5784319 3842696 2758306 2586571 3440873 5300865 7149235 7961000 8335494
10115 8335494 9130451 9125906 6882255 4305759 4731040 7599152 9025882 7854382 6897468
10106 6897468 7729888 8759950 9068057 9272263 7906460 2623123 -3715422 -4478374 909348
10097 909348 4979289 3063711 -381143 6501 2742262 4744951 7555804 12167833
10089 12167833 13735967 8635746 1877738 164492 1947130 1871630 745943 2609414
10081 2609414 5453423 4039149 -374967 -2147934 -1260082 -2062507 -3557279 -772743
10073g72743N496356J227689l217504k90936M450577K064780l693734l193190
10065B071295K048693L036639j97702j27535K648561J08904o969860q026727l44434
10056e752166N622924K851390k004302p97706L391405K832740k405499n627586
10048a888800l244856J901187M625851J940665m108058p044870k740957M257228
10040f302610N798232J503441j036194J738395M392330K216494j188380o43996
10032F477712J944258J250886k808166n460803m154919r50572J054796O38809
10024b007999j311988k541543j466596O50731J356155R33067J619476K761781
10016f916J152372k683827l592060M20770M352893L476392L4133j220676k00661
$$ plain form
10073 -772743 4723613 5951302 2733798 2442862 6893439 8958219 5264485 2071295
10065 2071295 4119988 7156627 6958925 6831390 9479951 9588855 2618995 -5407732 -5752166
10056 -5752166 -129242 2722148 717846 -79860 3311545 6144285 3738786 -1888800
10048 -1888800 -5133656 -3232469 1393382 3334047 -774011 -7818881 -10559838 -6302610
10040 -6302610 -504378 999063 -37131 1701264 6093594 8310088 7121708 6477712
10032 6477712 8421970 9672856 6864690 1403887 -2751032 -3701604 -2646808 -2007999
10024 -2007999 -3319987 -5861530 -7328126 -6677395 -5321240 -4388173 -2768697 -6916
10016 -6916 1145456 -1538371 -5130431 -4709661 -356768 3119624 3153757 1933081 1732420
10007A732420K16401l30254n85814j199700k638368k304489J224578L685962O21276
9998D22012m640148m908577J5558L201438J337828j266337p14983J016097J118934
9989d418178O89598J267441J500598O03242Q12673K919977L393976j91769m413565
9980B163993m675195j545534J388349K800949K784302K98476l726406m265935
9972d777001R88747N761255K951567m051449n650170n23506K808175l89077m504093
9963g385552l231481J797462N532855O229084M153284m03638m310121k821308
9955d39415K628207M075454j362767o203807m092508L60522N8324k625147q86220
9946h487357M224869N855904K905657N43274O32731j5469k364531l566787k524300
$$ plain form
10007 1732420 1948821 1618567 1032753 -166947 -2805315 -5109804 -3885226 -199264 422012
9998 422012 -4218136 -9126713 -9111155 -5909717 -4571889 -5838226 -6553209 -5537112 -4418178
9989 -4418178 -3728580 -2461139 -960541 -357299 455374 3375351 6769327 6577558 2163993
9980 2163993 -2511202 -4056736 -2668387 132562 2916864 3215340 -511066 -4777001
9972 -4777001 -3788254 1973001 4924568 873119 -4777051 -5300557 -2492382 -2881459 -7385552
9963 -7385552 -10617033 -8819571 -3286716 2942368 7095652 6692014 2381893 -439415
9955 -439415 2188792 6264246 4901479 -1302328 -5394836 -5034314 -4975990 -7601137 -8487357
9946 -8487357 -4262488 1593416 4499073 5042347 5675078 5659609 3295078 -271709 -2796009
9937b796009p78125J320519L453067K362335l184255o891111k478117N285632
9929c706064O243078K91502k969384J6503K307103l47701k645745k7346L502876
9920B664822K846820l62655k156984k242277j701708m09046K63467j950095m586886
9911g634542k060400M841452Q320335M986435K46232j508515k734629n147526
9903f91158m948602m62038L307083K737199R28291M98604j209996m986084n723150
9894a0549851p21136N275773P643124O866077L148673m103226q762611k710255
9886c913432Q087448P929854k293717k702663J0805785J2006761j5541069m3995522
9878b9616555l5241153L005994K6905052J7598263J49086r38808O763045O929644
$$ plain form
9937 -2796009 -3574134 -2253615 1199452 3561787 377532 -6513579 -8991696 -3706064
9929 -3706064 2537014 2828516 -140868 -124365 2182738 1835037 -810708 -838054 2664822
9920 2664822 5511642 5148987 2992003 749726 -951982 -1361028 -1097561 -3047656 -7634542
9911 -7634542 -9694942 -4853490 3466845 8453280 8699512 7190997 4456368 -691158
9903 -691158 -5639760 -6101798 -2794715 -57516 870775 1369379 159383 -4826701 -10549851
9894 -10549851 -11270987 -5995214 1647910 8513987 11662660 7559434 -1203177 -3913432
9886 -3913432 4174016 12103870 9810153 7107490 17913275 29920036 14378967 -29616555
9878 -29616555 -64857708 -61851714 -34946662 -17348399 -17199313 -18138121 -11375076 -4445432
9870d445432J970623J123433J208161l571274p029356k109633M498279L333082
9862e022117j536242r71836K452809J75726n675455n288869K113467P036149M371753
9853b344615r15701k871934j106283K122970M800534M657769P68426m098984n980242
9844d968060l799598J003400O288686Q621138M979516j958781m789701j164633
9836D211967K400122N81423k681553j796368N94873j092441m670760l597061J346935
9827d702863K912038m86345k157786J793403O178120M545385k013288p167881
9819a099217o952129k388728K851944N078834K748967j879331m196836j782695
9811g619191K895534N036421K488610k216870m754314l567866q89105Q51643J920217
$$ plain form
9870 -4445432 -2474809 -1351376 -143215 -3714489 -10743845 -12853478 -8355199 -5022117
9862 -5022117 -6558359 -7530195 -5077386 -4901660 -10577115 -15865984 -13752517 -6716368 -2344615
9853 -2344615 -3260316 -6132250 -7238533 -5115563 -315029 4342740 5111166 1012182 -4968060
9844 -4968060 -8767658 -7764258 -1475572 7145566 12125082 10166301 5376600 4211967
9836 4211967 6612089 7193512 4511959 2715591 3310464 2218023 -2452737 -6049798 -4702863
9827 -4702863 -1790825 -2277170 -4434956 -2641553 3536567 8081952 6068664 -1099217
9819 -1099217 -8051346 -10440074 -7588130 -2509296 239671 -1639660 -5836496 -7619191
9811 -7619191 -4723657 312764 2801374 584504 -4169810 -7737676 -8626781 -7775138 -5854921
9802e854921L171926L100925K00011k895730j854367K655900N047329K535559
9794F106632j401112k677648j555077j19614J071269J581512K48555j885571j694090
9785c25144O31580O99538k726296m454728r76803L041472J733676k583265l301843
9776h261813J36461K580360K112620J697180K364550J528792j145887k357803
9768a345540j196805j000258k992143l224185Q90107N183625M078459j174116
9760g80856l904839r14559L677847M036599l62875m534533l821398J065017M843103
9751f96494L272190k155994n475306k545775M128641P642315M137279k720393
9743E586463n773303k470104K816338M803438L219922J188703O0008j160465k471173
$$ plain form
9802 -5854921 -2682995 417930 617941 -2277789 -4132156 -1476256 3571073 6106632
9794 6106632 4705520 2027872 472795 353181 1424450 3005962 3254517 1368946 -325144
9785 -325144 306436 1005974 -1720322 -6175050 -7151853 -4110381 -2376705 -4959970 -8261813
9776 -8261813 -8125352 -5544992 -3432372 -1735192 629358 2158150 1012263 -1345540
9768 -1345540 -2542345 -3542603 -6534746 -9758931 -8868824 -3685199 393260 -780856
9760 -780856 -4685695 -5600254 -1922407 2114192 1751317 -2783216 -6604614 -5539597 -696494
9751 -696494 2575696 419702 -5055604 -7601379 -3472738 4169577 8306856 5586463
9743 5586463 -186840 -2656944 159394 4962832 8182754 9371457 9431465 8271000 5799827
9734E799827k453460j173707m51027p73529n81903Q76806K462034L339355L723619
9725A0768015K999551o1343m366657o551125n171869k519666j143915q00018M1787
9716f805240J689612L280673L716671K118221r88751l174218k848645j656481
9708d668158j410301k40408L905748P436142M949379j297054l014088J517314
9700G178574M213853l0140m965994k981649K905623M202531k37934m069895l701716
9691B513253j620360m87802j08253k29885j398735k762951k652699j053581J179987
9682f621026L959152N963184L867205k315765o135714k371189M518794N733875
9674F598516L94545m148321l639110j536646j554853k283320j365310L93911J500878
$$ plain form
9734 5799827 3346367 2172660 1721633 948104 366201 1243007 3705041 7044396 10768015
9725 10768015 13767566 13706223 9339566 2788441 -2383428 -4903094 -6047009 -6847027 -6805240
9716 -6805240 -5115628 -1834955 1881716 3999937 3011186 -163032 -3011677 -4668158
9708 -4668158 -6078459 -6318867 -2413119 5023023 9972402 8675348 5661260 7178574
9700 7178574 11392427 11362287 6396293 3414644 6320267 10522798 10284864 6214969 2513253
9691 2513253 892893 405091 296838 66953 -1331782 -4094733 -6747432 -7801013 -6621026
9682 -6621026 -2661874 3301310 7168515 4852750 -1282964 -3654153 864641 6598516
9674 6598516 6993061 2844740 -794370 -2331016 -3885869 -6169189 -7534499 -7140588 -5639710
9665e639710K047804J665125o96626l409836k876073Q05906L257966K580942J933153
9656c31349L210957L340020J77951k745483j754288P12827L32837j752879j282887
9647i2294J538249K568072R92733M23679K349329L565192J476040k203218m667726
9638E950056n320294m107647j79648N252809P823786N056316L62578j422895q82868
9629A2532193k438420o665893q682007n150043R59598M599308M669522L376120
9621C200378J979768L30580p41947l1236J200929R4473l325464n110112k414691
9612d817322K117732L163581m26859l719050j817808L452337N526782J947634
9604E427027k171631j888626j02977k312694n961476l015132N848527Q835356
$$ plain form
9665 -5639710 -3591906 -1926781 -2623407 -6033243 -8909316 -8103410 -4845444 -2264502 -331349
9656 -331349 2879608 6219628 6397579 3652096 1897808 2610635 2943472 1190593 -92294
9647 -92294 1445955 4014027 5006760 5430439 7779768 11344960 12821000 10617782 5950056
9638 5950056 629762 -3477885 -3657533 1595276 9419062 14475378 14837956 13415061 12532193
9629 12532193 10093773 3427880 -5254127 -10404170 -9444572 -4845264 -175742 3200378
9621 3200378 5180146 5510726 4768779 4737543 5938472 6032945 2707481 -2402631 -4817322
9612 -4817322 -2699590 463991 37132 -3681918 -5499726 -2047389 3479393 5427027
9604 5427027 3255396 1366770 1263793 -1048901 -7010377 -10025509 -4176982 4658374
9596D658374r7401j0100460p519297M585138J1200554O506908r53988l689271
9588D590557m073476n234512m160536P51982M172044K366478J89593K695097N804068
9579G101295K989604l300818n048231p89061L315894L141964M54629k187565m058862
9570A618849l905990p11145K840308K723605k30823j293466O74713J723537k39557
9561C200031k087842j102193N12883k44098j916656j188256J158127R09698k894392
9552c652698n394247j958957M992965Q081647L908110k973118o305025n317342
9544h618665k987329k84547L063771M236241K75197m968937m093199K389634N465422
9535e522412J242943k933828p04547L085838J479638k418082j598719J884997
$$ plain form
9596 4658374 4560973 -5539487 -13058784 -8473646 2726908 9233816 8279828 4590557
9588 4590557 517081 -4717431 -8877967 -8125985 -3953941 -1587463 -1397870 1297227 7101295
9579 7101295 10090899 6790081 1741850 952789 4268683 7410647 7865276 5677711 1618849
9570 1618849 -2287141 -2998286 -157978 2565627 2334804 1041338 1716051 3439588 3200031
9561 3200031 1112189 9996 522879 278781 -1637875 -2826131 -1668004 -758306 -3652698
9552 -3652698 -9046945 -11005902 -6012937 2068710 5976820 3003702 -3301323 -8618665
9544 -8618665 -11605994 -11890541 -8826770 -4590529 -4315332 -9284269 -13377468 -10987834 -5522412
9535 -5522412 -4279469 -7213297 -7917844 -4832006 -3352368 -5770450 -7369169 -5484172
9527e484172Q94861l061031j889022L955882M643448k400858o678058p19621P823549
9518b915022P743341O48546l085510l07304K332162M37432k280063j737358K9050
9509H65274l57000j296568N83188L586260K580480k818595o657112m892420r59144
9500i365637J19068m53046J617886N017198M076098j021055k601933K882268Q020193
9491H291040M430211m865789r194967m094909M261280P632992L986427k532501
9483G913784o153615m155564L72843J362835k520846n346704k097806L687793
9475f937280N041225J784751j65703J482095K597146R5018l224971l149734K87489
9466b189964L363459K824214j106100m509792l396276R94394K677902j017689
$$ plain form
9527 -5484172 -4589311 -7650342 -9539364 -5583482 -940034 -3340892 -10018950 -10738571 -2915022
9518 -2915022 4828319 5476865 2391355 2084051 4416213 4853645 2573582 836224 865274
9509 865274 508274 -788294 -205106 3381154 5961634 3143039 -3514073 -8406493 -9365637
9500 -9365637 -9246569 -9699615 -8081729 -3064531 1011567 -9488 -2611421 270847 8291040
9491 8291040 12721251 7855462 -1339505 -5434414 -1173134 6459858 10446285 7913784
9483 7913784 1760169 -2395395 -2022552 -659717 -3180563 -8527267 -10625073 -6937280
9475 -6937280 -1896055 -111304 -277007 1205088 3802234 3897252 672281 -2477453 -2189964
9466 -2189964 1173495 3997709 2891609 -1618183 -5014459 -4020065 -1342163 -2359852
9458b359852n016171l713001P81805K648816J538619J437548K545294J523492
9450f13450j018177p88204K061118K355607j194850l383885j028052K067651J475734
9441f6508j726908m006219m038404j838803K432804O262472N472706j13604n051091
9432b673555m700888m38869L169813L382018L01292l722182m684963n77986M655015
9423e290305M865510L06898k218463P51496M473813L511804p57315l532680l474176
9414a363418k380133r41370J326379L533861L839063J754778j421607l644828
9406G02725l341896j134416J07848q43677q01174L268145Q140642P625944J567422
9397A5291563l744934m431752k792526j536606j67291J300095P10758j911548
$$ plain form
9458 -2359852 -7376023 -11089024 -10307219 -7658403 -6119784 -4682236 -2136942 -613450
9450 -613450 -1631627 -2419831 -358713 1996894 802044 -2581841 -3609893 -1542242 -66508
9441 -66508 -1793416 -5799635 -9838039 -11676842 -9244038 -2981566 2491140 2377536 -2673555
9432 -2673555 -7374443 -7813312 -4643499 -1261481 -960189 -4682371 -9367334 -9945320 -5290305
9423 -5290305 -424795 -117897 -2336360 -1584864 2888949 6400753 5643438 2110758 -1363418
9414 -1363418 -3743551 -4684921 -3358542 175319 4014382 5769160 4347553 702725
9406 702725 -2639171 -3773587 -3665739 -4509416 -5310590 -2042445 6098197 13724141 15291563
9397 15291563 11546629 7114877 4322351 2785745 2618454 3918549 4629307 2717759
9389B717759l349136k393810j307233p72766J191047L940622L959609J638438
9381E624530J615302M079829L133666k775490o482642l092698J768235Q13664
9373D684396l786505m942779j674089J206719J150756m46009k096286k755277
9365h659074r50419K613428M478766L595414K946661L094822K1493o310333q123824
9356g293066j044886P041061O286994q83441m378963j442683J883258J735957
9348A904231O7406j341044k521201j915987J492402L867245J249275l068830l129953
9339c396456k59407l06008k723475j646230K791439L961035K53749k459177j430972
9330e215502o03496j189747J471578P568694Q764632O39141q477773q280245m76747
$$ plain form
9389 2717759 -631377 -3025187 -4332420 -5105186 -3914139 26483 3986092 5624530
9381 5624530 7239832 11319661 14453327 11677837 5195195 2102497 3870732 4684396
9373 4684396 897891 -4044888 -5718977 -4512258 -3361502 -3807511 -5903797 -8659074
9365 -8659074 -9609493 -6996065 -2517299 1078115 4024776 7119598 7141091 830758 -7293066
9356 -7293066 -8337952 -1296891 4990103 4106662 -272301 -1714984 168274 1904231
9348 1904231 1971637 630593 -1890608 -3806595 -2314193 1553052 2802327 -266503 -3396456
9339 -3396456 -3655863 -3961871 -6685346 -8331576 -5540137 -1579102 -1325353 -3784530 -5215502
9330 -5215502 -5818998 -7008745 -5537167 2031527 10796159 11435300 2957527 -5322718 -5799465
9321e799465N157641M482902J437769n56939k308224m365758m801402k627352
9313i380828L05226J936321K264987K349876K508860J986063k226k686947l581953
9304d300621j303320J707703J565795j613470l276058m94688L961738N211210
9296A458289K112903k013473l297163q82958K365618K309613j915083n751539
9288e613793l820680K902499P201256M253916k268033m871752j384560L146092
9280d55055L292252l93709k896058j477158R45936J0325l770297n266026j651910
9271a1661700L527365M927330K035820j151429j761415o30505K55588L67879L40315
9262c750752O65948J069905O40849r47782k165253j048152J633695K773574J384072
$$ plain form
9321 -5799465 -641824 3841078 5278847 4721908 2413684 -1952074 -6753476 -9380828
9313 -9380828 -9075602 -7139281 -4874294 -2524418 -15558 1970505 1968279 -718668 -4300621
9304 -4300621 -5603941 -3896238 -2330443 -3943913 -7219971 -7714659 -3752921 1458289
9296 1458289 3571192 1557719 -1739444 -2622402 -256784 2052829 137746 -5613793
9288 -5613793 -9434473 -6531974 669282 4923198 2655165 -2216587 -3601147 -455055
9280 -455055 2837197 2443488 -452570 -1929728 -983792 -973467 -4743764 -10009790 -11661700
9271 -11661700 -8134335 -3207005 -1171185 -2322614 -4084029 -4714534 -4458946 -4091067 -3750752
9262 -3750752 -3084804 -2014899 -1374050 -2321832 -4487085 -5535237 -3901542 -1127968 256104
9253B56104O0634O50427J467688P78108j46241J9725q8714j329429j483393O20949
9243H05858J870619j64952k509272j695267J35878m99457j609181K97083K618378
9234g50313Q40051k021628Q35376P487521Q141304r542p790026p017067o89206
9225i73530L647536L897876K247016l24936l282971m221196j825711J398512K437560
9216C000156J439017J91692k21487R86122L661870M870171J808663k895565l856267
9207H984372j440110j300833m231422m173913P55088L505777n76537n290311l284687
9198g052576K107328K799658r96226k425943R4309J396475q37805k867991j829039
9189i611810N69331K228695L257917L536627K291999P91516J278936K774007K033038
$$ plain form
9253 256104 316738 967165 2434853 3212961 3066720 3086445 2997731 1668302 184909 805858
9243 805858 2676477 2511525 2253 -1693014 -1557136 -2056593 -3665774 -3368691 -750313
9234 -750313 89738 -1931890 -1096514 6391007 14532311 14522769 6732743 -284324 -973530
9225 -973530 2674006 6571882 8818898 8493962 5210991 989795 -835916 562596 3000156
9216 3000156 4439173 4630865 4409378 5395500 9057370 13927541 15736204 12840639 8984372
9207 8984372 7544262 6243429 2012007 -2161906 -1406818 2098959 1522422 -3767889 -7052576
9198 -7052576 -4945248 -2145590 -3141816 -5567759 -5473450 -4076975 -4914780 -7782771 -9611810
9189 -9611810 -9042479 -6813784 -3555867 -19240 2272759 3064275 4343211 7117218 9150256
9180I150256r04328k376664j049930N1885j148580k365771j001780J377663J206557
9171B939308k056393n215902n047127j448874K833719M930344M174516J803009
9163B912600j011007l600763m627594k811175M70653J873028O97098R3553J840030
9154d163577L060640J063890j557419p79127K025177J937793j713389m319324
9146d445336k994607j23866J163736J096418J058592N32084j336872l114877k452552
9137a0617280O03972L275793L023757K79669j875539j008480J636794K434726
9129b246588J88936k092284j587121K22833L08507q26557m09849J211971Q78056
9120d352096j278363p76362L926781P209455L321568m677897p693744k071655
$$ plain form
9180 9150256 8245928 5869264 4819334 4871219 3722639 1356868 355088 1732751 2939308
9171 2939308 882915 -4332987 -9380114 -10828988 -7995269 -3064925 1109591 2912600
9163 2912600 1901593 -1699170 -6326764 -9137939 -8667286 -6794258 -6097160 -6003607 -4163577
9154 -4163577 -1102937 -39047 -1596466 -2375593 -350416 1587377 -126012 -4445336
9146 -4445336 -7439943 -7563809 -6400073 -5303655 -4245063 -3712979 -5049851 -8164728 -10617280
9137 -10617280 -10013308 -6737515 -3713758 -3434089 -5309628 -6318108 -4681314 -2246588
9129 -2246588 -2057652 -4149936 -5737057 -5514224 -5205717 -6032274 -6442123 -5230152 -4352096
9120 -4352096 -5630459 -6406821 -2480040 4729415 8050983 3373086 -4320658 -6392313
9112f392313N887166Q052766L601167k192206n374079n926465m498721j098509
9104g941194K388122K609197k85227j599721J176183L828666J524133l220769
9096a520610l874586K05221L175099K100835O20667J443368J392847k333414n991792
9087d782365m437523P64807L645512K494022J108880J880770K420324J20643l454038
9078b38968m640645k380166P78997J893903Q46268p2608M38430R50142l8095j207763
9068c670505n02428J113591J291701Q39047K227912L777624R59913n230391p447099
9059f640635k572952K879333K449505p45715k10100K828574K132520k365095m321461
9050f566026j573156P59222p35180k275396N86375N754180P587128M475445K32692
$$ plain form
9112 -6392313 -505147 7547619 11148786 8956580 3582501 -2343964 -6842685 -7941194
9104 -7941194 -5553072 -2943875 -3229102 -4828823 -3652640 176026 1700159 -1520610
9096 -1520610 -5395196 -5189975 -2014876 85959 706626 2149994 3542841 1209427 -4782365
9087 -4782365 -9219888 -8455081 -4809569 -2315547 -1206667 674103 3094427 3215070 -238968
9078 -238968 -4879613 -7259779 -6480782 -4586879 -3740611 -3813219 -3374789 -2424647 -2462742 -3670505
9068 -3670505 -4172933 -3059342 -1767641 -928594 1299318 5076942 6036855 806464 -6640635
9059 -6640635 -9213587 -6334254 -3884749 -4630464 -4840564 -2011990 120530 -2244565 -6566026
9050 -6566026 -8139182 -7379960 -8115140 -10390536 -9804161 -4049981 3537147 8012592 8245284
9041H245284j095330L35244J109612p78197l096920k471717K36655O68169k169489
9032I83311l754907j138518J963986J038918j920272j994266N66962J514841O3230
9023b676715o87403J78621O01123L34083R72881J477197o23345l454719k193326
9014f071603K895382N603060K579878k207591l763475k158833k32250P05412O83943
9005a966077q7374n03200M71598J353295j67370k872181l218044j100898M02q88909
8995h978758q32640J366401K972189K204023Q23446M43268N19450J031106K658686
8986B207171L585387J199986k309863j819980K291199L941892J064476j429381
8978H730887o25561j58792k497342m011380k033231l8497j039501k170208o71428
$$ plain form
9041 8245284 7149954 7485198 8594810 7816613 4719693 2247976 2484631 3152800 983311
9032 983311 -2771596 -3910114 -1946128 -907210 -2827482 -4821748 -4254786 -2739945 -2676715
9023 -2676715 -3364118 -3185497 -2584374 -2250291 -1277410 199787 -423558 -3878277 -6071603
9014 -6071603 -3176221 2426839 5006717 2799126 -964349 -3123182 -3355432 -2650020 -1966077
9005 -1966077 -2053451 -2556651 -2085053 -731758 -899128 -3771309 -6989353 -8090251 -8089849 -8978758
8995 -8978758 -9811398 -8444997 -5472808 -3268785 -2445339 -2002071 -1482621 -451515 2207171
8986 2207171 5792558 6992544 4682681 2862701 5153900 9095792 10160268 8730887
8978 8730887 8105326 7946534 5449192 1437812 -595419 -633916 -1673417 -3843625 -4515053
8969d515053J032242J011890J790627L571460J293003n277877p006817P72011
8961g328514Q184609M918190l121584l622264J893534K237430k863233k721057
8953b422889M005501N644802k170156p848758k419111O078459N751807j504468
8945E115187n442696l403879o88535N30294K826606N737263M792535r90883o374343
8936B101549o010291k77863N395541N516454k55701n831382m673491J858344N191234
8927C014394L73924p219545q870433l251198L267646N006584K187886j203150
8919f693892j805027P34987M010290N337540M161028J479936j908379m533122
8911G83361l402063J966798N970881K994884l231374l310460L541743O956721
$$ plain form
8969 -4515053 -3482811 -2470921 -680294 2891166 4184169 -1093708 -8100525 -7328514
8961 -7328514 856095 5774285 2652701 -969563 923971 3161401 298168 -2422889
8953 -2422889 1582612 7227414 5057258 -2791500 -5210611 867848 6619655 5115187
8945 5115187 -327509 -3731388 -4419923 -3889629 -1063023 4674240 9466775 8475892 2101549
8936 2101549 -3908742 -4186605 1208936 6725390 6469689 638307 -4035184 -2176840 3014394
8927 3014394 3388318 -3831227 -12701660 -15952858 -12685212 -7678628 -5490742 -6693892
8919 -6693892 -8498919 -7763932 -3753642 1583898 5744926 7224862 5316483 783361
8911 783361 -2618702 -651904 5318977 8313861 5082487 1772027 5313770 12270491
8903A2270491Q33823o767371n556120J782368M720447R84131j841406N80681L493643
8894A0500687J539607l704279o931175n362881k22938M708070N396339J477620
8886G401050k256280j431845J765625J977557r37282k127213j57192P28356j937179
8877C025597m739819m282729k391755k083937k162594K02089L970114N272431
8869c190603K842571q01761l094158l648413k821972n06588K731351M776323L763901
8860E0651P46439p37418J149714L620264K565041j407916l223178n63725K667992
8851D867864K363639M6401r07131j411607l871195n880400l316557J352805J161681
8842e594500m249792o934819k410751L657126M275280O93673j597667j480548
$$ plain form
8903 12270491 13104314 6336943 780823 2563191 7283638 8267769 6426363 7007044 10500687
8894 10500687 12040294 8336015 1404840 -3958041 -4180979 527091 5923430 7401050
8886 7401050 5144770 3712925 5478550 7456107 6518825 4391612 4234420 4962776 3025597
8877 3025597 -1714222 -5996951 -8388706 -10472643 -12635237 -12433148 -8463034 -3190603
8869 -3190603 -348032 -1149793 -4243951 -7892364 -10714336 -11220924 -8489573 -3713250 50651
8860 50651 797090 59672 1209386 4829650 7394691 5986775 2763597 2199872 4867864
8851 4867864 7231503 7277904 6370773 4959166 1087971 -4792429 -8108986 -6756181 -5594500
8842 -5594500 -9844292 -16779111 -19189862 -15532736 -11257456 -10563783 -12161450 -13641998
8834a3641998j176149l10522K714784N457483L728546j253088l358672Q7691M631880
8825c120045M627764p9380m648977m605039N9496N030077N751156J971885k301063
8816B685874l604893k194868m3608J687101J971021j72499l048781k790460Q60698
8807d650415K746370k46815l565780j591771L325857M381821P21183k240900j862480
8798b982930q03107n90489L60639J455165k96490l428913k121259L918355O761464
8789B272435J878299m020579k691818L268941M842654Q4583m250739l382154N8327
8780a940051J728157J148509K31060K91612J799076M028508M226835J16750n950951
8771E679505q211890m178563J979695M155746J132847k556561k229536J354137
$$ plain form
8834 -13641998 -14818147 -15128669 -12413885 -6956402 -3227856 -4480944 -7839616 -7751925 -3120045
8825 -3120045 1507719 1428339 -3220638 -7825677 -7766181 -2736104 3015052 4986937 2685874
8816 2685874 -919019 -3113887 -3157495 -1470394 500627 328128 -2720653 -5511113 -4650415
8807 -4650415 -1904045 -2150860 -5716640 -7308411 -3982554 399267 1120450 -1120450 -2982930
8798 -2982930 -3786037 -4376526 -4015887 -2560722 -2857212 -6286125 -8407384 -4489029 2272435
8789 2272435 4150734 130155 -2561663 707278 5549932 5634515 1383776 -1998378 -1940051
8780 -1940051 -211894 936615 1167675 1459287 3258363 7286871 11513706 11630456 5679505
8771 5679505 -2532385 -6710948 -4731253 -575507 557340 -1999221 -4228757 -2874620
8763b874620K915977k28594l647291j432592M406964N401947r52607o216111k804887
8754e431814M511866N560763m02887m854898l422285m72932K92546J218398L844686
8745H43443M266291p7962m644608l903771P05212L621938L007846J450066J039716
8736F308171J528079J841417O93901k540870n572767m416844R94085N458808N104424
8727I398404J972951l93671j821592k821968j695255J365711J812485k347499
8719E469566n472742k317486K883705K727061j350896k028124J096469J406462
8711B414015k243475l038246J762862N576861K986174k279999m148278k529098
8703a499184n98952N83356P05912j369071m098118l226460J380560M191953K400818
$$ plain form
8763 -2874620 41357 -187237 -3834528 -5267120 -860156 4541791 3589184 -2626927 -5431814
8754 -5431814 -919948 4640815 4237928 -616970 -4039255 -4512187 -4219641 -3001243 843443
8745 843443 5109734 5031772 387164 -3516607 -2811395 810543 3818389 5268455 6308171
8736 6308171 7836250 9677667 10371568 7830698 2257931 -2158913 -1164828 4293980 9398404
8727 9398404 11371355 10977684 9156092 6334124 4638869 6004580 7817065 5469566
8719 5469566 -3176 -2320662 563043 3290104 1939208 -88916 1007553 2414015
8711 2414015 170540 -2867706 -1104844 4472017 7458191 5178192 1029914 -1499184
8703 -1499184 -2098136 -1514780 -808868 -2177939 -6276057 -9502517 -8121957 -3930004 -1529186
8694a529186j89637q64720k264149m699174k667080M611039P816656J377253n284233
8685c693231j239483P841491Q059498p14707n696477k304798P55766j223825j633098
8676A51136L167277N968307J876725k375092l51779K853140L35782m101048l116712
8667D407736J031865R78239k711419l389265m13008O40458j342043j415925K089230
8658a24132M719179L433649K99265k400244m819646o314950m976656j531967Q87606
8649a0827896J452067J762166J521189q11518l212773j769877K368711L797398
8641e720533J600700Q28459L394853M335995M80603l532529k630297N68820O09833
8632f4096j766392j615308J515448L056002J013270j217434l63846K293683L203738
$$ plain form
8694 -1529186 -1718823 -2583543 -4847692 -9546866 -12213946 -7602907 213749 1591002 -3693231
8685 -3693231 -4932714 2908777 10968275 10253568 4557091 2252293 3008059 1784234 151136
8676 151136 3318413 9286720 11163445 8788353 8436574 11289714 11625496 7524448 4407736
8667 4407736 5439601 6417840 3706421 317156 -95852 544606 -797437 -2213362 -124132
8658 -124132 4595047 8028696 8327961 5927717 1108071 -5206879 -10183535 -11715502 -10827896
8649 -10827896 -9375829 -7613663 -6092474 -6903992 -10116765 -11886642 -9517931 -5720533
8641 -5720533 -4119833 -3291374 103479 4439474 4920077 1387548 -1242749 -673929 -64096
8632 -64096 -1830488 -3445796 -1930348 1125654 2138924 921490 557644 2851327 6055065
8623F055065Q55233l006356n026331l037732J594369M808710M050888Q43983j708198
8614E429631k491651k168568j232150k42852m84820k230369l532681k635903k70393
8605i859756K069873M079542M886418K282968k946875m928224J09332O628771
8597B322049N948340j151741n041781j467538K432975j59200n011073l933923
8589f061892K214072N154752J753758k496335k703483n89768N03357R33869J971850
8580F80180J985099o58764l497338k748956J006424L410120K381032O64539J606351
8571D828687M305525M378333n75959o979575q043575j738402N303742M937801
8563F416577j714360n209526j090609L343215J85134o130194m906028L932769
$$ plain form
8623 6055065 6910298 3903942 -1122389 -4160121 -2565752 2242958 6293846 7137829 5429631
8614 5429631 2937980 769412 -462738 -705590 -1190410 -3420779 -6953460 -9589363 -9859756
8605 -9859756 -7789883 -3710341 1176077 3459045 512170 -4416054 -4306722 2322049
8597 2322049 8270389 7118648 2076867 609329 3042304 2883104 -2127969 -6061892
8589 -6061892 -3847820 1306932 3060690 564355 -2139128 -2728896 -2225539 -1291670 680180
8580 680180 2665279 2006515 -1490823 -4239779 -3233355 176765 2557797 3222336 4828687
8571 4828687 9134212 13512545 12936586 5957011 -2086564 -3824966 1478776 6416577
8563 6416577 4702217 -507309 -1597918 1745297 1930431 -4199763 -9105791 -5173022
8555e173022Q644180L028411m321362l259626K980021L922144j721214m979735
8547h80203r64907M403589M014135q21154l954834l104837r54200p8648l92762
8538b733821o55359L6095J839761L645676L432685M51964l218065m290682j580227
8529c071973K531864M038678J217638l132666m326035j264894K162641K193380
8521C48633l78108k710960m170154m786142k240311M358148R360616O037987k603132
8512C216577n856473l43217M591588R16183n790080n072560K565238P254861M758028
8503F240145Q93250P53503J672218o16959n038494p597325o474443k235592L315993
8494i087704O567799M361781j033861l217769k26260K526797P90810j854598l56886
$$ plain form
8555 -5173022 3471158 6499569 2178207 -1081419 1898602 5820746 4099532 -880203
8547 -880203 -1845110 2558479 6572614 5751460 1796626 -1308211 -2262411 -2341059 -2733821
8538 -2733821 -3389180 -3353085 -1513324 2132352 5565037 6017001 2798936 -1491746 -3071973
8529 -3071973 -540109 3498569 4716207 1583541 -2742494 -4007388 -1844747 348633
8521 348633 -29475 -2740435 -6910589 -11696731 -13937042 -9578894 -218278 5819709 3216577
8512 3216577 -2639896 -2983113 1608475 2524658 -3265422 -8337982 -5772744 1482117 6240145
8503 6240145 7133395 7886898 9559116 8942157 3903663 -3693662 -10168105 -12403697 -9087704
8494 -9087704 -2519905 1841876 808015 -2409754 -2636014 -109217 681593 -1173005 -1529891
8485a529891L057196K545475j635555l792429k058552j82103J48880J804516N155339
8476C512876N112171j014796p802644q450079l607653J040370K935007L401289
8468d873459K677019o3379k704100j849916J433910K729196J494134J703686M127941
8459D675032L934942j212126o110924n249416p99053J448662Q20412J006820K700748
8450A215097K767833K51454j894804j519009K57455J656805J953904N46384k389320
8441B845799m492399l698890j502268k70552J245177M878141O964583K109614
8433H079205o723771r512753k812214N168416O550172L657474K115436J198839
8425G720804j966665m298734j394700L256454K533944k598217m306041l94103
$$ plain form
8485 -1529891 1527305 4072780 2437225 -1355204 -3413756 -3595859 -3446979 -1642463 3512876
8476 3512876 8625047 7610251 -192393 -8642472 -12250125 -11209755 -8274748 -4873459
8468 -4873459 -2196440 -2259819 -4963919 -6813835 -5379925 -2650729 -1156595 547091 4675032
8459 4675032 8609974 7397848 1286924 -3962492 -4761545 -3312883 -2492471 -1485651 1215097
8450 1215097 3982930 4234384 2339580 820571 1078026 2734831 4688735 5235119 2845799
8441 2845799 -1646600 -5345490 -6847758 -7118310 -5873133 -994992 5969591 8079205
8433 8079205 1355434 -8157319 -10969533 -5801117 749055 4406529 6521965 7720804
8425 7720804 5754139 1455405 60705 3317159 5851103 3252886 -1053155 -1447258
8417a447258K944604J820945j57323K53507M85149j681033k988682n65875K041749
8408G05783K1354m777041o160825k084973L323311N170119K145170l320542o577085
8399a1554729l866641L326338Q251702N891477r98067n236121l539039R60179
8391f764901L498127K306418j015465l289788k115639J644065M152874L054462
8383A470153O39264L86092J545140M14801l269556m983622j775740K947760L365461
8374G39753j353047n795649m494353J834713O819256N220779j136420n196862
8366c361830k851912K258589L734797P53840j592227J4514K864427L111156J487835
8357F419189J123993J904016R38133j997155l514608j909589P7874m37277k209798
$$ plain form
8417 -1447258 1497346 3318291 3160968 3414475 3899624 2218591 -770091 -1335966 705783
8408 705783 727137 -4049904 -10210729 -12295702 -8972391 -3802272 -1657102 -4977644 -11554729
8399 -11554729 -15421370 -12095032 -3843330 2048147 1050080 -4186041 -7725080 -6764901
8391 -6764901 -3266774 -960356 -1975821 -5265609 -7381248 -5737183 -1584309 1470153
8383 1470153 2109417 2495509 4040649 4455450 1185894 -3797728 -5573468 -2625708 739753
8374 739753 -613294 -6408943 -10903296 -9068583 -2249327 2971452 1835032 -3361830
8366 -3361830 -6213742 -3955153 -220356 533484 -1058743 -1044229 1820198 4931354 6419189
8357 6419189 7543182 9447198 10385331 8388176 4873568 2963979 3041853 2604576 394778
8348C94778k291358o12272P39073J345110K291534K952219J562299r39335j375644
8339D066404N27008J221439q81267k577371j313205L74390m52392j493996O75355
8330A46365L470694J649063l299332m354867k90017J946032r28849k126372L911020
8321A23737J0286068O434670n176438j0966071n017500L415925M144526n55215
8313B689702k367363k90504L14237j405074p00117L046617L784403j233325n763985
8304a925409l640577J552375K109667j643670k336478J908977M003465m14978
8296c86628m980598j863554N741434P592570J032921n679093n310679l00422L024779
8287a129270L228680K672369J786844m05728k225176r80102J895467J987865j446256
$$ plain form
8348 394778 -1896580 -2508852 -1769779 -424669 1866865 4819084 6381383 5442048 4066404
8339 4066404 4593412 5814851 4933584 2356213 1043008 1417398 965006 -528990 146365
8330 146365 3617059 5266122 1966790 -2388077 -2678094 -732062 -1660911 -3787283 123737
8321 123737 10409805 16844475 11668037 701966 -4315534 -899609 3244917 2689702
8313 2689702 322339 31835 346072 -1059002 -1759119 1287498 5071901 3838576 -1925409
8304 -1925409 -5565986 -4013611 -1903944 -3547614 -5884092 -3975115 28350 -386628
8296 -386628 -5367226 -7230780 -1489346 6103224 7136145 1457052 -3853627 -4154049 -1129270
8287 -1129270 2099410 4771779 6558623 6152895 3927719 2947617 4843084 6830949 5384693
8278E384693m125908l110975p34169l30481j306445j082673M40683J349461J154102
8269b361712Q36027M29896n17288p60348J098823L052939J432862k991766m620765
8260d401332p65604L924571L950644O33198j023803n38488j275275k781832p85232
8251c063153M065180M655648j787637p617302n042712K261168M689267P82363
8243a057178k094490j84695J804376j47000k720177j304031K801601N329260N170190
8234G597856L602538P22617l236919n523822l877214l09267J546082J323123R94154
8225B839148P79993m31648j820975j388147O66499K297656K551740J528213j069104
8216E953375m184391m128007P03406N312293L454966l096756o304248l190344
$$ plain form
8278 5384693 1258785 -1852190 -2586359 -2916840 -4223285 -5305958 -4865275 -3515814 -2361712
8269 -2361712 -1525685 -1095789 -1613077 -2373425 -1274602 1778337 3211199 219433 -4401332
8260 -4401332 -5166936 -1242365 2708279 3341477 2317674 1779186 503911 -2277921 -3063153
8251 -3063153 1002027 5657675 3870038 -3747264 -8789976 -6528808 -1839541 -1057178
8243 -1057178 -3151668 -3336363 -1531987 -1678987 -4399164 -5703195 -2901594 2427666 7597856
8234 7597856 11200394 11923011 8686092 3162270 -714944 -1024211 521871 1844994 2839148
8225 2839148 3619141 3187493 1366518 -21629 644870 2942526 5494266 7022479 5953375
8216 5953375 1768984 -2359023 -1655617 3656676 7111642 4014886 -2289362 -5479706
8208e479706P18443Q85522K74520K761888N606525L881618j127149l787261k648730
8199A085670j556219k619092l245268j246808J293327J389966k85214n87320J595156
8190d175802M001760L996221J621337q44479j869099k142797k502473j694991
8182c610323J608928N028108M027587j548435n830862m329347j01520R88711j219916
8173d987069k118657m21135M19653o86949j6922L781198N496362Q85034n447538
8164c096023n477981O37142M466831J163163m262911m785584q43499J912044J445417
8155h841401J035234K727488L832632J700285j296000o41023L629913O176663
8147H323791K899756l726669p213463m207282K075193N476347L145449k086099
$$ plain form
8208 -5479706 -4761263 -3875741 -3601221 -839333 4767192 8648810 7521661 3734400 1085670
8199 1085670 -470549 -3089641 -6334909 -7581717 -6288390 -4898424 -5183638 -5770958 -4175802
8190 -4175802 -174042 3822179 5443516 4599037 2729938 587141 -1915332 -3610323
8182 -3610323 -2001395 3026713 7054300 5505865 -324997 -4654344 -4755864 -3767153 -4987069
8173 -4987069 -7105726 -7526861 -7107208 -7794157 -7811079 -4029881 1466481 2351515 -3096023
8164 -3096023 -8574004 -7936862 -3470031 -2306868 -6569779 -11355363 -12198862 -10286818 -8841401
8155 -8841401 -7806167 -5078679 -1246047 454238 -841762 -1482785 2147128 8323791
8147 8323791 11223547 7496878 283415 -3923867 -1848674 3627673 6773122 4687023
8139D687023n070106l521818K75393K500752J795726l1299n85665O95192K447904
8130C193102K724155M02067l673080o640483n802483j547292K674417L923818
8122d745779K560890Q76360K8193n01326j147008j388254n63842J263820L083298
8113e33648L295712J300949p79760K22606L756253M712719J42109n147018m074803
8104B895119K186199M545385j516070q923919q278584m59929N212461L814323
8096e25015J73574N57232L846007M122547l55833m501423l032878K608554N716954
8087H609719K256347m357247p304779m094320J338289L737504J768106j894120
8079E9499l619638j512371K930637N322988K729293k083996l513378p42072J337232
$$ plain form
8139 4687023 -383083 -3904901 -3629508 -1128756 666970 635671 50006 745198 3193102
8130 3193102 5917257 6319324 2646244 -3994239 -9796722 -11344014 -8669597 -4745779
8122 -4745779 -2184889 -1308529 -1280336 -1781662 -2928670 -4316924 -4880766 -3616946 -533648
8113 -533648 2762064 4063013 3283253 3505859 7262112 11974831 12116940 6969922 2895119
8104 2895119 5081318 9626703 8110633 -813286 -9091870 -9551799 -4339338 -525015
8096 -525015 -351441 205791 4051798 8174345 7818512 3317089 284211 2892765 8609719
8087 8609719 10866066 6508819 -795960 -4890280 -3551991 185513 1953619 59499
8079 59499 -3560139 -5072510 -2141873 3181115 5910408 3826412 313034 -429038 908194
8070I08194J28617o86672J705256L366831L02391l241584n45817N859050O636653
8061A4432919k45416o247879n067987r07642k39900k092233j781655O49166J597950
8052I7323M83318k12715K36404L77125k01788p48771j218639j330096N17418M334061
8042B333640O463144L831430j326464m303083l849664k001039P518J699190J090241
8033C944913k826015o386460m930402J61178K828537Q10768k006010k292485j427670
8024a2123646j415025j115874R83002L540983M390382L484363J967663M13761
8016A25609n28754J06076J770233K366754J236651K3880m41097j426297l026776
8007B06279k633108Q84795L981228K634061j683520l531405o78812L126947L154243
$$ plain form
8070 908194 1036811 350139 2055395 5422226 5724617 2483033 1937216 7796266 14432919
8061 14432919 14187503 7939624 2871637 1963995 1724095 -368138 -2149793 -1500627 97323
8052 97323 580641 367926 604330 981455 779667 30896 -1187743 -2517839 -2000421 2333640
8042 2333640 8796784 12628214 11301750 6998667 3149003 1147964 1155482 2854672 3944913
8033 3944913 1118898 -5267562 -10197964 -10036786 -7208249 -6397481 -8403491 -10695976 -12123646
8024 -12123646 -13538671 -14654545 -13671543 -10130560 -5740178 -2255815 -288152 125609
8016 125609 -403145 -297069 1473164 3839918 5076569 5100449 4659352 3233055 206279
8007 206279 -2426829 -1542034 2439194 5073255 3389735 -141670 -820482 2306465 5460708
7998E460708o13478l954803l660247j027557K42068j037558k081169j66090L387995
7989c450131N007910L601205J129891r30016k670884l259715j046384K558345
7981I40221L011970r65343m074885j287838M127041M277543j993239o677473l530231
7972f172234L045086M214536p69860l950234p29326L476033J996096k517028k353896
7963c760827K678673M455229q09313o417679n226823L26649L446524L310034L620667
7954A623134M236350J801831k660988m260579k351729j205765j976325j037047
7946e831118K235183L253097M44297j283959R38134K514698o18115m404894l114289
7937e866966J239921K545645L20749r94845j80827J95066K7772J575509L396349
$$ plain form
7998 5460708 4847230 892427 -2767820 -3795377 -3553309 -4590867 -6672036 -6838126 -3450131
7989 -3450131 1557779 5158984 6288875 5358859 2687975 -571740 -1618124 940221
7981 940221 3952191 2986848 -1088037 -2375875 1751166 6028709 4035470 -2642003 -6172234
7972 -6172234 -3127148 1087388 317528 -3632706 -4362032 -885999 1110097 -1406931 -3760827
7963 -3760827 -1082154 3373075 2563762 -3853917 -9080740 -8754091 -5307567 -1997533 1623134
7954 1623134 5859484 7661315 5000327 739748 -1611981 -2817746 -4794071 -5831118
7946 -5831118 -3595935 -342838 101459 -1182500 -244366 2270332 1652217 -2752677 -5866966
7937 -5866966 -4627045 -2081400 -1760651 -2755496 -2936323 -2741257 -2713485 -1137976 2258373
7928B258373J310337l558817m273495J892272Q367816P685165R86406m531809
7920A0136248m842652k025889K51750M75102j038075l116714l934616k320655
7912f415501M66213J790978J158450J142551L433046N254632K397843m019340
7904E208872p047240k371591N161754P080201K113634k878117k830347l41843
7896D095323K03371l97071J099676L813374L562364p38384n315664o285244l655674
7887c617929m50303N79873m84637p36769J932350M910298L164769l315741p806322
7878e824411n250814Q17530L468052J749333K52094J211549K369799K137538J669591
$$ plain form
7928 2258373 3568710 9893 -4263602 -2371330 5996486 13681651 14668057 10136248
7920 10136248 5293596 3267707 3519457 3994559 2956484 -160230 -4094846 -6415501
7912 -6415501 -5949288 -4158310 -2999860 -1857309 1575737 6830369 9228212 5208872
7904 5208872 -1838368 -4209959 951795 8031996 10145630 7267513 4437166 4095323
7896 4095323 4298694 3901623 5001299 8814673 12377037 11638653 6322989 37745 -3617929
7887 -3617929 -4068232 -3488359 -3972996 -4709765 -2777415 2132883 5297652 1981911 -5824411
7878 -5824411 -11075225 -10257695 -6789643 -5040310 -4788216 -3576667 -1206868 930670 2600261
$$ [...]
##END NTUPLES=NMR SPECTRUM
##END=
