##TITLE=31Pdec_SR34
 , 124 sc
 10.03.2021
##JCAMPDX= 6.0         $$ Bruker NMR JCAMP-DX V2.0
##DATA TYPE= NMR SPECTRUM
##DATA CLASS= NTUPLES
##ORIGIN= UXNMR, Bruker Analytische Messtechnik GmbH
##OWNER= root
$$ XWIN-NMR		Version 3.5
$$ Wed Mar 10 12:24:10 2021 Russian Standard Time (UT+4h)  she@DPX200
##.OBSERVE FREQUENCY= 81.013821
##.OBSERVE NUCLEUS= ^31P
##.ACQUISITION MODE= SIMULTANEOUS
##.ACQUISITION SCHEME= undefined
##.AVERAGES= 124
##.DIGITISER RES= 16
##SPECTROMETER/DATA SYSTEM= spect
##.PULSE SEQUENCE= zgpg30
##.SOLVENT NAME= CDCl3
##.SHIFT REFERENCE= (INTERNAL, CDCl3, 0, 248.564)
##AUDIT TRAIL= $$ (NUMBER, WHEN, WHO, WHERE, WHAT)
$$ ##TITLE= Audit trail, XWIN-NMR		Version 3.5
$$ ##JCAMPDX= 5.01
$$ ##ORIGIN= Bruker BioSpin GmbH
$$ ##OWNER= she
$$ F:/spectra/data/she/nmr/P31/1/pdata/1/auditp.txt
$$ ##AUDIT TRAIL=  $$ (NUMBER, WHEN, WHO, WHERE, WHAT)
(   1,<2021-03-10 12:23:08.87 +0400>,<she>,<DPX200>,
      <continue with go, POWCHK disabled, PULCHK disabled
       configuration hash MD5:
       00 E9 B6 7A A2 85 ED C7 34 08 36 98 17 FE 4E 26
       data hash MD5: 32K
       CF AF 04 64 40 10 04 BE 94 41 20 3B 25 97 A1 A7>)
(   2,<2021-03-10 12:23:10.43 +0400>,<she>,<DPX200>,
      <Start of raw data processing
       efp BC_mod = 2 LB = 1 FT_mod = 6 PKNL = 1 PHC0 = -4221.751 PHC1 = 1056.801 SI = 64K 
       data hash MD5: 64K
       FE 66 28 B7 59 27 F2 C0 6D 6A 41 18 93 A4 2A 44>)
(   3,<2021-03-10 12:23:42.89 +0400>,<she>,<DPX200>,
      <pk PHC0 = 126.6221 PHC1 = -820.6 
       data hash MD5: 64K
       45 A1 9E A6 4E 9D F7 7F 73 64 9C C2 82 5E BC 15>)
(   4,<2021-03-10 12:23:46.79 +0400>,<she>,<DPX200>,
      <abs ABSG = 5 
       data hash MD5: 64K
       CF E0 EB F3 38 DE 63 24 C1 00 31 1C 41 91 80 9D>)
$$ ##END=
$$ 
$$ hash MD5
$$ DE 8B 04 00 1D E3 33 DF 09 27 65 84 A0 5D EA 61
##$RELAX= 
##$RELAX= 
##$RELAX= 
##$RELAX= 
##$RELAX= 
##$RELAX= 
##$RELAX= 
##$RELAX= 
$$ Bruker specific parameters
$$ --------------------------
##$DU= <F:/spectra>
##$EXPNO= 1
##$NAME= <P31>
##$PROCNO= 1
##$TYPE= <nmr>
##$USER= <she>
##$AMP= (0..31)
100 100 100 100 100 100 100 100 100 100 100 100 100 100 100 100 100 100 
100 100 100 100 100 100 100 100 100 100 100 100 100 100 
##$AQSEQ= 0
##$AQ_mod= 1
##$AUNM= <au_zg>
##$AUTOPOS= <>
##$BF1= 81.014009
##$BF2= 200.13
##$BF3= 200.13
##$BF4= 200.13
##$BF5= 200.13
##$BF6= 200.13
##$BF7= 200.13
##$BF8= 200.13
##$BYTORDA= 1
##$CFDGTYP= 0
##$CFRGTYP= 5
##$CHEMSTR= <none>
##$CNST= (0..31)
1 1 145 1 1 1 1 1 1 1 1 1 1 1 1 1 1 1 1 1 1 1 1 1 1 1 1 1 1 1 1 1 
##$CPDPRG= <waltz16>
##$CPDPRG1= <>
##$CPDPRG2= <waltz16>
##$CPDPRG3= <>
##$CPDPRG4= <mlev>
##$CPDPRG5= <mlev>
##$CPDPRG6= <mlev>
##$CPDPRG7= <mlev>
##$CPDPRG8= <mlev>
##$CPDPRGB= <>
##$CPDPRGT= <>
##$D= (0..31)
0 1 0 0 0 0 0 0 0 0 0 0.03 2e-05 3e-06 0 0 0 0 0 0 0 0 0 0 0 0 0 0 0 0 
0 0 
##$DATE= 1615364380
##$DBL= (0..7)
120 120 120 11 120 120 24 19 
##$DBP= (0..7)
150 150 150 150 150 150 150 150 
##$DBP07= 0
##$DBPNAM0= <>
##$DBPNAM1= <>
##$DBPNAM2= <>
$$ [...]
##$SUBNAM3= <"">
##$SUBNAM4= <"">
##$SUBNAM5= <"">
##$SUBNAM6= <"">
##$SUBNAM7= <"">
##$SUBNAM8= <"">
##$SUBNAM9= <"">
##$SW= 501.771253377433
##$SWIBOX= (0..15)
0 1 3 0 0 0 0 0 0 0 0 0 0 0 0 0 
##$SW_h= 40650.406504065
##$TD= 32768
##$TD0= 1
##$TE= 0
##$TE2= 300
##$TE3= 300
##$TEG= 300
##$TL= (0..7)
0 120 53 12 22 120 120 120 
##$TP= (0..7)
150 150 150 150 150 150 150 150 
##$TP07= 0
##$TPNAME0= <>
##$TPNAME1= <>
##$TPNAME2= <>
##$TPNAME3= <>
##$TPNAME4= <>
##$TPNAME5= <>
##$TPNAME6= <>
##$TPNAME7= <>
##$TPOAL= (0..7)
0.5 0.5 0.5 0.5 0.5 0.5 0.5 0.5 
##$TPOFFS= (0..7)
0 0 0 0 0 0 0 0 
##$TUNHIN= 0
##$TUNHOUT= 0
##$TUNXOUT= 0
##$USERA1= <user>
##$USERA2= <user>
##$USERA3= <user>
##$USERA4= <user>
##$USERA5= <user>
##$V9= 5
##$VALIST= <valist>
##$VCLIST= <CCCCCCCCCCCCCCC>
##$VD= 0
##$VDLIST= <DDDDDDDDDDDDDDD>
##$VPLIST= <PPPPPPPPPPPPPPP>
##$VTLIST= <TTTTTTTTTTTTTTT>
##$WBST= 1024
##$WBSW= 4
##$XGAIN= (0..3)
0 0 0 0 
##$XL= 0
##$YL= 0
##$YMAX_a= 36028
##$YMIN_a= -35436
##$ZGOPTNS= <>
##$ZL1= 120
##$ZL2= 120
##$ZL3= 120
##$ZL4= 120
##$ABSF1= 248.5645
##$ABSF2= -253.2056
##$ABSG= 5
##$ABSL= 3
##$ALPHA= 0
##$AQORDER= 0
##$ASSFAC= 0
##$ASSFACI= 0
##$ASSFACX= 0
##$ASSWID= 0
##$AUNMP= <proc_1d>
##$AZFE= 0.1
##$AZFW= 0.5
##$BCFW= 0
##$BC_mod= 2
##$BYTORDP= 0
##$COROFFS= 0
##$CY= -3
##$DATMOD= 1
##$DC= 0
##$DFILT= <>
##$DTYPP= 0
##$F1P= 0
##$F2P= 0
##$FCOR= 1
##$FTSIZE= 65536
##$FT_mod= 6
##$GAMMA= 0
##$GB= 0
##$INTBC= 1
##$INTSCL= 5.30512e-09
##$ISEN= 30
##$LB= 1
##$LEV0= 0
##$LPBIN= 0
##$MAXI= 10000
##$MC2= 0
##$MEAN= 0
##$ME_mod= 0
##$MI= 50
##$NCOEF= 0
##$NC_proc= -6
##$NLEV= 6
##$NOISF1= 182.463
##$NOISF2= 159.3651
##$NSP= 0
##$NTH_PI= 0
##$NZP= 0
##$OFFSET= 248.5645
##$PC= 4
##$PHC0= -4095.129
##$PHC1= 236.201
##$PH_mod= 1
##$PKNL= yes
##$PPARMOD= 0
##$PSCAL= 0
##$PSIGN= 0
##$REVERSE= no
##$SF= 81.014009
##$SI= 65536
##$SIGF1= 159.3651
##$SIGF2= -187.1042
##$SINO= 113.3802
##$SIOLD= 16384
##$SREGLST= <1H.CDCl3>
##$SSB= 0
##$STSI= 65536
##$STSR= 0
##$SW_p= 40650.406504065
##$SYMM= 0
##$S_DEV= 0
##$TDeff= 32768
##$TDoff= 0
##$TI= <>
##$TILT= no
##$TM1= 0
##$TM2= 0
##$TOPLEV= 0
##$USERP1= <user>
##$USERP2= <user>
##$USERP3= <user>
##$USERP4= <user>
##$USERP5= <user>
##$WDW= 1
##$XDIM= 65536
##$YMAX_p= 270752548
##$YMIN_p= -101399071
$$ End of Bruker specific parameters
$$ ---------------------------------
##NTUPLES= NMR SPECTRUM
##VAR_NAME=  FREQUENCY,     SPECTRUM/REAL,   SPECTRUM/IMAG
##SYMBOL=    X,             R,               I
##VAR_TYPE=  INDEPENDENT,   DEPENDENT,       DEPENDENT
##VAR_FORM=  AFFN,          ASDF,            ASDF
##VAR_DIM=   65536,         65536,           65536
##UNITS=     HZ,            ARBITRARY UNITS, ARBITRARY UNITS
##FACTOR=    0.620285442955139, 1,           1
##FIRST=     20137.2065510759, 0,            0
##LAST=      -20513.1999529892, 0,           0
##MIN=       -20513.1999529892, -101399071,  0
##MAX=       20137.2065510759, 270752548,    0
$$ Real data points
##PAGE= N=1
##DATA TABLE= (X++(R..R)), XYDATA
$$ [...]
57975e775160o46224K687407J779128j216845j817535M87132K375356J789682
57967c37059J58718o8790J678894L557137L008693l43068l428281k818545P40475
57958B148174K816070Q03612l060454m853010l148958N50890L507292L334252
57950B097868J52769k397370q34825L086581M037481M57913l375730l783684k149310
57941b708307r83328K73690K434579L343023J542965L01524L245765P548332O332829
57932B1331072j996757j0689085j2089806n925158J101281L119509J352523J567374
57924b229047N307733O707967J168475n798376m850520K905484O288437O61739
57916A0161892m901244k041191L989266L734200j266783k725766k20404l55784
$$ y = [-5775160, -6421384, -3733977, -1954849, -3171694, -4989229, -4502097, -2126741, -337059, -178341, -247131, 1431763, 4988900, 7997593, 7654525, 4226244, 1407699, 2148174, 4964244, 5767856, 2707402, -2145608, -5294566, -4743676, -1236384, 2097868, 2250637, -146733, -981558, 2105023, 6142504, 6600417, 3224687, -558997, -2708307, -3691635, -3417945, -983366, 2359657, 3902622, 4204146, 7449911, 14998243, 21331072, 19334315, 8645230, -3444576, -9369734, -8268453, -5148944, -3796421, -2229047, 3078686, 9786653, 10955128, 5156752, 306232, 3211716, 9500153, 10161892, 5260648, 3219457, 7208723, 10942923, 9676140, 6950374, 6729970, 6374186]
57908F374186l734361m270764j263651q85975m124807m084978J599465N909618
57900d481267M385981K255084L835521L888485k722536j0074997q943806o68577
57892a2526112N564478N975185M138502J998797k047034o360748n793344M4230
57884i006046M802416L998774N33105o38441R26188K376962K139932Q30989m01599
57875E562280p71061l68333l44336j201570j223750J254008M372509M282603L43733
57866A1906083l763509m482700j770638J888795L516495J069043m300022p693635
57858c630088n390882r8695K318932J080167Q39919L429357M852771K483990l83866
57849E501605n48006k58433k118981l387756j099723J043986k085353p405429
$$ y = [6374186, 2639825, -1630939, -2894590, -3780565, -7905372, -11990350, -10390885, -4481267, -95286, 2159798, 5995319, 9883804, 7161268, -2913729, -11857535, -12526112, -6961634, -986449, 3152053, 5150850, 3103816, -3256932, -9050276, -9006046, -4203630, -204856, 328249, -310192, 615996, 2992958, 5132890, 5963879, 5562280, 4791219, 4422886, 4078550, 2876980, 1653230, 2907238, 7279747, 11562350, 11906083, 8142574, 3659874, 1889236, 3778031, 7294526, 8363569, 4063547, -3630088, -9020970, -9119665, -6800733, -5720566, -4880647, -1451290, 3401481, 5885471, 5501605, 4953599, 4695166, 2576185, -811571, -1911294, -867308, -2952661, -10358090]
57841a0358090p020510m52843M568869M271666L541553N914198O972588K657216
57833A0094647k524282k167460J777621K528047o70478k496730j056953k00843
57825E283569j921182k951378p89392K053969K252751L00536j298497j551874
57817A378502r11298j44105m96282k614557m633963l975353j295169N28990J233513
57808a0929722K759330M028895J873822j674659N0156P264944J0321441K963615
57800A6657822p125589q460201j898860K008485q44996m123283k867789R734R53162
57791e691515J234631J940383O16973k899184l497904J281994N464861K696477
57783A146716l636262m832218O33722N597817M831491J061676q38897m13325J74498
$$ y = [-10358090, -17378600, -17831443, -13262574, -8990908, -5449355, 464843, 7437431, 10094647, 7570365, 5402905, 7180526, 9708573, 9038095, 6541365, 5484412, 5283569, 3362387, 411009, -378383, 1675586, 3928337, 4228873, 2930376, 1378502, 467204, 323099, -173183, -2787740, -7421703, -11397056, -12692225, -12163235, -10929722, -8170392, -4141497, -2267675, -3942334, -3892178, 3372766, 13694207, 16657822, 9532233, 1072032, -826828, 1181657, 336661, -3786622, -6654411, -6644677, -5691515, -4456884, -2516501, -1899528, -4798712, -8296616, -7014622, -1549761, 1146716, -2489546, -7321764, -6688042, -1090225, 3741266, 4802942, 3964045, 3550720, 3725218]
57774C725218M87374R04055o1853l528050o403816m068651K474804O200800L141621
57765B871502j589006q85735L584010L543442l063025q124837n006980K012203
57757f658426M975101L904353M210615N689652K852418m028340p104050k858227
57749I83096J725123n32009o307365p074402j308054M644628O096305M704082
57741B931404L603675K657274L19012k489191k734589O53316M289015L395125
57733A2625041j868701n016928j008304N787503N965302k031897q731868o095612
57725c75464J612057M055222j235934o770450n913447m64501L421195K804455
57717b866867m44271l123044l512819j466287K453846O897946R099087O212903
$$ y = [3725218, 4212592, 5116647, 5054794, 1526744, -4877072, -8945723, -6470919, -270119, 2871502, 1282496, 396761, 3980771, 7524213, 4461188, -3663649, -8670629, -6658426, -1683325, 2221028, 6431643, 12121295, 14973713, 10945373, 3841323, 983096, 2708219, 2176210, -4131155, -11205557, -12513611, -7868983, -1772678, 2931404, 6535079, 9192353, 9511365, 7022174, 4287585, 4940901, 9229916, 12625041, 10756340, 5739412, 4731108, 10518611, 16483913, 14452016, 5720148, -375464, 1236593, 5291815, 4055881, -2714569, -8628016, -9092517, -5671322, -2866867, -3311138, -6434182, -9947001, -11413288, -8959442, -2061496, 7037591, 13250494]
57709A3250494q72886o306936m988673O93522L519822J236262r26964Q06950K687483
57700I099074K53270l405228k134344L104162N119928J204850l096146k326374
57692G819192J608575L137902R86931n94490K168259P335963Q946982M133165
57684C5542479k504623l826404N98611L621299K82933n557723p438305n329924
57676A5388343l798587l932921k867148k20376P43226j319838l874699m669152
57668d551152l766907j236924K905935O120233N136736J064716j469179q60304
57660C343154J75656K65979J072384K145051N067m967704o396104p99934N887135
57651G30684N632596r39422o056067n074544m83571L333760M764930M167828K069406
$$ y = [13250494, 12377608, 6070672, 1081999, 1775521, 5295343, 6531605, 5604641, 6411591, 9099074, 9352344, 5947116, 3812772, 6916934, 12036862, 13241712, 10145566, 7819192, 9427767, 12565669, 13552600, 12958110, 15126369, 22462332, 31409314, 35542479, 33037856, 29211452, 29810063, 33431362, 33714295, 28156572, 20718267, 15388343, 11589756, 7656835, 4789687, 4569311, 5312537, 3992699, 118000, -4551152, -8318059, -9554983, -6649048, -528815, 4607921, 5672637, 4203458, 3343154, 3518810, 3784789, 4857173, 7002224, 7007291, 2039587, -4356517, -5156451, 730684, 6363280, 5423858, -632209, -5706753, -6190324, -2856564, 1908366, 6076194, 8145600]
57642H145600n91359k351756k416603j407881p23304j080812j278531P96659M496056
57633C588069N165700k13153p046631p478979j073480M219617L253244p8402n74916
57624b38931O54990Q83649J902046M980912M957874k388771j0626323r622557
57616i497111n96022N326707L465334N30594J528376K015315k086569n980421
57608e293797l943794R10621K046072k08459r82227K74856O41799P90351L539686
57599b224892O600239M381531k611884p087846n147134j221652o54539k425065
57591a0391242k220522R47357M273747N134142L352879Q95395K50884J730215
57583C972855K580025Q59465r10529N22113K936486J360063l189569m102051K33496
$$ y = [8145600, 7554241, 5202485, 2785882, 1378001, 654697, -426115, -1704646, -907987, 3588069, 8753769, 8540616, 1493985, -5984994, -7058474, -2838857, 414387, 335985, -238931, 416059, 1299708, 3201754, 8182666, 13140540, 10751769, 125446, -9497111, -10093133, -4766426, -1301092, -770498, 757878, 2773193, 686624, -5293797, -9237591, -8326970, -6280898, -6489357, -7471584, -7196728, -6554929, -5764578, -2224892, 4375347, 8756878, 6144994, -942852, -6089986, -7311638, -7966177, -10391242, -12611764, -11664407, -7390660, -2256518, 1096361, 1991756, 2242640, 3972855, 6552880, 7412345, 6501816, 7023929, 9960415, 11320478, 8130909, 4028858, 4262354]
57574D262354L137723K06503l588864k415238Q62480L47766k406633j578371K181765
57565A009485K740078q01953k815654j136909k47744k424085l306831l4565K677788
57556d340390j12777m554129k382382P238356J5286406J2863051R74115j0425885
57548A4546365j2336179n439782J410489J750513j406416j341401J907269K005003
57540A095861l009825o655861l201374L853722O533022K933746j041479K10843
57532G18655N093689O738243J135538p366486j0242868n092875J204165K021850
57524e790089k53138K10889K380809J265377j488534K84910M955190L909096l283647
57515B190863n955339Q96072P959249O269764K84159j773834j086276k110775
$$ y = [4262354, 7400077, 7606580, 4017716, 1602478, 2464958, 2812724, 406091, -1172280, 1009485, 3749563, 2947610, 131956, -1004953, -1252697, -3676782, -6983613, -7018178, -4340390, -4453167, -9007296, -11389678, -4151322, 11135084, 23998135, 24972250, 14546365, 2210186, -3229596, -1819107, -68594, -1475010, -2816411, -909142, 1095861, -1913964, -8569825, -11771199, -7917477, -1384455, 1549291, 507812, 718655, 5812344, 12550587, 13686125, 6319639, -3923229, -9016104, -7811939, -5790089, -6043227, -5832338, -3451529, -2186152, -3674686, -3389776, 1565414, 5474510, 2190863, -3764476, -2868404, 5090845, 11360609, 11644768, 9870934, 8784658, 6673883]
57507F673883j959054K722531N404307j123977j0354085r969352p64108N331643
57499d038212L866311J364272J342673K20748k349475j961658K64962j829087
57491c119466o822389n876162K012703P339308N834552M171206N863576M730546
57483A4133874j763968n733946k889570q61860m766411o616586J50688O820186
57475a527593K994770n079684m201059M202224P156893J260209l872176k352361
57467a418777J033772J586078R24338M96417j419525l955036l217595K43551R63352
57458d763425k409927m384348j054007M611531P778005P006473L367057r09438
57450I241921k400499M2935J956326j259830o134580m959668K150100O436015
$$ y = [6673883, 4714829, 7437360, 12841667, 11717690, 1363605, -8605747, -9369855, -4038212, -171901, 1192371, 2535044, 2755792, 406317, -1555341, -1290379, -3119466, -9941855, -15818017, -13805314, -6466006, -631454, 3539752, 9403328, 14133874, 12369906, 6635960, 3746390, 2884530, -1881881, -8498467, -8347779, -1527593, 1467177, -3612507, -7813566, -3611342, 3545551, 4805760, 933584, -1418777, -385005, 1201073, 2125411, 2621828, 1202303, -2752733, -5970328, -5726777, -4763425, -7173352, -11557700, -12611707, -8000176, -222171, 6784302, 10151359, 9241921, 6841422, 6884357, 8840683, 7580853, 1446273, -3513395, -1363295, 5072720]
57442E072720L109166k547404m216024k747530j654759n36234K147325M155737
57434B782997K449385j441701l277176j888441R4441L53323o20331o78467J446084
57425g79886M178084L808616j190063o867217p354026k035406L378441L654946
57417c206511k89130l363857k239546J580282L861211K593329O00140J691624
57409A227542M543022M109299J12682j244198K673975N053550k57900p776636
57401H441336p601589m27222L774558Q32834l172720k979285p10891M13848Q72944
57392e56187R17999r02310k880570p65961M381142N975848K032032j788836j920863
57383D492294j705555k969200j462763L994063O093103j74875q062092q132180
$$ y = [5072720, 8181886, 5634482, 1418458, -1329072, -2983831, -3520065, -1372740, 2782997, 5232382, 3790681, 513505, -1374936, -1280495, -927172, -1547503, -2225970, -779886, 3398198, 7206814, 6016751, -850466, -8204492, -10239898, -6861457, -3206511, -3495641, -6859498, -9099044, -7518762, -3657551, -1064222, -464082, 1227542, 5770564, 9879863, 9992545, 8748347, 11422322, 16475872, 16217972, 8441336, 839747, 412525, 4187083, 5019917, 1847197, -1132088, -1842979, -1429131, -556187, 361812, -540498, -3421068, -4187029, 194113, 6169961, 8201993, 6413157, 4492294, 2786739, -182461, -1645224, 2348839, 8441942, 8267067, 204975, -7927205]
57375g927205j530244L475972L850954K954066K703500K063040J045907j37988
57367F498002l338947p961037p815342M03326Q868444P305864k038532o985461
57359e063683k488641L735808L807195l34058k504975j405448k44927j055676
57351e554405k507623j719613K553479P155332O456135k06044n559394l306207
57343b688340K593056L405475j794868o215590o613079n965266m810828N62490
57335b1526950Q803000J1515340N148465k790000m569227k298028j343281o32757
57327g693438K771269N089637J293752m082170j783341P027391J0451849K871657
57319A5946606o588142p195378j183953J386220k004167l952232N10624O355221
$$ y = [-7927205, -9457449, -5981477, -2130523, 823543, 3527043, 5590083, 6635990, 6498002, 3159055, -4801982, -12617324, -12213998, -3345554, 3960310, 1921778, -5063683, -7552324, -3816516, -9321, -343379, -2848354, -4253802, -4498729, -5554405, -8062028, -9781641, -7228162, -72830, 6383305, 6177261, 617867, -2688340, -95284, 3310191, 1515323, -4700267, -11313346, -17278612, -22089440, -21526950, -12723950, -1208610, 3939855, 1149855, -3419372, -5717400, -7060681, -7693438, -4922169, 167468, 1461220, -2620950, -4404291, 2623100, 13074949, 15946606, 9358464, 2163086, 979133, 2365353, 361186, -3591046, -3080422, 3274799]
57311C274799O097581K69849l933147k558589R47436J704432l40361k021380k065397
57302A375223j657988j286719j45886J604198K763264L368360M372661M783405
57294A5176518K174618k889207n926827l969930L44435K229523M98189k270132
57286E367187l668175l154578j055919J554090K698417J595403L71462J380755
57278E088642L368218K952020j99446k554996j726180K98747J72304k472646n028287
57269a01624m911708j575940L171057O054036N016598J842647L90525J352701
57261A1238292J167537k185511n163139l688667O595K55505l039335l733093R50493
57252d191323N497045M122605n44710j608256J898082M486544L004394K84684
$$ y = [3274799, 9372380, 9642229, 5709082, 3150493, 4097929, 5802361, 5462000, 3440620, 1375223, -282765, -1569484, -1715370, -111172, 2652092, 6020452, 10393113, 15176518, 17351136, 14461929, 8535102, 4565172, 4909607, 7139130, 7637319, 5367187, 1699012, -1455566, -2511485, -957395, 1741022, 3336425, 3707887, 5088642, 8456860, 11408880, 11209434, 8654438, 6928258, 7227005, 7399309, 4926663, -101624, -5013332, -6589272, -3418215, 2635821, 7652419, 9495066, 9885591, 11238292, 12405829, 10220318, 5057179, 1368512, 1375107, 1630612, -1408723, -5141816, -4191323, 1305722, 5428327, 4883617, 3275361, 5173443, 9659987, 12664381, 12949065]
57244A2949065q09833j746046m298886o282776m750695r36793J420058J243185
57236c212721N63534P63618J335685J981568L076744L728407J893512k481516
57228G648831o062140n256258l24610M443968M853529J045872k649626k499503
57220A200063N25698K526560J901612M95749m97098k403782n238928n467343r23040
57211g880509M459176M982736R87889k007569j376596J29814L15864Q82858K958844
57202C452507L828663J266276k188681k783148j034791j87974r39680j301503
57194A11669o89733o23496j593197k197985j420493N76657L470884O089995N516111
57185I240412K86686n705951o432997j666544K088438J81234m208436n011128
$$ y = [12949065, 12139232, 10393186, 6094300, -188476, -4939171, -5875964, -4455906, -3212721, -2649187, -1885569, -549884, 1431684, 4508428, 8236835, 10130347, 7648831, 1586691, -3669567, -3994177, 449791, 5303320, 6349192, 3699566, 1200063, 1725761, 4252321, 6153933, 6649682, 6152584, 3748802, -1490126, -6957469, -7880509, -3421333, 1561403, 2549292, 541723, -834873, -705059, -389195, 493663, 3452507, 7281170, 8547446, 6358765, 3575617, 2540826, 2352852, 1413172, 111669, -578064, -1201560, -2794757, -4992742, -6413235, -5836578, -2365694, 3724301, 9240412, 9527098, 3821147, -2611850, -4278394, -2189956, -2008722, -6217158, -11228286]
57177a1228286j134242L532000N631509M700711J722604j430274k188224Q8784
57169c05418K470843K056336M8812o90504p17372k661976n566907n215885o56092
57160a1238163L929766N107933M067489L105038K034160J83921j328114j614152
57152D247878j558538j466465j31208J966129K021662k88041j200713J006101
57144D596805K272928r52963n295254n027600k97328M070705N688946N641352
57136A0697591M452120K046544O3217n04572j913477n127704n764143q16793L873643
57127G006426J160261m746538l330055M847759P243757j473403j0400073q160688
57119g852554J481973O924749M635376Q5008k289461k541930j541803l1221M13709
$$ y = [-11228286, -12362528, -8830528, -3199019, 1501692, 3224296, 1794022, -394202, -305418, 2165425, 4221761, 4270573, 3580069, 2862697, 200721, -5366186, -10582071, -11238163, -7308397, -2200464, 1867025, 4972063, 7006223, 7190144, 5862030, 4247878, 2689340, 1222875, 1091667, 3057796, 5079458, 4791417, 3590704, 4596805, 6869733, 5916770, 621516, -4406084, -4703412, -632707, 5056239, 10697591, 15149711, 17196255, 17259472, 16754900, 14841423, 9713719, 3949576, 3132783, 7006426, 8166687, 3420149, 90094, 4937853, 12181610, 10708207, 308134, -7852554, -6370581, 554168, 5189544, 5274552, 2985091, 443161, -1098642, -1129863, -716154]
57110g16154l91327l49330Q65860O84540r23420k51814K758167K629953j716802
57101B589673k885381K664789O327090O12191o523285k668795Q349845J0515239
57093A8981366o16265j1583625j0593838j669277M865233O084276N000843K919227
57085A3387940l37562k860588k468250J1405J945804J559620j346191m837543
57077E054635n295307j546365K475954K815148J174795Q90403L64031k777314
57069C155980m195760J308851Q351321O318933l549451q091358j673131N843540
57061G468925M908750r76859m257923m849156n322976l499236J923234N649028
57053A043787L715066N66516O90718K98161m274231p191147k284084M652254M037220
$$ y = [-716154, -1107481, -1456811, -590951, 93589, -829831, -1081645, 1676522, 4306475, 2589673, -295708, 2369081, 8696171, 9308362, 2785077, 116282, 8466127, 18981366, 18365101, 6781476, -3812362, -5481639, -616406, 5467870, 10468713, 13387940, 13050378, 10189790, 7721540, 7732945, 9678749, 11238369, 9892178, 5054635, -240672, -1787037, 688917, 3504065, 4678860, 5569263, 5933294, 3155980, -1039780, 269071, 8620392, 14939325, 11389874, 3298516, 1625385, 7468925, 12377675, 11400816, 7142893, 2293737, -3029239, -6528475, -4605241, 1043787, 4758853, 5325369, 6016087, 6314248, 2040017, -5151130, -7435214, -2782960, 1254260]
57044A254260j810266l124616O64513J487926j942048k560826P88894P55311m145020
57035h631872n139266J691488P096110K802444m890099m642549K633171N716046
57027c364527J49636n590695k621260N901753R026778K575269n110341m106816
57019c140203L284684N208229k633130r589780m832603O448972J0087472K979019
57011G812660m072008l461018j86196r66510l381058j835403K309846L453007
57003c26680P86689j370397j74845L272380O319087O306007J871570m270007o317458
56994F096346k279352K566126K307992j949972m538153l113220l97514L68446
56986i39301j671969n234794p069283l665049L987444R211848O923938N14827
$$ y = [1254260, -556006, -3680622, -3016109, -1528183, -3470231, -6031057, -5242163, -4486852, -8631872, -13771138, -12079650, -4983540, -2181096, -7071195, -11713744, -9080573, -3364527, -3214891, -8805586, -11426846, -5525093, 3501685, 6076954, 966613, -3140203, 144481, 5352710, 2719580, -6870200, -11702803, -5253831, 4833641, 7812660, 3740652, 279634, 93438, -873072, -4254130, -6089533, -3779687, -326680, 460009, -910388, -1085233, 2187147, 8506234, 14812241, 16683811, 12413804, 6096346, 3816994, 6383120, 8691112, 6741140, 2202987, -910233, -1307747, -939301, -2611270, -7846064, -14915347, -18580396, -14592952, -5381104, 1542834, 2057661]
56978B057661k527752m75271J793834J047506n29742n71117m18937j543388k147577
56969c314783m57729J435588M98822k137188k523553J81150K477835J740480k90731
56960b390109p32989O8904j52719j244251o52134K204916M511630L967803J637743
56951G218794m21772j887193k725956j713947Q73854J548459j755533n211920
56943d075214l667881J446133L695061R11784k279056j912573N09874K231075
56935c140797L295161M017172K795864p06862l795369m569528l945378j987314
56927h037051L004157R013887R431245K104749n567585n955037j416437P04386
56919C282314n92406p17145J185183J470522n19113j572992j053826j452200k434605
$$ y = [2057661, -470091, -945362, 848472, 1895978, 1366236, 795119, 376182, -1167206, -3314783, -3772512, -2336924, -1838102, -3975290, -6498843, -6317693, -3839858, -2099378, -2390109, -3123098, -3054194, -3206913, -4451164, -5103298, -2898382, 1613248, 5581051, 7218794, 6797022, 4909829, 2183873, 469926, 1343780, 2892239, 1136706, -4075214, -7743095, -6296962, -2601901, -1690117, -3969173, -5881746, -5371872, -3140797, 154364, 4171536, 6967400, 6260538, 2465169, -2104359, -6049737, -8037051, -5032894, 3980993, 13412238, 15516987, 9949402, 3994365, 2577928, 3282314, 2689908, 1972763, 3157946, 4628468, 4109355, 2536363, 1482537, 30337, -2404268]
56910b404268j034179J836610J868360p98330j085369K224099M017666J235852
56902E860441k747255m347825m017705k184820K027814N479503K254039o053764
56894c729572r473863m008821J681918M17936j651044L441495J0142310P722618
56886D542977j315763m827526p86400O70361m260930o509755k60457O753233N852279
56877a41981M96652j191518N67927L20974j870641j664455O55722Q24420j177690
56868c180590j016632J908698K992316L06443j773286N39725M070779K855390
56860F702843l182572p410782m850480J309208L908357J429714m20653K010118
56852e04247M024824j0400o387278o226145R24832N645199K521328k393778j941638
$$ y = [-2404268, -3438447, -1601837, 266523, -531807, -1617176, 606923, 4624589, 5860441, 3113186, -1234639, -5252344, -7437164, -5409350, 70153, 2324192, -3729572, -13203435, -17212256, -15530338, -15112402, -16763446, -13321951, -3179641, 4542977, 3227214, -1600312, -2386712, -1716351, -5977281, -12487036, -12747493, -5994260, -141981, 354671, -836847, -268920, 52054, -1818587, -3483042, -2827320, -2002900, -3180590, -4197222, -2288524, 703792, 1010235, -763051, -223326, 3847453, 6702843, 3520271, -3890511, -8740991, -7431783, -3523426, -2093712, -2514365, -504247, 3520577, 3510177, -2877101, -9103246, -8178414, -2533215, -11887, -2405665, -4347303]
56843d347303J473200J597132q48924n27981K577049L302695L70821j640791n5734
56834A900164J832427K56141l356445m471196j441689K255681J970434k019300
56826c073783l894515o7442M409297K388562l499816l570471L042229N344159
56818A078220j829450p754461k330706O741125N634384l439478o257241N46816
56810g610791N865216L294956p84041p67908P3363q55418j55655K308636L54759
56801A723117o450468q591381j343967O419182N878797J343484J057022L415715
56793C451501K057448k099541l779273l027717k756714j386653L039187N838025
56785A336263K017722m111947m742909o79960J347888L48579O05911K001620N28451
$$ y = [-4347303, -2874103, -1276971, -2125895, -2653876, -76827, 3225868, 3596689, 1955898, 1900164, 3732591, 3988732, 632287, -3838909, -5280598, -3024917, -1054483, -3073783, -6968298, -7035740, -2626443, -237881, -3737697, -7308168, -4265939, 1078220, -751230, -8505691, -10836397, -4095272, 1539112, -1900366, -8157607, -7610791, -1745575, 1549381, 765340, -2568, 70795, -784623, -940278, 1368358, 1723117, -4727351, -13318732, -14662699, -8243517, -2364720, -1021236, 35786, 3451501, 5508949, 3409408, -369865, -3397582, -6154296, -7540949, -4501762, 1336263, 3353985, -757962, -5500871, -6180831, -4832943, -4484364, -3878453, -1876833, -1348382]
56776a348382k784940k684448J030737L256649K109859K53330j128959k348942
56768c645096j240252K914545M266854j531986p159033k746542O999792Q063591
56760E921873o64506n081337J418021P748649L755960m402476o170840k798882
56752b73538j499260j984420L47709L702585K860492p69746j371968J312975K395563
56743D720392O49395m16650M90590Q55182l45313r84238J71710J545041J172540
56734G858649j238136m180696n043365k568222P08581J325588M95696K263209
56726c78696N364629L465517l890949p863904k705499N021397N908037P92104
56718E712636k778173k532130j932274j842187K4436K813398L002582M94675j777306
$$ y = [-1348382, -4133322, -6817770, -5787033, -2530384, -420525, -167195, -1296154, -3645096, -4885348, -1970803, 2296051, 764065, -6394968, -9141510, -2141718, 5921873, 5257367, 176030, 1594051, 9342700, 13098660, 8696184, 2525344, -273538, -1772798, -3757218, -3409509, 293076, 3153568, 2383822, 1011854, 2324829, 4720392, 5369787, 4953137, 5443727, 6298909, 5953596, 4969358, 5141068, 6686109, 7858649, 6620513, 2439817, -2603548, -5171770, -4463189, -3137601, -2641905, -378696, 4985933, 8451450, 4560501, -3303403, -6008902, -987505, 4920532, 5712636, 2934463, 402333, -1529941, -3372128, -3347692, -534294, 2468288, 2962963, 1185657]
56709A185657l190846m684045m409762m41212L669204K739963j502730k373532
56701i007303J714821N560134N362973K477676q11554l233692k692184J273817
56693F44688L889115Q28014l417899r85966N882786O519987j454649p455681l983622
56684D66773K484450K888561o81892q49224J800163P53864m394812o920096l369415
56675g821628K118645M451250L210140Q60202o58658p36329j14699k37040r34946
56666A36937n2517K698558L796794Q29398k926125k778195K60208J241610p06322
56657B500346j259169J634566L983374J609382l606227o102327l579203P62305
56649d056953K347650N7717l064807l200427L52225M616049O099409M018052L64002
$$ y = [1185657, -2005189, -6689234, -11098996, -11540208, -7871004, -5131041, -6633771, -9007303, -7292482, -1732348, 3630625, 6108301, 5296747, 2063055, -629129, 644688, 4533803, 5361817, 1943918, 957952, 6840738, 13360725, 11906076, 4450395, 466773, 2951223, 5839784, 5157892, 4308668, 6108831, 6862695, 2467883, -4452213, -7821628, -5702983, -1251733, 1958407, 2818609, 2159951, 1423622, 1308923, 1071883, 136937, 84420, 2782978, 6579772, 7409170, 4483045, 1704850, 1965058, 3206668, 2500346, 1241177, 2875743, 6859117, 8468499, 4862272, -1240055, -4819258, -4056953, -1709303, -1651586, -4716393, -7916820, -7564595, -2948546, 3150863, 7168915, 7532917]
56640G532917k279864k600437j221611m0363m6542K15719K462407N007908M011462
56631A3041596o66408m019461k484645R48816J338007j003452j955509o07731
56623D591213m5484j411020j926024J82476K806192L505313K528649O95310k394083
56614H532542n914339o677509l246589J115055K505649J533140J395544K489331
56606A732824K529236J102659J59012k9809j434620l985672m664507k606936j278450
56597h476263k722875l225094R37433O061583N210997r58907m268489j258171
56589h699786J648887r21988l905235k01163O478775O594847N90831j182734M171760
56580D574194O222768j776605j0343918p673436J530718L342178l293016n595063
$$ y = [7532917, 5253053, 2652616, 1431005, 1390642, 1344100, 1559819, 4022226, 9030134, 13041596, 12375188, 8355727, 5871082, 6819898, 8157905, 7154453, 5198944, 4591213, 4545729, 3134709, 1208685, 1391161, 4197353, 7702666, 10231315, 10926625, 8532542, 2618203, -4059306, -7305895, -6190840, -3685191, -2152051, -756507, 1732824, 4262060, 5364719, 5523731, 5493922, 4059302, 73630, -4590877, -7197813, -8476263, -11199138, -14424232, -13486799, -7425216, -2214219, -3173126, -7441615, -8699786, -7050899, -7972887, -11878122, -12079285, -5600510, 994337, 1585168, 402434, 4574194, 10796962, 9020357, -1323561, -8996997, -7466279, -4124101, -7417117, -13012180]
56572a3012180J732441Q269107N500873P7688J271058N236343K732256m097537
56564G710049n082180P35025L684434k38967l307763L29179N015333L358345j986934
56555A0216521l406422j53311K308732J959080J983956L570138L311293r77185
56547A8812802o351873q383524n889744q72545L862196N850882L820755r04753
56539I944196m731258m870050k095171J50529l47674j848735p41043L175371N146004
56530C782169J393807m584464n326916P33111O767427O347279P60214m586299
56522E286328o840139n668185r87080M624845N130760j354292o973071l091532
56514i872366O697234J0172117L098865n588623o847335k207862J747666K735893
$$ y = [-13012180, -11279739, -3010632, 2490241, 2567929, 3838987, 9075330, 11807586, 7710049, 2627869, 3362894, 7047328, 6808361, 3500598, 3829777, 8845110, 12203455, 10216521, 6810099, 6656788, 8965520, 10924600, 12908556, 16478694, 19789987, 18812802, 12460929, 4077405, -1812339, -2684884, 1177312, 7028194, 10848949, 9944196, 5212938, 342888, -1752283, -1601754, -1949428, -3798163, -4539206, -1363835, 3782169, 5175976, 591512, -4735404, -4002293, 2765134, 9112413, 9872627, 5286328, -1553811, -7221996, -8209076, -3584231, 1546529, 192237, -6780834, -9872366, -3175132, 6996985, 10095850, 4507227, -2340108, -4547970, -2800304, -64411]
56506f4411K067988R8654k446482k627817L40394K247205k4771k954247j861063
56497e224550J326201J542742o97943n48757K476099L745274J582215k34435O71527
56488D638373J557648j74026k800573l929631m173232m223993j958210L781576
56480g282068R106617Q980547M079759m7220m70534L5322j762704m419449m267779
56471C952491j288544N67400r20831l057237k399124K3444N40482j143366j494204
56462e219489Q50641K503975O10259k678672l763974k803887k002019j118552
56454a3621718J209170L377818K702068N77700R19764L479290L727682K53066
56446B624840k738878k119028l11627l78417q20445J151775M363367N533313M120097
$$ y = [-64411, 2003577, 2102231, -344251, -2972068, -2631674, -384469, -409240, -3363487, -5224550, -3898349, -2355607, -3053550, -3602307, -1126208, 2619066, 4201281, 3966846, 4638373, 6196021, 6021995, 3221422, -708209, -4881441, -9105434, -11063644, -7282068, 1824549, 10805096, 14884855, 14837635, 14367101, 14402423, 12639719, 8220270, 3952491, 2663947, 3231347, 2310516, -746721, -3145845, -3122401, -2581919, -3725285, -5219489, -4368848, -1864873, -1254614, -3933286, -7697260, -10501147, -12503166, -13621718, -12412548, -9034730, -6332662, -5754962, -4835198, -1355908, 2371774, 2624840, -114038, -2233066, -2544693, -2923110, -3743555, -2591780, 1771587, 7304900, 11424997]
56437A1424997J766676j018858l915009m401291o20533M381709N562396K648460
56429A5828547r7613o56921j218683k838869l132791j208696k68969k240466l789439
56420C76100j645184J408976Q46353j596235k96921M403523N363906n67598o968552
56411A324368o771966k015239L59352r21925j186414J412698L374174K601266
56403a823686J627948K181993J950708k75115j197637J169878K679689n88281
56395E725497m625024k926519K310264K439134l736346o798493r13085O377404
56387b147168M836246l238723o428617n54257O609811P412756L534555M40216
56379A0464819j025363k954210m587025l548199p80856N46932P6227m8240J39281
$$ y = [11424997, 13191673, 12172815, 8257806, 3856515, 3235982, 7617691, 13180087, 15828547, 15730934, 15074013, 13855330, 11016461, 7883670, 6674974, 6406005, 4165539, 376100, -1269084, 139892, 986245, -609990, -906911, 3496612, 8860518, 8292920, 1324368, -5447598, -7462837, -7103485, -8025410, -9211824, -7799126, -4424952, -1823686, -195738, 1986255, 3936963, 3661848, 2464211, 3634089, 6313778, 5725497, 1100473, -1826046, 484218, 2923352, -812994, -7611487, -8524572, -2147168, 2689078, -549645, -6978262, -7532519, -922708, 6490048, 10024603, 10464819, 9439456, 6485246, 1898221, -1649978, -2430834, -1883902, -1807675, -1855915, -1716634]
56370a716634j459648m003808l443361J215391N299602M479544M29841k038195
56362a237268j140274J171906K682199K378184O2383k739095k874099M98134L267418
56353B069488R78393m627681p215159l944986J521485M545140M516342L199183
56345A042205J425026m30499j051191K55033J782745J204482j442418l838559
56337a053176l971716j776192J263844L380457L670229K380789J27984k562128
56329A460091m481796l755532q6057L907469N267618L829972J263635j505558
56321E899842l651629l107642O53215L860071K555136j498824l500285l102623
56313a892739l479558l526161J395838R435635J1329927L704803m213044l323662
$$ y = [-1716634, -3176282, -7180090, -10623451, -9408060, -4108458, 371086, 800927, -1237268, -2377542, -1205636, 1476563, 3854747, 3917130, 1178035, -1696064, -1197930, 2069488, 3047881, -1579800, -8794959, -12739945, -11218460, -6673320, -2156978, 1042205, 2467231, 2036732, 985541, 1240574, 3023319, 4227801, 2785383, -1053176, -5024892, -6801084, -5537240, -2156783, 1513446, 3894235, 4022219, 1460091, -3021705, -6777237, -6863294, -2955825, 2311793, 6141765, 7405400, 5899842, 2248213, -859429, -206214, 3653857, 6208993, 4710169, 1209884, -1892739, -5372297, -8898458, -7502620, 1933015, 13262942, 16967745, 12754701, 9431039]
56305I431039K193003K199809l525650n890416j103881M355612M143109j20310
56297A1682315l461289m047124k555006K73393K778125K529405l52482k589337
56289D258000k042074k41421M64550k35105j574186k850500k619480L55618M055835
56280d28763M169030J8792l363886j717777K365871L238165L80347j474215k08414
56271B979150M14172k641086n817710l777206K086889M981532K348718j064429
56263d89970j082497L43906L80689P40195L119514M008820M52561k932997n37254
56254D002967L642010J423178n065971n346990K193436O887259K967170j626000
56246I077059M68871L959909J342105l965669m555429j605999n47350m82639J817805
$$ y = [9431039, 11624042, 13823851, 10298201, 4407785, 3303904, 7659516, 11802625, 11682315, 8221026, 4173902, 1618896, 1892289, 4670414, 7199819, 6847337, 4258000, 2215926, 1974505, 2439055, 2203950, 629764, -2220736, -4840216, -4484598, -428763, 3740267, 3759059, 395173, -1322604, 1043267, 4281432, 4661779, 3187564, 2979150, 3393322, 752236, -5065474, -8842680, -6755791, -1774259, 574459, -489970, -1572467, -1228561, -847872, -107677, 3011837, 7020657, 7473218, 4540221, 4002967, 7644977, 9068155, 4002184, -1344806, 848630, 7735889, 10703059, 9077059, 9545930, 13505839, 14847944, 10882275, 6326846, 4720847, 4173497, 3690858, 5508663]
56237E508663K931719j405561o129810l653467K851158M289289O31578p36930
56229D286639Q25430o24296m406776l279252K623974M548466k02948m171024k968495
56220c368282j325244k626123l130627n16593J675581J932343L572126O095403
56212B308584L636032l808022p492465l095219K652658L448113K114036K509369
56204B273086K237867m70418j578005O98889J279667k048556l290159N62181K473153
56195B137705k328274o216593j108167P387987Q373771J927489l565214n062399
56187A546305n312245l977683J005136N941912N071193R9064k226613l17116J817626
56178C647579K159729J778703O42551j346641j864724l39551o89419m191749m960265
$$ y = [5508663, 8440382, 7034821, 905011, -2748456, 102702, 4391991, 5023569, 4286639, 5112069, 4487773, 80997, -3198255, -574281, 3974185, 3771237, -399787, -3368282, -4693526, -7319649, -10450276, -10966869, -9291288, -7358945, -3786819, 2308584, 5944616, 2136594, -5355871, -8451090, -5798432, -2350319, -236283, 2273086, 4510953, 4040535, 2462530, 3161419, 4441086, 2392530, -897629, -335448, 2137705, -190569, -6407162, -7515329, -127342, 8246429, 10173918, 6608704, 1546305, -3765940, -7743623, -6738487, -796575, 4274618, 4373682, 2147069, 1829953, 3647579, 5807308, 7586011, 8228562, 6881921, 5017197, 4677646, 3988227, -203522, -5163787]
56169e163787N36630N421666K447426l504664k865955L285680O015091L273648
56161I445735R46808J272256P38415j502115k558157k223074k201304q35652L238576
56152F321488N199534P58191m780765m093125n42832j988856n736846k921343
56144g784554M620739O334411J059068j601241J335130K415213o83973q80764
56136D814029L397031L783286k378586n913855j598637L044464J732651l75216
56128F505167J566926K157119l029169o919717k179246N557236O264805P52113
56120A0675234k593259j074117J290157J900628J073294j045898l039972j742967
56112E443100J969817K201685k507066n205219j305787L673392L226541l46332
$$ y = [-5163787, -4627157, 794509, 3241935, -262729, -3128684, 156996, 6172087, 9445735, 10392543, 11664799, 12403214, 10901099, 8342942, 6119868, 3918564, 3082912, 6321488, 11521022, 12279213, 7498448, 3405323, 2862491, 873635, -4863211, -7784554, -3163815, 3170596, 4229664, 2628423, 3963553, 6378766, 5694793, 4814029, 8211060, 11994346, 9615760, 3701905, 2103268, 5147732, 6880383, 6505167, 8072093, 10229212, 7200043, 280326, -1898920, 3658316, 9923121, 10675234, 8081975, 7007858, 8298015, 10198643, 11271937, 10226039, 7186067, 5443100, 7412917, 9614602, 7107536, 1902317, 596530, 4269922, 7496463, 7150131]
56104G150131j924720k286000l579989l000767J182991L810431J080555j843964
56096E88668K81363L160813J306603j085172J829384N235831J545240m749853
56088H112877l540436L006064L168879m719270r259391l981541M058617O518105
56080C363904L936093L31062k990422m503637j454194M286318N974777J110068
56072A0053969m690198n603539k402246P79075J876402J315183P38088K022256
56064D088990M373354L581268j788632o027708l815673Q60997P80499k321046
56056b67951j034332L881850M009888j735900m079289J569687P487991N725065
56048A5557009j024356n651815o063586l553834J052022M828334L179989k437644
$$ y = [7150131, 5225411, 2939411, -640578, -3641345, -2458354, 1352077, 2432632, 588668, 870031, 4030844, 5337447, 4252275, 6081659, 11317490, 12862730, 8112877, 4572441, 7578505, 10747384, 6028114, -3231277, -7212818, -3154201, 3363904, 7299997, 7631059, 4640637, 137000, -1317194, 2969124, 8943901, 10053969, 5363771, -239768, -2642014, -1862939, 13463, 1328646, 2066734, 4088990, 8462344, 12043612, 10254980, 4227272, 411599, 1272596, 2053095, -267951, -1302283, 2579567, 6589455, 4853555, 774266, 2343953, 9831944, 15557009, 14532653, 8880838, 2817252, -736582, 315440, 5143774, 8323763, 5886119]
56040E886119l985326J352009N966902L495806j834110l464595k467213k142239
56032B807353j70656N169974P581412J592916o296177o065491Q1339J845451j885693
56023D660428k459961K173207L711623j151345m098349N23978N560672K960553
56015A1880806k724665k156019L361412M564468n64298m475000k722320L63541
56007G527925N39246o2814R40159Q37189k343817m327620j136408L078388J925019
55998F977267k304256j783813L809662O427454K895051m23897M15084k3097n346535
55989A0642920q279900k210043N462397L523969m140224l910632M617135O677740
55981A2383362l350015j0984513l332191J0623029J3128025K972149n168758k805913
$$ y = [5886119, 1900793, 3252802, 9219704, 12715510, 10881400, 7416805, 4949592, 2807353, 2636697, 7806671, 15388083, 16980999, 10684822, 4619331, 4700670, 6546121, 4660428, 2200467, 4373674, 8085297, 6933952, 2835603, 3359581, 8920253, 11880806, 9156141, 7000122, 10361534, 14926002, 14361704, 9886704, 7164384, 7527925, 8067171, 8004357, 8944516, 9781705, 7437888, 3110268, 1973860, 5052248, 6977267, 4673011, 2889198, 6698860, 13126314, 16021365, 15597468, 16012552, 15989455, 10642920, 2363020, 152977, 5615374, 9139343, 4999119, 1088487, 5705622, 12383362, 9033347, -1951166, -5283357, 5339672, 18467697, 21439846, 16271088, 13465175]
55973A3465175L248131L547929k370077q812658j0943524p048471O13903N828883
55965b470709L924460j922387l969334L86842O335285Q703843O643833J634207
55957A9266040l976771o244590k824056K265002K185996l242615o579767k769604
55949a920365M556313Q553564O758020J606664k695552k605423J488681L808967
55941A9550869l81433o807825o822427n15019K835327m33765k521856J987495
55933F891366O056591K055873m555574m012222J355365J770833k595297k450138
55925D516797L143810M314434j923423n220894Q46428P196137L722287m392534
55917A2203042n688845p71439O25666k836342k490624M227733Q103557K452288
$$ y = [13465175, 16713306, 20261235, 17891158, 9078500, -1865024, -8913495, -8299592, -2470709, 1453751, -468636, -4437970, -4051128, 2284157, 10988000, 17631833, 19266040, 15289269, 9044679, 6220623, 8485625, 10671621, 7429006, 849239, -1920365, 2635948, 11189512, 17947532, 19554196, 16858644, 14253221, 15741902, 19550869, 19169436, 12361611, 5539184, 5024165, 7859492, 7425727, 4903871, 6891366, 12947957, 15003830, 10448256, 6436034, 7791399, 9562232, 6966935, 4516797, 7660607, 11975041, 10051618, 4830724, 5677152, 12873289, 16595576, 12203042, 6514197, 5742758, 6368424, 3532082, 1041458, 5269191, 13372748, 15825036]
55909A5825036o183825p558275j837413K238258J00403l756142l129382J946024
55901b355316N829578M165426j029781l696827j259261J945352P12460l472072
55893H39559m781748j957553L75782j13025J13138L331054N603682L377224K38410
55884G026523J223536L873348J979775l513044n079487m62777L629892K127620
55876A0805386r05588L15432L718063K983645k283763n965141m181038L09042
55868D796038K776410J810178p36815k223572j020001K025960L820774K648253
55860A3897225Q24203J094230J563680j542662o323264n920284J345608P905116
55852A2843852O738741R23980j575471N15946J539673j147965l564905k282063
$$ y = [15825036, 9641211, 2082936, 245523, 2483781, 2584184, -1171958, -4301340, -2355316, 3474262, 7639688, 6609907, 2913080, 1653819, 3599171, 4311631, 839559, -3942189, -5899742, -5523960, -5636985, -5523847, -2192793, 3410889, 6788113, 7026523, 8250059, 12123407, 14103182, 10590138, 5510651, 5047874, 8677766, 10805386, 9899798, 10215230, 13933293, 16916938, 14633175, 8668034, 4486996, 4796038, 7572448, 9382626, 8645811, 6422239, 5402238, 7428198, 11248972, 13897225, 14721428, 15815658, 17379338, 15836676, 9513412, 3593128, 4938736, 12843852, 19582593, 20506573, 18931102, 19447048, 20986721, 19838756, 16273851, 13991788]
55844A3991788N11405J338775L79843n56527j394702k265228j621194J032198
55836A1416358K910513J579203j108108j804116p46110p35768k214024k747819
55828F550129r69291J867571L948571M116329J794949j708582k833621K14942
55820A2980997L939773L511349m32378k878416j951169p94145j574429k453355
55812A0348227j852118j062734o43722J340889N052652P076352N570383K993894
55804B8823823R13909k868890q106981q644748j236102O900455O954625J508879
55796B4244970o5811L058086K709011l350193p120357m051195n19016k096582
55788A2808913l753969N06085N980962M715543r74164k845200r46099k214346
$$ y = [13991788, 14503193, 15841968, 16221811, 15665284, 14270582, 12005354, 10384160, 11416358, 14326871, 15906074, 14797966, 12993850, 12247740, 11511972, 9297948, 6550129, 5580838, 7448409, 11396980, 15513309, 17308258, 15599676, 12766055, 12980997, 16920770, 20432119, 19999741, 17121325, 15170156, 14376011, 12801582, 10348227, 8496109, 7433375, 6789653, 8130542, 13183194, 20259546, 25829929, 28823823, 29737732, 26868842, 18761861, 10117113, 8881011, 15781466, 22736091, 24244970, 24179159, 27237245, 29946256, 26596063, 19475706, 15424511, 14905495, 12808913, 9054944, 9561029, 15541991, 20257534, 19283370, 16438170, 15492071, 13277725]
55780A3277725o329133m992445L095990Q045297L883829k072352j145259L662297
55772A7425949M195072M43988j295189L85402J289648J68472p398J199300Q29557
55763B4634801j204014j321186J338533L267940K356099K91777j605207l845568
55755B3913175n149630k799642J870578L713581J470167j01610J813356L525151
55747B8255126J501933j714232k415744j871257k840124l950731k599376j08671
55739A4256924J073603K214949N008484O400645K740905l090245n016063k757932
55731B0831270j140782j489223n62121K076056K649717J78023j558554o08858
55723B0375528N97184R22343K490254M742632L076156l127974p281534m882199
$$ y = [13277725, 6948592, 1956147, 5052137, 13097434, 16981263, 14908911, 13763652, 17425949, 21621021, 22065009, 20769820, 21155222, 22444870, 22613342, 22605944, 23805244, 24634801, 23430787, 22109601, 23448134, 26716074, 29072173, 29363950, 27758743, 23913175, 18763545, 15963903, 17834481, 21548062, 23018229, 22916619, 24729975, 28255126, 29757059, 28042827, 25627083, 23755826, 20915702, 16964971, 14365595, 14256924, 15330527, 17545476, 22553960, 28954605, 31695510, 28605265, 23589202, 20831270, 19690488, 18201265, 17639144, 19715200, 22364917, 22542940, 20984386, 20375528, 20972712, 21895055, 24385309, 29127941, 32204097, 29076123, 21794589, 16912390]
55715A6912390m76546J4484j111153J822851P014980P030012M87080n365257m675168
55706B1653673K04912L530019L044217P2263l360479n136049l615533K02441L102953
55697A9698417L625511L317900K880180L47940m489903p183961m149512J061812
55689A5108384J909012j606349l076809J12951K851601J165285r91329J283468
55681A6756214M978022M090891K08800O2684L730956M165947m87831l089977P34314
55672C1150020N266415M064729l60282k031976p02740M51701Q38235J09866m247222
55663C4538746j0187610q637219L389936J3510716Q883129m448263r615190k929141
55655B4505104M034088M619608L948786M542676J074497o178285p533696q7291
$$ y = [16912390, 16435844, 16450328, 15339175, 17162026, 24177006, 31207018, 31694098, 26328841, 21653673, 21858585, 25388604, 28432821, 28505084, 25144605, 20008556, 16393023, 16595464, 19698417, 23323928, 26641828, 29522008, 29869948, 25380045, 18196084, 14046572, 15108384, 17017396, 15411047, 12334238, 12447189, 15298790, 16464075, 15472746, 16756214, 21734236, 25825127, 26033927, 26096611, 29827567, 33993514, 33505683, 30415706, 31150020, 36416435, 40481164, 40120882, 38088906, 37386166, 37837867, 38676102, 38785968, 34538746, 24351136, 15713917, 19103853, 32614569, 41497698, 37049435, 27434245, 24505104, 28539192, 33158800, 37107586, 41650262, 42724759, 36546474, 29012778, 28925487]
55647B8925487N640175K705027j271867J286940M631548J444765l245260j858680
55639C8258135J589301Q393k368891J900144P590235M120440n487890q159316
55631C7450551j341892M452913L392626R06295J423351K170203J368733J449649
55623E1272429J921371o24109l738246j014741N438724N765145j581616o156434
55615E1282523k134961K797425R74937l407861l213801j1168J161255J101844
55607D8550193K455613K877630K19210j155395K530985O003163K265216n336093
55599E8410522p269786j812011L600057L971959J773587K99360p25313j654427
55591E6593948j022235J051126K141144J804060K626107N332349O374002K712944
$$ y = [28925487, 34565662, 37270689, 35998822, 37285762, 41917310, 43362075, 40116815, 38258135, 39847436, 39855829, 37486938, 39387082, 46977317, 51097757, 45609867, 37450551, 36108659, 40561572, 43954198, 44860493, 46283844, 48454047, 49822780, 51272429, 53193800, 52569691, 48831445, 47816704, 53255428, 59020573, 57438957, 51282523, 49147562, 51944987, 52919924, 49512063, 46298262, 46287094, 47448349, 48550193, 51005806, 53883436, 54102646, 52947251, 55478236, 61481399, 63746615, 58410522, 51140736, 49328725, 52928782, 56900741, 58674328, 58973688, 58248375, 56593948, 55571713, 56622839, 58763983, 60568043, 63194150, 68526499, 74900501, 77613445]
55583G7613445l252807n965575l183239J501135K939753M78925j497469L07202
55575F8941370L196688K370220j303567j812676K755252O335024L361353k780646
55567H1063018m366102j58131L484162J972082j753601k231585J095502L886569
55559H2991914K909060l04187k059832j188633L65935J228287K532900M973501
55551I1448945O206299L918797N4988j376329N0548J382499J648466K613687L926086
55542A09873986K569229j269710k761385L91068L736353K572480j062810k067924
55534A11981287o2166J127986o838j260565j124244l89421P30657L322295O705496
55525A21024487P634513M263823o40336k133061J441346O380513P655375M741765
$$ y = [77613445, 74360638, 68395063, 65211824, 66712959, 69652712, 70131637, 68634168, 68941370, 72138058, 74508278, 73204711, 71392035, 74147287, 80482311, 83843664, 81063018, 76696916, 76538785, 80022947, 81995029, 80241428, 78009843, 79105345, 82991914, 85900974, 85596787, 83536955, 82348322, 82714257, 83942544, 86475444, 91448945, 97655244, 101574041, 101629029, 100252700, 100303248, 101685747, 103334213, 105947900, 109873986, 112443215, 111173505, 108412120, 108803188, 112539541, 115112021, 114049211, 111981287, 111919121, 113047107, 113040269, 111779704, 110655460, 110266039, 110996696, 114318991, 121024487, 128659000, 132922823, 132282487, 130149426, 131590772, 137971285, 145626660, 150368425]
55517A50368425K009840K552092L744546J492835k850661l992095p16912K483664
55509A55091734K812444L089009N792105P966490O063475K262935J233796K846152
55501A87158140K967466M56393j285248J71450L110037M793490M815119M340336
55493B06527183M121014M190408M173596L443308K016179J197003K009849L164933
55485B30843473K324000k73744j268959J502014N345897N339544O45592l860105
55477B40597712l519778L08606K721676K209548J516485J987669J899082J519376
55469B49240376M125912Q862754Q523506p3148q576425p266672R69409N261502
55461B61067214K845175P52922K100570J534014l401159o527980l193938K145523
$$ y = [150368425, 152378265, 154930357, 158674903, 160167738, 157317077, 153324982, 152608070, 155091734, 157904178, 160993187, 166785292, 174751782, 180815257, 183078192, 184311988, 187158140, 190125606, 190581999, 189296751, 189468201, 192578238, 197371728, 202186847, 206527183, 210648197, 214838605, 219012201, 222455509, 224471688, 225668691, 227678540, 230843473, 233167473, 232893729, 231624770, 233126784, 238472681, 243812225, 244457817, 240597712, 237077934, 237386540, 240108216, 242317764, 243834249, 245821918, 247721000, 249240376, 253366288, 262229042, 270752548, 270679400, 262102975, 254836303, 255805712, 261067214, 263912389, 264665311, 266765881, 268299895, 264898736, 258370756, 255176818, 257322341]
55453B57322341L613070K145010R02481j000814m572890o513349m488992j871459
55445B45535398j839899j814323O65719J785885k251720p268182o536857r02513
55437B27373508L229537L301002J672007j71116k162128k497755l0717J808577
55429B32522915r73625o514457r571566q517866n409315j824086O04272j090016
55421A99226256o399008q770991m032077K172592K235615j757811k319535O23326
55413A80978367O75661k828642l672008k67020J221491k621628p051843p148811
55405A59285567m455347k698995k468629k829094l659693m301687l614058k343701
55397A32914363j920239j222971J241329K953650L64704m643651o851136n300935
$$ y = [257322341, 260935411, 263080421, 263982902, 262982088, 258409198, 251895849, 247406857, 245535398, 243695499, 241881176, 242546895, 244332780, 242081060, 234812878, 228276021, 227373508, 230603045, 233904047, 235576054, 235404938, 233242810, 230745055, 230714338, 232522915, 231549290, 225034833, 215463267, 206945401, 201536086, 199712000, 200316272, 199226256, 192827248, 184056257, 180024180, 182196772, 184432387, 182674576, 180355041, 180978367, 181654028, 178825386, 175153378, 174886358, 176107849, 173486221, 166434378, 159285567, 154830220, 152131225, 149662596, 146833502, 143173809, 138872122, 135258064, 132914363, 130994124, 129771153, 131012482, 133966132, 134330836, 129687185, 122836049, 117535114]
55389A17535114l038348q07132K208748L003183j779524p874710p619679j816891
55381I9810761J813649J738777L431136O317027K393001q506303j4438854q550273
55373H4008921M19315K270364o5522J001331L440981M66158o331558r281759o420605
55364F9507626j866742K430593O703840P881600K806414m639158p529212n792985
55356F9501976m732736n077139k677860K142041L456607l02721k818238K79148
55348E9771078M011063J247128o277041r526084m280449K893520L244595k126904
55340D8956906l657430K499742P684004L186198n480794n793695K226043N126528
55332E4747502l008824j0484409n488151O118522R957679L445769l363481l497886
$$ y = [117535114, 114496766, 113689634, 115898382, 118901565, 117122041, 109247331, 101627652, 99810761, 101624410, 103363187, 106794323, 113111350, 115504351, 106998048, 92559194, 84008921, 84428236, 86698600, 86633078, 87634409, 91075390, 91541548, 85209990, 75928231, 69507626, 67640884, 70071477, 76775317, 84656917, 87463331, 82824173, 75294961, 69501976, 64769240, 59692101, 57014241, 59156282, 62612889, 62310168, 59491930, 59771078, 63782141, 65029269, 58752228, 49226144, 44945695, 47839215, 51083810, 48956906, 45299476, 47799218, 55483222, 58669420, 53188626, 47394931, 49620974, 54747502, 51738678, 41254269, 35766118, 41884640, 51842319, 55288088, 51924607, 48426721]
55324D8426721K44446K811028K536462n25709n082463p414314m996819o20110
55316C5379242J443994J380883J478040R65119j325750k416495M81838M073186
55308D1460057L713853Q06184j000565k846386o285527o630037k47088N796202
55300C4766693K789300m221544l170523M752606O390004j255225o050910j568705
55292C2431696K856072l95995m370536j587864J874607k005342p681499n057170
55284A6063969L103401N669064O21452l781565k645927J146546M250427N434771
55276B9862138K784611l172725n877423r33252M756613J753624o196137o467485
55268A6509964K584684Q072180J829922p594836p831336N18800O752303M822627
$$ y = [48426721, 48671167, 51482195, 54018657, 53492948, 48410485, 40996171, 35999352, 35379242, 36823236, 38204119, 39682159, 40647278, 39321528, 36905033, 37386871, 41460057, 45173910, 45980094, 44979529, 42133143, 35847616, 29217579, 28970491, 34766693, 37555993, 33334449, 30163926, 34916532, 41306536, 40051311, 34000401, 32431696, 35287768, 34891773, 30521237, 28933373, 30807980, 28802638, 21121139, 16063969, 19167370, 24836434, 25457886, 21676321, 19030394, 20176940, 24427367, 29862138, 32646749, 29474024, 23596601, 22663349, 27419962, 29173586, 22977449, 16509964, 19094648, 27166828, 28996750, 21401914, 13570578, 14089378, 20841681, 25664308]
55260B5664308j151500m035666j606475K518300L698684J582069r623R98897J811115
55251B9470109k5788j892095j088777q75373m984099r150559o513671K40014J919732
55242G099493j946078j781831N668223J0717561N859681k253327l501137O38322
55234B0500907J382454l138007o685294n201187p86898L183593M993917L785878
55226A8035363N65920j335003n21862o3989k321334m358877k529075J601476M123801
55217A3196420M275852K975223j34193l657187l182445J498939L022854l014215
55209A4981248r315191o788344J541304N953551N209273N299583O016367J499501
55201B4397292o334489q018923k039631K261464M08681p45069L075649N084719
$$ y = [25664308, 24512808, 20477142, 18870667, 21388967, 25087651, 26669720, 26660097, 27658994, 29470109, 29444321, 27552226, 26463449, 25588076, 20603977, 11453418, 4939747, 5179761, 7099493, 5153415, 3371584, 9039807, 19757368, 25617049, 23363722, 19862585, 20500907, 21883361, 18745354, 12060060, 6858873, 6071975, 9255568, 14249485, 18035363, 18601283, 17266280, 16744418, 16680429, 14359095, 10000218, 7471143, 9072619, 13196420, 17472272, 20447495, 20313302, 16656115, 13473670, 14972609, 17995463, 14981248, 5666057, -1122287, 419017, 6372568, 11581841, 16881424, 22897791, 24397292, 18062803, 10043880, 8004249, 10265713, 10674394, 9929325, 13004974, 18089693]
55193A8089693l81661p490129q496948n037691k059619J293467O180541P094789
55185I192442L25805o482217l652211N547579R171031L286219m732497p791381
55177D864770n477381k20656M950582N701083P12523m156304k667582K401793
55169F108828L570136K30519k100138k261333l834782n642432k096538N452758
55161e72982P668080R71542o279188n745132J50376M238722M769358M002142K050860
55152A1253778j666440m386467l213102k54822K65768j491232j619823J311543
55144A99203M371551M487816J923543o96345j334703l34811L21822k70896o59704
55135H007476L67840J158919l55002k591599k125231P53090K104088L54542j577023
$$ y = [18089693, 17708032, 10217903, 1720955, -3316736, -5376355, -4082888, 2097653, 9192442, 9518247, 3036030, -616181, 4931398, 14102429, 17388648, 12656151, 4864770, -612611, -833267, 4117315, 9818398, 10530921, 6374617, 3707035, 6108828, 9678964, 9909483, 7809345, 5548012, 1713230, -3929202, -6025740, -572982, 7095098, 8066640, 1787452, -3957680, -3807304, 431418, 5200776, 9202918, 11253778, 9587338, 5200871, 1987769, 1732947, 1998715, 507483, -1112340, 199203, 4570754, 9058570, 10982113, 10285768, 8951065, 8616254, 8938076, 8667180, 8007476, 8375316, 9534235, 9179233, 6587634, 4462403, 5215493, 7319581, 7674123, 6097100]
55126F097100j096789O70010J485283Q27489r37570l184778m059093k089285O49780
55117a637853O18987j364709p17238L309149N366773J746391l780588m942019
55109a401107p95175M174837N467457K056158l264751n599367k466364K639862
55101H11550M253435K582498K521578M518562K854196m300468r674535o584085
55093c017269J315405N526225L949598Q63530r57960j777522q52073K617916N526162
55084A3194012L843293q15803l080988j985917j528982k846324k084520K103233
55076F798004M821409K184558k202892k495205O08162J452633j262622k186079
55068G717968K196523P136891N347274k849979r301406q016185j627078L275950
$$ y = [6097100, 5000311, 5670321, 7155604, 7983093, 7045523, 3860745, -198348, -2287633, -1637853, -1018866, -2383575, -3100813, 208336, 5575109, 7321500, 3540912, -1401107, -2196282, 1978555, 7446012, 9502170, 6237419, 638052, -1828312, 811550, 5064985, 7647483, 10169061, 14687623, 17541819, 13241351, 3566816, -3017269, -1701864, 3824361, 7773959, 8637489, 7679529, 5902007, 5049934, 7667850, 13194012, 17037305, 16221502, 13140514, 11154597, 9625615, 6779291, 4694771, 6798004, 11619413, 13803971, 11601079, 9105874, 9714036, 11166669, 9904047, 7717968, 9914491, 17051382, 22398656, 19548677, 10247271, 2231086, 604008, 3879958]
55060C879958L716038J166895j748738k356309J105944N793065M729780l956125
55052A2330508j1308826p844779K476975O969137K404783j381497J894040N397501
55044A0937842J793642m030956l444563J457411J906238k677032m092623J042202
55036B892161O198905N026120m90170m502022m881392l536939k359124j343462
55028b995923M95207L326907N291710M030642K38125k345720j953827j114475
55020D972646j868769k033842M88221K986007J876417j226940k103971n97044
55012B492725N9396j040928k055711k187233j486702J152539N019732N165317
55004G119135r87966o934913m474588L439745N840634J80462l681486J107512
$$ y = [3879958, 7595996, 8762891, 7014153, 4657844, 5763788, 11556853, 16286633, 12330508, 1021682, -6823097, -4346122, 2623015, 5027798, 3646301, 5540341, 10937842, 12731484, 8700528, 5255965, 6713376, 8619614, 5942582, 1849959, 2892161, 9091066, 14117186, 13627016, 9124994, 4243602, 706663, -1652461, -2995923, -2500716, 826191, 6117901, 10148543, 10386668, 8040948, 6087121, 4972646, 3103877, 1070035, 1558256, 4544263, 6420680, 5193740, 3089769, 2492725, 2552121, 1511193, -544518, -2731751, -4218453, -3065914, 1953818, 7119135, 6131169, -803744, -5278332, -1838587, 4002047, 4182509, 501023, 1608535]
54996A608535P758611O272302j961573o991891m249744R87325K108160j018123
54988D513602l429540j385819L660717O700819M798066M97021j839446j945840
54980A1569580k713098m041504k449004K194587M667447J800270k489307l104889
54972E434082j096824q88115k897038l610236j576047J103183K689625L293820
54964B452450K671593L00613k168951k219840q10279j636980m832154n433418
54956a1676966p21036M578422M493527O35642m79861K127368K546034j703926
54948b00796m665021j192010M462002N241384K165247J149585J904273p86517
54940H078147n483618m361536K755488N476603p64734n729489k58590P675446
$$ y = [1608535, 9367146, 15639448, 13677875, 6685984, 2436240, 3423565, 5531725, 4513602, 1084062, -301757, 3358960, 10059779, 14857845, 15354866, 13515420, 11569580, 8856482, 4814978, 2365974, 4560561, 9228008, 11028278, 8538971, 5434082, 4337258, 3449143, 552105, -3058131, -4634178, -3530995, -841370, 2452450, 5124043, 5424656, 3255705, 1035865, 225586, -1411394, -6243548, -11676966, -12398002, -7819580, -3326053, -2690411, -3170272, -1042904, 1503130, -200796, -4865817, -6057827, -1595825, 3645559, 5810806, 6960391, 8864664, 8078147, 2594529, -1767007, 988481, 6465084, 5700350, -29139, -287729, 7387717]
54932G387717M542425o722239j0084143n70815Q776025P059447L27078l57100
54924A0358395L706711K633961n599470j1834780q693543L564N137685L741984
54916e45493J100413K221257M766689L050072k693862n802235k882744J259321
54908D73418J563387L55697J802401L412422M41703m408536m382819k90100O64609
54899c67818k193009j349053N250561Q933794L644575m014091m697014L18936
54891E526881K998352J019054j175062j012388m46247r33073j320144o96445L45734
54882D306662R65163L50782j780277l315116j274098K770519K884529k427777
54874B480387o174445k342138M765226O684425L055225O80196K133897K914887
$$ y = [7387717, 11930142, 5207903, -4876240, -5447055, 3328970, 10388417, 10715495, 10358395, 14065106, 16699067, 11099597, -735183, -9428726, -9425162, -4287477, -545493, 554920, 2776177, 7542866, 10592938, 7899076, 2096841, -785903, 473418, 2036805, 2392502, 4194903, 7607325, 8049028, 3640492, -742327, -1032427, -367818, -2560827, -3909880, 1340681, 10274475, 13919050, 9904959, 5207945, 5526881, 8525233, 9544287, 8369225, 7356837, 6910590, 5977517, 4657373, 3960928, 4306662, 5271825, 5622607, 3842330, 527214, -746884, 2023635, 4908164, 2480387, -3694058, -6036196, -1270970, 5413455, 8468680, 9148876, 11282773, 14197660]
54866A4197660R5617l282518m091167l445574k883153j296019J542110K675323
54858C512279M64478j930392j059379J271730P07713k788928m654357k375031
54850f851887R34295J023702j599014k476656P78609N459438P247067M981301
54842I496855Q31436k784845m608006l940104j167724J298756J068817r87847
54834g92662j824066p05842J13569k64611L86945L302304N749550M523911N14499
54825A1003597k374363j671485J626509M152950K640633k738612p070990n474730
54817I3509L30762L772191K372384J63830k42643j681730n050310m859643J524620
54808c577030O283512J539964o857499o384546L192587R325344N823705N47040
$$ y = [14197660, 14293277, 11010759, 6919592, 3474018, 590865, -705154, 836956, 3512279, 3976757, 2046365, 986986, 2258716, 2966429, 177501, -4476856, -6851887, -5917592, -4893890, -6492904, -8969560, -8190951, -2731513, 4515554, 9496855, 10328291, 7543446, 2935440, -1004664, -2172388, -873632, 195185, -792662, -2616728, -3322570, -3209001, -3473612, -3086667, 215637, 5965187, 10489098, 11003597, 8629234, 6957749, 8584258, 12737208, 15377841, 12639229, 5568239, 93509, 424271, 4196462, 6568846, 6732676, 6490033, 4808303, -242007, -5101650, -3577030, 2706482, 4246446, -2611053, -8995599, -5803012, 3522332, 9346037, 9893077]
54800I893077M39014Q30033l251146n680170K40241P277847L137176r344212j3943260
54791a0401400l820282R084671J1010089L142822l796607m177776m76692K935406
54783C500231K976146j281135n875633m152269L435950O826168M7352q058306
54775b581496n811668L082963N132032j032329k548459N417812J0135829J763467
54767A3558151r290314p377743M506232R727428K820834m748135l638709J343579
54759F901323J772280j913127l918794k505394m74867J3683q04360j531779o99688
54750c160723J331243J525493j621162l928863m81127N758616O512754J72017
54742F108248n418796m243703K51105K000396R63812P67682K203044L239671K399392
$$ y = [9893077, 10332091, 11162124, 7910978, 2230808, 2471049, 9748896, 12886072, 3541860, -10401400, -14221682, -5137011, 5873078, 9015900, 5219293, 1041517, 564825, 3500231, 6476377, 5195242, -680391, -4832660, -1396710, 5429458, 5476810, -2581496, -8393164, -5310201, -178169, -1210498, -3758957, 1658855, 11794684, 13558151, 4267837, -3109906, 1396326, 11123754, 13944588, 9196453, 5557744, 6901323, 8673603, 6760476, 2841682, 336288, -138579, -124896, -929256, -2461035, -3160723, -1829480, -303987, -1925149, -5854012, -6335139, -576523, 5936231, 6108248, 689452, -3554251, -3303146, -1302750, -338938, 428744, 2631788, 5871459, 8270851]
54733H270851p31575n156785o982125k789609L803074M728930q66738m244157
54725c968134j64765M912144L462198j247263j634586J560897K176568J32555
54717E229614K55623J932642J04945m001724l475823J616858K357724m509948
54709d90089r380730l409601P376778R520064M45945q443419o968000J849610
54701i499442P393646N013141J0633r47167J671334K560963R8279j464450J226316
54692F063253N357349N684928J193718m385296p130308n920317k293492Q25948
54684f04217J500890R52245J415277J462042k503095q507376q349020J034567
54676a3598687J0557402R684536O46022n323982l716956m59161l29737n28685
$$ y = [8270851, 7539276, 2382491, -4599634, -7389243, -3586169, 1142761, 276023, -3968134, -4132899, 779245, 4241443, 2994180, 1359594, 2920491, 5097059, 5229614, 5485237, 7417879, 7522824, 3521100, 45277, 1662135, 4019859, -490089, -9870819, -13280420, -5903642, 3616422, 4062367, -4381052, -11349052, -9499442, -2105796, 2907345, 2917978, 1970811, 3642145, 6203108, 6301387, 4836937, 6063253, 11420602, 17105530, 18299248, 13913952, 6783644, 863327, -1430165, -604217, 896673, 1848918, 3264195, 4726237, 2223142, -6284234, -14633254, -13598687, -3041285, 6643251, 7289273, 1965291, -1751665, -2210826, -2540563, -3069248]
54668c069248J915549M060538K607545m9982j6392J692166J358729j360320l516449
54659C622136l454630k126526q36605r3741O0090K10718J156377K345056K191121
54650C073996Q02930L44344J485625J885596M4431j690576n82684J849557J853515
54641I066734q02699k553703j658322o78426j959885l558797k322892P64479J812489
54632a891022J93321m51440J480722K347052n67333l222140k12462O001333P498900
54623A1176931K433697k514537k771320j917101l522768l846247J138943O674409
54615F852007N039625k374313o831155m972412j844554j007797K32765L520893
54607a384941M927042J922060j074401N48180L542689J629184m000958n664208
$$ y = [-3069248, -1153699, 2906839, 5514384, 5464402, 5448010, 7140176, 8498905, 7138585, 3622136, 167506, -1959020, -2795625, -2889366, -2829276, -2618558, -1462181, 882875, 3073996, 3876926, 4221270, 5706895, 7592491, 7636922, 5946346, 5363662, 7213219, 9066734, 8264035, 5710332, 4052010, 3373584, 1413699, -2145098, -4467990, -3703511, -1891022, -1697701, -2149141, -668419, 1678633, 1111300, -2110840, -2323302, 3678031, 11176931, 13610628, 11096091, 8324771, 6407670, 2884902, -961345, 177598, 6852007, 11891632, 9517319, 2686164, -2286248, -4130802, -5138599, -4905834, -1384941, 3542101, 5464161, 4389760, 4937940, 8480629, 10109813, 6108855, 444647]
54599D44647q27711L489067Q86831m381354k820069O247835J2091899O378629
54591B1509774n156161r771971m069407K855082K561760k800631n918532m101941
54583d892027l100L239271L726093J045362j851102n89432L803372M770558N56247
54574I805242j642597K351119M654466k530939j1618642q932781L443679R200829
54566D730376K133800n323928k493384L965966L070064k723527l575192J019953
54558H04128L060503L8030k461249j119068J105477J604124J310820N20862j975698
54549B887929m564594l589042J88377J579386p97727j965734J015498L710774
54541a535133J693660j478382K63077M966161M929786q23425m065149p48M601558
$$ y = [444647, -383064, 3106003, 3992834, -388520, -3208589, 3039246, 15131145, 21509774, 16353613, 6581642, 2512235, 5367317, 7929077, 5128446, -790086, -4892027, -4895127, -1655856, 2070237, 3115599, 1264497, 675065, 4478437, 9248995, 9805242, 8162645, 10513764, 15168230, 12637291, 1018649, -7914132, -4470453, 4730376, 6864176, 1540248, -953136, 3012830, 6082894, 3359367, -215825, 804128, 3864631, 3902661, 1441412, 322344, 1427821, 3031945, 4342765, 4863627, 2887929, -1676665, -5265707, -5077330, -3497944, -4295671, -6261405, -5245907, -1535133, 158527, -1319855, -1056778, 3909383, 8839169, 8015744, 3950595, 3949847, 8551405]
54532H551405J466082o061927p646218j447694L663216J976322j581156j044187
54524b124157J339241R19178o43158N13142K202035r8826m153350l756337O82343
54515e119889K475822l52458k268410L06657M010780N200356M944840M538111
54507A3735809K177305k238442m353984j720872J282027n99126n666313p750918
54499e134514m557870L07481K528961J191137j707405l468769k543093L52664
54491a3031408K814410K914900R06480q12875M20878M172858N607423Q41240n844223
54482b010317n427609K775790Q147935L851163k547652j581364K346916n56180
54474D998682o904191n142228L321923N077299j953232m057674M292231R773376
$$ y = [8551405, 10017487, 3955560, -3690658, -5138352, -1475136, 501186, -1079970, -2124157, -784916, 134262, -508896, 4246, 2206281, 2107455, -2045895, -5802232, -5119889, -2644067, -2996525, -5264935, -4958278, -947498, 4252858, 9197698, 13735809, 15913114, 13674672, 9320688, 7599816, 8881843, 8282717, 2616404, -5134514, -9692384, -9384903, -6855942, -5664805, -7372210, -10840979, -13384072, -13031408, -10216998, -7302098, -6395618, -7208493, -6787615, -2614757, 2992666, 3833906, -2010317, -7437926, -4662136, 3485799, 7336962, 4789310, 3207946, 5554862, 4998682, -1905509, -7047737, -3725814, 1351485, -601747, -4659421, -367190, 9406186]
54466I406186K545262o974525n867366O91747J035429k336083r076N023088K675751
54457F190413m880992o293033p02596J924476r19801j475399K249866K943611
54449i63455j144652k122989K903550O117677K659922j804367k374168k537624
54441G33894m527029k832876N058379J0650659N886276m177662q565078n169304
54433b942741n30152J237979J718622K557814K925247J967131j04047k444972
54425D384881l148492p20534K670960K941674K60211j054324P2903K6165j822504
54416C610940j063069L034697M387306L59331k385004J527171O677136N371090
54408B1519598l01446l124509k469761k581038l186650j089540J678358M60894
$$ y = [9406186, 11951448, 4976923, -890443, -198696, 836733, -1499350, -1508426, 3514662, 6190413, 1309421, -4983612, -5686208, -3761732, -4681533, -6156932, -3907066, -963455, -2108107, -4231096, -1327546, 4790131, 7450053, 5645686, 3271518, 733894, -3793135, -6626011, -1567632, 9083027, 14969303, 10791641, 2226563, -2942741, -3472893, -2234914, -516292, 2041522, 4966769, 6933900, 6829853, 4384881, 1236389, 515855, 3186815, 6128489, 6388700, 5334376, 5407279, 5433444, 3610940, 2547871, 5582568, 9969874, 10329205, 7944201, 9471372, 16148508, 21519598, 21218152, 18093643, 15623882, 13042844, 9856194, 8766654, 10445012, 10905906]
54400A0905906l219898m187116k920334l304502l309822J581169P009974L872073
54392F427450n537004q280313o67153N447009J655373m114531j886432M124512
54384b831089M237515p5613m35672K950671K536819k319666m195442m65404L178201
54375B580320L076446K014242J511221j327577o272877p406325k344087K562012
54367e606625J048922m055212n439045j270053L828702N328938K882384m72325
54359c754314j137136J297560K652159m72285m221047j628473O102436R340107
54351H179007L755299k947461k788728R11064N07536l202314l771283r45666l52263
54342f54809k791120l027563K70531J899910o23420k719672p80962J839399R39066
$$ y = [10905906, 7686008, 3498892, 578558, -2725944, -6035766, -4454597, 2555377, 6427450, 890446, -7389867, -8057020, -2610011, -954638, -5069169, -6955601, -2831089, 1406426, 1330813, 895141, 3845812, 6382631, 4062965, -132477, -597881, 2580320, 5656766, 7671008, 9182229, 7854652, 1581775, -5824550, -8168637, -5606625, -4557703, -8612915, -14051960, -15322013, -11493311, -6164373, -3281989, -3754314, -4891450, -3593890, -941731, -1414016, -5635063, -7263536, -1161100, 8179007, 11934306, 8986845, 6198117, 7109181, 7616717, 4414403, 643120, -302546, -654809, -3445929, -6473492, -6202961, -4303051, -4926471, -7646143, -8427105, -6587706, -5648640]
54333e648640j420447o64181K586404L353196k05645l947722l040419J788024
54325g199430M628425J313380m956917o980483k698388K341626L194239J947956
54317h409592K493565L237723O79329k990804k829570Q5027K37869k556743k662129
54308a2715325J497799M704707L877310K574807L905365N338370L777225M03703
54300A3363961k463296m468252m872033k216513J523451J838944j154125k156301
54292f04164O43951K648866J014792j073801j185507j451100k212483K40039N306733
54283C327326N900880J58368l411487M87935M039698q98348q196691o957169N35299
54274e014189L057801j050228k826090R71788L316156K33608k711607o95039K786387
$$ y = [-5648640, -7069087, -7733268, -5146864, -1793668, -1999313, -5947035, -8987454, -7199430, -2571005, -1257625, -6214542, -13195025, -15893413, -13551787, -10357548, -8409592, -5916027, -2678304, -1998975, -4989779, -7819349, -7734322, -7496453, -10053196, -12715325, -11217526, -6512819, -2635509, -60702, 3844663, 9183033, 12960258, 13363961, 10900665, 6432413, 1560380, -656133, 867318, 2706262, 1552137, -604164, 39787, 2688653, 3703445, 2629644, 1444137, -6963, -2219446, -1979407, 3327326, 9228206, 9386574, 5975087, 6463022, 10502720, 9604372, 1407681, -5549488, -5014189, -1956388, -3006616, -5832706, -4860918, -1544762, -1311154, -4022761, -4717800, -1931413]
54265a931413K825735N75839m00781j29464q32844k775766l934800k092290K791916
54256e903868O603575L800187m684585r747656n296753K605956M271991L30433
54248h020720j161264J410489K321623M14698J044068M969677N701778P37115
54240G417464l851988l506589j333357n08893J013054L762317K983352k693996
54232C281364o116136j801410M629664M336724j833652n491999k890658J832159
54224d053944M184231L992854K468043n18324m629090p090474m633238K109155
54216h170787O925252L481952n849011j0151602l133558P237551Q679148J502926
54208E21871l125189q01364J028092k328044m444769K32761N716269L977577j851378
$$ y = [-1931413, 894322, 1470161, 1069380, 939916, 107072, -2668694, -6603494, -8695784, -5903868, 699707, 4499894, -184691, -9932347, -15229100, -12623144, -8351153, -8020720, -9181984, -7771495, -5449872, -5035174, -3991106, 978571, 6680349, 7417464, 3565476, 58887, -1274470, -1783363, -770309, 2992008, 5975360, 3281364, -2834772, -4636182, -6518, 4330206, 2496554, -2995445, -5886103, -4053944, 130287, 4123141, 6591184, 6072860, 1443770, -5646704, -10279942, -8170787, -1245535, 2236417, -3612594, -13764196, -16897754, -9660203, -981055, 521871, -2603318, -3404682, -2376590, -4704634, -9149403, -8916642, -3200373, 777204, -1074174]
54199a074174k776322J996080N035473K407684k271730m541235l584194n44221
54191e352639K475272K215921k430339p269705o750679p91001N229017O648632
54183f025521L412903j053755k829447p34153K011982J393749j413754j234341
54175f472337K755591M779064J204488l579580l957217j090670N24083L24221
54167e512357K85790j28179k021862k973636n10857K722279K741948R01315J172386
54158c323173K861227K116773p44317j683637o3149P24117k86649l08087J503944
54149G97049K364451R30505o76164j211899k345597m618207n077875j307322M411574
54140f733485O966799L669916k924223o913377m387855K192609O083334L736170
$$ y = [-1074174, -3850496, -1854416, 3181057, 5588741, 3317011, -1224224, -4808418, -5352639, -2877367, -661446, -3091785, -10361490, -17112169, -17903170, -12674153, -6025521, -2612618, -3666373, -6495820, -7229973, -5217991, -3824242, -5237996, -6472337, -3716746, 1062318, 2266806, -1312774, -5269991, -6360661, -5836578, -5512357, -5226567, -5354746, -7376608, -10350244, -10861101, -8138822, -5396874, -4495559, -3323173, -461946, 1654827, 910510, -773127, -836276, -112159, -398808, -706895, 797049, 3161500, 4092005, 3415841, 2203942, -141655, -4759862, -9837737, -11145059, -6733485, 233314, 3903230, 979007, -5934370, -10322225, -8129616, -2046282, 1689888]
54132A689888j546756m586935m242171k299849L82256L277910M244495K063726
54124a017436o63787o30960J596724L135138L083806K182507K79560k509492m215956
54115A240104l826875l230135l265963j347637L094048N136749J726323j898525
54107b371911n5441L220942O01572n000307l913914L992969P892542K871852k785879
54098D452425j648896J483074r44212o181513o012935n809M301298K507681k093342
54089d142229m475231l144498N38487M203690N252259K691501j382600l747193
54081d205814l196616p67170J831131K708066M98557l478180n187396k138013
54073a3935435L220370O167355M980569J848251p19379k367517l671715m067959
$$ y = [1689888, 143132, -4443803, -8685974, -10985823, -10603567, -7325657, -3081162, -1017436, -1681223, -2312183, -715459, 2419679, 5503485, 7685992, 7965552, 5456060, 1240104, -2586771, -5816906, -9082869, -10430506, -7336458, -2199709, -473386, -2371911, -2427352, 793590, 1395162, -3605145, -7519059, -3526090, 4366452, 7238304, 4452425, 2803529, 4286603, 3342391, -2839122, -8852057, -8857866, -4556568, -2048887, -4142229, -8617460, -11761958, -11223471, -7019781, -1767522, 923979, -458621, -4205814, -7402430, -8169600, -6338469, -3630403, -3131846, -6610026, -11797422, -13935435, -10715065, -4547710, 432859, 2281110, 1561731, -805786, -4477501, -8545460]
54065h545460k171417J871086N230424M817887J039666k313959k660045j407342
54057d139160r79878j207746p24930J77376Q12668K151325M344700M354462K30942
54048E019759m154825l782590n18496m61016l813782m339298K39239M576200M753191
54039b481618L798730M478533L551921j373139n266625k781779K505296L384878
54031E816197L58495l39541J813911J061653l468995n045247n71842L538533J640317
54022D803481j710672N47683N502248L992668m619136j0084805n508910L254824
54014c822619O286270K221604k713886m277557l045086j47314L610157N256075
54006C367644K251619k421437l468981j664460k505664n775632m423872L226363
$$ y = [-8545460, -10716877, -8845791, -3615367, 1202520, 2242186, -71773, -2731818, -4139160, -5119038, -6326784, -7051714, -6874338, -6061670, -3910345, 434355, 4788817, 5019759, 864934, -2917656, -3436152, -3897168, -7710950, -12050248, -11811009, -7234809, -2481618, 1317112, 5795645, 9347566, 7974427, 2707802, -73977, 2431319, 5816197, 6174692, 5835151, 7649062, 8710715, 5241720, 196473, -375369, 3163164, 4803481, 3092809, 3640492, 9142740, 13135408, 8516272, -1568533, -7077443, -3822619, 2463651, 4685255, 1971369, -2306188, -5351274, -5498588, -1888431, 3367644, 5619263, 3197826, -271155, -1935615, -4441279, -10216911, -14640783, -11414420]
53998a1414420Q506547N073506r76403j064591K210576P01263m579259n236094
53990f778875j25160K891280N00430j213193J771864M467308J951864k115750
53982A349768j634519K531900M714858K699286o66914k180368j530999r53683
53974D329329k677289n371983m282316J949968O794382L701862l438030n269187
53966d263264j334777Q7841k894275k237331M861518Q999233L713934k841651
53958D091228o89996N934786O145263j45784l841265k005207k68298j396747j718037
53949F105943Q45307L411747L233120J3622n601369j0079870o912010M052144
53941d931366J1265004N217625o114859p446713P55779L822629k524787n778782
$$ y = [-11414420, -2907873, 2165633, 1189230, 124639, 2335215, 3036478, -1542781, -6778875, -6904035, -4012755, -3512325, -4725518, -2953654, 1513654, 3465518, 1349768, -284751, 2247149, 6962007, 9661293, 8994379, 6814011, 5283012, 4329329, 1652040, -3719943, -8002259, -6052291, 742091, 4443953, 1005923, -4263264, -5598041, -5510200, -8404475, -10641806, -5780288, 3218945, 6932879, 4091228, 3401232, 9336018, 15481281, 15335497, 11494232, 9489025, 9220727, 7823980, 6105943, 6951250, 10362997, 13596117, 13609739, 8008370, -2071500, -8983510, -4931366, 6333638, 11551263, 5436404, -2010309, -1254530, 2568099, 43312, -5735470]
53933e735470O88268N377025j322373r204946l985514Q998413J2325403K606659
53925I747465o173262m415162J674235K628646j445958m806138m845838k445090
53917a0081102R97567L239666K030950j042465j257950K568064N796494M452137
53909F703361L76143k407711l036832k816435j894766q7305J116980M78254m75738
53900b044049L93323K256321K536267R65146j68152L94070J344876J045692n52928
53891F170566k432351l309190j819749K146466N755815N028814j94640m802008
53883F543723m135813j52723J018058k351578m965903k231620K621277K961397
53875f93182j317536l347731M64965M768928L021939k778424m939349j043357
$$ y = [-5735470, -5047202, 329823, -992550, -10197496, -14183010, -5184597, 7140806, 9747465, 3574203, -840959, 833276, 3461922, 2015964, -2790174, -7636012, -10081102, -9083535, -5843869, -3812919, -4855384, -6113334, -3545270, 2251224, 6703361, 7079504, 4671793, 1634961, -1181474, -3076240, -3163545, -2046565, -1568311, -2044049, -1650726, 605595, 3141862, 4107008, 3938856, 4332926, 5677802, 6723494, 6170566, 3738215, 429025, -1390724, 755742, 6511557, 11540371, 11345731, 6543723, 2407910, 2255187, 3273245, 921667, -4044236, -6275856, -3654579, -693182, -2010718, -5358449, -4893484, -124556, 2897383, 118959, -4820390, -5863747]
53867e863747L245510K869891k5296n78839J370607K032343K8975j906041j582226
53858d08823l65187k56617m06836J114441L137960J954270l076447o960296m660122
53849i927657J896411N771682M143464J460243J697273J946101j904973o510902
53841a428358m703414L062146P960868M884405j252713l915664l338675k590417
53833a321822j334990R64393Q56168l352096n978700j877952L531190J392464
53825g121345n418302m978466N078640J2557175Q001028k485039p191437l863914
53817e421660J413853M139610L639879K66590l461639l002950J525810L369255
53809B468748p44106m078310l67446M981000L216186k885824l395255K024560
$$ y = [-5863747, -2618237, 251654, 226358, -352481, 1018126, 3050469, 3079444, 1173403, -408823, -774010, -1030627, -1437463, -323022, 2814938, 4769208, 1692761, -5267535, -9927657, -8031246, -2259564, 1883900, 3344143, 5041416, 6987517, 5082544, -1428358, -6131772, -3069626, 4891242, 9775647, 8522934, 4607270, 1268595, -1321822, -2656812, -1692419, -836251, -4188347, -10167047, -12044999, -8513809, -7121345, -12539647, -17518113, -12439473, 117702, 8118730, 5633691, -1557746, -5421660, -4007807, 131803, 3771682, 4038272, 576633, -2426317, -900507, 2468748, 1724642, -2353668, -2721114, 2259886, 5476072, 2590248, -805007, 1219553]
53801A219553L621598k013938o670607m287845M59718J648989J176404K876564
53793a969564M836896L575307N47695r42413j087468j283698n94970J235421J246535
53784E563741k001828m850525l752935m41041J892734L424409M475626K096351
53776F406532m482909q895163m884800L844014P778698M315674l20097j396990
53768B364959q91331j151116p2648L898851O798962L953657k528463n713519k950111
53759C709241J139097J970516J314672K787950M044836j51101p190284p056633
53751E68294K621751R850893M182703p017152q744907n75299M305020Q54699j977533
53742D068469O48773J344693l360341m208932L489195P910906n06237j0365746
$$ y = [1219553, 4841151, 2827213, -3843394, -8131239, -7671521, -6022532, -4846128, -1969564, 2867332, 6442639, 6990334, 6047921, 4960453, 3676755, 3081785, 4317206, 5563741, 3561913, -1288612, -5041547, -5482588, -3589854, -165445, 4310181, 6406532, 1923623, -6971540, -11856340, -8012326, -233628, 4082046, 3761949, 2364959, 1473628, 322512, 249864, 4148715, 10947677, 14901334, 12372871, 6659352, 3709241, 4848338, 6818854, 8133526, 10921476, 14966312, 14815211, 7624927, 568294, 3190045, 13040938, 17223641, 10206489, 1461582, 886283, 5191303, 6046002, 4068469, 4717242, 6061935, 2701594, -1507338, 1981857, 9892763, 9386526, -979220]
53734i79220n862594O991652R473357N8411n040905M2233L011406k913659p127993
53725b347312j287894N786872L539747k927956k792300K663042M262197O22165
53717G518561j804393p09669r3045k222009n037014o335506n087890p02858M511226
53708i962597N423336J189003j795072Q60074M079244J525181l344656k532289
53700d557776L255637N554823J417531k794365j834092J467427J793579j519679
53692B783085n151460n808283k204796L813109P479084N379431k88598m357458
53684A644114m915010l857768k443401k87834J909218K805920L198298M333536
53676B387073M138354j49012n900039p027387k682773J306400J155192K0684J746142
$$ y = [-979220, -6841814, 149838, 9623195, 9681606, 4640701, 4682934, 7694340, 4780681, -2347312, -3635206, 2151666, 5691413, 2763457, -28843, 2634199, 6896396, 7518561, 5714168, 5004499, 4911454, 2689445, -2347569, -8683075, -13770965, -14473823, -9962597, -4539261, -3350258, -5145330, -4285256, -206012, 1319169, -2025487, -4557776, -1302139, 4252684, 5670215, 2875850, 1041758, 2509185, 4302764, 2783085, -2368375, -8176658, -10381454, -6568345, 910739, 6290170, 6001572, 1644114, -3270896, -7128664, -9572065, -9859899, -7950681, -5144761, -1946463, 2387073, 6525427, 6376415, 476376, -6551011, -9233784, -7927384, -6772192, -6751508, -5005366]
53667e005366M530038M422084J597091p96688j798800k867845m076988l398567
53659g395041J48267M639998O829147M896572J30428l684539l529368m16926J541121
53650C159659j57362l595663m820130k196841J977819L701145J248776k646459
53642c329056l522642p87651J245297m70073k961725j830132J535271J939693
53634h181018j358958l625025k180429L66015J682374L117907N204422M956441
53626a8271J282575j233514J569209O572857P136435J778944m851376q148683
53618D088176p150030l436860J69777J083373M314P37673M154600N137108l18275
53609D469856p616945q626657k654801L424928N197433M666114M132628K679476
$$ y = [-5005366, -475328, 3946756, 5543847, 4747159, 2948359, 80514, -3996474, -7395041, -7246774, -2606776, 4222371, 9118943, 9249371, 5564832, 2035464, 1618538, 3159659, 3002297, -593366, -5413496, -7610337, -5632518, -1931373, -682597, -3329056, -6851698, -7639349, -6394052, -6864125, -9825850, -11655982, -10120711, -8181018, -9539976, -13165001, -15345430, -14979415, -13297041, -10179134, -4974712, -18271, 1264304, 30790, 1599999, 8172856, 15309291, 17088235, 12236859, 4088176, -3061854, -6498714, -6328937, -5245564, -5241250, -4503577, -348977, 4788131, 4469856, -3147089, -11773746, -14428547, -11003619, -5806186, -1140072, 2992556, 5672032]
53601E672032K16147r68503q26788k216596m676086l379442K484549O200782L015494
53592E521589k034049j536984L075531M353232M21963l116012k240178O98710
53584E143802J894953Q68537q00634j868873j655829n02690l1785p21516m53863
53575A872102J694240K401066r44196m545378l214704O27293J49418m221206m753155
53566a0934520N76848M039351Q82305k528125O43635O251935O172990J298141
53558F402560j180374J40611N89875o93384J83257L052461K722457j828495n214166
53549D174802m622036l487484l608334j486157L347027M198622k246843p898224
53541a1628627m048103M499194N852840o53215l494360K559791Q009556L880209
$$ y = [5672032, 5888179, 4919676, 4092888, 1876292, -2799794, -6179236, -3694687, 2506095, 5521589, 3487540, 1950556, 5026087, 9379319, 9801282, 6685270, 4445092, 5143802, 7038755, 7907292, 7106658, 5237785, 3581956, 3079266, 3047481, 2325965, 1872102, 3566342, 5967408, 5023212, 477834, -2736870, -2109577, -1960159, -6181365, -10934520, -10357672, -6318321, -5436016, -7964141, -7320506, -1068571, 5104419, 6402560, 5222186, 5362797, 5952672, 5259288, 5442545, 8495006, 11217463, 9388968, 4174802, -447234, -3934718, -7543052, -9029209, -5682182, -1483560, -3730403, -11628627, -15676730, -11177536, -5324696, -5977911, -9472271, -6912480, 1097076, 4977285]
53533D977285l780602l373529L993538O388570l11167o520526m179889J656322
53525a149998K157014j672197k613636J07369Q46040j535869j904216J377657
53517d387836L482619K119550J373666L057214K268694l151010o374303k121946
53509c733352L116793O68067n444548m316983L576802O359276p5530n279119j178271
53500f306865N146790L259074m131380n973533J64764N462990L287139k588794
53492a679815m545077n75710M732602N673819P84102n420596o177883J27912O978621
53483a02025O568199p96907o856407n247184J258359M595414J173322l923575
53475c330804l187843L599040Q246682M373785l667341o145948j198051K968598
$$ y = [4977285, 1196683, -2176846, 1816692, 8205262, 7894095, 1373569, -2806320, -1149998, 1007016, -665181, -3278817, -3171448, -2325408, -3861277, -5765493, -4387836, -905217, 1214333, 2587999, 5645213, 7913907, 4762897, -1611406, -3733352, -616559, 51508, -5393040, -9710023, -6133221, 226055, 150525, -5128594, -6306865, -1160075, 2098999, -2032381, -8005914, -7841150, -2378160, 908979, -1679815, -6224892, -6800602, -2068000, 3605819, 4389921, -1030675, -7208558, -7080646, -102025, 6466174, 5669267, -1187140, -6434324, -5175965, -580551, 592771, -3330804, -6518647, -2919607, 5327075, 9700860, 6033519, -112429, -1310480, 1658118]
53467A658118K95353m864408n361354j818530j0011j214347j591074M50043K483877
53458i972333L319985M233857M527309J515935l599804n175990j057705L441428
53450b767318L023438K42068J167657N205345M920939k916064j0873510r290943
53442a1288388P70641P849102M410111l610399n317513K77058M045678Q06124
53434b057586l784937l130418L32341O07631j408069k73375L759707M672790O54615
53425f27301k993853k268496L03600Q99450l16680j513453k296123k115415K58224
53416a0670047L355699L360469L64426l09156L669731O776837L548336k687376
53408G408919m631623j687781M92299l65328o22015J926039M274100L499555R70218
$$ y = [1658118, 1953471, -2910937, -8272291, -10090821, -10100832, -11315179, -12906253, -12456210, -9972333, -6652348, -2418491, 2108818, 3624753, 24949, -5151041, -6208746, -2767318, 256120, 498188, 1665845, 6871190, 11792129, 8876065, -1997445, -11288388, -10517747, -2668645, 1741466, -1868933, -7186446, -6909388, -2863710, -2057586, -5842523, -8972941, -8640600, -8032969, -9441038, -9714413, -5954706, -1281916, -627301, -3621154, -5889650, -5586050, -4686600, -5003280, -6516733, -8812856, -10928271, -10670047, -7314348, -3953879, -3589453, -3898609, -228878, 6547959, 10096295, 7408919, 2777296, 1089515, 1581814, 1216486, 594471, 2520510, 6794610, 10294165, 11264383]
53399A1264383r53707k533413m545882n628683m127152l90591M297382Q447864
53391E830201Q825534K231516q290242j3102095o747357L494978N713667j015849
53383c059647n765410j460908N605773N875264L67530j983083K075105O356133
53375H010757N108307K75105l084005l564117k605095q39090J082070Q71392k093207
53366C162117l778009k96158N173168N171329j627377p446669n282683J740868
53358c183414M576548J85841m855092l402225K784401N324916J78057o796638
53350e187606p053478k91842N346324M231383K03243j10956K763153L034590k82849
53341B651962j793174Q08532K296734j507429o227900n410906o08519J610580
$$ y = [11264383, 10310676, 7777263, 3231381, -2397302, -6524454, -6915045, -2617663, 5830201, 14655735, 16887251, 8597009, -4505086, -11252443, -7757465, -2043798, -3059647, -8825057, -10285965, -4680192, 1195072, 1562602, -420481, 1654624, 8010757, 13119064, 13394169, 10310164, 6746047, 4140952, 3301862, 4383932, 5255324, 3162117, -615892, -912050, 4261118, 9432447, 7805070, 358401, -4924282, -3183414, 1393134, 1578975, -3276117, -6678342, -3893941, 1430975, 1609032, -5187606, -12241084, -12532926, -7186602, -2955219, -2751976, -2862932, -99779, 2934811, 2651962, 858788, 1667320, 3964054, 2456625, -3771275, -9182181, -9790700, -8180120]
53333h180120N10047J466014N438943O145409M63640n272054m129023J430483
53325b126661M094569K524877J166954J379091j21573l838504n168820j575101
53317c665168K992642L608787O13707k317376l379018l278645k920064k732838
53309a1077973k641195j341547K263967N993349N796412J559764k033219k097375
53301c577817q16881J3535K347405N966222N117150k569556q769385m574278N121527
53292a742078P155523p46537o888395l638347J896242L85610n216715n373930
53284a4168627J194633O501912M928847q73818n178124n125058j405644L073983
53276a1051896M784868K475382j277405k882405j436620J477752M085835N001718
$$ y = [-8180120, -7670073, -6204059, -765116, 5380293, 5843933, 571879, -3557144, -2126661, 1967908, 4492785, 5659739, 7038830, 6917257, 3078753, -2090067, -3665168, -672526, 2936261, 3549968, 1232592, -2146426, -5425071, -8345135, -11077973, -13719168, -15060715, -12796748, -6803399, -1006987, 552777, -1480442, -3577817, -4394698, -4381163, -2033758, 3932464, 9049614, 6480058, -2289327, -6863605, -1742078, 5413445, 4666908, -2221487, -5859834, -3963592, -3577982, -8794697, -14168627, -12973994, -6472082, -1543235, -2417053, -7595177, -12720235, -14125879, -11051896, -6267028, -3791646, -5069051, -7951456, -9388076, -7910324, -3824489, 1177229]
53268A177229L384583L99042j155088m28978J08301j299694k443256l58012L818032
53259C202159N744603K889535k998911p605860p308134k105823L820689N854233
53251A492491L559199n0658l126942n785699o931236m703368m74699K125854K716225
53242a1178833L872353N203554L848347J372567K553525N775596L637861l710454
53234A1374516n955666J091817O833202J635777q078740j0566580o392228l569952
53226a3627854j936055L991819J0914996R892135K002761k559437p95323L95235
53218H278277j860864k559111l51100l88781l080099k078469L066728L964296
53210D990877k468099p875795n665104k67339K190845K910296M338758M067253
$$ y = [1177229, 4561812, 4960854, 3805766, 3376788, 3485089, 2185395, -257861, -615873, 3202159, 8946762, 11836297, 8837386, 1231526, -6076608, -8182431, -4361742, 1492491, 5051690, 5001032, 1874090, -3911609, -10842845, -15546213, -16020912, -13895058, -11178833, -7306480, -2102926, 1745421, 3117988, 5671513, 11447109, 15084970, 11374516, 5418850, 6510667, 13343869, 14979646, 6900906, -3665674, -10057902, -13627854, -15563909, -11572090, -657094, 9235041, 11237802, 8678365, 7883042, 8278277, 6417413, 3858302, 3507202, 3118421, 38322, -2040147, 1026581, 4990877, 2522778, -5353017, -11018121, -11285460, -9094615, -6184319, -1845561, 2221692]
53202B221692R39148q19537P20882J217585j153440j517568J704200K015326l433281
53193A895007o908425k649917K928142K491177K87124L032189O358393K360631
53185I794321n331071o575551j032914K508730Q45618p49183P45196K456433K336906
53176D998485J211431r20433l286020j498924N671557R954013L573463p145237
53168A2558335q976238j079264M374552Q60291m816014n193279j568348K277046
53160a562919N870996P779571M305804l315213p846715n924441k206623p74610
53152c674150Q5740J283715o19522n572329o407470P18000Q490179P779810K04312
53143B288285n084925l678804R83970M057540L291878j381192p200945q834438
$$ y = [2221692, 3160840, 2341303, 3062185, 4279770, 3126330, 1608762, 3312962, 5328288, 1895007, -5013418, -7663335, -4735193, -2244016, -1956892, 1075297, 7433690, 9794321, 4463250, -2112301, -3145215, -636485, 209133, -540050, 205146, 2661579, 4998485, 6209916, 5289483, 2003463, 504539, 6176096, 16130109, 19703572, 12558335, 3582097, 2502833, 6877385, 7737676, 2921662, -2271617, -3839965, -1562919, 4308077, 12087648, 16393452, 13078239, 5231524, -692917, -2899540, -3674150, -3588410, -2304695, -2924217, -8496546, -14904016, -14186016, -5695837, 2083973, 2288285, -2796640, -6475444, -5491474, -1433934, 1857944, 476752, -6724193, -15558631]
53135a5558631l593200M405658Q432570O375657J440448k322262k599225O20764
53127b798221L984203K665884l273102o794444k178863O508753R844535M870914
53119A2829659k284225n346943m381758k330272j11798J939487J537742k471231
53111f19339o295249m783943J307348N491779L878691j79231j545083q4201R91536
53102a837692Q70469J120694J473433K64386j363658m38488K336127K832527J88328
53093E446126j596239k06727J739441J837377J140535k83l657489q667650r132958
53084a3097867k964896L500694M321094K035707J561663J753283k18217j559912
53076d668451Q91540K741363j343833o583726l938420M810163Q464835K918074
$$ y = [-15558631, -19151831, -14746173, -6313603, 62054, 1502502, -819760, -3418985, -2798221, 1185982, 3851866, 578764, -6215680, -8394543, -1885790, 7958745, 12829659, 10545434, 5198491, 816733, -1513539, -1625337, 314150, 1851892, -619339, -6914588, -11698531, -10391183, -4899404, -1020713, -1199944, -2745027, -2829228, -1837692, -967223, 153471, 1626904, 1891290, 527632, 89144, 2425271, 5257798, 5446126, 3849887, 3643160, 5382601, 7219978, 8360513, 8360230, 4702741, -3964909, -13097867, -16062763, -12562069, -8240975, -6205268, -4643605, -2890322, -3108539, -4668451, -3776911, -1035548, -2379381, -8963107, -12901527, -8091364, 373471, 3291545]
53068C291545l855266m595174j162514K016025M181934M822575J654514m239327
53060B114312p245894m452617O76003L692776L469683L30574m476121o697183
53052a2588467k600710M439602O984188L797644N57703R752q75069k909116k315167
53043e499640J340073K901273K96912j918303n51071J850269L065432M125518
53035E610463L915396p43145o916338o615019M57128M767208J809180j111394
53027A173479J548544L910598J37533m476857l133396L70901p33370l777250k484812
53018g464630Q73893J41486k658485q80337M531031O766921M409773J245693k388005
53009D577340p962379j0798727m652201O387491J1000937O216080L44420o64453
$$ y = [3291545, -563721, -5158895, -6321409, -4305384, -123450, 4699125, 6353639, 2114312, -5131582, -9584199, -8908196, -5215420, -1745737, -1415163, -5891284, -12588467, -15189177, -10749575, -3765387, 32257, 589960, 599712, -275357, -3184473, -5499640, -4159567, -1258294, -961382, -2879685, -3430756, -1580487, 1484945, 5610463, 9525859, 8782714, 1866376, -4748643, -4291515, 475693, 2284873, 1173479, 2722023, 6632621, 6770154, 2293297, -840099, -469198, -1202568, -4979818, -7464630, -6590737, -6449251, -9107736, -9988073, -5457042, 1309879, 5719652, 6965345, 4577340, -3385039, -14183766, -18835967, -12448476, -1447539, 4768541, 5112961, 4448508]
53001D448508k97793k489500m312119j937032K375720L770695J495359j295457
52993A758381k073554j051680q5047m12066j055887k59715J281244J178840r9189
52984h18673M32503K148442P04800l465103l583814K102153N026044q39457p973382
52975f266487n978183K512652O568705L359639n87803j611457j921670k061651
52967e986255l07148J388663j3294j443091J741729N872878L702827k530554l758448
52958a332693R45973L606029J667223J002963L367300L223068l57911r04782K701536
52949A3918706K846260k660997n120605K1658M228734R8916n727493l627433L177467
52940G155213M455646q36011m464572k112668K102783L089944K28106l887300
$$ y = [4448508, 4150715, 1661215, -2650904, -4587936, -2212216, 1558479, 3053838, 1758381, -315173, -1366853, -1451900, -1863966, -2919853, -3179568, -1898324, -719484, -818673, -386170, 1762272, 2467072, -998031, -4581845, -2479692, 2546352, 1706895, -6266487, -12244670, -9732018, -3163313, 196326, -391477, -2002934, -3924604, -5986255, -6293403, -4904740, -4918034, -6361125, -4619396, 1253482, 4956309, 2425755, -1332693, -386720, 3219309, 4886532, 5889495, 9256795, 12479863, 12121952, 11217170, 13918706, 16764966, 14103969, 8983364, 9005022, 13233756, 13332672, 7605179, 3977746, 7155213, 11610859, 10774848, 6310276, 4197608, 6300391, 9390335, 9618441, 5731141]
$$ [...]
##END NTUPLES=NMR SPECTRUM
##END=
