##TITLE=31Pdec_SR32-pk
 CDCl3, 24 sc
 1.2.2021
##JCAMPDX= 6.0         $$ Bruker NMR JCAMP-DX V2.0
##DATA TYPE= NMR SPECTRUM
##DATA CLASS= NTUPLES
##ORIGIN= UXNMR, Bruker Analytische Messtechnik GmbH
##OWNER= root
$$ XWIN-NMR		Version 3.5
$$ Mon Feb  1 11:19:10 2021 Russian Standard Time (UT+4h)  she@DPX200
##.OBSERVE FREQUENCY= 81.013821
##.OBSERVE NUCLEUS= ^31P
##.ACQUISITION MODE= SIMULTANEOUS
##.ACQUISITION SCHEME= undefined
##.AVERAGES= 24
##.DIGITISER RES= 17
##SPECTROMETER/DATA SYSTEM= spect
##.PULSE SEQUENCE= zgpg30
##.SOLVENT NAME= CDCl3
##.SHIFT REFERENCE= (INTERNAL, CDCl3, 0, 182.463)
##AUDIT TRAIL= $$ (NUMBER, WHEN, WHO, WHERE, WHAT)
$$ ##TITLE= Audit trail, XWIN-NMR		Version 3.5
$$ ##JCAMPDX= 5.01
$$ ##ORIGIN= Bruker BioSpin GmbH
$$ ##OWNER= she
$$ F:/spectra/data/she/nmr/P31/1/pdata/1/auditp.txt
$$ ##AUDIT TRAIL=  $$ (NUMBER, WHEN, WHO, WHERE, WHAT)
(   1,<2021-02-01 11:18:21.09 +0400>,<she>,<DPX200>,
      <created by zg, POWCHK disabled, PULCHK disabled
       configuration hash MD5:
       00 E9 B6 7A A2 85 ED C7 34 08 36 98 17 FE 4E 26
       data hash MD5: 32K
       22 B2 A8 18 96 96 A1 07 BE 2C 44 51 42 3A DA FE>)
(   2,<2021-02-01 11:18:23.81 +0400>,<she>,<DPX200>,
      <Start of raw data processing
       efp BC_mod = 2 LB = 1 FT_mod = 6 PKNL = 1 PHC0 = -1697.94 PHC1 = -24.39859 SI = 64K 
       data hash MD5: 64K
       B5 61 6F 30 8F 72 89 66 3B 1D BB 9C 83 73 E7 4A>)
(   3,<2021-02-01 11:18:39.07 +0400>,<she>,<DPX200>,
      <pk PHC0 = 4.938046 PHC1 = 0 
       data hash MD5: 64K
       B6 24 67 0E 47 97 08 26 C3 5A EE C2 37 FC 2D E7>)
$$ ##END=
$$ 
$$ hash MD5
$$ E8 F3 D0 3D B6 6E 06 A8 50 9D 1A 1B 5C 82 76 52
##$RELAX= 
##$RELAX= 
##$RELAX= 
##$RELAX= 
##$RELAX= 
##$RELAX= 
##$RELAX= 
##$RELAX= 
$$ Bruker specific parameters
$$ --------------------------
##$DU= <F:/spectra>
##$EXPNO= 1
##$NAME= <P31>
##$PROCNO= 1
##$TYPE= <nmr>
##$USER= <she>
##$AMP= (0..31)
100 100 100 100 100 100 100 100 100 100 100 100 100 100 100 100 100 100 
100 100 100 100 100 100 100 100 100 100 100 100 100 100 
##$AQSEQ= 0
##$AQ_mod= 1
##$AUNM= <au_zg>
##$AUTOPOS= <>
##$BF1= 81.014009
##$BF2= 200.13
##$BF3= 200.13
##$BF4= 200.13
##$BF5= 200.13
##$BF6= 200.13
##$BF7= 200.13
##$BF8= 200.13
##$BYTORDA= 1
##$CFDGTYP= 0
##$CFRGTYP= 5
##$CHEMSTR= <none>
##$CNST= (0..31)
1 1 145 1 1 1 1 1 1 1 1 1 1 1 1 1 1 1 1 1 1 1 1 1 1 1 1 1 1 1 1 1 
##$CPDPRG= <waltz16>
##$CPDPRG1= <>
##$CPDPRG2= <waltz16>
##$CPDPRG3= <>
##$CPDPRG4= <mlev>
##$CPDPRG5= <mlev>
##$CPDPRG6= <mlev>
##$CPDPRG7= <mlev>
##$CPDPRG8= <mlev>
##$CPDPRGB= <>
##$CPDPRGT= <>
##$D= (0..31)
0 1 0 0 0 0 0 0 0 0 0 0.03 2e-05 3e-06 0 0 0 0 0 0 0 0 0 0 0 0 0 0 0 0 
0 0 
##$DATE= 1612163900
##$DBL= (0..7)
120 120 120 11 120 120 24 19 
##$DBP= (0..7)
150 150 150 150 150 150 150 150 
##$DBP07= 0
##$DBPNAM0= <>
##$DBPNAM1= <>
##$DBPNAM2= <>
##$DBPNAM3= <>
##$DBPNAM4= <>
##$DBPNAM5= <>
##$DBPNAM6= <>
##$DBPNAM7= <>
##$DBPOAL= (0..7)
0.5 0.5 0.5 0.5 0.5 0.5 0.5 0.5 
##$DBPOFFS= (0..7)
0 0 0 0 0 0 0 0 
$$ [...]
##$SUBNAM2= <"">
##$SUBNAM3= <"">
##$SUBNAM4= <"">
##$SUBNAM5= <"">
##$SUBNAM6= <"">
##$SUBNAM7= <"">
##$SUBNAM8= <"">
##$SUBNAM9= <"">
##$SW= 369.568048894756
##$SWIBOX= (0..15)
0 1 3 0 0 0 0 0 0 0 0 0 0 0 0 0 
##$SW_h= 29940.119760479
##$TD= 32768
##$TD0= 1
##$TE= 0
##$TE2= 300
##$TE3= 300
##$TEG= 300
##$TL= (0..7)
0 120 53 12 22 120 120 120 
##$TP= (0..7)
150 150 150 150 150 150 150 150 
##$TP07= 0
##$TPNAME0= <>
##$TPNAME1= <>
##$TPNAME2= <>
##$TPNAME3= <>
##$TPNAME4= <>
##$TPNAME5= <>
##$TPNAME6= <>
##$TPNAME7= <>
##$TPOAL= (0..7)
0.5 0.5 0.5 0.5 0.5 0.5 0.5 0.5 
##$TPOFFS= (0..7)
0 0 0 0 0 0 0 0 
##$TUNHIN= 0
##$TUNHOUT= 0
##$TUNXOUT= 0
##$USERA1= <user>
##$USERA2= <user>
##$USERA3= <user>
##$USERA4= <user>
##$USERA5= <user>
##$V9= 5
##$VALIST= <valist>
##$VCLIST= <CCCCCCCCCCCCCCC>
##$VD= 0
##$VDLIST= <DDDDDDDDDDDDDDD>
##$VPLIST= <PPPPPPPPPPPPPPP>
##$VTLIST= <TTTTTTTTTTTTTTT>
##$WBST= 1024
##$WBSW= 4
##$XGAIN= (0..3)
0 0 0 0 
##$XL= 0
##$YL= 0
##$YMAX_a= 5035
##$YMIN_a= -8595
##$ZGOPTNS= <>
##$ZL1= 120
##$ZL2= 120
##$ZL3= 120
##$ZL4= 120
##$ABSF1= 0
##$ABSF2= 0
##$ABSG= 0
##$ABSL= 0
##$ALPHA= 0
##$AQORDER= 0
##$ASSFAC= 0
##$ASSFACI= 0
##$ASSFACX= 0
##$ASSWID= 0
##$AUNMP= <proc_1d>
##$AZFE= 0.1
##$AZFW= 0.5
##$BCFW= 0
##$BC_mod= 2
##$BYTORDP= 0
##$COROFFS= 0
##$CY= -3
##$DATMOD= 1
##$DC= 0
##$DFILT= <>
##$DTYPP= 0
##$F1P= 0
##$F2P= 0
##$FCOR= 1
##$FTSIZE= 65536
##$FT_mod= 6
##$GAMMA= 0
##$GB= 0
##$INTBC= 1
##$INTSCL= 5.30512e-09
##$ISEN= 30
##$LB= 1
##$LEV0= 0
##$LPBIN= 0
##$MAXI= 10000
##$MC2= 0
##$MEAN= 0
##$ME_mod= 0
##$MI= 50
##$NCOEF= 0
##$NC_proc= -8
##$NLEV= 6
##$NOISF1= 182.463
##$NOISF2= 159.3651
##$NSP= 0
##$NTH_PI= 0
##$NZP= 0
##$OFFSET= 182.463
##$PC= 4
##$PHC0= -1693.002
##$PHC1= -24.39859
##$PH_mod= 1
##$PKNL= yes
##$PPARMOD= 0
##$PSCAL= 0
##$PSIGN= 0
##$REVERSE= no
##$SF= 81.014009
##$SI= 65536
##$SIGF1= 159.3651
##$SIGF2= -187.1042
##$SINO= 113.3802
##$SIOLD= 16384
##$SREGLST= <1H.CDCl3>
##$SSB= 0
##$STSI= 65536
##$STSR= 0
##$SW_p= 29940.119760479
##$SYMM= 0
##$S_DEV= 0
##$TDeff= 32768
##$TDoff= 0
##$TI= <>
##$TILT= no
##$TM1= 0
##$TM2= 0
##$TOPLEV= 0
##$USERP1= <user>
##$USERP2= <user>
##$USERP3= <user>
##$USERP4= <user>
##$USERP5= <user>
##$WDW= 1
##$XDIM= 65536
##$YMAX_p= 313450963
##$YMIN_p= -71792614
$$ End of Bruker specific parameters
$$ ---------------------------------
##NTUPLES= NMR SPECTRUM
##VAR_NAME=  FREQUENCY,     SPECTRUM/REAL,   SPECTRUM/IMAG
##SYMBOL=    X,             R,               I
##VAR_TYPE=  INDEPENDENT,   DEPENDENT,       DEPENDENT
##VAR_FORM=  AFFN,          ASDF,            ASDF
##VAR_DIM=   65536,         65536,           65536
##UNITS=     HZ,            ARBITRARY UNITS, ARBITRARY UNITS
##FACTOR=    0.456856943014862, 1,           1
##FIRST=     14782.0589164895, 0,            0
##LAST=      -15158.0608439895, 0,           0
##MIN=       -15158.0608439895, -71792614,   0
##MAX=       14782.0589164895, 313450963,    0
$$ Real data points
##PAGE= N=1
##DATA TABLE= (X++(R..R)), XYDATA
$$ [...]
42410a1295021M523615M141554K303236l87201k576439j649608K717994N828005
42402C606135K723968m349628p293832k291769M937300O454094J978894j844422
42394C920740o43264K856179L350362n75286n514000p108132m112287M08561J953913
42385e463214k86397k055048K60495L853694L137391j293885k538023K186784
42377b198203O478564L887337k552500n205027k685492N02408K638140N516225
42369F381452P378993L559243m305245p723096l309345J857340J211270j685192
42361C365420m12685L174211K647529j826287m026077j747925J120987K095324
42353D390497K594918K541049o96718o234844q502553m727464R77723L441700
$$ y = [-11295021, -6771406, -2629852, -326616, -713817, -3290256, -4939864, -2221870, 3606135, 6330103, 1980475, -5313357, -7605126, -2667826, 3786268, 5765162, 3920740, 3277476, 6133655, 9484017, 8908731, 3394731, -3713401, -7825688, -7417127, -5463214, -5749611, -7804659, -7544164, -3690470, -553079, -1846964, -4384987, -2198203, 4280361, 8167698, 5615198, 410171, -2275321, -1772913, 865227, 6381452, 13760445, 17319688, 13014443, 5291347, 1982002, 3839342, 5050612, 3365420, 2952735, 6126946, 8774475, 6948188, 2922111, 1174186, 2295173, 4390497, 6985415, 9526464, 8829746, 2594902, -5907651, -10635115, -9657392, -6215692]
42345f215692K463133Q80393L53186J280431L418882M369664R66579n395509q476403
42336f355336n317334j108448j853689n144528l713967K973702O838008K505106
42328a1176486m568431n265988O53993M475966J206623l102566l95158O823208
42320a1348839Q476460J935094l552260n31745N463517M567976k457609n980711
42312c428117j933797L980592O329548N881899M105481j55342n363370n895137
42304C521757m47714M027732J756338l357481l984344k32562J495915j789102
42296I90539o292226o840743k175240M188860O407271J814356m494134m226288
42288a0627605K999418P998186M628372j505888j848171K836189N362889L246225
$$ y = [-6215692, -3752559, -2872166, -2518980, -1238549, 2180333, 6549997, 7516576, 2121067, -6355336, -11672670, -12781118, -14634807, -19779335, -23493302, -20519600, -13681592, -11176486, -15744917, -21010905, -20356912, -15880946, -14674323, -17776889, -18172047, -11348839, -2872379, -937285, -4489545, -5021290, 442227, 5010203, 2552594, -3428117, -5361914, -1381322, 4948226, 10830125, 14935606, 14780264, 9416894, 3521757, 3074043, 7101775, 8858113, 5500632, 1516288, 1283726, 2779641, 990539, -5301687, -12142430, -14317670, -10128810, -3721539, -1907183, -6401317, -10627605, -7628187, 369999, 4998371, 3492483, 1644312, 4480501, 9843390, 13089615]
42280A3089615j03571k449511m067402m070905j811962O647n03521n7286L567372
42271C599476N011203m25995o014160k131795O853934P361090j670472o252964
42263F330317O3990N765665P19032p353460o358844N95804J833205l439947n496830
42254g341068o61776M613691N388198L465369P39542l399311o942545n748853
42246i886753p46112K376924J947693J915544L456999K429367k316448n194754
42238f017540k219693K780231M310580K508155K24205k298601n065260m992229
42230a0770152n85907L259355J251854l553704l404874K518274O692549M333952
42222b58653l01883j188778J132547K295397J356401O89444Q69748M60494m68
$$ y = [13089615, 12986044, 10536533, 6469131, 2398226, 586264, 592911, 89390, 32104, 3599476, 8610679, 8184684, 2170524, 38729, 6892663, 14253753, 12583281, 6330317, 6394307, 12159972, 12879004, 5525544, -833300, -237496, 1595709, -1844238, -7341068, -8002844, -3389153, 1999045, 5464414, 6203956, 2804645, -4137900, -9886753, -10632865, -8255941, -6308248, -4392704, -935705, 1493662, -822786, -6017540, -8237233, -5457002, -1146422, 1361733, 1585938, -712663, -5777923, -10770152, -11356059, -8096704, -6844850, -10398554, -13803428, -11285154, -4592605, -258653, -560536, -1749314, -616767, 1678630, 3035031, 3724475, 4594223, 5054717, 5054249]
42213E054249J419795L242709J162059m867475q517103n275394N50326J324962
42205e905872l273270n984594k193332M321372P297533N712635L018149J379228
42197D371849j09029k479921m784765m978585j757502L985787Q764616Q756636
42189A1769086L777055j990301m541403m249660m007170m444061l432080o3622
42181g182156L389714M361700L191985K136463J869091M23112l724535q165516
42173c700142p832640r60486P300787R572246M723070p85445j077585K049093
42165I288898K350529k265462p255921p238997j841879M636472P607347N595772
42157A0876759O48369l603626m735559l163911j267101r25220j861373k226920
$$ y = [5054249, 6474044, 9716753, 10878812, 6011337, -2505766, -7781160, -7230834, -5905872, -9179142, -15163736, -17357068, -13035696, -5738163, -25528, 2992621, 4371849, 4262820, 1782899, -3001866, -7980451, -9737953, -5752166, 3012450, 11769086, 15546141, 13555840, 9014437, 4764777, 757607, -3686454, -7118534, -7182156, -3792442, 569258, 3761243, 5897706, 7766797, 8189909, 4465374, -3700142, -11532782, -12493268, -5192481, 4379765, 9102835, 8317390, 7239805, 9288898, 11639427, 9373965, 2118044, -5120953, -6962832, -2326360, 5280987, 10876759, 11525128, 7921502, 3185943, 22032, -1245069, -2170289, -4031662, -6258582]
42149f258582q29321J273252J994829J214398J178463K832642L503899O70708
42141E580288l302083l750969n67067J815177J751076K615637N585642N542263
42133A5269964j325959r754800j1145917n274523k57002r69564l309495j638695
42125a8405991K963499N160253L146234K45505m56527O8787q23112l138798m141510
42116a5381660k253431R12327L365332N600174Q374688R281759N289346j739105
42108A3449430o359870o779723o003798m880112k18334P240475R704036K886007
42100I038111n603566n656734J129653M558164R54017l376028l492821k111793
42092d560997k780443l972197k850966L69715M095902O875219O068284J42629
$$ y = [-6258582, -7087903, -5814651, -3819822, -2605424, -1426961, 1405681, 4909580, 5580288, 2278205, -1472764, -2039831, -224654, 1526422, 4142059, 9727701, 15269964, 13944005, 4189205, -6956712, -12231235, -12488237, -13457801, -16767296, -18405991, -15442492, -10282239, -7136005, -6890500, -7347027, -7278240, -8101352, -11240150, -15381660, -17635091, -16722764, -13357432, -7757258, 617430, 9899189, 15188535, 13449430, 7089560, 309837, -5693961, -10574073, -10792407, -3551932, 6152104, 9038111, 3434545, -2222189, -1092536, 3465628, 4419645, 1043617, -2449204, -4560997, -7341440, -11313637, -14164603, -13794888, -9698986, -2823767, 3244517, 3387146]
42084C387146o584292p279592k210296J180270k73870j064326K653321N921682
42076d269957L679456l8125J144113M807567L605573k328929n212615j662243
42068b75160K508225J379903k757047l322727J251574N247099K564146n384553
42060A211460j0182771o181252J777444M273239M93636o19275N451219J0495975
42052F719675N165563o459813j1677290n964007K868790O576862N016680K042498
42044D288958j54796m00376K100760M964529L689726j716328n188288k797140
42036D787045J067424k71468n820510p626127j423470P266647R564004L771691
42028A1315236l159504m598092j744120j89773j423513k009847n68011j5773j233434
$$ y = [3387146, -3197146, -10476738, -12687034, -11506764, -11780634, -12844960, -10191639, -4269957, -590501, -628626, 515487, 5323054, 8928627, 6599698, 1387083, -275160, 2233065, 3612968, 855921, -2466806, -1215232, 4031867, 6596013, 1211460, -8971311, -15152563, -13375119, -9101880, -8608244, -9227519, -3776300, 6719675, 11885238, 5425425, -6251865, -12215872, -9347082, -2770220, 2246460, 4288958, 4134162, 3733786, 5834546, 10799075, 14488801, 12772473, 7584185, 4787045, 5854469, 5583001, -237509, -7863636, -9287106, -2020459, 7543545, 11315236, 8155732, 3557640, 1813520, 1623747, 200234, -1809613, -2377624, -2393397, -3626831]
42019c626831k66209M350319O728175J871575n167006n540702K11593L106078
42011A666992o02569m769498l899356p27119Q1210m96989Q96247L625890M596532
42002C71340L259708J170402j174925l611535m354651k005545J779272M021159
41994e44775L520166P18282l221976n470596k831847L169058N624956N82564o476250
41985d930418p194367j653179K417580J307831p2139K899548O835391N740402
41977E350649L44259l274441k765290j711173k547118k718086j56351K052435
41969e425116M77837k361265j476482K530383M324851K307099M85158J117030
41961A979495J335302r09836l164404l436716l248006k592682J645971P688615
$$ y = [-3626831, -3893040, 457279, 7185454, 9057029, 3890023, -1650679, -1439086, 1666992, 1064423, -3705075, -7604431, -8331550, -8250340, -8747329, -7851082, -4225192, 371340, 3631048, 4801450, 3626525, 14990, -4339661, -6345206, -4565934, -544775, 2975391, 3693673, 471697, -4998899, -7830746, -4661688, 963268, 1545832, -4930418, -12124785, -13777964, -11360384, -10052553, -10124692, -7225144, -389753, 5350649, 5694908, 2420467, -344823, -2055996, -4603114, -7321200, -7477551, -5425116, -4947279, -7308544, -8785026, -6254643, -1929792, 377307, 862465, 1979495, 3314797, 2404961, -759443, -4196159, -7444165, -10036847, -8390876, -702261]
41953g02261O649355m342220j3528435q980088L247889P130592n6983n674044
41945a6256195k516780K515095L259592L621500O264697N202170j818220n156276
41937d884417J847789R558712N945334l864501n828878L60080K120772m244444
41929A010447q120689l098531L118851K599979n73881Q52343M978117N341891
41921F108527J896638n13312q57479j790386l063680j894968P67919M03683l935440
41912b878498p467369o233099k084598R97075K661563N178827Q111764P750574
41904F036239K647836l248305n060562k641096O69778L135791N000558N039526
41896A1579765J402859m005641o795160o422797o099999n528652n03768P706064
$$ y = [-702261, 5947094, 1604874, -11923561, -20903649, -17655760, -10525168, -10582151, -16256195, -18772975, -16257880, -12998288, -9376788, -3112091, 2090079, 271859, -4884417, -3036628, 6522084, 12467418, 8602917, 2774039, 3134119, 5254891, 1010447, -7110242, -10208773, -7089922, -4489943, -5063824, -4211481, 766636, 6108527, 8005165, 7491853, 6634374, 4843988, 1780308, -114660, 653259, 1056942, -2878498, -10345867, -16578966, -18663564, -17666489, -15004926, -9826099, -1714335, 6036239, 8684075, 5435770, 375208, -2265888, -1596110, 1539681, 6540239, 11579765, 12982624, 8976983, 2181823, -4240974, -10340973, -15869625, -16373393, -8667329]
41888h667329J0347748L646453l976760m036501n67753j778312n166615k379272
41880a2578341M714730N713843j033296n456058j905050L457173M572897L602739
41872A088637K793506p55878o211274n318911M493394J2281302Q021684k359611
41864A4032849o218566k569927n09919l222595m868907k212531J047140K320195
41856b202261L682997N584818M377518j223857o692020p273467l396727Q17701
41848f325298J457528k819244q967122j0567084m485852L947001O456655K106936
41840a9196480k119554p48794M503426Q609255Q777084N775377K954124L654801
41832A2209239O731312O254028o42494q074136q737119m443649k570807l865492
$$ y = [-8667329, 1680419, 5326872, 1350112, -2686389, -3254142, -5032454, -10199069, -12578341, -7863611, -2149768, -3183064, -8639122, -10544172, -7086999, -2514102, 1088637, 3882143, 3126265, -3085009, -8403920, -3910526, 8370776, 16392460, 14032849, 7814283, 5244356, 4734437, 1511842, -3357065, -5569596, -4522456, -2202261, 1480736, 7065554, 11443072, 10219215, 3527195, -3746272, -7142999, -6325298, -4867770, -7687014, -16654136, -27221220, -31707072, -27760071, -21303416, -19196480, -21316034, -22064828, -17561402, -8952147, -175063, 5600314, 8554438, 12209239, 18940551, 25194579, 24552085, 16477949, 7740830, 3297181, 726374, -3139118]
41824c139118k332976K783234M418858m52480n230495m176044p82066m13953j261681
41815a0586721J107848N241455O249874L244647j113840n137293p179103m082646
41807a2255779L627714Q574477N157149j390863j631378M363151P589967L698360
41799A7732798j990929l953807l229783k200287L58374M706480O028668L74449
41791A7825963q235089j1762347p993148k219876M62610O41061J569706L784399
41783e926721M841304L158606j1203k528926l588422l144420p41915L060532N122645
41774B41480K695185j916116l301187p15296L65548k854237m712663N45473Q106625
41765a545188P739264j154937p652665m483226K259257K906224k218354n252494
$$ y = [-3139118, -5472094, -2688860, 1729998, 1277518, -3952977, -8129021, -8911087, -9325040, -10586721, -9478873, -4237418, 2012456, 5257103, 4143263, -994030, -8173133, -12255779, -8628065, -53588, 5103561, 3712698, 2081320, 6444471, 14034438, 17732798, 15741869, 11788062, 8558279, 6357992, 6716366, 11422846, 17451514, 17825963, 9590874, -2171473, -10164621, -12384497, -11921887, -11280826, -9711120, -5926721, -1085417, 2073189, 2061986, -466940, -4055362, -7199782, -7941697, -4881165, 241480, 2936665, 1020549, -2280638, -2995934, -2630386, -5484623, -10197286, -9651813, -1545188, 6194076, 5039139, -2613526, -7096752, -4837495, -1931271, -4149625, -9402119]
41757i402119l173706n18496n29633l76592K944370O897043O851468K692332j131403
41748D253264j391617L11527J395l626011p229297o322850q72275L804803L135755
41739g935306p32385j633945K070296N042273K495869l091990n696260l688112
41731a3169560j87888K843249N854823P308584L869621l071254o477763k858983
41723e889171K138147J854716j775257k652944j111088k265460n287765l423031
41715a8411853L937636Q058744L600913k887975k520927L743270Q270494P454521
41707A1244823L350404j499299m945739m300268k43692J725770o69602j508372
41699C154025L324942O482731m90807j1072484j0649497J324887R509315N202606
$$ y = [-9402119, -12575825, -13094321, -13623954, -14000546, -11056176, -4159133, 2692335, 5384667, 4253264, 2861647, 3173174, 3174569, -451442, -7680739, -14003589, -14875864, -11071061, -7935306, -8667691, -10301636, -8231340, -3189067, -693198, -3785188, -9481448, -13169560, -13357448, -10514199, -4659376, 2649208, 6518829, 3447575, -3030188, -5889171, -3751024, -1896308, -3671565, -6324509, -7435597, -9701057, -14988822, -18411853, -14474217, -6415473, -2814560, -5702535, -8223462, -4480192, 3790302, 11244823, 14595227, 13095928, 8150189, 3849921, 3606229, 5331999, 4662397, 3154025, 6478967, 12961698, 12470891, 1398407, -9251090, -7926203, 1583112, 6785718]
41691F785718k618700l724160j368522k689606n231749l275308L50049l70987
41683a2143265l069916j494592K428861J778740k429400k051483M764157J0324598
41675a892300Q547304J847801m025648n727170k680600K360967L600725j039182
41667I91897m876340j017969O113499O515624M08351k316923J233981K774301
41659I826421j692643m358662L98465N332776K013916n353993p205287l290574
41651d329581m17086k49695Q74568L023409K920442J300994J424227J700809j624553
41642D623534n538120l303734L368729M933766j074486n155962j57245P731854
41634E428336Q444452K329977k293338k119903j703435m279470o628881m759630
$$ y = [6785718, 4167018, 442858, -925664, -3615270, -8847019, -12122327, -11772278, -12143265, -15213181, -16707773, -14278912, -12500172, -14929572, -16981055, -12216898, -1892300, 6655004, 8502805, 4477157, -1250013, -3930613, -1569646, 2031079, 991897, -3884443, -4902412, 1211087, 7726711, 8135062, 5818139, 7052120, 9826421, 8133778, 3775116, 4173581, 9506357, 11520273, 6166280, -1039007, -4329581, -4746667, -4996362, -4121794, -1098385, 1822057, 3123051, 4547278, 6248087, 4623534, -914586, -4218320, -849591, 4084175, 3009689, -2146273, -2303518, 5428336, 13872788, 16202765, 13909427, 11789524, 10086089, 5806619, -822262, -5581892]
41626e581892j44742K343307N44211l078291m733133k973517P26870L868670M798486
41617d230031L218676k0800l072372l777325j274858L004648O421643P134064
41609G403645M983502J170642k423698m317557m459722l691297k182453L05895
41601c211043K550780K480062N17501k32781J205004J412630k167072o103204
41593c548123m932685R34689N297906M158197R8627k056966j136198R8180r69781
41584b056154l354809k999145K269167Q099574O969144j739932q618320n421059
41576f851534L506423O787538J387303m453546l843949M23805K459651J763474
41568A179165J214780J355295J070717P99462J155374P11499j549219l644678
$$ y = [-5581892, -5726634, -3383327, -2839116, -5917407, -10650540, -13624057, -12897187, -9028517, -4230031, -1011355, -1032155, -4104527, -7881852, -9156710, -6152062, 269581, 7403645, 12387147, 13557789, 11134091, 6816534, 2356812, -1334485, -3516938, -3211043, -660263, 1819799, 2337300, 2104519, 3309523, 4722153, 2555081, -3548123, -8480808, -7546119, -2248213, 1909984, 2008611, -48355, -1184553, -1086373, -2056154, -5410963, -8410108, -6140941, 1958633, 8927777, 7187845, -1430475, -6851534, -3345111, 3442427, 4829730, 376184, -3467765, -3043960, -584309, 1179165, 2393945, 3749240, 4819957, 5619419, 6774793, 7486292, 5937073, 2292395]
41560B292395l282426j126353J003023K766559L639324J391881m461958r822075
41552g599630r985336n120618P59801M529308N292406L357512P67031O59480L202031
41543d138015M570075K883899J810243M170549N725722J436786m845155m731809
41535F882295J347306L594501k528909r065974p070794J009481N975953M484085
41527D627944R85254l14553N03054J935723K566263M1749o231719j1029666p515436
41518a4431387K659962Q825992M369903m205752o238275j227008K619896K205240
41510e421429L069189P558985Q700787J558958o550327n618552J734844M198994
41502I231449q52603m403191j125714K769683P63138m102136o069930n495102
$$ y = [2292395, -990031, -2116384, -1113361, 1653198, 5292522, 6684403, 2222445, -7599630, -17584966, -22705584, -21945783, -17416475, -12124069, -8766557, -7999526, -7340046, -4138015, 432060, 3315959, 5126202, 9296751, 15022473, 16459259, 11614104, 6882295, 8229601, 11824102, 9295193, 229219, -6841575, -5832094, 143859, 4627944, 5613198, 5298645, 5801699, 7737422, 10303685, 10345434, 4113715, -6915951, -14431387, -11771425, -2945433, 1424470, -2781282, -9019557, -10246565, -7626669, -5421429, -2352240, 5206745, 13907532, 15466490, 8916163, 3297611, 5032455, 9231449, 8378846, 3975655, 2849941, 5619624, 6382762, 2280626, -3789304, -9284406]
41494i284406m322780j3923P991586J1979691N827932l223321l319980M062158
41486I696957O402642j17246n375224k384500K108780j09482n438904n387823
41478f04800k28177K768995R85250j571102k146836k099409k205677j015932J322014
41469d795674K073560p11k655294l289270j847808J00007J339743J358281J14501
41460g602665j594418k073510L3384L774167N435442J868810m647197p213818
41452a2019805k683131L094775K839823j142219q6916P037872J0586627M648430
41444A2275456l441045m053554N05503Q72348m080133o119752j189319M628254
41436f02242M687686O25549j544057L29420L213657L037059j587341p350591p517845
$$ y = [-9284406, -13607186, -13621109, -5629523, 6350168, 12178100, 8954779, 5634799, 9696957, 16099599, 15982353, 10607129, 8222629, 10331409, 10221927, 4783023, -604800, -832977, 1936018, 2921268, 1350166, -796670, -2896079, -5101756, -6117688, -4795674, -2722114, -2722825, -5378119, -8667389, -10515197, -10415190, -9075447, -7717166, -7602665, -9197083, -11270593, -11237209, -7463042, -2027600, -158790, -4805987, -12019805, -14702936, -11608161, -8768338, -9910557, -9997473, -2959601, 7627026, 12275456, 8834411, 4780857, 5286360, 6158708, 2078575, -4041177, -5230496, -602242, 4085444, 4710993, 3166936, 3496356, 6710013, 9747072, 8159731, 809140, -6708705]
41427f708705J205021J2362155J4714089N367302o232050r858371n809897j211374
41419C828170P45739K289426L997727K792447k099438o257165n591240j631084
41411a925418J227363J646878J821081L112283M000650K692299r2386j816699
41403A0666051r04036J563629K567106r7330m919026p055940l338546L110058
41395A591966N547875J724174l310218m330063k952515l910838o473015n065767
41387a7178401J347045O241354M389822q36684k669007K8300L240622M785710
41379f51239N741893N981297L545224q89454l340305j890344N75642O75520j185963
41370H562271k618444k892569k646408j840611m27659Q7801j788442m734810n434907
$$ y = [-6708705, -5503684, 6858471, 21572560, 26939862, 20707812, 10849441, 5039544, 3828170, 4573909, 6863335, 10861062, 13653509, 11554071, 5296906, -294334, -1925418, -698055, 948823, 2769904, 5882187, 9882837, 12575136, 12482750, 10666051, 9762015, 11325644, 13892750, 13795420, 8876394, 1820454, -1518092, 1591966, 7139841, 8864015, 5553797, 1223734, -1728781, -5639619, -12112634, -17178401, -15831356, -9590002, -5200180, -6036864, -8705871, -8677571, -5436949, -651239, 5090654, 11071951, 14617175, 13727721, 10387416, 8497072, 9072714, 9748234, 8562271, 5943827, 3051258, 404850, -1435761, -1863420, -1775619, -3564061, -8298871, -13733778]
41361a3733778k465040K044024M882520M732648K464448j58002j315316Q7307
41353c461189L016258M239460J439632l414069n602037l303113J76064J212862
41345e696132Q57307K390003N319134N498687J327181l637356n249641l164103
41337b354920L09780K916495K921446j08078l481684l309015J04562J930270k90878
41328a362022l095954k933069j465207j421834j148540J804496M891972M088040
41320f42118Q90386k57330J41370j980419n694919n211263M46828M748176K980277
41311d579012j451216k861001o47172K107027L433108L113414J673831P16094
41303A505073J317454J332046j743623m973489k838766K989979L991079k070076
$$ y = [-13733778, -16198818, -14154794, -9272274, -4539626, -2075178, -2233180, -3548496, -3461189, -444931, 3794529, 5234161, 1820092, -3781945, -7085058, -6908994, -5696132, -4838825, -2448822, 2870312, 8368999, 9696180, 6058824, 809183, -2354920, -2045140, 871355, 3792801, 3684723, 203039, -3105976, -3001414, -1071144, -1362022, -4457976, -7391045, -8856252, -10278086, -11426626, -9622130, -4730158, -642118, 248268, -9062, 132308, -1848111, -7543030, -12754293, -12307465, -7559289, -4579012, -6030228, -8891229, -9538401, -7431374, -3998266, -884852, 788979, 1505073, 2822527, 4154573, 2410950, -2562539, -5401305, -2411326, 1579753, -490323]
41295d90323o118718j203715O345802O706920J536986k02055K470705K098071
41287A1143673l257926o134375j882357M023847M695838J103927j688151k368922
41279E635554k863235l629823l826750l787117l729830j936332K491583O540314
41271e105636O135798J462172k979943l328217J75626M014357M362270J32865
41263D869292n470111p169354k776133M304835Q672270Q324753N523770L171651
41255A9450973J760969k16887l770176p515794q388143m912453L48111L007465
41247b35935J920234L82997J298920K902394J274049l846896q121152p601300
41239a2026689k813183K614663N730350N757396L324639j4202j930623q46526
$$ y = [-490323, -6609041, -7812756, -1466954, 5239966, 6776952, 6574897, 9045602, 11143673, 7885747, 1751372, -130985, 3892862, 8588700, 9692627, 8004476, 5635554, 2772319, -857504, -4684254, -8471371, -12201201, -14137533, -11645950, -5105636, 1030162, 2492334, -487609, -3815826, -3640200, 374157, 4736427, 4869292, -600819, -7770173, -10546306, -6241471, 2430799, 10755552, 16279322, 19450973, 21211942, 20995055, 17224879, 9709085, 1320942, -3591511, -3243400, -235935, 1684299, 2067296, 3366216, 6268610, 7542659, 3695763, -4425389, -12026689, -14839872, -12225209, -6494859, -737463, 2587176, 2572974, 642351, -204175]
41231b04175K069053L556514J726002j826693m001810l457518j049748J912410
41223a275965M293499M770942K946028O61849L551j04750k593823o797532p539622
41214e635823j927779N443538P254858K208222l979130n720182k870402R02975
41206d323723K259436K43330l455422n465566l570206P75958L886289L887604
41198e762300K104560O36294J65084J66776k47255j702739l411867l078792K94913
41189a0835326M034254M463634J721207n17587o3435J671596K714157K779580
41181E968080J940696j6294k035662k371622j501763j460080j685282M61512L818392
41172C117977L110462k600207o316660k664602L470778M165080P75245R61608
$$ y = [-204175, 1864878, 5421392, 7147394, 5320701, 1318891, -2138627, -3188375, -1275965, 3017534, 7788476, 10734504, 11396353, 11399904, 11295154, 8701331, 1903799, -5635823, -7563602, -2120064, 5134794, 7343016, 3363886, -2356296, -5226698, -4323723, -2064287, -1820957, -5276379, -10741945, -14312151, -13536193, -9649904, -5762300, -3657740, -3021446, -2856362, -2689586, -2936841, -4639580, -8051447, -11130239, -10835326, -6801072, -2337438, -616231, -1133818, -1197253, 474343, 3188500, 5968080, 7908776, 7892482, 5856820, 3485198, 1983435, 523355, -1161927, -700415, 3117977, 6228439, 3628232, -2688428, -5353030, -1882252, 2282828, 3058073, 4019681]
41164D019681N013326M716754k488054p598021l183479N029924O577921J118942
41156A3206994k915961j586381Q43931P59814q5289O5773k68176j341783m31251
41147H247671K473048K749415j280188m055683j033344L317473K134455k503874
41139A0048973k495111L199404O402674J967466m894846o569086k873529P26862
41131E512807P63869j940894m661855m431850N5826N690689O905528K762473j145399
41122I511194m81144J841639Q29317l075259n730004n315575k448644K238976
41114b629500O014411L686796m567773r165154k880811O626147N902211m322656
41106a336329r698935l684413L922729L911898R93158K756027N779473L083518
$$ y = [4019681, 9033007, 13749761, 11261707, 3663686, 480207, 5510131, 12088052, 13206994, 10291033, 8704652, 9548583, 10308397, 10223108, 10288881, 10020705, 8678922, 8247671, 10720719, 13470134, 12189946, 8134263, 7100919, 10418392, 12552847, 10048973, 7553862, 10753266, 17155940, 19123406, 14228560, 7659474, 4785945, 5512807, 6276676, 4335782, -326073, -4757923, -4702097, 988592, 7894120, 10656593, 9511194, 9030050, 10871689, 11701006, 8625747, 2895743, -2419832, -4868476, -2629500, 3384911, 7071707, 2503934, -6661220, -9542031, -2915884, 2986327, -1336329, -11035264, -14719677, -10796948, -6885050, -5891892, -3135865, 2643608, 5727126]
41098E727126k147940k059947J323499o30770p188287p942117K13899P108716
41090e595821M343731k804543m264648O71894M587986L335205j60647j960862
41082a847705j792297j332779j071716p5538K053694L664512K337342j470015
41074D65498l445228m64243M373045N049439O81771l422948l052251M29749L595106
41065D209938M864287L668053j03695l943749l980803m98001J696475M79349n63844
41056E828010R47447J497656j776800m764739k419794K637491M017091J298202
41048G264564q68900j242618k296647l452782j840817O42521p16553m021578k153916
41039h686726M759271P742697L262105n65121K404431N830297K002825m414082
$$ y = [5727126, 3579186, 1519239, 2842738, 2211968, -4976319, -12918436, -12704537, -5595821, -1252090, -4056633, -8321281, -7649387, -3061401, 273804, 113157, -1847705, -3640002, -4972781, -6044497, -6120035, -4066341, -401829, 1935513, 465498, -2979730, -3443973, 929072, 5978511, 6660282, 3237334, 185083, 614832, 4209938, 9074225, 12742278, 12638583, 8694834, 4714031, 4216030, 5912505, 6391854, 5828010, 6775457, 8273113, 6496313, 1731574, -688220, 1949271, 5966362, 7264564, 6395664, 5153046, 2856399, -596383, -2437200, -1794679, -2511232, -6532810, -8686726, -3927455, 3815242, 7077347, 6512226, 8916657, 14746954, 16749779, 12335697]
41031A2335697l762913K980219O680182M755055K640707K331445J89919m020873
41023B4129438o061188n673623o309021n938160Q58036R965637R233903k781622
41015A7423400j1676604p395080J822093M171625K087148M123985Q125114N992354
41007B4674035o65984l544511k620173m355134p304548m016133L144232L140354
40999H452138m738069p911664r10695N578640K704374k904879k349859O69694
40991a410320q91386l363627j06246M421673J882121m041848l108047L242116
40983c375564L736766l130740o079211j70978M911302J316791m236303k307505
40975i335442L887194M708194p8557j813764K941475P674208N802410j174179
$$ y = [12335697, 8572784, 11553003, 18233185, 22988240, 25628947, 27960392, 28150311, 24129438, 18068250, 12394627, 6085606, 147446, 1005482, 10971119, 20205022, 17423400, 5746796, -1648284, 173809, 4345434, 6432582, 10556567, 18681681, 24674035, 24008051, 20463540, 17843367, 13488233, 6183685, 2167552, 5311784, 8452138, 3714069, -4197595, -5108290, 470350, 3174724, 269845, -2080014, -1410320, -2301706, -5665333, -5771579, -1349906, 532215, -3509633, -6617680, -3375564, 361202, -2769538, -8848749, -9019727, -4108425, -2791634, -7027937, -9335442, -5448248, -740054, -818611, -2632375, 309100, 7983308, 13785718, 12611539]
40967A2611539o931659p420251l234438K135796N051815M404419K241102R01021
40959I759344J79665j217544k489844j585089Q88584J386026j731378n057006
40951A32758l924906J270195M757410K263018l425759n781467k769321J141427
40943f336645J949301J631673L755514O349081M200508k236767n914365l145526
40935B52774M92015j759480p246559o893525J991082J1202071J1493021L235581
40927A2766980n193978p337048m210637j040899j126203l202274l399275M29436
40919a2313898N639036O824791K239624l070130l178947N14373J110230l206928
40911e441849n711712j440549M141711K805084l376125m642748J218277N080984
$$ y = [12611539, 5679880, -1740371, -4974809, -2839013, 2212802, 6617221, 8858323, 9759344, 9939009, 8721465, 6231621, 4646532, 5535116, 6921142, 5189764, 132758, -3792148, -2521953, 2235457, 4498475, 1072716, -4708751, -7478072, -6336645, -4387344, -2755671, 999843, 7348924, 11549432, 9312665, 3398300, 252774, 744789, -1014691, -8261250, -15154775, -13163693, -1961622, 9531399, 12766980, 7573002, 235954, -3974683, -5015582, -6141785, -9344059, -12743334, -12313898, -6674862, 149929, 2389553, -680577, -3859524, -3345151, -2234921, -5441849, -11153561, -12594110, -8452399, -5647315, -9023440, -13666188, -12447911, -7366927]
40903g366927P52360n002843k504781O469255J1621061Q455439K362293p88719
40895A3997138j303556j689648j478096J140993N236361P020652L235522n407556
40887B0751810j3315273j3800922n821262M076776Q590206P057094L719680P98581
40879A2056690k696467o357802p232662l981053J021611M340305M084979N13373
40871A748974l318890k736729L147833Q223505N751529k645192q811382q470803
40863g111155m849434j933325J28008J698299J509555K14668R82935L668120L174301
40854b518028k680536p845216n208482L525497R677484Q087906K046843j780688
40846C304780m59511L235996M169307J28728n564905p384246l723527J656141
$$ y = [-7366927, -6614567, -11617410, -14122191, -7652936, 3968125, 12423564, 14785857, 13997138, 12693582, 11003934, 9525838, 10666831, 15903192, 22923844, 26159366, 20751810, 7436537, -6364385, -12185647, -8108871, 481335, 7538429, 11258109, 12056690, 9360223, 3002421, -4230241, -8211294, -7189683, -2849378, 1235601, 1748974, -1569916, -4306645, -1158812, 7064693, 12816222, 10171030, 1359648, -7111155, -11960589, -13893914, -13765906, -12067607, -10558052, -10343384, -9360449, -5692329, -2518028, -5198564, -13043780, -18252262, -14726765, -5049281, 3038625, 5085468, 3304780, 2845269, 6081265, 10250572, 10379300, 4814395, -2569851, -6293378, -4637237]
40838d637237M447231M087307K680269J722939J072664k9471j648297k473314
40830E222091j172533Q85741L81044k742501l888721q52953J428511j647876n688212
40821h075409l502763K409373K775478l392401o694209k202400L507400M012791
40813a1162140K448872L830173O052771M957949J789514p23149l868414q356863
40805e031287r814879n283777P76131L093428L196312M445582M998175K475664
40797a144651K59426J725877L206738M78852k548840o4833N034541N706547K403481
40788A5057138J037793K072939O92833l985810p980449q881372o362615K59099
40780h090444P776804P600873k420804j0305229m966638O565740R640509M261369
$$ y = [-4637237, -190006, 3897301, 6577570, 8300509, 9373173, 9343702, 7695405, 5222091, 4049558, 4935299, 5316343, 2573842, -1314879, -2167832, -739321, -2387197, -8075409, -11578172, -9168799, -6393321, -9785722, -16479931, -18682331, -15174931, -11162140, -8713268, -4883095, 1169676, 6127625, 7917139, 7193990, 3325576, -5031287, -14846166, -20129943, -19353812, -16260384, -13064072, -8618490, -3620315, -1144651, -885225, 840652, 4047390, 4526242, 1977402, 1912569, 6947110, 12653657, 15057138, 16094931, 18167870, 18860703, 14874893, 6894444, -1986928, -8349543, -8090444, -313640, 7287233, 4866429, -5438800, -10405438, -3839698, 5800811, 10062180]
40772A0062180J596837K583020j627731r187970p740827K318504N042995m503858
40764a456850j0396740j855980Q911063P034431k469906o496955n095331n631200
40756a7457468o185135q56763N716689M701251r52789r86724N313277R528405
40748a179257Q230493M808630M07473n182907o785780k54600O940291M159199
40740A1143542n195931p986183j978931J657845k467958o322161l551138O53760
40732a4047155N25558l25726L020798P266102O899887L595592K469790L169681
40724A2574527J239460l901180p694279o563114j977568J721573K292025K058924
40716b49632M362821P236069M307942n144622j1763457p573342K047912N742369
$$ y = [10062180, 11659017, 14242037, 12614306, 3426336, -4314491, -1995987, 3047008, -1456850, -11853590, -13709570, -4798507, 2235924, -233982, -6730937, -11826268, -17457468, -23642603, -24499366, -18782677, -14081426, -15034215, -16020939, -10707662, -1179257, 7051236, 11859866, 12267339, 7084432, 298652, 44052, 6984343, 11143542, 5947611, -2038572, -4017503, -2359658, -4827616, -11149777, -14700915, -14047155, -13521597, -13847323, -10826525, -3560423, 3339464, 6935056, 9404846, 12574527, 13813987, 9912807, 2218528, -4344586, -6322154, -4600581, -2308556, -249632, 4113189, 11349258, 15657200, 10512578, -1250879, -8824221, -6776309, -1033940]
40708a033940K654835J693961N267398N296508j996091q382744o285356j80783
40700b966212J666844p0167P38507M253304N093069K085497R382J434255K695718
40691A4940197l38800o127777r191590o617378j235238J985270J816496J219360
40683c549460J752252J041840j788194k313648K489753P021046L639609n055638
40675C237560q550012l190592L493425M577187J615087j584690m580142o091159
40667a1073336k575430M102207N589940m47752m591671K97703O928243M867819
40659C097723k320004k813542M161551P404991J982637l784312k637408Q32271
40651E923907n94053m573364l578102K719509O570454K855098m416249p264019
$$ y = [-1033940, 1620895, 3314856, 8582254, 13878762, 11882671, 3499927, -2785429, -2966212, -1299368, -1369535, -631028, 3622276, 8715345, 10800842, 10810224, 12244479, 14940197, 14601397, 8473620, -717970, -7335348, -8570586, -6585316, -4768820, -3549460, -1797208, -755368, -2543562, -4857210, -2367457, 4653589, 8293198, 3237560, -5312452, -8503044, -5009619, -432432, 1182655, -402035, -4982177, -11073336, -13648766, -9546559, -3956619, -4404371, -8996042, -8698339, -1770096, 3097723, 777719, -2035823, 2125728, 9530719, 11513356, 7729044, 5091636, 5923907, 5329854, 756490, -2821612, -102103, 6468351, 9323449, 4907200, -2356819]
40643b356819k813290L945423N861649J597284k879337j613745L722019N970237
40635A1433421J899407l816504n233332k701661j070621k092426k290581J180756
40627b691541N700069O377616K490907k000963m003392m401327m911684m845877
40619h286192l028180o14946N53558P09122Q27701M64641l44958O08795L864188
40610e246271N234487J397096l619141l399903R99102L041070J638162J955897
40602B000499M824422M411617j006283m851272k952990j58616j062409k047342
40594h42374J028663M410055L127020n7438k24234O40488j598070m329945k843544
40585f89379L62782O706k004149n80094J990225j1488l751863j229516O320206
$$ y = [-2356819, -5170109, -1224686, 4636963, 6234247, 3354910, 1741165, 5463184, 11433421, 13332828, 9516324, 4282992, 1581331, 510710, -1581716, -3872297, -2691541, 3008528, 9386144, 11877051, 9876088, 5872696, 1471369, -3440315, -8286192, -11314372, -11929318, -11375760, -10666638, -9838937, -9374296, -9719254, -9110459, -5246271, -11784, 1385312, -2233829, -5633732, -4634630, -1593560, 44602, 2000499, 6824921, 11236538, 10230255, 5378983, 2425993, 2267377, 1204968, -842374, 186289, 4596344, 7723364, 7665926, 7441692, 8082180, 6484110, 2154165, -689379, -326597, -319891, -2324040, -2904134, -913909, -925397, -4677260, -5906776, 413430]
40576D13430Q965410L531574k561994m140757l964033l666303k68732M991142
40568C299737N157625p99378m794973k550079J94623q64319j413742J259190J633658
40559A122342k847212m404352J911501P468524L621676k692839j19166P199157
40551A1259631N945493l911003q831789l578096J858745p7449l631214j702212
40543b667894K773174M049131L202869L497756L071001o88083m564678l885310
40535D787966J12075K624842J851330j198092n810519r853093q688027j182903
40527a7356421O243140P148430L913102K952101L595118m13578q679052j2014967
40519a4612127n441382L741965N855148J861493L39484M133311O967747L749693
$$ y = [413430, 9378840, 12910414, 10348420, 6207663, 2243630, -1422673, -1691405, 3299737, 8457362, 7657984, 2863011, 312932, 507555, -356764, -1770506, -511316, 1122342, -1724870, -6129222, -4217721, 3250803, 6872479, 4179640, 4060474, 11259631, 17205124, 13294121, 4462332, 884236, 2742981, 2665532, -965682, -2667894, 105280, 4154411, 7357280, 10855036, 13926037, 13237954, 8673276, 4787966, 4900041, 7524883, 9376213, 8178121, 2367602, -7485491, -16173518, -17356421, -11113281, -3964851, -51749, 2900352, 6495470, 6081892, -2597160, -14612127, -20053509, -16311544, -10456396, -8594903, -8255419, -4122108, 2845639, 6595332]
40511F595332j909570l453238o13988J363508J3640j315791P48488M381186N211622
40502A1021189K204256j532219l057502k487998j475948o98972K42856J479044
40494E694706K456974K601928J763402J23935j826959l172526k944198j151360
40486C545902O72773O96759j070554k582713k362985j438792j381694j230756
40478e152060J333246N597878P293691L941640j321899l395378j402048J066898
40470G961968J129944m95050j743614j838167q39256J424254M484079O388993
40462A6473151N315997J820567j602761l222951l457293l435371l281252k658400
40454E951687k157783k553544k875832j295690J486183K180997j81955j960439
$$ y = [6595332, 4685762, 1232524, 618536, 1982044, 1995684, 679893, 1428381, 5809567, 11021189, 13225445, 11693226, 8635724, 6147726, 4671778, 3972806, 4215662, 5694706, 8151680, 10753608, 12517010, 12640945, 10813986, 7641460, 4697262, 3545902, 4218675, 4915434, 3844880, 1262167, -1100818, -2539610, -3921304, -5152060, -3818814, 1779064, 9072755, 13014395, 11692496, 8297118, 6895070, 7961968, 9091912, 8596862, 6853248, 5015081, 4175825, 5600079, 10084158, 16473151, 21789148, 23609715, 22006954, 18784003, 15326710, 11891339, 8610087, 5951687, 3793904, 1240360, -1635472, -2931162, -1444979, 736018, 554063, -1406376]
40446a406376l96773J195278j556269n509647l031395N634890J0195285M074211
40438I199204n861739q830969m464756o40894m02900M59382L510914M133580R1832
40429b806346l694094k841081l65805j137268l572149k237106L452149Q260423
40421d941277Q264325M734166P15178k595668m946417n311895l085335J73060
40413f993863J917178J443599L50143j61520j170453l746914n561305k714484
40405a6637619M052955Q233551N510444K46283k27931L824781N149587O28347
40397A0780398m170589l444051J272324N057786O354182N800659K554369l162711
40389B1042367o915623n066715j052654r60278l985660l603796J500082M345220
$$ y = [-1406376, -1803149, -607871, -2164140, -7673787, -10705182, -5070292, 5124993, 9199204, 3337465, -5493504, -9958260, -10599154, -11002054, -10542672, -7031758, -2898178, -2806346, -6500440, -9341521, -9707326, -10844594, -14416743, -16653849, -13201700, -4941277, 3323048, 8057214, 8772392, 6176724, 1230307, -4081588, -7166923, -6993863, -5076685, -3633086, -3282943, -3444463, -4614916, -8361830, -13923135, -16637619, -12584664, -4351113, 1159331, 1405614, 1177683, 5002464, 10152051, 10780398, 6609809, 3165758, 4438082, 9495868, 15850050, 21650709, 24205078, 21042367, 14126744, 9060029, 8007375, 7047097, 3061437, -542359, 957723, 5302943]
40381E302943L8993o336309o632131j027394K652505J20193l720417k033963M076614
40372g558966O462575O85851p400616q449087j346213N801102O515831L168168
40364b121355J372667J907263K280501K505285L704020L429339j152370o485464
40356E439886n977493m08220K219576j057976l405611P32344O543419O326762
40348A0412687J001524k335623j297810j35805j974862m818903n448059l155664
40340g752515O72329L810674M379313L006757K522131L435357K400364j752547
40332A0721863l990085k6622N732553N605857J09058l233206j850641r26802l305840
40323H836135m774583k264858O51741N79247J31024K006556K888407q93065n958041
$$ y = [5302943, 5341936, -994373, -7626504, -8653898, -6001393, -5881200, -9601617, -11635580, -7558966, -1096391, -410540, -7811156, -16260243, -17606456, -11805354, -5289523, -2121355, -748688, 1158575, 3439076, 5944361, 9648381, 13077720, 11925350, 5439886, -537607, -945827, 1273749, 215773, -3189838, -2457494, 4085925, 10412687, 11414211, 9078588, 7780778, 7644973, 5670111, 851208, -4596851, -7752515, -7080186, -3269512, 1109801, 4116558, 6638689, 10074046, 12474410, 10721863, 6731778, 6705156, 12437709, 18043566, 18152624, 14919418, 13068777, 12141975, 8836135, 4061552, 1796694, 2448435, 3027682, 3158706, 5165262, 8053669, 7160604, 1202563]
40314A202563o304881k052121K048313M220885N899486O423742L703211p43251
40306A4397947l047601k854764k914999l472188k251561M03364J744898J795710
40298C800806K812141L665909R85910l402638l030850L042016P189842L808603
40290A8871739k907899o036315n456307n031547m669445j622880K818515M403372
40282C69233K821857J811995K336556R21523m042256q636255q094838k603938
40274a5116123L173322M891448K145226j488752j913488J036163L359524K267205
40266a645475J8816P4978J407156M25358k513498l097067K02708L752577M132156
40257B757709J860310j470621n402497p893316n031785K826720Q288942N057961
$$ y = [1202563, -5102318, -7154439, -5106126, -885241, 5014245, 11437987, 15141198, 14397947, 11350346, 8495582, 5580583, 2108395, -143166, 260198, 2005096, 3800806, 6612947, 10278856, 11264766, 7862128, 4831278, 7873294, 15063136, 18871739, 15963840, 9927525, 4471218, -560329, -5229774, -6852654, -4034139, 369233, 3191090, 5003085, 7339641, 8261164, 4218908, -4417347, -12512185, -15116123, -11942801, -7051353, -4906127, -6394879, -8308367, -7272204, -3912680, -1645475, -1626659, -1551681, -144525, 280833, -2232665, -5329732, -5127024, -1374447, 2757709, 4618019, 3147398, -2255099, -10148415, -15180200, -12353480, -4064538, 993423]
40249I93423l195734o825891k139761N091810P828222N195362J075341j053956
40241F968816n73322M21719j089780n263013p579862l932244K720914N076478
40233c250294J465063k077945j582673r69049l914815n623725K70629R926452
40225e756357J2618123N288257l789782o780568m605465j537112J503130M521869
40217A462095N097106K114242j178055j888931j569857k062903j702648J51524
40209D22573k89945m604200o861162j935099M926262N120201K74266p61842K976928
40200g32018L280119k452838o161815k526979K529420K261084n58710n13755M38068
40191d437424k191514n842771m575386R37803M823623N195927M731284L773913
$$ y = [993423, -2202311, -9028202, -11167963, -6076153, 1752069, 6947431, 8022772, 6968816, 6395494, 6817213, 5727433, 464420, -7115442, -11047686, -8326772, -3250294, -1785231, -3863176, -5445849, -6414898, -10329713, -15953438, -15682809, -5756357, 6861766, 12150023, 8360241, 1579673, -3025792, -4562904, -3059774, 1462095, 6559201, 8673443, 7495388, 5606457, 4036600, 1973697, 271049, 422573, 132628, -4471572, -11332734, -13267833, -8341571, -3221370, -2947104, -3708946, -732018, 2548101, 95263, -6066552, -8593531, -6064111, -3803027, -4361737, -4875492, -4437424, -6628938, -12471709, -17047095, -16109292, -11285669, -6089742, -1358458, 2415455]
40183B415455K15921m195605m303852Q50590O190515P221204M265421r2490l652398
40174H914761m560295k466490J69238R76863Q82467J175561l31450n273408q946821
40165i459574n121504L842241Q437342M422909k345849m787090k345412J881112
40157e475825N823008P501338M618555j487337n363030l922932k55516J262211
40149B700472L29525q67972j282563r44862k00090m78497k785878m657836k493221
40140a0680922K386145M700060L126616J703661J929060J11031m523243o005558
40132g253150n96338O319253P688485M176542O86677j641839l877939m120495
40124A381196p01390K674735J656538j549197k063246o99649j667740m258039
$$ y = [2415455, 2631376, -1564229, -5868081, -5017491, 1173024, 8394228, 12659649, 12567159, 8914761, 4354466, 1887976, 2057214, 3034077, 3916544, 5092105, 4760655, -512753, -9459574, -14581078, -10738837, -2301495, 2121414, -224435, -5011525, -7356937, -5475825, 347183, 7848521, 12467076, 10979739, 5616709, 1693777, 1438261, 2700472, 3029997, 2162025, 879462, -65400, -265490, -743987, -3529865, -8187701, -10680922, -8294777, -3594717, -468101, 1235560, 3164620, 3275651, -1247592, -7253150, -7849488, -1530235, 6158250, 10334792, 11021469, 9379630, 5501691, 1381196, 679806, 3354541, 5011079, 3461882, 1398636, 698987, -968753, -5226792]
40116e226792l974777l52059L216941N749394P691246N782231k550038j0775301
40108d39155q816461K233761J0190274Q264794K351646n75639j623125l277597
40100H308498k983771L15954J342907k400457l753484L093244J0441390O459954
40092B0824235o226778j2439226n323197M775332N460501j845144o379844l051140
40084d205261L065347N110433K205329j380802j688686J282515M048097L200219
40076A1637191r87418m566032m046034l08785K403430J470688j150106j721151
40068B731783M10879K416500K299018J330487J208199J078779n43847k603038
40060H328760k772074p68067J992457M688416O344512M641172o75184m824674
$$ y = [-5226792, -9201569, -9553628, -6336687, -587293, 7103953, 12886184, 10336146, -439155, -9255616, -7021855, 3168419, 11433213, 13784859, 13209220, 11586095, 8308498, 5324727, 5640681, 6983588, 4583131, 829647, 3922891, 14364281, 20824235, 14597457, 2158231, -3164966, 1610366, 7070867, 5225723, -1154121, -4205261, -1139914, 3970519, 6175848, 4795046, 3106360, 4388875, 8436972, 11637191, 10649773, 6083741, 2037707, 1728922, 4132352, 5603040, 4452934, 2731783, 3142662, 5559162, 7858180, 9188667, 10396866, 11475645, 10931798, 8328760, 5556686, 4788619, 6781076, 11469492, 17814004, 22455176, 21779992, 16955318]
40052A6955318l411229K37572q03619n817640o730200j158394L082859N36741
40044B891408k866144J04835N626542N222535j83202k600815j013143k334705
40036D847311p919600r705436l178345M867851O702878M432848M037058M506815
40028H591380Q20915n508965p144911j810081M470496O069999L937707J332153
40020A0758693j275140l922882m101042l54238L558863K786908j337476k803335
40012C310351O4013J881973j533211o416251o238310q68878L997783N270447N309126
40003D777043O132122N858801K850809q80486l248121n486084q468908q795606
39995g260430l255051M579435P375718L448647j509494k584035r80249J14626
$$ y = [16955318, 13544089, 13781661, 12978042, 7160402, 430202, -728192, 2354667, 2891408, 25264, 130099, 5756641, 10979176, 10795974, 8195159, 7182016, 4847311, -3072289, -12777725, -15956070, -11088219, -4385341, 47507, 4084565, 8591380, 9412295, 3903330, -3241581, -5051662, -581166, 5488833, 9426540, 10758693, 9483553, 5560671, 1459629, 1105391, 4664254, 7451162, 6113686, 3310351, 3374364, 5256337, 3723126, -2693125, -8931435, -9800313, -5802530, -532083, 4777043, 10909165, 16767966, 19618775, 18738289, 15490168, 10004084, 1535176, -7260430, -10515481, -5936046, 1439672, 4888319, 3378825, 794790, -185459, -70833]
39987g0833N34895J284102J169167j043070l058482j422760L052309N465578K976714
39978H887620j537207l057060l07595L162291L374578L25742k520851k669278
39970E658240j254864n97465m38857J294739M294358N177101K208827j500408
39962A4841671j719768J214140K964783J184046j597239j788493O56103K989108
39954A8744351L669869L523342L248822K074928j28163j096516J524905O523474
39946C8085012R542966P630540K395177j572683o24276N296277J2464398J5965075
39938H9182486J4357541J1830947J3346125J7505166J7983287J3521645J1750662
39931A89477859J8856091K9164025L1287070K3006508J2940639P105897J612874
$$ y = [-70833, 464062, 1748164, 2917331, 1874261, -1184221, -2606981, 445328, 5910906, 8887620, 7350413, 4293353, 3985758, 7148049, 10522627, 10848369, 8327518, 5658240, 4403376, 3805911, 3367054, 4661793, 8956151, 14133252, 16342079, 14841671, 13121903, 14336043, 17300826, 18484872, 16887633, 15099140, 15755243, 18744351, 22414220, 25937562, 29186384, 31261312, 31133149, 30036633, 31561538, 38085012, 47627978, 55258518, 57653695, 56081012, 55456736, 60753013, 73217411, 89182486, 103540027, 115370974, 128717099, 146222265, 164205552, 177727197, 189477859, 208333950, 237497975, 268785045, 291791553, 304732192, 311838089, 313450963]
39924C13450963q167081j8370744k2586984k2263645k3804672k7315705k5921796
39917A65020336j7129231q153385o682953j0860596j2752627r471035o176274
39910I3794235p821266j1812164j1499532n481722k8765j066420o365909q784438
39902D0934019o143341l600475n245253p760610n606385O54795N414367N673581
39894B4320698L357251Q55803j346737k621721k020926p92367j272927k643299
39886A7835775j807031O83261L02914l950123o549333l115159L002914N643154
39878A2046372L825327O06919k774396o449026q004168m832686O65422L646293
39870a269943L845313M519516N117396J788423m094257n301955N33239O132778
$$ y = [313450963, 305283882, 286913138, 264326154, 242062509, 218257837, 190942132, 165020336, 147891105, 139737720, 133054767, 122194171, 109441544, 99970509, 93794235, 85972969, 74160805, 62661273, 57179551, 57150786, 56084366, 49718457, 40934019, 34790678, 31190203, 25944950, 18184340, 12577955, 13232750, 18647117, 24320698, 27677949, 28533752, 27187015, 24565294, 22544368, 21752001, 20479074, 17835775, 16028744, 16712005, 17014919, 13064796, 6515463, 3400304, 6403218, 12046372, 15871699, 16478618, 13704222, 7255196, -748972, -5581658, -4916236, -1269943, 2575370, 7094886, 12212282, 14000705, 9906448, 4604493, 5137732, 11270510]
39862A1270510M607655j313132m892331n112603m828188l400094J463418O698349
39854D493584O341290Q29233k934287j600957P38223J53738j617647j811949j506342
39845C084886k379388k699795l24141L179267M714964L682884J291051j451037
39837I098691k662268m3981M357386L799047m022816j1050215q346812R17835
39829g953133N503682K329678P234M336958R104042O448229o78913l786145k045235
39820A3266397j799749m753469n397967j254847K169009N1296m122834m190089
39812f032253l76163K336250K268871K198296L496797M052754K365089j78988
39804A0130653j845765k295220j313266J116360K977840J773529j279052k096203
$$ y = [11270510, 15878165, 14565033, 9672702, 4560099, -268089, -3668183, -2204765, 4493584, 10834874, 11664107, 8729820, 7128863, 7867086, 8020824, 6403177, 4591228, 3084886, 705498, -1994297, -2318438, 860829, 5575793, 9258677, 10549728, 9098691, 6436423, 6392442, 10749828, 14548875, 10526059, -524156, -8870968, -7953133, -2449451, -119773, -112539, 4224419, 13328461, 19776690, 19097777, 15311632, 13266397, 11466648, 6713179, 1315212, 60365, 2229374, 2280670, -1842164, -6032253, -6408416, -4072166, -1803295, 395001, 3891798, 7944552, 10309641, 10130653, 8284888, 5989668, 4676402, 5792762, 8770602, 10544131, 9265079, 7168876]
39796G168876P9311J260868o16137j961832K53444K673358P99668k992289k736074
39787C929193J214840K126305k701130p619133o950909k539613K33868J38575
39779a2168004M7760J628138L711776M852124M708636L418645J453750l90446
39771G262379j850717l028078k913279j62581L729964M696787J333830k627524
39763F440781l371262k134834k402856l980586l486673J37919M102685N780006
39755A085180N422724M400868K873784R5830l861366p108592o896040k618156
39747f605768K326538L806758K199766J261784J353377j408035p076392q668140
39739a2810112j881622O708767P786020K405153m74488K364880N400004M583621
$$ y = [7168876, 7248187, 8509055, 7892918, 5931086, 6184530, 8857888, 9657556, 6665267, 3929193, 5144033, 7270338, 4569208, -3049925, -10000834, -12540447, -12306579, -12168004, -12120244, -10492106, -6780330, -1928206, 2780430, 6199075, 7652825, 7262379, 5411662, 2383584, -529695, -692276, 3037688, 7734475, 9068305, 6440781, 3069519, 934685, -1468171, -5448757, -8935430, -8797511, -4694826, 1085180, 6507904, 10908772, 13782556, 13878386, 10017020, 2908428, -3987612, -6605768, -4279230, -472472, 1727294, 2989078, 4342455, 2934420, -4141972, -12810112, -14691734, -7982967, -196947, 2208206, 1733718, 4098598, 9498602, 14082223]
39731A4082223K045058n41723m764509q973715p193960J152214P645972O283922
39723I735482K149718K612540N603743M171080j377657m206770k024215K68229
39715A6932150j241839n081757q392235r752218p851632k641206J968009J704032
39707a4356696j585346k288440K01480J239945j42913N09975L904215M151260
39699h366520o16810k680970L327605R521932N204205n786294r218224j382002
39691i997078N568121K295035m239626k800842M558648O507149N1086n971908
39683d029415m830650l00694J326974K69187M9983O35995j29657j516274j169227
39674i693778O62658K397901M709793Q265110R411452L699605o128596j1098090
$$ y = [14082223, 16127281, 15585558, 10821049, 1847334, -5346626, -4194412, 3451560, 9735482, 11885200, 14497740, 20101483, 24272563, 22894906, 18688136, 16663921, 16932150, 15690311, 10608554, 2216319, -7535899, -15387531, -18028737, -16060728, -14356696, -15942042, -18230482, -18029002, -16789057, -16931970, -16421995, -12517780, -8366520, -8983330, -11664300, -8336695, 1185237, 6389442, 603148, -8615076, -9997078, -4428957, -2133922, -6373548, -9174390, -4615742, 1891407, 1942493, -4029415, -8860065, -9160759, -7833785, -7564598, -7514615, -6878620, -7008277, -8524551, -9693778, -9031120, -6633219, -1923426, 6341684, 15753136, 19452741, 13324145, 2226055]
39666B226055o744488J289755M634351J719085k645931m351340l471770k199886
39658i544169k112313l039223l125420p72614K620460L507717J030303j062165
39650a2497424O25424M037643M234960O0806m518430n474310k713716J041252
39642a5203795L214870K868025J065478K65846J850422L934077L398406P21360
39634B114689M95062N063435R287489N364573o409782j5410075j2409260j322193
39626a3226062N455122K968044r80063J393851O069768M071931l995487q320694
39618f563590m169676K071318L118691M35078N1958L573897P391060P818683L933229
39609A7660648k085666n322736k186747L814011M521044j939005p459010n107810
$$ y = [2226055, -4518433, -3228678, 1405673, 3124758, 478827, -3872513, -7344283, -9544169, -11656482, -14695705, -17821125, -18593739, -15973279, -12465562, -11435259, -12497424, -11872000, -7834357, -3599397, -3538591, -8057021, -13531331, -16245047, -15203795, -11988925, -9120900, -8055422, -7789576, -5939154, -2005077, 1393329, 2114689, 2609751, 7673186, 16960675, 22325248, 15915466, 505391, -11903869, -13226062, -7770940, -4802896, -5782959, -4389108, 1680660, 5752591, 1757104, -6563590, -10733266, -8661948, -5543257, -5108179, -5056221, -1482324, 5908736, 13727419, 17660648, 15574982, 10252246, 8065499, 11879510, 16400554, 14461549, 7002539, 1894729]
39601A894729R04379J886428k782988o409104n581620k922772o18641J646320
39593a1983269K474886n22493m730953l683813L594265R704065Q077328J056974
39585C986990l810106k511582K476338N527559K780626m068939q359854n405971
39577i384939J302567M297659K185986O24964K645250L974909P95013l323351
39569C118058k903980Q01120K135536L5830r90388J035532J750586k773557q773482
39560f564745q391447k60209P355039O413791l74597l202808J260614N678917
39552A914555L429569j897410l234089j143875j015527k424650N284N934331Q427186
39543I995374M994086J125488L35852j031140n017701o045139K7513O882359N276513
$$ y = [1894729, 2799108, 4685536, 1902548, -4506556, -10088176, -13010948, -13629589, -11983269, -9508383, -10030876, -14761829, -18445642, -14851377, -5147312, 2930016, 3986990, 176884, -2334698, 141640, 5669199, 8449825, 4380886, -3978968, -9384939, -8082372, -3784713, -1598727, -973763, 1671487, 5646396, 6441409, 3118058, 214078, 1015198, 3150734, 3186564, 2196176, 3231708, 4982294, 2208737, -6564745, -14956192, -15216401, -7861362, -1447571, -1822168, -5024976, -3764362, 1914555, 5344124, 3446714, 212625, -931250, -1946777, -4371427, -4366143, 1568188, 9995374, 14989460, 16114948, 16450800, 15419660, 10401959, 4356820, 4384333, 11266692, 16543205]
39534A6543205l724766r933676p022385J096474O123788L565693m125215r593629
39526g070511p015371J297316O842247N250239J054646k88833j57967k055577
39518b143811l980431k037692J538768J315731j843979j534979L801075P918156
39510C032838N657213n41212m846259m605609j111560K682914L776371J334580
39502E379276j691870j663389P31733J414434r87448l385050l285485k135633
39494e623432k023858j860098P93247N345153P744109M834013j471414n432443
39486B305277l888012k92120J67067j559580j02173M438623M983304j094974o086488
39477a129076l316269J938286J104650l070896r91399P133548J0657050N182687
$$ y = [16543205, 12818439, 2884763, -4137622, -3041148, 3082640, 6648333, 2523118, -7070511, -14085882, -12788566, -5946319, -696080, 358566, 69733, -88234, -2143811, -6124242, -8161934, -6623166, -5307435, -7151414, -8686393, -4885318, 3032838, 8690051, 8148839, 3302580, -1303029, -2414589, 268325, 4044696, 5379276, 3687406, 2024017, 2755750, 4170184, 3182736, -202314, -3487799, -5623432, -7647290, -9507388, -8714141, -3368988, 4375121, 9209134, 7737720, 2305277, -1582735, -1874855, -1707788, -3267368, -3369541, 1069082, 6052386, 4957412, -1129076, -4445345, -2507059, -1402409, -4473305, -5464704, 1668844, 12325894, 17508581]
39469A7508581j268114j885570p45006l679072p876261p225711k205774J968802
39461e408125L049760K259444M85559j443443j771166q58281j727295m226615
39453i640162l209989L170372Q129508M781592l856913r248027q327333m056914
39445b2257866J568312P773983J0661144O726340M6866j804136R02121O79550
39437D296314m314283o665457j939429L720523L436843J98953P52601L793225
39429C279290K312734m502756r589303q176864k890308K182810O174432Q325804
39421b884161O336500J143539j837095k61781J078303j520531l351589J020179
39413b76636O904846N445561j642127m113807m98265j086822r414152j3389699
$$ y = [17508581, 16240467, 14354897, 13609891, 9930819, 2054558, -5171153, -7376927, -5408125, -2358365, -98921, 386638, -1056805, -2827971, -3686252, -5413547, -9640162, -12850151, -9679779, -1550271, 3231321, -625592, -9873619, -18200952, -22257866, -20689554, -12915571, -2254427, 4471913, 4518779, 2714643, 3616764, 4296314, -17969, -6683426, -8622855, -4902332, -1465489, -1266536, -513935, 3279290, 5592024, 1089268, -8500035, -16676899, -19567207, -17384397, -11209965, -2884161, 3452339, 4595878, 2758783, 2497002, 3575305, 2054774, -1296815, -276636, 6628210, 12073771, 10431644, 6317837, 5819572, 4732750, -4681402, -18071101]
39405a8071101l797945R008956R452934L79954k446640M202764P275755j21113
39397E883564q251829p515923k192893k62330n65681J438072L896207L281883
39389d288930J863663K203685P73349m487651o828134o68877O768566M900715
39381B36386l275344n693564m43496K267744k181837n659665j310651N662751
39373a0397676O556633J017273m757901o183865k610769L752692P912639N558922
39365H47948o99091l002383J324685N792846M102619j319264l891346k177650
39357I78364o14823l096088q488738j1132517n498173O748659J5145464J1130591
39349E172739P3170m381608J268255O385949L296422j898850j665757l2662l464934
$$ y = [-18071101, -21869046, -12860090, -3407156, -3027202, -5473842, -1271078, 6004677, 5883564, -2368265, -9884188, -12077081, -12339411, -12905092, -11467020, -7570813, -4288930, -2425267, -221582, 551767, -3935884, -10764018, -11432895, -4664329, 236386, -3038958, -8732522, -9176018, -6908274, -9090111, -14749776, -16060427, -10397676, -3841043, -2823770, -7581671, -13765536, -16376305, -12623613, -4710974, 847948, 148857, -2853526, -1528841, 4264005, 8366624, 7047360, 3156014, 978364, 363541, -2732547, -11221285, -22353802, -27851975, -21103316, -5957852, 5172739, 5245909, 864301, 2132556, 8518505, 11814927, 9916077, 8250320, 8217658, 4752724]
39340D752724o946424j940467O633517N763566m360366r027456j751273N448082
39332a428097J074480q109042q198640Q48300O768163L939397m86794L56108L561570
39323a674555L312435K79064p15608J387945L027391J627905j519579l688180
39315B036818l590539j882073n34201j473084m182659n052866j259655M732711
39307a1205548P193229M368502O92975J8563K2795l025685o695110n212890Q53075
39298a2990094M164166J414753j685140L14731M087119L680067O11795O81939
39290B79336L307809K189941l551791o954662l884467J009505K329243J616591
39282c658495K482389L386729J074012k407447k271158J375067M023216L630341
$$ y = [4752724, -2193700, -4134167, 2499350, 8262916, 3902550, -5124906, -6876179, -1428097, -353617, -8462659, -16661299, -15812999, -9044836, -5105439, -5592233, -5236125, -1674555, 1637880, 1916944, 1201336, 2589281, 5616672, 7244577, 5724998, 2036818, -1553721, -3435794, -3969995, -5443079, -9625738, -14678604, -15938259, -11205548, -4012319, 356183, 1049158, 1067721, 1090516, -1935169, -8630279, -13843169, -12990094, -8825928, -7411175, -9096315, -8781584, -4694465, -1014398, -402603, 279336, 3587145, 5777086, 2225295, -4729367, -8613834, -7604329, -5275086, -3658495, -1176106, 2210623, 3284635, 877188, -1393970, -18903, 4004313, 7634654]
39274G634654J832803n56404l760273n378021k480292K307946K889924r54378
39266A535959k567222R57781L629496J70993m936117l907392K672060P084284
39258D639842N356662P01351l035938n301358n820269l208093J691753N088039
39250A11989M580976J435716k122751m777029m968884j728369K401671L097638
39242a969043K38053j566654J38586K284602J817859M20734P35447J568723M49203
39233D117510j928825l401803l991433m390616l274546R9903K853159K119099
39225g797552j17693K2268K115712K532461M98585j305512j311425q2441K168040
39216c277557M786071M774178O59930l069568j325213K718848J235474n549480
$$ y = [7634654, 9467457, 8911053, 5150780, -227241, -2707533, -399587, 2490337, 1535959, -1031263, -73482, 3556014, 3727007, -1209110, -5116502, -2444442, 4639842, 9996504, 10697855, 7661917, 2360559, -3459710, -6667803, -4976050, 111989, 4692965, 6128681, 4005930, -771099, -5739983, -7468352, -5066681, -1969043, -1730990, -3297644, -3159058, -874456, 943403, 1364137, 2099584, 3668307, 4117510, 2188685, -1213118, -5204551, -9595167, -12869713, -12769810, -9916651, -7797552, -7915245, -7892977, -5777265, -3244804, -2746219, -4051731, -5363156, -5445597, -3277557, 1508514, 6282692, 6942622, 3873054, 2547841, 5266689, 6502163, 952683]
39208I52683q388163l004440L144207K590002r64429K77206N356391O646910K110377
39199H720744k218416j761474R39217J353066q75676k866051k826038j533446
39191a068074m98467K49861K049358M747210N152347J018477m066064m148884
39183C435764J28843J566936k480169n425324k137703K243176R33771k703336
39175d438042j051908L896394L395181k595302m538067M15437L074191k095362
39167c937478o751872j995737O670764P679118J094094k938277p70493Q94586
39159e5295j867203l732166k00570M402697M295091J367163P82595J733913n13011
39150F213214n301080o232840o94796N890778P259044L497611j353354n209526
$$ y = [952683, -7435480, -10439920, -7295713, -4705711, -5670140, -5392934, -36543, 6610367, 8720744, 6502328, 4740854, 5680071, 7033137, 6157461, 3291410, 465372, -1068074, -1566541, -1316680, 732678, 5479888, 10632235, 11650712, 7584648, 3435764, 3564607, 5131543, 2651374, -2773950, -4911653, -2668477, -1734706, -4438042, -5489950, -1593556, 1801625, -793677, -5331744, -4916307, -1842116, -3937478, -10689350, -12685087, -6014323, 1664795, 2758889, -179388, -949881, -55295, -1922498, -5654664, -5855234, -1452537, 2842554, 4209717, 4992312, 6726225, 6213214, 912134, -5320706, -6015502, -124724, 7134320, 10631931, 9278577, 4069051]
39142D069051p973557q246553m537393P43319K643865l6820l014486k462349J79335
39133a8635588J409836J202073K217051M684510N429536K303863k831285o178074
39125a0398078n391781p21018N213008Q222379N372298j455211o197877m550943
39117i907223J321427N424917M874288K550799K480680M166832L307915j871013
39109A2348622p083527o741386j464557K122074L9516l655461k869727J445877
39101e858569K622621j733394o037435m813242k34325J855977N46115K3084K356981
39092a1272187M879742N332407N256899O103238N413702M56566o064168q034931
39084B071268l933530O90436L15568l567379n030700j743698K540733L289592
$$ y = [4069051, -3904506, -12151059, -16688452, -15945133, -13301268, -13338088, -16352574, -18814923, -18635588, -17225752, -16023679, -13806628, -9122118, -3692582, -1388719, -4220004, -10398078, -15789859, -16510877, -11297869, -3075490, 2296808, 841597, -5356280, -9907223, -8585796, -3160879, 1713409, 4264208, 6744888, 10911720, 14219635, 12348622, 5265095, -1476291, -2940848, -818774, -779258, -4434719, -7304446, -5858569, -3235948, -4969342, -11006777, -15820019, -16054344, -14198367, -13652252, -13629168, -11272187, -6392445, -1060038, 4196861, 10300099, 15713801, 16170367, 10106199, 2071268, -1862262, -1171826, -856258, -4423637, -9454337, -11198035, -8657302, -5367710]
39076e367710J73548l874620o010641m533741R77177Q019895J1058546O390829
39068F833283k488728p128856l199200M406318P397641L945358J51454J355086
39060A1272356M802569L631840l057955q153370o033848n64150J73288m788817
39052b718087q200416m887716K023929O924758Q719969Q611318N419720j548262
39044A4345213p770561p815241l456838j543880l670215m122490L96043N100213
39036h537756M512656O22552p93588J316344L190478K693453J218435K7085j066506
39027C183153j415227K83845K984528L693422J766209k8773J10145K74056j696563
39018I154795m200883l931822r35269J153049K77043q68051J626789P033389R497827
$$ y = [-5367710, -5194162, -9068782, -15079423, -19613164, -18635987, -10616092, 442454, 6833283, 4344555, -2784301, -5983501, -1577183, 5820458, 9765816, 9917270, 11272356, 16074925, 19706765, 16648810, 8495440, 2461592, 1897442, 2070730, -2718087, -10918503, -15806219, -13782290, -6857532, 1862437, 10473755, 15893475, 14345213, 6574652, -1240589, -4697427, -6241307, -9911522, -14034012, -13637969, -8537756, -4025100, -3402548, -4196136, -2879792, 310686, 3004139, 4222574, 4249659, 3183153, 1767926, 2051771, 5036299, 8729721, 10495930, 10467157, 10577302, 10851358, 9154795, 4953912, 1022090, 86821, 1239870, 1516913, 648862, 2275651, 9309040, 18806867]
39009A8806867M247378o267768j3640742j1732409l267077L036074K288376j303419
39001g832720p09484M018283O022291K149899j929627m95714K914454J190808
38993E328190m051135m167682K360958O553620K718790l259747m787623n022311
38985d326940q339116r216117j121802Q802380P727329k089367n177582L236424
38977a0504791J0260619O842437J282846K826777N282801p00095r275600p967596
38969a952602J523642N993066J499224k741211j055374J360678p9090k226001
38961B322332k119186k178628l441983k186944K458381N189947L112255O01780
38953C757954J225328J613576j616990m915886l231740K335382O950964P713673
$$ y = [18806867, 23054245, 16786477, 3145735, -8586674, -11853751, -8817677, -6529301, -7832720, -8542204, -4523921, 1498370, 3648269, 1718642, 1222928, 4137382, 5328190, 1277055, -2890627, -529669, 6023951, 8742741, 5482994, 695371, -4326940, -12666056, -21882173, -23003975, -14201595, -6474266, -8563633, -13741215, -10504791, -244172, 6598265, 7881111, 10707888, 15990689, 15290594, 6014994, -1952602, -428960, 5564106, 7063330, 4322119, 3266745, 4627423, 4548333, 2322332, 203146, -1975482, -5417465, -7604409, -5146028, 43919, 3156174, 3757954, 4983282, 6596858, 4979868, 63982, -3167758, -832376, 6118588, 13832261]
38945A3832261L388420n811958j4108034j2550955j273280P151300L576018m667146
38937a0463374m968496K019081N591111K910583J483345M387997N294201O92042
38929F946490l656472k835201l92519o68559j241849R30855K421017n84794m073958
38920c154990j738353M377049O426313K607730q63468J30583K215031J090465
38912A1090360j933837k968802j435680K28039M92266m13251k083495l861023
38904h85423m087371j769515J383362K689025K185343K431434M170512M555867
38896A0673234J305474l193180m485630j971844P37293J477105K016178L379845
38888I938475K503440k596795o805422k778610P836875J3741197P494550m515153
$$ y = [13832261, 17220681, 11408723, -2699311, -15250266, -16523546, -9372246, -5796228, -10463374, -15431870, -13412789, -7821678, -4911095, -3427750, 960247, 6254448, 6946490, 3290018, 454817, 62298, -606261, -1848110, -917255, 1503762, 918968, -3154990, -4893343, -516294, 5910019, 8517749, 7654281, 7784864, 9999895, 11090360, 9156523, 6187721, 4752041, 4980080, 5472346, 5059095, 2975600, -885423, -4972794, -6742309, -5358947, -2669922, -484579, 1946855, 6117367, 10673234, 11978708, 8785528, 4299898, 2328054, 3065347, 4542452, 6558630, 9938475, 12441915, 9845120, 3039698, 261088, 8097963, 21839160, 29333710, 24818557]
38880B4818557j0042819o316997j791527k943330n565399k323453N437386Q891151
38872A0163569L736213m238151p159338m652484k240259k629860k948492n35497
38864a0504299K575477K769079p3885k793297k883132m16449K888614M859248
38856c578644M045422J329476m30264K24489J429942J009419j80300k66457j22035
38847C461048j709411l640680k627875N61400J308901j347693k268035J793746
38839d468599O086896M304355j833667m905482k366636J016666J573913J580309
38831I87755L356024L784767p79960p243374q596839l083360M075900Q111957
38823F12870R244166Q731373N345512r46713n525033m115044M86371J549497k236779
$$ y = [24818557, 14775738, 8458741, 6667214, 3723884, -1841515, -4164968, 1272418, 10163569, 13899782, 9661631, 2502293, -2150191, -4390450, -7020310, -9968802, -10504299, -7928822, -5159743, -5233628, -8026925, -10910057, -11326506, -8437892, -3578644, 466778, 1796254, 1365990, 1590479, 3020421, 4029840, 3849540, 3583083, 3461048, 1751637, -1889043, -4516918, -3955518, -2646617, -3994310, -6262345, -4468599, 1618297, 5922652, 4088985, -816497, -3183133, -2166467, -592554, 987755, 4343779, 8128546, 7348586, 105212, -8491627, -11574987, -7499087, 612870, 9857036, 18588409, 23933921, 22987208, 17462175, 13347131, 13833502, 15382999, 13146220]
38814A3146220n464166m475483j902472r88611o14803P48215Q65299j857068l651595
38805d194464p46269L441370L000498n02956l55262L495919L621527k084400n681651
38796e688j805347K970035M26787n635790m892887L428080R192272N949283j257685
38787H369060m434920k354822J052077K821823K135905r25957m559341n575742
38779c471917l056902K57359J876441K475630L229187L022021Q11477j532318
38771C610978j647644l45295k7551p56279r47452j070980l071919n929083n461601
38762a5646826k43969N087349N153269R45698j554587M21232L210903L055623
38754D28692K013653L877004O512820L935784l615840p808906l670044K241850
$$ y = [13146220, 7682054, 3206571, 1304099, 315488, -299315, 448900, 1314199, -542869, -4194464, -4940733, -1499363, 1501135, 998179, 642917, 4138836, 7760363, 5675963, -5688, -1811035, 1159000, 1585787, -4050003, -8942890, -5514810, 3677462, 9626745, 8369060, 3934140, 1579318, 2631395, 5453218, 7589123, 6663166, 2103825, -3471917, -6528819, -6271460, -4395019, -1919389, 1309798, 4331819, 5143296, 3610978, 1963334, 1618039, 1590488, 834209, -113243, -1184223, -4256142, -10185225, -15646826, -15890795, -10803446, -5650177, -4704479, -6259066, -5837834, -2626931, 428692, 2442345, 6319349, 12832169, 16767953, 13152113, 5343207, 1673163, 3915013]
38746C915013O67334o606108q912501k074945N657503N297203j148382m728584
38738g933467j603984L656727N372155L173011O44141M6267j28149k370099n585873
38729d729271n136161R12453P317303P008339M89981m378968k820154J204272
38721a32206J883086l29869j181642M3484K01611k087303m418657l910797L0229
38712i902064N605886R268747P785188J955502l152367m105440l472323n262055
38704a278926p900783o154821M68932N951681N521609J329538j661783k400114
38696f124667l206430l987414j022485O803010J3099161R386457l676398j4267864
38688b996630j2104751q60734O755181M954889j33127j513004m4202N65607M85500
$$ y = [3915013, 4582347, -2023761, -10936262, -13011207, -7353704, -2056501, -3204883, -7933467, -9537451, -5880724, -508569, 2664442, 3308583, 3354850, 3226701, 856602, -4729271, -9865432, -8952979, -1635676, 5372663, 5862644, 1483676, -1336478, -132206, 1750880, 1421011, 239369, 282853, 484464, -1602839, -6021496, -9932293, -9902064, -4296178, 4972569, 12757757, 14713259, 11560892, 7455452, 3983129, -1278926, -9179709, -15334530, -14865598, -8913917, -3392308, -2062770, -3724553, -6124667, -9331097, -13318511, -14340996, -7537986, 5561175, 14947632, 11271234, -2996630, -15101381, -15962115, -9206934, -4252045, -4385172, -5898176, -5942378, -5376771, -4891271]
38679d891271O99514j050283n507810p670157l414532L380079O295299N220866
38671f938295L582104J049814l424676n345287n31850N684082M995322k45995
38663a174781o93301L980728M888675J03333k210586N84923O21488m721808n837059
38654d458388K271169Q803023L586551n841800o134730J070548L999583O62362
38646C958318o07581K306200K601966j651197m147863k488716j887010l986579
38638e902462l042685K599587N308885J31683o375297n796818J08185L721616
38630i247306K930412J250116m7033k848011o336212o283160j039282N676638
38622a5943838R127234Q325631N545515K789256K23142k121782k636955J15916
$$ y = [-4891271, -4191757, -5242040, -10749850, -18420007, -21834539, -18454460, -12159161, -6938295, -3356191, -2306377, -5731053, -11076340, -11608190, -5924108, -928786, -1174781, -1868082, 2112646, 7001321, 7104654, 4894068, 5478991, 6100479, 1378671, -4458388, -2187219, 6615804, 10202355, 4360555, -1774175, -703627, 3295956, 3958318, 3350737, 5656937, 8258903, 6607706, 2459843, -28873, -1915883, -5902462, -8945147, -6345560, -1036675, -904992, -7280289, -13077107, -12968922, -9247306, -6316894, -5066778, -5113811, -7961822, -14298034, -20581194, -21620476, -15943838, -6816604, 1509027, 7054542, 9843798, 10066940, 7945158, 5308203, 5424119]
38614E424119M073083M703094P95954l310699l577625j714873j479824k030948
38606B882281L43043N152230P389658M254788j968396p558750r923749p290275
38598f719170o26815M504910L187393j759675l222579k37184J230150j474825
38590e117795l714335j847455J375956K777394L645664M931128L797087m01875
38582E445769k490718O86937L878466J086032m565544n501388j358608J097088
38574a721966j640004n978912p471679n373556q55712M607490Q670533R629642
38566a34164Q476307O535417K480601m398599r580655p221869J471100Q587094
38558F215232Q630626L174530l460614q284583q933635m376531J660829K713519
$$ y = [5424119, 9497202, 14200296, 14996250, 11685551, 8107926, 6393053, 4913229, 2882281, 3225324, 8377554, 15767212, 20022000, 18053604, 10494854, 571105, -6719170, -7345985, -2841075, 346318, -1413357, -4635936, -4873120, -3642970, -5117795, -8832130, -10679585, -9303629, -6526235, -2880571, 2050557, 5847644, 5445769, 2955051, 3641988, 7520454, 8606486, 4040942, -1460446, -2819054, -1721966, -3361970, -9340882, -16812561, -22186117, -23041829, -18434339, -9763806, -134164, 8342143, 14877560, 17358161, 12959562, 3378907, -3842962, -2371862, 6215232, 14845858, 18020388, 14559774, 6275191, -2658444, -7034975, -5374146, -2660627]
38550b660627k143819n868967k498446M584789P243022L292483j620397k244050
38542a916012J73872J087429p89119k257361j90468M425520P508762O228519J631892
38533A5903034k891867m978028m832201m029014l386716k140194O51657L915393
38525a787936M860666K548631L1975P43305L348836L251790m50048l073176j038229
38516H435814K854861L532678M81396k745558m034642m134285l489932j374169
38508d73837J530759K736174J232944p62302n71657J384927J902872r71036m706002
38499A302842m363947J104760O186068N051642m85275l172238m92580K316845
38491G448117J017022j209982L21610L903054M289647O01576l331781m549639
$$ y = [-2660627, -4804446, -10673413, -13171859, -8587070, -1344048, 1948435, 328038, -1916012, -1742140, -654711, -1443830, -3701191, -3891659, 533861, 8042623, 14271142, 15903034, 13011167, 8033139, 3200938, -828076, -4214792, -6354986, -5703329, -1787936, 3072730, 5621361, 5653336, 6396641, 9745477, 12997267, 12547219, 9474043, 8435814, 11290675, 14823353, 15304749, 12559191, 8524549, 4390264, 900332, -473837, 1056922, 3793096, 5026040, 4263738, 3692081, 5077008, 6979880, 6008844, 1302842, -3061105, -1956345, 4229723, 9281365, 8796090, 5623852, 5131272, 7448117, 8465139, 7255157, 7576767, 11479821, 15769468, 16371044, 13039263, 8489624]
38483H489624k822506R42359M167699K940370k669448o175190k647838L322376
38475E547446L535521j916123n336689k988047J049592K557996J838215P991k714186
38466A581716l953210r70107L175240K079928l621124n671777p64129L955634
38458d187829K239077j752065j284344J809989J284425k449640l350841J43609
38450g547619L356525L334280K309274K523914K673239R94824j528344k503956
38442C612137q42708K279022M031343K238625j724724l824841k533660q75774
38434B359420j414958k127842l87938J770247P28864k232964k441597Q86287L658099
38425G97618L352093J908643J332503O78913q69462j515454J86328K369929K262194
$$ y = [8489624, 5667118, 6609477, 10777176, 13717546, 11048098, 4872908, 2225070, 5547446, 9082967, 7166844, 1830155, -1157892, -108300, 2449696, 4287911, 4295902, 1581716, -2371494, -3341601, -166361, 1913567, -1707557, -7379334, -8143463, -4187829, -1948752, -3700817, -4985161, -3175172, -1890747, -4340387, -7691228, -7547619, -4191094, -856814, 1452460, 3976374, 6649613, 7644437, 6116093, 3612137, 2769429, 5048451, 9079794, 11318419, 9593695, 5768854, 3235194, 2359420, 944462, -1183380, -1571318, 198929, 927793, -1305171, -3746768, -2860481, 797618, 4149711, 6058354, 7390857, 8069770, 7200308, 5684854, 5871182, 8241111, 10503305]
38416A0503305m7193k293963l303807l545261l081183j078710K197236M290470
38408C640894K684019j966042n612317m673771J2354L918534L615424O0386k885877
38399a206396k123634K541433Q260896J0520238O446352j826678q207029q436185
38391E968997m102022L4402J451414J176963R22986J158009J881292L212273M356987
38382A6061301L279491j147345o683573q700101m780455K057503O243399N745486
38374A2075706L251439J073283j625833m701876m461920L72316L688461n40718
38366I130858p748917p631417M24672N492526J187056n154075m478608N38504
38358h239401J517090j876771l178756j089526q00623l531771l322468L270833
$$ y = [10503305, 10456112, 8162149, 4858342, 1313081, -1768102, -2846812, -649576, 3640894, 6324913, 4358871, -1253446, -5927217, -5914863, -1996329, 1619095, 1679481, -1206396, -3330030, -788597, 7472299, 17992537, 24438889, 22612211, 14405182, 5968997, 1866975, 1901377, 3352791, 4529754, 5452740, 6610749, 8492041, 11704314, 16061301, 19340792, 18193447, 11509874, 2809773, -1970682, 86821, 6330220, 12075706, 15327145, 16400428, 14774595, 10072719, 5610799, 5983115, 9671576, 9130858, 1381941, -6249476, -5824804, -332278, 854778, -4299297, -8777905, -8239401, -6722311, -8599082, -11777838, -12867364, -13667987, -17199758, -20522226, -17251393]
38350a7251393J0583638J0658097L204032m340148n134484N16489O319007O945242
38342A1500480L509714R77059N28972j886864p841439j1728629p840187J072755
38334a1708139P123156O977789L481704k50051k894918k563545J636143N945121
38326G747260N271525K70480l631371l842928k211404J34016L463804N295292
38318A2496674K429605k201473j927632K812869L491223l776999j1807377j2754242
38310a1237352q207357l872857n38897L232505M759005J418556k191195M84566
38302a6153026O897490P611732J07074o901324n256125K303833P046520N501750
38294A157924J799017O88064K021905K429424K31082k584992l011541p87740J307918
$$ y = [-17251393, -6667755, 3990342, 7194374, 2854226, -2280258, -1763769, 4555238, 11500480, 15010194, 15987253, 16516225, 14629361, 6787922, -4940707, -12780894, -11708139, -4584983, 2392806, 5874510, 5624459, 2729541, 165996, 1802139, 7747260, 13018785, 13289265, 9657894, 5814966, 3603562, 3737578, 7201382, 12496674, 14926279, 12724806, 10797174, 13610043, 17101266, 13324267, 1516890, -11237352, -19444709, -23317566, -23856463, -20623958, -15864953, -14446397, -16637592, -16153026, -9255536, -1643804, -1536730, -8438054, -13694179, -11390346, -4343826, 1157924, 2956941, 3645005, 5666910, 8096334, 8327416, 5742424, 2730883, 1943143, 3251061]
38285C251061Q32547j818107m567884n744100m247756K17202N189746N796816
38277a090475L27151n605685m653002K141073N492603M40100n943264m282311
38269a3173810L059018N196084m69165l824076J826685Q234164N133902k139326
38261C843476l30732R167602J0357470j928558j1687735n369149O819042O211520
38253A7082936o238622j2736650n882622K790411K551505k585804m144683j908230
38245a1071759j15821P73258K357532M044053N084237O072439N667649J359843
38237A4171431m433014n641253k060170q1829j514548n31301M584482O522247
38229A1016045J460888l296735j726119K03630m410090r910580o804259K279103
$$ y = [3251061, 4083608, 2265501, -2302383, -8046483, -12294239, -12077037, -6887291, -1090475, -763324, -6369009, -11022011, -8880938, -3388335, -2948235, -8891499, -13173810, -10114792, -4918708, -5387873, -9211949, -7385264, 848900, 5982802, 3843476, 3512744, 12680346, 23037816, 21109258, 9421523, 4052374, 10871416, 17082936, 10844314, -1892336, -7774958, -4984547, -2433042, -5018846, -9163529, -11071759, -11187580, -10414322, -8056790, -4012737, 1071500, 7143939, 12811588, 14171431, 9738417, 4097164, 2036994, 1955165, 440617, -90684, 4493798, 11016045, 12476933, 9180198, 7454079, 7657709, 3247619, -6662961, -13467220, -11188117]
38221a1188117P089244N712793M306394M254926J580403k756242l678692k279960
38213C040749m120434p691245n836418J056583M654250K529290J130834L263519
38205a972872M131278K288232K497709M068627r24377j1958254j5224094l223250
38197b0317001J1399250J2128324P43542p649850n901322j64293K475942J529136
38189e756272l90958q06019J691393M309677J212119o705739q729887J117893
38181a4057793J2201631J0461365r11033o471149j825473K236426m04912k231919
38173a002857K194581N321530p2244p290461n782983K515257P365213N752787
38165I000823K911194J064839k319958o020327m790072J194802N022774L219678
$$ y = [-11188117, -4098873, 1613920, 5920314, 10175240, 11755643, 8999401, 5320709, 3040749, -1079685, -8770930, -14607348, -13550765, -8896515, -6367225, -5236391, -1972872, 2158406, 4446638, 6944347, 11012974, 10088597, -1869657, -17093751, -20317001, -8917751, 3210573, 3954115, -3695735, -9597057, -9761350, -7285408, -5756272, -6147230, -6953249, -5261856, -952179, 259940, -6445799, -15175686, -14057793, -1856162, 8605203, 7694170, 1223021, -602452, 1633974, 1229062, -1002857, 1191724, 6513254, 6441010, -849451, -6632434, -4117177, 3248036, 9000823, 11912017, 12976856, 10656898, 4636571, -153501, 1041301, 6064075, 9283753]
38157I283753l8983j200284k668551o369736q452410n226476N10785M042462N552873
38148d566567P241809P346397L190096k295490l773067k132206l158889p416704
38140e564621q352156k453104M782041O309799K346992j771323k747092p93083
38132h242547K729781N431970M504466Q85724p6634L807631O500354J646275o887398
38123A0299622r204885l495865J387263r16675n356997l515431M359933J0187219
38115C744184Q353335J027922n517454o667196k358204L187098N013001K317488
38107I100174r12381j032603J195323K865514K873602J526093j410929n262447
38099H942346o800240l573417J950728M866098L880268J612529n09272l455451
$$ y = [9283753, 9244770, 8044486, 5375935, -993801, -9446211, -14672687, -14161902, -10119440, -4566567, 2675242, 10021639, 13211735, 10916245, 7143178, 5010972, 1852083, -5564621, -13916777, -16369881, -11587840, -5278041, -2931049, -4702372, -7449464, -8242547, -5512766, -80796, 4423670, 5309394, 5232760, 9040391, 15540745, 17187020, 10299622, 1094737, -2401128, -1013865, -1930540, -7287537, -10802968, -6443035, 3744184, 12097519, 13125441, 7607987, 940791, -1417413, 1769685, 6782686, 9100174, 8187793, 7155190, 8350513, 11216027, 14089629, 15615722, 14204793, 8942346, 2142106, -1431311, 519417, 5385515, 9265783, 10878312, 10369040, 6913589]
38091F913589o306462n402345L7951N103599N054161J525451k86461J171660K878572
38082A0689715K519071J079842O3022p20330j676733k098901j409709k50232K81263
38073H477008o32134l161667n451321l721556K813180P783252L670249o810295
38065B966716j1441151m229458N575407O229203P6711j431699L666016N445550
38057F857295o73321n829843k164299M277986L390435k999651m898198k54321
38049b293917L141304J283350n28626J918902M394603J799610l119300m255115
38041B340811j508156O0047j432800k679226j452853m1792p54892j642364K94588
38032f816637L597212L778200J34574k626632j090535J987784K489404J596632
$$ y = [6913589, 607127, -4795218, -4757267, 346332, 5400493, 6925944, 6639483, 7811143, 10689715, 13208786, 14288628, 14351650, 13631320, 11954587, 9855686, 8445977, 8195745, 8477008, 7844874, 4683207, -768114, -4489670, -1676490, 6106762, 9777011, 2966716, -8474435, -12703893, -7128486, -899283, -822572, -2254271, 1411745, 6857295, 6183974, 354131, -1810168, 2467818, 5858253, 2858602, -2039596, -2293917, 847387, 2130737, 1602111, 3521013, 7915616, 9715226, 6595926, 2340811, 832655, 892702, -540098, -3219324, -4672177, -4713969, -5468861, -7111225, -6816637, -3219425, 558775, 693349, -1933283, -3023818, -1036034, 1453370, 3050002]
38024C050002K953736N075437K903978k880049n035391p29040L146489J9267o314087
38015B190342p401610k239742K487125K311234n41805j852030n1470L519489N843313
38006D264846M563096J176158k92574N20372m20474l682154l751769J290664M317748
37997G985913J27239m865577k801064J975632N17165m566123l699076K156177
37989c169714L287070n43979N18349P310482Q285453l15939o800978l435074J346685
37980F482355j010504m747097k182941J818439J67784k215368K039244P632883
37972G984795N168362j975562l629788l16068k85143l230995j921533K356806
37964D150874J151697m828960n450949J514858O653507N037164K932555M515180
$$ y = [3050002, 6003738, 11079175, 13983153, 11103104, 6067713, 5338673, 8485162, 8504429, 2190342, -5211268, -7451010, -4963885, -2652651, -3194456, -5046486, -5097956, -1578467, 4264846, 8827942, 10004100, 9711526, 10231898, 9811424, 6129270, 2377501, 3668165, 7985913, 8113152, 3247575, 446511, 2422143, 2939308, -1626815, -5325891, -3169714, 117356, -426623, 91726, 7402208, 15687661, 15371722, 8570744, 5135670, 6482355, 5471851, 724754, -1458187, 360252, 528036, -1687332, 351912, 7984795, 13153157, 11177595, 7547807, 7231739, 6946596, 3715601, 1794068, 4150874, 5302571, 473611, -4977338, -3462480, 3191027, 8228191, 11160746, 15675926]
37956A5675926M284027j641091p262638o320716j776901N45496O83221R70813
37948E158137O4026l329727n595741k888880K559446N272239L252265r30902l214781
37939C46082p29400N214877Q056894K400273p588078j1419341n305316L514416
37931e509593P015924M925503P85073l983330q208886q608952l973571J798256
37923a5759576M437896M079401K762146O86317k312742m589427m370076j388895
37915a6454956L827252R298074J0730096O030728K13885k13050K525290N01588
37907A6458907o098635p775191j388210L182898j683326q390097n319398N273053
37899e739999J0594514N542031j887946l139692Q22096L715843K748795L12645
$$ y = [15675926, 19959953, 18318862, 11056224, 4735508, 2958607, 3504103, 4187324, 5158137, 5222163, 1892436, -3703305, -6592185, -4032739, 1239500, 4491765, 3560863, 346082, -383318, 4831559, 12888453, 15288726, 7700648, -3718693, -9024009, -5509593, 1506331, 6431834, 7216907, 3233577, -4975309, -13584261, -17557832, -15759576, -11321680, -7242279, -4480133, -3793816, -6106558, -10695985, -15066061, -16454956, -12627704, -3329630, 7400466, 13431194, 13645079, 13432029, 15957319, 16458907, 10360272, 2585081, 1196871, 4379769, 2696443, -5693654, -11013052, -5739999, 4854515, 10396546, 8508600, 5368908, 6191004, 9906847, 12655642, 12968287]
37891A2968287p46626q75486k071124l370144j299612L285891L326277m132671
37883G084792j0105883m916837N665898P231799r45140m450504K690612Q392256
37875A0646993L209348m511258m638292k491397o316785r436622j694408R877743
37867e354678J0245027J082098k481623K520055L683386l549380q344040m377494
37859f576649k9063j939465l676479N96516M401293R90885l811553j827106L004789
37850h866832J864166l463759l993967J228712M378244K027124p38592J21233
37842g443671K218069K694835K817573L759494K870110k027133p434431p313966
37834i859120j040132M957762M800859K43811k404405j116918K62155m63497j93452
$$ y = [12968287, 12221661, 11346175, 9275051, 5904907, 4605295, 7891186, 11217463, 7084792, -3021091, -7937928, -2272030, 4959769, 4014629, -435875, 2254737, 10646993, 13856341, 9345083, 4706791, 2215394, -4101391, -13538013, -15232421, -5354678, 4890349, 5972447, 3490824, 6010879, 9694265, 6144885, -2199155, -6576649, -6605712, -8545177, -12221656, -11625140, -7223847, -6232962, -10044515, -11871621, -8866832, -7002666, -10466425, -14460392, -13231680, -8853436, -6826312, -7564904, -7443671, -5225602, -2530767, 286806, 4046300, 6916410, 4889277, -2545154, -9859120, -10899252, -5941490, -1140631, -896820, -3301225, -4418143, -4155988, -4619485, -4812937]
37825d812937K901065M691906J826635j737099j271358L1980l075001o886205
37817h331014l552532M675233P061235J091111l415358K40352O402239P653929
37809A1825195N166527K914974M2560m499865o830078m393328j364066j485613
37801A376306j354500K596960O112058L500089k598899n328073l847445k293005
37793a836509j622058M35151L517424N023833M530846K839971n47505m272980
37785H068173l621984K027870M942559n62769p823523o523144J676485N792734
37777C976401J940191k876756l144559j226428J2589J984432M984498N419571
37769A1069939J787076k123126k714959q06359J241959K239602J071278k515438
$$ y = [-4812937, -1911872, 2780034, 4606669, 2869570, 1598212, 1630192, -1444809, -8331014, -11883546, -7208313, -147078, 944033, -2471325, -2230973, 4171266, 11825195, 16991722, 19906696, 19949256, 15449391, 8619313, 4225985, 2861919, 1376306, 21806, 2618766, 8730824, 12230913, 9632014, 4303941, 456496, -1836509, -3458567, -3023416, 494008, 5517841, 10048687, 12888658, 12341153, 8068173, 4446189, 6474059, 11416618, 10853849, 3030326, -3492818, -1816333, 3976401, 5916592, 3039836, -104723, -1331151, -1318562, 665870, 5650368, 11069939, 12857015, 10733889, 8018930, 7212571, 8454530, 10694132, 11765410, 9249972]
37761I249972n306591l438996J633780M458657K855621o80960l937649n881089
37753a047255m028189K160463O331844J932877o328139p026369Q97607N847670
37745a259491J385632m193204j678584M972801N950588J60591n335742n847820
37737e845229k336618K198465M294557J701658k352696j395136L968583M663054
37729D896638k658906p916813k143361P439366P383701j969680q160318n660315
37721h789688j176929q8488O99521L929263O026337L987792P66497l8831R63801
37712F279275K239996L899347M549328J202746m979935q061808n119619Q6906
37704I6236L350961M686317M503794J042160m905341q087000n749005j957090
$$ y = [9249972, 3943381, 504385, 2138165, 6596822, 9452443, 8771483, 4833834, -1047255, -5075444, -2914981, 3416863, 5349740, -978399, -8004768, -7107161, -1259491, 126141, -4067063, -5745647, -772846, 5177742, 5338333, 2591, -5845229, -8181847, -5983382, -1688825, 12833, -2339863, -3734999, 233584, 4896638, 2237732, -5679081, -7822442, -383076, 7000625, 5030945, -3129373, -8789688, -9966617, -10055105, -9355584, -5426321, 600016, 4587808, 5354305, 5315474, 6279275, 8519271, 12418618, 16967946, 18170692, 13190757, 5128949, 9330, 96236, 3447197, 8133514, 12637308, 13679468, 8774127, 687127, -5061878, -7018968]
37696g018968j032638j305243J90730J498113k26823k311856n57495K918409K419657
37687e426114j961123m145051j286412K680672L758918K978894K832554K816400
37679B248738J201497j468715l174528l166925k118481o97858O17370J244354
37671e314548J143877J054549J282992J053192j10701j125713o02770R73839J559261
37662h6022L08184j115288q93517J91385R0324p41825M39020L660143M503217
37653F355621K87620m403749k936713L409770O064059R66189n494772n441661
37645a193636k7401L652893L207602K557880L515096K062084m425249j0831250
37637a481981r826019k134984L572480J964859k092955j080610M048276N724072
$$ y = [-7018968, -8051606, -9356849, -9166119, -7668006, -7894829, -10206685, -10764180, -7845771, -5426114, -7387237, -11532288, -12818700, -10138028, -6379110, -3400216, -567662, 2248738, 3450235, 1981520, -1193008, -4359933, -6478414, -7176272, -6558902, -5314548, -4170671, -3116122, -1833130, -779938, -890639, -2016352, -2619122, -1645283, -86022, 222162, -893126, -1786643, -1595258, -1504934, -2246759, -1807739, 1852404, 6355621, 6643241, 2239492, -697221, 2712549, 8776608, 9742797, 4248025, -1193636, -1221037, 2431856, 5639458, 8197338, 11712434, 13774518, 9349269, -1481981, -11308000, -13442984, -9870504, -7905645, -9998600, -11079210, -7030934, -1306862]
37629a306862J778681j253226J120665M236677K702089l02229N42664J920803
37621I439262k732478r860027r318707j340815K404243k300969m920514J926506
37613a6703499R200994N964383k408238k949349M159288O971273J172057m948411
37605D58498n195147l486570m568690o059857l592422K433351Q148960R899894
37597a961983N904602j278481m676745o64561M708868L587288j644306k524837
37589A449845R80180N95590n371127q551398m475486Q63471K394796L467016O682382
37580a964731P240454K261303k053393l12046K589657J08584m375111l472132
37572B2585J774631M257912K163217k11423o03652n95447j025899j423803k179774
$$ y = [-1306862, 471819, -781407, 339258, 4575935, 7278024, 6975795, 7518459, 9439262, 6706784, -3153243, -12471950, -13812765, -11408522, -13709491, -18630005, -16703499, -7502505, -1538122, -3946360, -6895709, -2736421, 4234852, 5406909, 458498, -4736649, -8223219, -12791909, -18851766, -22444188, -20010837, -11861877, -1961983, 3942619, 2664138, -2012607, -2677168, 2031700, 5618988, 3974682, 1449845, 2430025, 3025615, -2345512, -10896910, -15372396, -14508925, -12114129, -8647113, -1964731, 5275723, 7537026, 5483633, 5171587, 7761244, 7869828, 3494717, 22585, 1797216, 6055128, 8218345, 8006922, 7403270, 6807823, 5781924, 4358121, 2178347]
37563B178347k806392r90095K622959L091618q64188l017533P06491M696977K584588
37554H202772k276499l228735j515169j984472k796200L54070L948135J576349
37546B280251l911281m391843l08602R60996j134199l27135L373874L221603r61673
37537a198009j645013K375265L317907j229167l702685n54623J254805k549766
37529c931286n206477q47396N141821N520401K500907J654686J793568q85386
37521E740838m400716m455551j713649P85107K896340M554278K954490j864220
37513D496917m176461j064405K041361L10944k292274o59892K002675M93055k387933
37504a236013j308531R07444j987226p666344q185195k869884J778322L865046
$$ y = [2178347, -628045, -1618140, 1004819, 4096437, 3232249, 214716, 921207, 5618184, 8202772, 5926273, 2697538, 1182369, -802103, -3598303, -3244233, 703902, 2280251, -1631030, -6022873, -6331475, -5370479, -6504678, -6831813, -3457939, -236336, -1198009, -2843022, -467757, 2850150, 1620983, -2081702, -2636325, -1381520, -3931286, -9137763, -9985159, -4843338, 677063, 3177970, 4832656, 6626224, 5740838, 1340122, -3115429, -4829078, -4043971, -1147631, 3406647, 6361137, 4496917, 320456, -743949, 1297412, 1608356, -683918, -1343810, 658865, 1151920, -1236013, -2544544, -1637100, -3624326, -11290670, -19475865, -22345749, -20567427, -16702381]
37496a6702381P460729J1962938J0598982K138907m967120m206438M13923J855255
37488H554795J33246m03530M04936j055184m665745n252220l14759M740448K782481
37479D924468m606313p484974n63354Q347148Q022096o31687n861256j572062
37471E74066N408877O442022J673591l856283p424039p648244l152505K972174
37463e010341L931978o52998k449727K516411O727286L904099j54713J299707
37455A0111702K823291l197678j0612635p921398J889044N161121o23751m186138
37447f556442k03018L254000K60579l459025j772715K122350K806866P20393j516136
37438d343148l125632k203196L165517Q079137M278671o247143j0941255m385239
$$ y = [-16702381, -9241652, 2721286, 13320268, 15459175, 10492055, 6285617, 6699540, 8554795, 8688041, 8284511, 8689447, 7634263, 2968518, -2283702, -2598461, 2141987, 4924468, 318155, -7166819, -7730173, 616975, 8639071, 8007384, 2146128, 574066, 5982943, 12424965, 14098556, 10242273, 2818234, -4830010, -7982515, -5010341, -1078363, -1731361, -4181088, -1664677, 5062609, 8966708, 8811995, 10111702, 12934993, 9737315, -875320, -8796718, -6907674, -1746553, -2370304, -6556442, -6759460, -3505460, -3244881, -6703906, -8476621, -6354271, -3547405, -2827012, -4343148, -7468780, -9671976, -6506459, 1572678, 5851349, -395794, -11337049, -15722288]
37430a5722288L736340M140697J299341L371588P667125O145372n08342m452276
37422E677557l126278j169563j445759j803491n61483Q20134J165503J555418
$$ y = [-15722288, -11985948, -7845251, -6545910, -3174322, 4492803, 10638175, 10129833, 5677557, 2551279, 1381716, -64043, -1867534, -2429017, -1608883, -443380, 1112038]
$$ [...]
##END NTUPLES=NMR SPECTRUM
##END=
