##TITLE=31Pdec_SR32-oiR
 CDCl3, 24 sc
 1.2.2021
##JCAMPDX= 6.0         $$ Bruker NMR JCAMP-DX V2.0
##DATA TYPE= NMR SPECTRUM
##DATA CLASS= NTUPLES
##ORIGIN= UXNMR, Bruker Analytische Messtechnik GmbH
##OWNER= root
$$ XWIN-NMR		Version 3.5
$$ Mon Feb  1 11:11:20 2021 Russian Standard Time (UT+4h)  she@DPX200
##.OBSERVE FREQUENCY= 81.013821
##.OBSERVE NUCLEUS= ^31P
##.ACQUISITION MODE= SIMULTANEOUS
##.ACQUISITION SCHEME= undefined
##.AVERAGES= 24
##.DIGITISER RES= 17
##SPECTROMETER/DATA SYSTEM= spect
##.PULSE SEQUENCE= zgpg30
##.SOLVENT NAME= CDCl3
##.SHIFT REFERENCE= (INTERNAL, CDCl3, 0, 182.463)
##AUDIT TRAIL= $$ (NUMBER, WHEN, WHO, WHERE, WHAT)
$$ ##TITLE= Audit trail, XWIN-NMR		Version 3.5
$$ ##JCAMPDX= 5.01
$$ ##ORIGIN= Bruker BioSpin GmbH
$$ ##OWNER= she
$$ F:/spectra/data/she/nmr/P31/1/pdata/1/auditp.txt
$$ ##AUDIT TRAIL=  $$ (NUMBER, WHEN, WHO, WHERE, WHAT)
(   1,<2021-02-01 11:09:23.62 +0400>,<she>,<DPX200>,
      <created by zg, POWCHK disabled, PULCHK disabled
       configuration hash MD5:
       00 E9 B6 7A A2 85 ED C7 34 08 36 98 17 FE 4E 26
       data hash MD5: 32K
       FF 7E 28 E6 1B 46 96 C5 F4 DB 14 91 8F 10 1A 56>)
(   2,<2021-02-01 11:09:25.93 +0400>,<she>,<DPX200>,
      <Start of raw data processing
       efp BC_mod = 2 LB = 1 FT_mod = 6 PKNL = 1 PHC0 = -2388.387 PHC1 = 1338.001 SI = 64K 
       data hash MD5: 64K
       A6 22 D1 EE 54 AE 91 74 C2 8E C8 8E 68 9F 0E 05>)
(   3,<2021-02-01 11:10:05.32 +0400>,<she>,<DPX200>,
      <pk PHC0 = 500.3591 PHC1 = -878.9998 
       data hash MD5: 64K
       A9 5E DB 8B 23 77 6B 0C 9A EC C8 F9 F7 73 30 3D>)
(   4,<2021-02-01 11:10:48.34 +0400>,<she>,<DPX200>,
      <pk PHC0 = 190.0882 PHC1 = -483.3998 
       data hash MD5: 64K
       B0 38 E9 A1 B7 BF B7 29 24 B2 46 C9 DA 0D 75 28>)
(   5,<2021-02-01 11:10:52.07 +0400>,<she>,<DPX200>,
      <abs ABSG = 5 
       data hash MD5: 64K
       E4 20 C9 57 3C 52 D7 2B B7 25 F3 99 31 B1 5C BB>)
$$ ##END=
$$ 
$$ hash MD5
$$ 2E 56 7B DE 68 F5 26 64 86 42 0B 0C D8 BD 3E E9
##$RELAX= 
##$RELAX= 
##$RELAX= 
##$RELAX= 
##$RELAX= 
##$RELAX= 
##$RELAX= 
##$RELAX= 
$$ Bruker specific parameters
$$ --------------------------
##$DU= <F:/spectra>
##$EXPNO= 1
##$NAME= <P31>
##$PROCNO= 1
##$TYPE= <nmr>
##$USER= <she>
##$AMP= (0..31)
100 100 100 100 100 100 100 100 100 100 100 100 100 100 100 100 100 100 
100 100 100 100 100 100 100 100 100 100 100 100 100 100 
##$AQSEQ= 0
##$AQ_mod= 1
##$AUNM= <au_zg>
##$AUTOPOS= <>
##$BF1= 81.014009
##$BF2= 200.13
##$BF3= 200.13
##$BF4= 200.13
##$BF5= 200.13
##$BF6= 200.13
##$BF7= 200.13
##$BF8= 200.13
##$BYTORDA= 1
##$CFDGTYP= 0
##$CFRGTYP= 5
##$CHEMSTR= <none>
##$CNST= (0..31)
1 1 145 1 1 1 1 1 1 1 1 1 1 1 1 1 1 1 1 1 1 1 1 1 1 1 1 1 1 1 1 1 
##$CPDPRG= <waltz16>
##$CPDPRG1= <>
##$CPDPRG2= <waltz16>
##$CPDPRG3= <>
##$CPDPRG4= <mlev>
##$CPDPRG5= <mlev>
##$CPDPRG6= <mlev>
##$CPDPRG7= <mlev>
##$CPDPRG8= <mlev>
##$CPDPRGB= <>
##$CPDPRGT= <>
##$D= (0..31)
$$ [...]
##$SUBNAM3= <"">
##$SUBNAM4= <"">
##$SUBNAM5= <"">
##$SUBNAM6= <"">
##$SUBNAM7= <"">
##$SUBNAM8= <"">
##$SUBNAM9= <"">
##$SW= 369.568048894756
##$SWIBOX= (0..15)
0 1 3 0 0 0 0 0 0 0 0 0 0 0 0 0 
##$SW_h= 29940.119760479
##$TD= 32768
##$TD0= 1
##$TE= 0
##$TE2= 300
##$TE3= 300
##$TEG= 300
##$TL= (0..7)
0 120 53 12 22 120 120 120 
##$TP= (0..7)
150 150 150 150 150 150 150 150 
##$TP07= 0
##$TPNAME0= <>
##$TPNAME1= <>
##$TPNAME2= <>
##$TPNAME3= <>
##$TPNAME4= <>
##$TPNAME5= <>
##$TPNAME6= <>
##$TPNAME7= <>
##$TPOAL= (0..7)
0.5 0.5 0.5 0.5 0.5 0.5 0.5 0.5 
##$TPOFFS= (0..7)
0 0 0 0 0 0 0 0 
##$TUNHIN= 0
##$TUNHOUT= 0
##$TUNXOUT= 0
##$USERA1= <user>
##$USERA2= <user>
##$USERA3= <user>
##$USERA4= <user>
##$USERA5= <user>
##$V9= 5
##$VALIST= <valist>
##$VCLIST= <CCCCCCCCCCCCCCC>
##$VD= 0
##$VDLIST= <DDDDDDDDDDDDDDD>
##$VPLIST= <PPPPPPPPPPPPPPP>
##$VTLIST= <TTTTTTTTTTTTTTT>
##$WBST= 1024
##$WBSW= 4
##$XGAIN= (0..3)
0 0 0 0 
##$XL= 0
##$YL= 0
##$YMAX_a= 44783
##$YMIN_a= -51134
##$ZGOPTNS= <>
##$ZL1= 120
##$ZL2= 120
##$ZL3= 120
##$ZL4= 120
##$ABSF1= 182.463
##$ABSF2= -187.1042
##$ABSG= 5
##$ABSL= 3
##$ALPHA= 0
##$AQORDER= 0
##$ASSFAC= 0
##$ASSFACI= 0
##$ASSFACX= 0
##$ASSWID= 0
##$AUNMP= <proc_1d>
##$AZFE= 0.1
##$AZFW= 0.5
##$BCFW= 0
##$BC_mod= 2
##$BYTORDP= 0
##$COROFFS= 0
##$CY= -3
##$DATMOD= 1
##$DC= 0
##$DFILT= <>
##$DTYPP= 0
##$F1P= 0
##$F2P= 0
##$FCOR= 1
##$FTSIZE= 65536
##$FT_mod= 6
##$GAMMA= 0
##$GB= 0
##$INTBC= 1
##$INTSCL= 5.30512e-09
##$ISEN= 30
##$LB= 1
##$LEV0= 0
##$LPBIN= 0
##$MAXI= 10000
##$MC2= 0
##$MEAN= 0
##$ME_mod= 0
##$MI= 50
##$NCOEF= 0
##$NC_proc= -6
##$NLEV= 6
##$NOISF1= 182.463
##$NOISF2= 159.3651
##$NSP= 0
##$NTH_PI= 0
##$NZP= 0
##$OFFSET= 182.463
##$PC= 4
##$PHC0= -1697.94
##$PHC1= -24.39862
##$PH_mod= 1
##$PKNL= yes
##$PPARMOD= 0
##$PSCAL= 0
##$PSIGN= 0
##$REVERSE= no
##$SF= 81.014009
##$SI= 65536
##$SIGF1= 159.3651
##$SIGF2= -187.1042
##$SINO= 113.3802
##$SIOLD= 16384
##$SREGLST= <1H.CDCl3>
##$SSB= 0
##$STSI= 65536
##$STSR= 0
##$SW_p= 29940.119760479
##$SYMM= 0
##$S_DEV= 0
##$TDeff= 32768
##$TDoff= 0
##$TI= <>
##$TILT= no
##$TM1= 0
##$TM2= 0
##$TOPLEV= 0
##$USERP1= <user>
##$USERP2= <user>
##$USERP3= <user>
##$USERP4= <user>
##$USERP5= <user>
##$WDW= 1
##$XDIM= 65536
##$YMAX_p= 434755714
##$YMIN_p= -16904989
$$ End of Bruker specific parameters
$$ ---------------------------------
##NTUPLES= NMR SPECTRUM
##VAR_NAME=  FREQUENCY,     SPECTRUM/REAL,   SPECTRUM/IMAG
##SYMBOL=    X,             R,               I
##VAR_TYPE=  INDEPENDENT,   DEPENDENT,       DEPENDENT
##VAR_FORM=  AFFN,          ASDF,            ASDF
##VAR_DIM=   65536,         65536,           65536
##UNITS=     HZ,            ARBITRARY UNITS, ARBITRARY UNITS
##FACTOR=    0.456856943014862, 1,           1
##FIRST=     14782.0589164895, 0,            0
##LAST=      -15158.0608439895, 0,           0
##MIN=       -15158.0608439895, -16904989,   0
##MAX=       14782.0589164895, 434755714,    0
$$ Real data points
##PAGE= N=1
##DATA TABLE= (X++(R..R)), XYDATA
$$ [...]
44318 -456756 -464752 405773 980998 217731 -1396132 -2288941 -1894555 -1220536 -1062276 -951781
44308 -951781 -440124 -101667 -386873 -613936 -123813 541922 732315 1069453 2428150
44299 2428150 4170863 4831485 4276675 3837137 4313286 5052158 5150748 4535731 3593995
44290 3593995 2599395 1792709 1300590 727405 -462377 -1894784 -2389539 -1554377 -553237
44281 -553237 -588385 -1135307 -620349 1270890 2966787 3056073 2141020 1864779 2560725 2957739
44271 2957739 2240758 1173234 551330 -347227 -2540404 -5180390 -6125488 -4671620 -2354969
44262 -2354969 -785420 -13257 470914 529601 153427 293906 1573868 2832979 2390112
44253 2390112 545257 -495209 657811 2980066 4478438 4387625 3450756 2613128 2107688
44244 2107688 1728071 1437709 1314262 1011220 -102485 -1806583 -2546352 -1036980 1794067
44235 1794067 3631701 3694822 3481792 4110268 4537465 3645595 2663171 3593022 5953092
44226 5953092 7113604 5737488 3052246 645230 -1111893 -2018881 -1325493 912031
44218 912031 3086077 3776627 3374637 3091919 3198199 3174563 2894158 2622015 2267991 1514797
44208 1514797 422140 -711469 -1725823 -2334275 -2044593 -984622 -213238 -420711 -860800
44199 -860800 -483933 347550 376381 -555079 -1173676 -498350 1081659 2604962 3541004
44190 3541004 3767793 3333713 2571966 1891697 1280763 583055 290554 1199291 2992011
44181 2992011 4028378 3101893 787704 -1458397 -2896859 -3578610 -3462524 -2396189 -760336
44172 -760336 694225 1679977 2470747 3170751 3390195 2700650 1097857 -888411 -2279115
44163 -2279115 -2188550 -791018 571221 859335 581793 816695 1413680 1328108 566418
44154 566418 323160 895618 1004254 -51243 -993040 -510983 561020 533189 -481377
44145 -481377 -921558 -390800 -86899 -562710 -821003 -143046 668998 607238 -174578 -1063702
44135 -1063702 -1980622 -2808062 -2793560 -1569344 -97232 425103 115721 -71167 79564
44126 79564 -15851 -486666 -750972 -526783 -220323 -148250 -37567 497195 1395763 2158265
44116 2158265 2177446 1272543 215302 306095 1810038 3168174 2585814 245334 -1910416
44107 -1910416 -2513697 -1926103 -1016827 -6242 893050 757927 -970344 -3095570 -3520156
44098 -3520156 -1679047 693809 1616927 1073304 597662 1060699 1732579 1657283 1133683
44089 1133683 1238822 2296212 3453916 3611982 2271615 -262340 -2862864 -4005295
44081 -4005295 -3102065 -1438352 -932448 -1874482 -2771125 -2546877 -1842285 -1765339 -2382842
44072 -2382842 -2995030 -3029499 -2165380 -479844 1049844 1225330 347965 92065 1035303
44063 1035303 1714473 1021602 -49399 -328997 -496474 -1420397 -2009716 -976647 465479
44054 465479 278533 -846488 -475699 1437435 2498959 2052687 2175279 3742007 4659491
44045 4659491 3465457 1891787 1878596 2342293 1270320 -619247 -818498 1251521 3665313
44036 3665313 4718184 4420558 3478538 2300547 1071637 -164383 -1458438 -2489626
44028 -2489626 -2648353 -2063389 -1723262 -1970351 -1883973 -916757 18528 86812 -40197 500575
44018 500575 1196421 1325530 1528197 2463944 2885851 1182930 -1639796 -2715760 -1087078
44009 -1087078 1242601 2332972 2555617 3122291 3873057 3649105 2151224 490831 9918
44000 9918 946632 2272458 2809633 2437088 1906209 1600360 1227642 802095 838352 1195113
43990 1195113 974020 197838 170723 1219084 1634704 282186 -1246413 -955261 339539
43981 339539 345346 -1058150 -1955852 -1697694 -1518941 -1884118 -1669237 -429141 620685
43972 620685 511856 -260553 -901453 -1207584 -1035763 -390297 -177655 -1266806 -2722595
43963 -2722595 -2736830 -1413263 -684600 -1239597 -1621847 -839594 208384 545322 386680
43954 386680 -44268 -1013191 -1956678 -1711231 -723350 -852567 -2227677 -2685388 -1292108
43945 -1292108 129763 199282 -23712 222746 -387997 -2153103 -2357317 634057 3755314
43936 3755314 3212417 260549 -764144 1009113 2384463 1587282 384233 336537 494191
43927 494191 -164352 -860138 -753448 -296540 137284 967541 1930051 1876698 893342 654854
43917 654854 1718819 2381561 1369741 -95934 -252456 678372 1286434 1068974 399091
43908 399091 -553659 -1575848 -1968100 -1586043 -1544603 -2661457 -3865152 -3420230 -1310036
43899 -1310036 762066 1488324 1076921 474242 416815 1195431 2562859 3810913 4453194
43890 4453194 4764106 5208746 5542689 5034267 3512234 1697963 452926 29820 119508
43881 119508 416864 1025662 2238830 3838592 4833077 4310023 2524175 661632 -541477
43872 -541477 -1435481 -2557304 -3626217 -3801903 -2693976 -907465 255291 -300030 -2434489
43863 -2434489 -4620671 -5253109 -4196052 -2672040 -1730275 -1409711 -1324512 -1242515 -918512
43854 -918512 -190975 425504 50388 -1200067 -1940427 -1244812 26075 424165 -74688
43845 -74688 -221817 564112 1441059 1539677 1300886 1868719 3483038 4997623 5049082 3476362
43835 3476362 1491468 531718 987337 1938590 2004115 540652 -1741201 -3335119 -3356373
43826 -3356373 -2397288 -1664223 -1401805 -873104 14465 130566 -1115397 -2340941 -1748649
43817 -1748649 265276 1359989 163836 -2184164 -3668472 -3578584 -2595137 -1517230 -637807
43808 -637807 -78023 -109334 -906770 -1994523 -2189044 -677361 1684323 2930012 2357104
43799 2357104 1463079 1660784 2053794 918122 -1354499 -2690377 -2443655 -2002019 -2095761
43790 -2095761 -1678597 -273351 569573 -517843 -2534822 -3582921 -3441792 -3250021 -3435839
43781 -3435839 -3415296 -2891696 -2193217 -1553728 -1028457 -866298 -1127173 -1215372 -574319 411653
43771 411653 887408 632513 125930 -179123 -158833 25025 -101352 -856577 -1599705 -1220108
43761 -1220108 96129 637728 -473553 -1741703 -1299288 362123 1080638 -2546 -1582662
43752 -1582662 -2199729 -1834300 -1337210 -1269501 -1639117 -2214527 -2869519 -3769045 -4962178
43743 -4962178 -5650317 -4586990 -1767950 988171 1950758 1446404 1166803 2043084 3563408
43734 3563408 4636540 4359359 2554637 361347 -418668 555829 1506893 979466 -71262
43725 -71262 41898 1000628 1198586 487723 208382 783487 1259653 1212942 1216838 1277399
43715 1277399 646132 -513388 -1045169 -801813 -1009434 -2094288 -2828643 -2381669 -1663001
43706 -1663001 -1698773 -2001967 -1589556 -595325 101363 108832 -337268 -804256 -765718 -14353
43696 -14353 728719 498970 -428071 -848721 -615059 -880661 -1911608 -2253932 -1006459
43687 -1006459 466067 290605 -1435790 -3055472 -3451763 -2699119 -1263844 429814 1950546
43678 1950546 2962370 3083998 1682603 -1227958 -3874921 -4040542 -1964083 -323119
43670 -323119 -611998 -1338435 -906669 -306918 -1111445 -2415234 -2128433 -417832 516612
43661 516612 -207673 -1166268 -1070000 -392883 -222126 -828205 -1711668 -2153308 -1660735 -582800
43651 -582800 32991 -81540 199341 1517348 2536229 1898239 762140 1261023 2904847
43642 2904847 2975616 654250 -1689500 -2014086 -1168997 -840465 -957558 -756040 -906879
43633 -906879 -2576604 -5011804 -5883857 -4101371 -1060377 1115533 1738282 1686530 1959357
43624 1959357 2565852 2824923 2485991 2149782 2385868 2858720 2857369 2402759 2133507 2231576
43614 2231576 2228783 1886846 1516736 1313716 1059137 641561 304281 273052 615241 1379652
43604 1379652 2298540 2551582 1600848 125876 -706067 -761796 -808510 -1014086 -699946 391246
43594 391246 1691149 2703096 3155321 2341026 -148736 -2797347 -2989993 -201132 3081102
43585 3081102 4378560 3737152 2396239 649796 -1521280 -3072367 -3006528 -2110704 -1897592
43576 -1897592 -2352309 -2360111 -1944300 -2268945 -3425524 -3963160 -3066208 -1795400 -1474092
43567 -1474092 -1842907 -1602467 -250033 1266154 1568448 274195 -1513996 -2221433 -1499268
43558 -1499268 -633327 -913556 -2024305 -2676296 -2443676 -2080764 -2156457 -2338865 -2182058
43549 -2182058 -1790620 -1395648 -909793 -255423 309743 484915 243733 -272455 -861737
43540 -861737 -1195377 -1000873 -402658 205151 624975 886435 898136 514580 -42787 -287699
43530 -287699 -90631 171227 173201 27278 43969 417973 1200178 2269466 3224505 3510975
43520 3510975 2768668 1090943 -835336 -1815520 -944657 1178871 2453420 1235821 -1771744
43511 -1771744 -4190203 -4450145 -3042945 -1429930 -497581 -239680 -243357 -89659 349535
43502 349535 758505 773084 547256 529339 702829 642204 447869 931253 2416253 3829588
43492 3829588 3625469 1601845 -584435 -880369 1193745 4014282 5308111 4178018
43484 4178018 1667072 -533243 -1545352 -1487859 -910664 -507984 -811494 -1511609 -1551864
43475 -1551864 -631933 -92631 -1279942 -3424139 -4463632 -3892483 -3303667 -3766926 -4137899
43466 -4137899 -2800124 -6582 2466741 3275646 2324032 355907 -1383063 -1670564 -435015
43457 -435015 995362 1477963 1393321 1655358 2066792 1782970 927102 347439 -128627 -1698495
43447 -1698495 -4449208 -6522381 -6204837 -3986987 -1729936 -483034 -62013 -236370 -1051162
43438 -1051162 -1961035 -1912954 -848228 -146378 -717692 -1439137 -751450 642092 422145
43429 422145 -1736753 -3122664 -1699833 802227 1403353 289564 193629 1805184 2736947
43420 2736947 1625845 355768 679793 1145534 -319454 -2602056 -2951217 -1289920 -110103
43411 -110103 -437142 -759977 -235108 -205404 -1590038 -3069733 -3229780 -2753954 -3012756
43402 -3012756 -3802741 -3975329 -3326476 -2464537 -1590170 -750192 -620238 -1597839 -2537894
43393 -2537894 -1832367 337918 2072685 2156752 1350915 1102636 1854844 2928193 3433388
43384 3433388 2991238 1938600 1022078 729864 998103 1661771 2744460 3953480 4456777
43375 4456777 3806164 2639871 1773990 1087770 179945 -401105 162576 1279895 1389877
43366 1389877 253082 -586797 -100738 795881 910996 698920 1323244 2536996 2877104
43357 2877104 1825331 583970 416506 1010603 951906 -516251 -2566460 -3602473 -2906726
43348 -2906726 -1365163 -371948 -147508 317126 1523815 2440196 1853864 256484 -548915
43339 -548915 305124 1697238 1944190 693616 -933730 -1653979 -1056979 404737 1946653
43330 1946653 2871613 2799349 1854420 719808 245558 663325 1209057 884201 -320225
43321 -320225 -1361484 -1506088 -1275146 -1583121 -2316281 -2439981 -1427939 46697 921922
43312 921922 736443 -268005 -1490533 -2215255 -1991077 -1079471 -235487 131155 239363
43303 239363 276660 17368 -536882 -683379 154574 1397183 1823643 1092218 77639
43294 77639 -434385 -713841 -1363210 -2176821 -2383236 -1830768 -1233892 -1108966 -1056853 -475529
43284 -475529 443119 992274 1046969 1249452 2013588 2904342 3241750 2841049 1878253 574275
43274 574275 -522637 -511202 830192 2329280 2640769 2035686 1992292 2990519 3846521
43265 3846521 3563634 2683307 2134991 1821650 1342104 1224747 2109573 3206446 3046604
43256 3046604 1714896 941000 1702096 2980096 3407951 3068077 2920880 3261128 3587054
43247 3587054 3513654 3077858 2469305 2064594 2391786 3426981 4183559 3667660 2163530
43238 2163530 1015366 1113155 1986952 2418457 1695558 302018 -511625 -24451 1036102
43229 1036102 1277606 448994 -182415 416343 1685648 2480942 2673315 2834296 2948560
43220 2948560 2583670 1971432 1743264 1840522 1898269 2427359 4088345 5842877 5642917
43211 5642917 3407745 1552681 1761243 2902861 3221371 2912728 2995167 3082168 2298906
43202 2298906 1488911 2311094 4457841 5754303 5003218 3028191 986423 -554258 -893950
43193 -893950 397343 2041524 2056221 755332 672651 2674637 4368820 3749698 2336263
43184 2336263 2728650 4676602 5861252 5498296 4812597 4581500 4514479 4731132 5578219
43175 5578219 6070529 4820245 2737825 2516833 4858842 7386315 8156009 8129427 8907024
43166 8907024 9965780 9908249 9054442 8861492 9563579 10110448 9957929 9453238 8912524
43157 8912524 8744377 10022282 13312328 17093456 18965755 18622312 18254224 19749663 22784726
43148 22784726 26048624 29039244 31942044 34782983 37616401 40925845 44999199 49231255
43140 49231255 52696799 55242018 57535493 60131955 62792479 64672774 65044397 63905224
43132 63905224 61865600 59327691 56028104 51742581 47133310 43265466 40435980 38162901
43124 38162901 36161585 34434042 32465587 29501581 25897196 23028687 21376940 19884294
43116 19884294 17886649 16316464 15795208 14838940 11872098 8325074 7416210 9675680
43108 9675680 11877811 11297722 9145228 8326246 9237340 9765486 8783300 7462721 6920994
43099 6920994 6509575 5336684 4040977 3722481 3931275 3176640 1223879 -397347 -332197
43090 -332197 1167690 3008337 4496837 5366011 5395323 4690989 3819449 3079402 2133792
43081 2133792 915038 255307 784622 1731677 1877151 1383875 1478123 2384955 2912015
43072 2912015 2383940 1700400 1798566 2133967 1637420 478487 -122379 501952 1820680
43063 1820680 2768109 2408818 366292 -2569482 -4509883 -4043976 -1778573 341176 1157472
43054 1157472 1036719 618270 -130966 -1242038 -1975949 -1483023 58229 1546021 2145074
43045 2145074 1959205 1497274 899092 27179 -864393 -1141356 -757456 -696515 -1752547
43036 -1752547 -3130583 -3238999 -1966452 -1052403 -1697488 -2907183 -3079735 -2259276 -1598321
43027 -1598321 -1327949 -745979 186035 825235 1291333 2265544 3236358 2760538 1016523
43018 1016523 287951 1846269 3879743 3921979 2178155 860486 1037828 1838555 2330333
43009 2330333 2472194 2266166 1557270 885016 1111518 1841694 1548838 -165610 -1647847
43000 -1647847 -1295583 403090 1798151 2200011 2060790 1693246 1036301 460721 622363
42991 622363 1377396 1798713 1565615 1535005 2476493 3849970 4422836 3769745 2626035
42982 2626035 1925875 1966846 2452028 2894020 2901476 2418764 1815687 1514125 1486594 1424215
42972 1424215 1439919 2105180 3460508 4475685 4196374 3262060 3389985 5039939 6397950
42963 6397950 5450600 2654266 584355 912450 2655776 3777330 3665031 3292945 3535227
42954 3535227 4351653 5449272 6656201 7465775 7233698 6252754 5676575 5763450 5208091
42945 5208091 3227081 1389852 1837902 4121310 5582083 4966398 3836356 3837427 4364038
42936 4364038 4055966 3106842 2582345 2543846 2506799 2962107 4630401 6653292 7359253
42927 7359253 6650288 5822882 5093914 3369057 850293 -241211 1436803 4331191 5963609
42918 5963609 5599859 3964082 1727139 -356783 -958305 594476 3180584 5156239
42910 5156239 6095824 6263401 5383257 3391508 1562664 1198477 1741665 1846197 1780998
42901 1780998 2839405 4631703 5145148 3803303 2469729 2717651 3764682 3964435 2975044
42892 2975044 1569727 451647 105472 800049 1894736 2031273 815778 -454152 -414194
42883 -414194 777214 2054494 2787847 2858164 2234640 1198693 321890 -242583 -627559
42874 -627559 -194697 1962781 4849267 5647160 3258284 220426 -568715 369748 684129
42865 684129 352315 1464596 4174486 5785791 4549037 2011433 533493 370946 474323
42856 474323 610028 1163539 1848854 2069775 1981581 2003879 1751544 586464 -1038866 -1820839
42846 -1820839 -1141829 384511 1825473 2712021 2960517 2666178 2104979 1540304 945600
42837 945600 175931 -605177 -935350 -551645 209732 550450 -92848 -1272405 -1678120
42828 -1678120 -583641 943935 1000724 -811781 -2715391 -2799431 -1138435 558431 861291
42819 861291 -308065 -2011400 -3100196 -2994279 -2159614 -1610509 -1689828 -1777976 -1470766
42810 -1470766 -1350486 -2023046 -3025781 -3447778 -3170071 -2735919 -2424543 -2256801 -2485751
42801 -2485751 -3132479 -3360422 -2375842 -815760 -162699 -728197 -1224945 -533461 975785
42792 975785 2106276 2080452 954446 -542516 -1505752 -1793101 -2271702 -3338901 -3685652
42783 -3685652 -1980773 437724 568629 -2041706 -4162429 -3164882 -605728 302471 -606202
42774 -606202 -701814 1011986 2279934 964409 -1888884 -3442893 -2456199 -282207 968234
42765 968234 477578 -893758 -1806764 -1913351 -2010760 -2660658 -3183971 -2627538 -1316093
42756 -1316093 -549946 -873181 -1494612 -1437909 -508520 855205 1919175 1896241 676885
42747 676885 -731027 -1297601 -1287676 -1503051 -1631084 -872159 -448 -760864 -2834229 -3602696
42737 -3602696 -1936309 -95450 -325185 -1492302 -1205034 280862 836273 142054 -217578
42728 -217578 30940 -561775 -2115234 -2750965 -1796301 -1099826 -1884707 -2599070 -1620402
42719 -1620402 -133746 -139528 -1011228 -508062 1510360 2874968 2534843 1886690 2192711
42710 2192711 2643954 1963902 523007 -292719 17851 778488 1190437 894577 -56335
42701 -56335 -1068715 -1243170 -429120 299112 -70216 -1041120 -1297834 -660631 -344304 -1111627
42691 -1111627 -2169321 -2399653 -1851990 -1258346 -704862 219013 1250544 1508200 768071
42682 768071 -236400 -911907 -1248520 -982378 466601 2588688 3497542 2141619 -51873
42673 -51873 -989422 -671025 -645547 -1191500 -924779 626161 1895511 1478581 53059
42664 53059 -807412 -665730 -158469 200067 222667 -225727 -851142 -894698 -197462 384712
42654 384712 311096 233710 707342 1000776 326890 -661724 -1008113 -1287563 -2594131 -4170740
42644 -4170740 -3996624 -1793959 352688 754861 -83681 -937974 -1620042 -2457319 -3191916
42635 -3191916 -3300889 -2648026 -1218374 998079 3354018 4672661 4617900 4114724 3889650
42626 3889650 3532683 2605093 1623639 1105904 609389 -305944 -1070423 -1181422 -1424398
42617 -1424398 -2624020 -3798665 -3184154 -926126 814987 641754 -537648 -1092816 -580717
42608 -580717 466615 1597396 2502344 2748819 2268122 1680244 1429730 934309 -637615
42599 -637615 -2851045 -4061263 -3259665 -1342839 -115910 -306635 -1056400 -1273126 -840879
42590 -840879 -238881 403072 1198260 1775547 1495333 444146 -480740 -626747 -139001
42581 -139001 583848 1238935 1337989 548453 -371422 -79264 1290837 1704781 -139411
42572 -139411 -2728615 -3579997 -2466256 -1322041 -1358548 -1908212 -2112327 -2114931 -2154640 -1833768
42562 -1833768 -954439 -105102 167906 -17366 -479846 -1292648 -2033142 -1697748 -85283
42553 -85283 1520940 1834679 1113386 480330 295430 81505 -316533 -430725 33542 787546
42543 787546 1391125 1673410 1749421 1880615 2185494 2361489 2049199 1601191 1873019 2923669
42533 2923669 3681143 3509052 3317343 4129762 5149441 4598853 2380363 531642 665772
42524 665772 2098406 3163568 3454200 3763953 4283920 4037325 2360302 163717 -909980
42515 -909980 -383794 563088 610860 -204347 -927746 -1206460 -1538234 -2001746 -1774999 -509990
42505 -509990 651658 444596 -579341 -654185 673740 1787107 1143461 -798230 -2449114
42496 -2449114 -3151671 -3482357 -3849680 -3783482 -2838767 -1552184 -967851 -1319942 -1609944
42487 -1609944 -761430 942771 2017391 1549448 335097 -280677 -303785 -913542 -2422602
42478 -2422602 -3552589 -3266450 -2333196 -2127086 -2547684 -2362409 -1366723 -826523 -1442294
42469 -1442294 -2066176 -1271899 498762 1358687 408859 -1062951 -1074388 752383 2691688
42460 2691688 2696095 579735 -1696626 -2034933 -351775 1582970 2328674 2178275 2191117
42451 2191117 2528695 2411861 1402985 23022 -877780 -864019 -89089 798366 990443
42442 990443 259018 -691994 -1089916 -1141624 -1548412 -2129828 -1924732 -839064 -98253 -476371
42432 -476371 -1030152 -476913 881526 1675196 1457099 992189 686010 -33505 -1460431
42423 -1460431 -2781551 -3127909 -2776180 -2590116 -2648287 -2191773 -934576 196990 -24452
42414 -24452 -1681896 -3472653 -3906333 -2552270 -134509 2195001 3420815 2994135 1337916
42405 1337916 -90765 -61546 959679 1365194 602994 -129485 204661 944056 881723
42396 881723 36258 -699334 -907897 -622918 258546 1348107 1355881 -224541 -1717013
42387 -1717013 -1255326 400893 1015478 378057 213315 626626 -464753 -3473207 -5431654
42378 -5431654 -3776892 203909 3399670 4571900 4306041 3069606 1482004 1118687
42370 1118687 2692797 4373841 4099890 2635084 2000040 1793347 -51186 -3204674 -4750463
42361 -4750463 -3487622 -1612292 -1186136 -1425796 -820919 160328 141690 -854436 -1758652
42352 -1758652 -2127705 -2178770 -1981343 -1700503 -1858976 -2389075 -2233446 -851311 678088
42343 678088 1053904 507032 123484 112679 -109100 -614727 -884762 -735481 -354296 324640
42333 324640 1359336 2130824 1820409 454678 -1220997 -2682283 -3714901 -3891083 -2931232
42324 -2931232 -1522393 -814926 -942220 -865224 49173 1071663 1200175 594362 232814
42315 232814 435473 543681 182099 -4878 463036 572163 -1133317 -4112601 -5763974
42306 -5763974 -4499734 -1792867 -131702 96159 308035 1138038 1956701 2597703 3579538
42297 3579538 4546388 4423911 3405125 2834729 2729147 1593907 -567950 -1462887 -42610
42288 -42610 1425226 646430 -1266741 -1766643 -645986 504409 1291225 2413248 3471160
42279 3471160 3457040 2846409 2749434 2532583 901520 -1082591 -1032754 694435 1060155
42270 1060155 -934233 -2598889 -1748880 221808 1029422 849953 1017720 1267241 470669
42261 470669 -1056852 -1978372 -1922802 -1438212 -616265 745061 2091037 2556054 2180552
42252 2180552 1710713 1540666 1610687 1850369 2044646 1846996 1453363 1456280 1589043 819468
42242 819468 -664553 -1108331 61126 756893 -837828 -3240225 -3637233 -1905785 -370417
42233 -370417 -89066 180054 1263034 2111994 1643287 272906 -1043911 -1934763 -2248339
42224 -2248339 -1809548 -1019526 -636481 -652326 -427532 -9235 5288 5218 1111309 2970866
42214 2970866 3585511 2196390 702986 1009591 2337323 2595469 1343440 -170835 -1156307
42205 -1156307 -1833956 -2257513 -2148927 -1834647 -1963456 -2182698 -1340468 707159 2587018
42196 2587018 3179502 3029897 3377963 4347601 4764239 3587475 1077325 -1446513 -2769118
42187 -2769118 -2678604 -1830638 -895868 -59309 648339 923836 398145 -922352 -2626698
42178 -2626698 -4064499 -4403057 -3053690 -521878 1606330 2184197 1728723 1472220 1567591
42169 1567591 1228760 495187 551064 1876216 3216998 3157911 1861897 377493 -1013209
42160 -1013209 -2589269 -3857558 -3916521 -3205218 -3425888 -5133982 -6586800 -5921859 -3648095
42151 -3648095 -1838389 -1325586 -989895 171829 1516336 1798652 890185 -243573 -823757
42142 -823757 -876119 -805433 -923323 -1337283 -1848889 -1916778 -1070705 495114 1898795 2251422
42132 2251422 1385347 -6342 -926928 -923006 -454232 -280030 -468058 -313414 616032 1705981
42122 1705981 1906316 930327 -482306 -1387153 -1424367 -889594 -351139 -208380 -384952
42113 -384952 -410900 72041 920615 1688439 2095019 2174489 2085823 1912060 1569720 912985
42103 912985 100688 -282385 44599 271483 -728532 -2539854 -3101687 -1281188 1230350
42094 1230350 1778819 102008 -1507317 -1363772 -344988 -282568 -1588857 -3233472 -4242258
42085 -4242258 -4329323 -3511202 -1996042 -417252 444459 369132 -60393 -14532 737305 1481737
42075 1481737 1254654 69474 -887172 -668991 285941 1057855 1675077 2499714 2676558
42066 2676558 941812 -1886864 -3127632 -1693269 378625 918578 474981 676481 1305212
42057 1305212 1094886 386627 542555 1140603 286785 -2089433 -3649623 -3025452 -1622961
42048 -1622961 -1020711 -523376 1211470 3627099 5098557 5353165 5353492 5333778 4584957 2970845
42038 2970845 1190361 -478530 -2393359 -4334002 -5253655 -4649152 -3303523 -2248645
42030 -2248645 -1698099 -1411534 -1436575 -1872174 -2273165 -1954105 -920527 -111563 -514843
42021 -514843 -2106678 -3790578 -4413159 -3716741 -2226069 -539819 824215 1186598 205868
42012 205868 -1244595 -1650427 -765417 -54239 -587451 -1446312 -1200856 -89764 626234
42003 626234 819621 1307903 1799039 992879 -930989 -1798711 -271226 2309765 3902943
41994 3902943 4241508 4124356 3520541 2082608 795701 1206838 3049736 4231141 3483074
41985 3483074 1778640 716759 585311 588952 155340 -652420 -1490946 -1916898 -1572108
41976 -1572108 -695028 -191279 -709193 -1767764 -2262388 -1863890 -1462964 -1925832 -2717795
41967 -2717795 -2392463 -565361 1312743 1707570 892274 148112 -382774 -1547645 -3000120
41958 -3000120 -3104620 -1646470 -674327 -1391644 -2085330 -1023109 277704 -686658 -2966534
41949 -2966534 -3180038 -812572 784929 -600475 -3068751 -3963433 -3509222 -3242803 -3065647
41940 -3065647 -2156314 -1221386 -1455020 -2284512 -2340537 -1877305 -2120969 -2870935 -2920147 -2423067
41930 -2423067 -2613304 -3319551 -3013832 -1515872 -471303 -615241 -591550 619765 1834925
41921 1834925 1407890 -392305 -1935641 -2367511 -2166895 -2061932 -2202108 -2204361 -1632241
41912 -1632241 -636991 -113415 -719794 -1852246 -2325064 -1966007 -1623587 -1658047 -1545717
41903 -1545717 -1087686 -796068 -764156 -334314 652956 1377355 1322267 1022753 1033454 1177132
41893 1177132 1327319 1842301 2620399 2841502 2332067 2026763 2277112 1967695 424365
41884 424365 -981169 -596193 969949 1656700 861816 -43214 -63903 -8523 -1139717
41875 -1139717 -3315251 -5011463 -4885385 -3088884 -1082364 -78764 188589 722575 1536722
41866 1536722 1648806 855016 247719 506124 948540 974828 1125292 1769943 2112095 1749407
41856 1749407 1912284 3530595 5141127 4597418 2170258 83818 -537762 -400867 -125766
41847 -125766 384157 739576 202859 -764621 -840349 28498 503827 147150 135781 1229354
41837 1229354 2588267 3176035 2964425 2295119 1427382 1107458 2069895 3481002 3446606
41828 3446606 1672782 32245 -196357 62286 -270878 -574922 -54020 445055 -257431
41819 -257431 -1716542 -2774913 -3421112 -4151801 -4393433 -3339918 -1799628 -1437832 -2374857
41810 -2374857 -3067867 -2535481 -1364404 -451840 116960 800247 1978284 3485189 4188580
41801 4188580 2686168 -597991 -2784373 -1509000 1898001 3860395 3031166 1541858
41793 1541858 1606302 2764527 3256887 2550948 1381488 374679 -226377 -218500 128085
41784 128085 -155697 -1560296 -3099952 -3381339 -2347730 -1124177 -446929 -170850 -76048
41775 -76048 -16624 758478 3115068 6286406 7748669 5939016 2518354 739349 1746330
41766 1746330 3679731 4512025 4379991 4452113 4782049 4641457 4295687 4803721 6013719
41757 6013719 6265233 4686926 2696445 2387419 4123492 6550002 8460878 9682442
41749 9682442 10284457 9943019 8502598 6631566 5339880 4876786 4521299 3673564 2805104
41740 2805104 2775187 3317355 3066107 1443336 -343796 -888472 -374629 174159 626715
41731 626715 1331202 1603459 512744 -941537 -534468 1819956 3387063 2205656 -377157
41722 -377157 -1897039 -1890522 -1436111 -1022071 -568227 -502256 -1025088 -1041771 429747 2309307
41712 2309307 2616163 1224357 -196979 -752047 -1116458 -1771431 -2141136 -1862830 -1513572
41703 -1513572 -1523083 -1407189 -633950 460878 1060660 776407 19392 -329708 154979 714654
41693 714654 293710 -551319 182619 3080612 5973808 6751534 6112624 5737351 5125659
41684 5125659 2811446 -154014 -996060 531265 1645055 791687 -381446 -193425 602103
41675 602103 851587 1122859 2071813 2593875 1481674 -446651 -1569039 -1682083 -1514944
41666 -1514944 -1142277 -414411 -5780 -492416 -1107896 -801224 50382 137924 -1132425
41657 -1132425 -3325756 -5472859 -6123545 -4126159 -389089 2409973 3017979 3065876 4028423
41648 4028423 4577441 3049732 853482 536821 1465667 678171 -2130841 -3749836 -2209461
41639 -2209461 532559 1897460 2179786 2992814 4099536 3923547 2290580 735459 315386
41630 315386 565124 693308 724266 1112441 1875324 2569810 2935478 3150649 3283988 2842136
41620 2842136 1464099 -16635 -143727 1162771 2185569 1713193 765939 970662 2149695
41611 2149695 2913109 2878921 2650023 2159938 960999 -128808 216728 1352927 1123090
41602 1123090 -793665 -2200493 -1785881 -968429 -1191466 -1592908 -1077576 -736838 -1919996
41593 -1919996 -3327161 -2699851 -714288 -397448 -2537212 -4249539 -2997031 -12160
41585 -12160 1646783 1156160 522478 1630572 3974276 5433231 4624987 2272523 460986
41576 460986 610854 2202086 3596463 3919736 3695475 3716699 4023246 4315026 4708680
41567 4708680 5367421 5673717 4639712 2357278 393614 234504 1630039 2992321 3258373
41558 3258373 2738129 2129308 1524464 838746 492747 813106 1129276 505841 -608518
41549 -608518 -532175 1387026 3492651 3582192 1577838 -295277 32310 2330570 4470571
41540 4470571 4692378 3334861 2283522 2690187 3545468 3004190 969979 -529987 98502
41531 98502 1943618 2857843 2219301 1378017 1551992 2416003 3003294 2998440 2612021 1987692
41521 1987692 1454525 1716620 2840373 3465131 2213162 -127369 -1133511 58280 1327637
41512 1327637 333638 -2275801 -3864971 -3473595 -2673878 -2688286 -2623340 -1495510 -344089
41503 -344089 -710178 -1980490 -2065167 -391607 1494865 2366989 2670557 2961518 2562112
41494 2562112 862185 -1044574 -1349235 157209 1836230 2312167 1989606 2152187 3109279
41485 3109279 3804538 3215474 1672923 456238 258312 535357 454587 -49845 -483519
41476 -483519 -578108 -406335 -91644 90557 -307410 -1245182 -1866478 -1463020 -404129 554245
41466 554245 1367000 2192967 2361661 1186984 -453809 -884192 -38715 446603 -141395
41457 -141395 -504823 478917 2032757 2907427 3174020 3420145 3339407 2509516 1662331 1670903
41447 1670903 1897713 1080944 -537404 -1536136 -1612468 -1954391 -3113191 -4002747 -3615674
41438 -3615674 -2563198 -2097827 -2393732 -2639481 -2358831 -1818599 -1323793 -869550 -569346
41429 -569346 -757217 -1259186 -1016344 813243 3336720 4324697 2689103 -2296 -1304964
41420 -1304964 -821810 -291240 -870985 -1658536 -1341199 -127140 776570 766084 49258
41411 49258 -1110369 -2435087 -3297377 -3178481 -2322552 -1423907 -905055 -848994 -1187984 -1561829
41401 -1561829 -1531245 -1338343 -1782153 -2867060 -3406107 -2644609 -1435993 -973223 -1185851
41392 -1185851 -1363647 -1507856 -1842799 -1744741 -640073 496447 108512 -1612008 -2808568
41383 -2808568 -2434203 -1358939 -849319 -1087992 -1465330 -1450038 -973707 -570668 -980678
41374 -980678 -1965742 -2046455 -422152 1435842 1473265 -100829 -1220636 -934357 -226615
41365 -226615 43206 107565 -53977 -1115670 -2893889 -4138878 -4461172 -4828803 -5520263
41356 -5520263 -5372964 -3954809 -2681275 -2555508 -2421910 -913198 1235993 2345751 2081458
41347 2081458 1043706 -802883 -3500223 -5707551 -5830198 -4200173 -2586739 -1874625
41339 -1874625 -1685317 -1906708 -2934826 -4439025 -5365392 -5291798 -4633241 -3634211 -2432033
41330 -2432033 -1937686 -3079440 -4988912 -5446622 -3598246 -999018 466771 499380 -234831
41321 -234831 -1323945 -2428999 -2970113 -2949050 -3310772 -4583380 -5797394 -5664627 -4318639
41312 -4318639 -2965562 -2215005 -1752234 -1448852 -1735020 -2722265 -3778153 -4243161 -3998048
41303 -3998048 -3162964 -1858226 -513965 197157 115872 -244223 -696924 -1908791 -4204085
41294 -4204085 -6334606 -6492161 -4531871 -2237770 -1169653 -1099761 -918815 -257024 338291
41285 338291 192294 -1051795 -3164128 -5024754 -5319878 -4128499 -3004103 -2792804 -2415747
41276 -2415747 -898651 498124 -147388 -2403634 -3937251 -3689237 -2687435 -1783737 -697771
41267 -697771 333171 56479 -1768340 -3482670 -3569537 -2302667 -817217 11733 -638353
41258 -638353 -3008089 -5354359 -5096213 -2286669 133014 540620 609163 1640875 1846541
41249 1846541 -231771 -2238185 -1331053 933570 867866 -1454116 -2689548 -2028308 -2086399
41240 -2086399 -3665933 -4048975 -1927087 -112321 -1123829 -3181532 -3164474 -1222486 206908
41231 206908 279066 31085 -101515 -634249 -1442247 -1768043 -1513537 -1099414 -526720 145529
41221 145529 59437 -1295742 -2776274 -2885724 -1986170 -1795185 -2898106 -4063701 -3974555
41212 -3974555 -2536419 -484847 1364125 2435809 2693105 2626405 2551983 2236983 1583983
41203 1583983 1058759 893762 612853 25202 -186889 236173 220936 -993695 -2116114
41194 -2116114 -1261589 1309417 3489610 4122341 3907831 3575447 2880102 1820556 1316319
41185 1316319 1885881 2720235 2841558 2382254 1994421 1642465 778776 -599425 -1738324
41176 -1738324 -1938148 -1211226 -118630 853972 1643830 2286697 2428904 1635968 292140
41167 292140 -442399 3615 860394 1183128 1173481 1553561 2116804 1910520 698554 -646981
41157 -646981 -1197932 -769242 168150 766137 308057 -896480 -1563758 -1102039 -522801
41148 -522801 -655963 -355536 1830278 4796649 5841044 4455508 2903242 2598994 2314806
41139 2314806 1034186 248078 1543181 3607874 3889189 2298512 1103238 1570678 2727033
41130 2727033 3338756 3210553 2279037 233619 -2230435 -3194944 -1627733 1028707 2303626
41121 2303626 1413472 -108444 -308644 1186719 3077358 3917643 3464730 2498387 1660169
41112 1660169 994879 578269 768969 1407655 1514798 524026 -733224 -1108838 -721737
41103 -721737 -474618 -400791 237838 1290638 1523266 402999 -1086056 -1888192 -2123408
41094 -2123408 -2348423 -2521952 -2373310 -1984670 -1319326 32021 1850720 2819001 2042099
41085 2042099 457577 -327656 -157554 -163194 -810200 -1382111 -1383325 -1213561 -1210997 -1128922
41075 -1128922 -934580 -1117861 -1703529 -1867780 -1171377 -396322 -424107 -918370 -927825 -298275
41065 -298275 398365 1000714 1849889 2823412 3235494 2930165 2695405 3144511 3709406 3323330
41055 3323330 1916439 671167 631341 1441144 1908264 1731887 1995326 3498582 5202204
41046 5202204 5326115 3854037 2716449 3117447 3919604 3535127 2333762 1860507 2370956
41037 2370956 2728391 2505938 2523891 3062880 3105893 2023563 772327 566042 1294781
41028 1294781 2119476 2811837 3529466 3916689 3541244 2869557 2726532 2915246 2412436
41019 2412436 1055588 108767 742149 2531061 3906055 3802178 2546980 1299693 905166
41010 905166 1298998 1853242 2113129 2085761 1936221 1693753 1307021 745567 11594 -674114
41000 -674114 -720291 334737 2014254 3054346 2661816 1315357 116127 -292962 34811
40991 34811 723396 1322135 1495029 1276120 958012 709563 692029 1387218 2936261 4084899
40981 4084899 3019320 -142192 -2863231 -3171300 -2098495 -1845956 -2380009 -1662521 939515
40972 939515 3360362 3503463 1830799 444816 436295 1028538 992103 173030 -472512 -69349
40962 -69349 1190411 2422561 3241645 3977229 4599480 4348202 3020775 1729277 1434634
40953 1434634 1509481 930394 164844 336229 1003803 643274 -657950 -889547 1002077
40944 1002077 3545003 4741165 4255393 2908105 1350195 169035 140573 1260989 2283338
40935 2283338 2139831 1257399 833872 1455157 2868716 4256552 4324328 2293327 -563720
40926 -563720 -1681066 -369364 1140691 940030 199201 999253 2759926 3176437 2055255
40917 2055255 1627208 2891384 4061280 3461957 1986192 1429866 1877810 2253422 2489280
40908 2489280 3424261 4814843 5111493 3690002 2106138 2203781 3615388 4281869 3334291
40899 3334291 2179630 2237070 2843599 2584080 1810475 2108423 3497815 4059397 2749328
40890 2749328 891063 164859 663746 1796563 3502187 5344535 5914869 4736974 3598000
40881 3598000 4308105 6128999 7137515 7117638 7069192 6703434 4854289 2066500 380057
40872 380057 471100 1186233 1996560 3573117 5588979 6435529 5945523 6090209 7850236
40863 7850236 9535467 9595590 9101961 9698352 10765895 10648411 9480968 8685957 8414405
40854 8414405 7570570 6067210 5123056 5194759 5206338 4254801 2957937 2609973 3631818
40845 3631818 5176194 5959338 5432116 4251852 3382082 2798450 1804222 678751 788770
40836 788770 2456583 3964526 3728517 2434101 1780053 2003165 2094899 1760768 1531777
40827 1531777 1354666 755701 239135 834201 2154024 2532965 1453656 365885 543046
40818 543046 1406262 1668082 1088277 328092 -157929 -360706 -374402 -346781 -381745 -253140
40808 -253140 262764 657324 54293 -1423628 -2432634 -1969130 -504769 826668 1548160
40799 1548160 1934910 2366750 3017908 3769171 4177216 3982505 3707456 4080197 4845564
40790 4845564 5091219 4870159 5245350 6273479 6362279 4578587 2336151 1506432 1888158
40781 1888158 2075620 1973957 2528409 3337437 2674975 208830 -2169660 -2905644 -2565784
40772 -2565784 -2201024 -1470784 261247 2092107 2471063 1416732 390350 211001 463609
40763 463609 863942 1716800 2737279 2833947 1741591 737952 874913 1409216 1014922
40754 1014922 -146744 -775626 -451979 -12107 24741 90486 348559 84497 -1020700
40745 -1020700 -1985528 -1781332 -826790 -299369 -435729 -542743 -407803 -510910 -781805
40736 -781805 -395043 697484 1170771 266535 -441659 1315673 5105096 7474551 5805665
40727 5805665 1535323 -1559446 -1744673 -632365 -207775 -259882 432203 1802641 2889991
40718 2889991 3679284 4761168 5467027 4336689 1745493 92667 511551 1196456 327644
40709 327644 -958470 -391510 1811174 3399760 3598002 3736091 4338409 4024678 2076035
40700 2076035 -10646 -759254 -839370 -1500377 -2209686 -1586682 118141 1264443 1229634
40691 1229634 946437 1040677 972105 394851 21078 371014 612304 -353114 -2037995 -2571076
40681 -2571076 -912300 1723828 3080038 2316652 827112 497301 1616255 2965695
40673 2965695 3599840 3654557 3385084 2533396 1287367 924971 2356558 4421132 4868349
40664 4868349 3151285 1218861 1142950 2754229 4207392 4335956 3684322 3336250 3447414
40655 3447414 3287162 2399935 1198336 298295 -280838 -818607 -1083088 -545761 522111
40646 522111 962212 180972 -920229 -1048756 -100827 969102 1445671 1329990 875570
40637 875570 431827 497786 1108016 1367813 506917 -747591 -900779 195066 1112967
40628 1112967 972349 558479 769631 1113978 680886 -232030 -537975 52840 817008
40619 817008 1109781 873138 302248 -259642 -345683 6230 -18142 -809411 -1200765 322889
40609 322889 3276829 5206165 4431594 1854830 -377604 -1131377 -666151 375401 1487108
40600 1487108 2282202 2802409 3623881 4958970 5851972 5037423 2625453 288311 -383307
40591 -383307 709233 2389276 3313014 2854646 1526057 705935 1362488 2781614 3165096
40582 3165096 1851226 265447 64061 991812 1528831 1225465 1129567 1881657 2743597
40573 2743597 3048572 3415837 4569986 5821632 5930608 5008718 4298114 4228611 4012007
40564 4012007 3330587 3108011 3972477 4961608 4654865 3081056 1739328 1962550 3714992
40555 3714992 5705976 6361126 5120694 3120666 2079696 2240170 2208826 1247004 527703
40546 527703 1113863 1871301 1062513 -733788 -1355697 -501398 -185808 -1355749 -2306495
40537 -2306495 -1505206 47274 829881 1460790 3289897 5479589 5829813 4104286 2358611
40528 2358611 1939774 2127473 1972526 1519852 663196 -1284458 -3867354 -4962579 -3322563
40519 -3322563 -493169 1145713 1347624 1641367 2761578 4002365 4789371 5351450 5759689
40510 5759689 5601272 4908289 4414416 4558008 4988718 5276190 5378215 5215864 4520957
40501 4520957 3368898 2255114 1481783 1083306 1365126 2610121 4062674 4269758 2951425
40492 2951425 1569597 1361934 1755081 1640247 1321118 1885039 3187675 3974163 3891188
40483 3891188 3867723 4252698 4063876 2761405 1487883 1527695 2464856 3006517 2910935 2792113
40473 2792113 2537671 1532794 383683 655484 2373259 3411580 2370602 650367
40465 650367 250817 705143 193404 -956540 -384314 2380954 4574346 4006561 2250307
40456 2250307 2200917 3855744 4749123 3871697 2755086 2652117 2929453 2848584 2887355 3244381
40446 3244381 2790588 956946 -677215 -365477 1155829 1809841 1441156 1973396 4257185
40437 4257185 6607210 7095874 5901248 4560728 3947170 3897765 4092916 4309023 4152001
40428 4152001 3358456 2253116 1396238 941658 725225 688145 759842 654296 376177 692976
40418 692976 2383364 4994676 6986270 7314573 6437959 5556775 5251542 5150929 4667600
40409 4667600 3694684 2580370 1626715 776137 -93793 -617717 -69669 1606974 3188480
40400 3188480 3285450 2175690 1820963 3592187 6471411 8147454 7609771 5932863 4610743
40391 4610743 3997230 3632399 3258904 2866802 2242062 1232669 280632 41364 536456
40382 536456 1222429 1778204 2179527 2082932 1018735 -551983 -1203138 -114790 1848433
40373 1848433 3114721 2996564 1898447 583655 -95723 651019 2676924 4437740 4407879
40364 4407879 2933778 1815730 2064091 2974769 3460831 3261157 2594575 1684626 1078858
40355 1078858 1424241 2322167 2404085 1330537 707270 1896789 3767975 4088599 2685269
40346 2685269 1570867 1956005 2824607 2948603 2757063 3217935 4005379 4062389 3397059
40337 3397059 3049671 3405289 3622193 2934805 1747806 1091866 1428229 2254363 2642895
40328 2642895 2052108 831643 -6601 273110 1379743 2341454 2554075 2289111 2253161
40319 2253161 2903190 4092530 5060320 4873101 3347892 1590289 1154101 2490691 4568913
40310 4568913 6102328 6678783 6545627 5958042 5245801 5008760 5529602 6213570 6259241
40301 6259241 5740596 5374971 5349120 5165778 4670508 4328136 4238712 3847094 3184934 3466480
40291 3466480 5461854 7846185 8341908 6398129 3722826 2116546 1780009 1979888 2323815
40282 2323815 2743223 2971850 2841635 2710539 2920051 3091122 2593036 1562326 861153
40273 861153 1028443 1710916 2127379 1761533 685169 -440931 -769541 -26653 1203211
40264 1203211 2228680 3055729 4032528 4990922 5396536 5223522 4957166 4742012 4331935
40255 4331935 4020691 4698851 6477102 7964433 7637106 5615615 3559277 3015930 4195417
40246 4195417 5992404 6827235 5888254 4047076 3187388 4132054 5645579 6061390 5387084
40237 5387084 4934816 5245600 5537338 5248987 4976180 5389218 6034081 5867149 4636909
40228 4636909 3301201 3180889 4711198 6749097 7328114 5714102 3536595 3008372 4114353
40219 4114353 4783211 4071895 3661393 5274252 7903380 9067281 8108037 6696984 6302365
40210 6302365 6603054 6558335 5847084 4851298 4026032 3643491 3657803 3722798 3770939 4365639
40200 4365639 5845774 7428434 8019388 7622964 6920544 5805944 3812143 1949345 2313255
40191 2313255 5225677 8284162 9175161 8221478 7221413 6965622 7052550 7138569 7039500
40182 7039500 6289199 4837371 3633200 3411948 3507934 2986130 2247650 2212679 2597894
40173 2597894 2549225 2458124 3406432 5069152 5989380 5924580 6070271 6732503 6666783 5283288
40163 5283288 3755433 3152950 3041167 2822207 2984843 3961521 5055993 5647260 6268990
40154 6268990 7299666 7757497 6821513 5562934 5570747 6566325 7014945 6603464 6404359
40145 6404359 6806774 7021503 6777239 6898336 7714547 8209778 7453248 5983860 5104350
40136 5104350 5360414 6198234 6708074 6363580 5347082 4383034 4088754 4499830 5334271
40127 5334271 6322367 6927859 6389045 4843691 3879727 4830397 6759754 7368868 5877736
40118 5877736 3726229 2281174 1319264 365086 112798 1343571 3249595 4108525 3427543
40109 3427543 2506705 2861818 4678787 6854204 8143600 8178367 7530427 6875856 6289709
40100 6289709 5580462 4981314 4872706 4977822 4677759 4171441 4359081 5313250 5911990
40091 5911990 5531065 5069552 5437388 5904803 5131607 3341279 2208618 2658756 3868250
40082 3868250 4614802 4723447 4861133 5565301 6832712 8212004 9010213 8769480 7787341
40073 7787341 6853367 6255357 5395283 3740382 1902433 1247180 2352467 4284016 5677749
40064 5677749 6192024 6400720 6529882 6207035 5630152 5884510 7289621 8312523 7384703
40055 7384703 5294637 4266364 4796141 5101485 4024073 2706629 2537417 3041175 3122931
40046 3122931 3129262 4038410 5418552 5934112 5535574 5522758 6450452 7383270 7404059 6712006
40036 6712006 6037808 5910912 6522053 7333102 6928692 4485435 1453524 419155 1943026
40027 1943026 3814724 3973489 2927835 2527019 3466910 5048074 6580608 7830670 8430609
40018 8430609 7916886 6433898 4832683 4017159 4363210 5483559 6358465 6153780 5204756
40009 5204756 4686927 4991415 5067738 3916136 2156762 1409473 2456901 4631277 6705044
40000 6705044 7796384 7703724 6996986 6606634 6805112 6840041 6083783 5167225 5231029 6276428
39990 6276428 7093563 6833428 5911815 5249537 5292926 5993070 7155348 8460798 9513472
39981 9513472 10180760 10692196 11245267 11731716 12016683 12324470 13139780 14658692 16349497
39972 16349497 17247525 17007892 16603411 17418918 19467388 21155432 21244680 20342356 19715849
39963 19715849 19303788 18066470 15991366 14363182 13866164 13716758 13190802 12825602 13228917
39954 13228917 13600235 12627721 10509057 8983023 9265171 10687505 11559796 10910183 9254639
39945 9254639 7978436 8028785 9016652 9651042 9149094 7901609 6552284 5042260 3241370
39936 3241370 1994496 2387759 4012326 5195637 5345379 5834730 7689164 9465669 8922892
39927 8922892 6396462 4819167 5996860 8277056 8826454 7239091 5646629 5705211 6838079
39918 6838079 7622730 7750780 7953689 8640852 9357682 9405483 8522074 7062212 5824759
39909 5824759 5523032 6082665 6611722 6379814 5627154 5040227 4721468 4309880 3976405
39900 3976405 4427620 5664634 6545639 6167321 5102637 4527148 4526296 4210762 3378782 2945156
39890 2945156 3372359 3706569 2988849 1937980 2117921 3624392 4751533 4260307 3038114
39881 3038114 2867108 4157441 5701252 6399142 6372397 6247015 6076214 5497079 4656498
39872 4656498 4366140 5129233 6333054 6835625 6377107 5950161 6445000 7330111 7319257
39863 7319257 6161533 4911590 4318011 3935288 3320298 3126090 4079668 5566906 6369041
39854 6369041 6408753 6574604 7039998 7093263 6692480 6790545 7722221 8570857 8749201 8952578
39844 8952578 9652830 9816261 8414910 6428050 5837362 6908730 7897320 7565935 6752331
39835 6752331 6983416 8432416 9874659 10213834 9543899 8854829 8943883 9570642 9707027
39826 9707027 8782476 7554987 7409768 8785465 10602775 11377780 10767530 9884324 9983070
39817 9983070 10854470 10931184 9402158 7713044 7926677 9768956 10802651 9926391 8932625
39808 8932625 9395702 9695787 7303078 3152912 1159051 3185272 6762597 8549053
39800 8549053 8131320 7242417 6820403 6533012 6398926 7129138 8792630 10292562 10544314
39791 10544314 9639497 8566285 8012080 7698726 7021264 6195082 6190593 7202978 7913278
39782 7913278 7142002 5701862 5411292 6570410 7832696 8498717 9260820 10342699 10646349
39773 10646349 9573667 8256619 8024083 8853023 10168787 11808456 13178781 12946804
39765 12946804 10972111 9254258 9379226 10203516 9858148 8949036 9569753 11800754 13532226
39756 13532226 13585531 12805525 12008290 11043259 10237436 10628652 12042945 12779089 12039679
39747 12039679 11055759 10968816 11214771 11007353 10840832 11211828 11194137 9851504 8146616
39738 8146616 7843004 9013531 10081472 10073699 9519049 9154342 8957064 8779766 9080444
39729 9080444 10446710 12618765 14347856 14456654 13165409 12088877 12479198 13735440
39721 13735440 14325955 13866767 13212931 12681449 11708818 10520508 10400056 11512691 12163506
39712 12163506 11475543 11242030 13339968 16445045 17439431 15584605 13257114 12615898 13395090
39703 13395090 14189807 14226740 13416779 12103777 11325649 12127152 14065451 15445677 15529586
39694 15529586 15472468 16517302 18267586 19459691 19624550 19205866 18600308 17787686 16608259
39685 16608259 15031615 13510595 13171894 14922582 18042652 20412469 20616510 19229049
39677 19229049 17670080 16564331 15781560 15371178 15676716 16845732 18671363 20560674
39669 20560674 21522367 20972513 19857819 19977196 21648615 23171797 23372980 23334195 24272730
39660 24272730 24998936 23538070 20607551 19096239 19998524 21188830 20937744 20494558 21809414
39651 21809414 24308330 25694188 25064659 23560078 22367706 21646426 21342507 21679324 22584632
39642 22584632 23622069 24697987 26002931 27142132 27252496 26268753 25244893 25052842
39634 25052842 25499010 26105718 26967026 28216438 29283692 29446947 28797877 28044954 27637718
39625 27637718 27624867 28045154 28830165 29586467 30111469 30836006 32014080 32801983 32218534
39616 32218534 30992941 31209116 33662009 36657207 38198368 38492747 39274447 41237647
39608 41237647 43375763 44709497 45392035 45747058 45297434 43613870 41611746 40984797 42171208
39599 42171208 43551858 43202355 41241506 39852835 40772743 43232056 44919294 44786814
39591 44786814 44223334 45311869 48513076 52358709 54944346 55392191 54335489 53426108
39583 53426108 53990697 55741551 57195828 57711266 58388540 60221569 62130290 62175048 60465581
39574 60465581 59355654 60490869 63070856 65636774 68191511 71362502 74425537 75795577
39566 75795577 75393169 75162280 76813489 79921370 82754190 84360055 85227530 86262093
39558 86262093 87830464 89831380 92109773 94490648 96742402 98893785 101422511 104719567
39550 104719567 108423084 111715742 114295636 116595992 119061496 121885251 125555167 130642000
39542 130642000 136463283 140990737 143195882 144791297 148318304 153958624 159769181 164861872
39534 164861872 170478647 177499435 184700513 190544644 195419361 200903215 207659530 215123996
39526 215123996 222579181 229517714 235545791 240973488 247100112 255022845 264488507 274547924
39518 274547924 284718545 294747671 304034446 312394513 320790783 330131377 339833394 348743233
39510 348743233 356941924 365309440 373814437 381816126 389703289 398368795 407027583 413514429
39502 413514429 417253571 420177881 423957219 427926666 430722806 432455075 433912374 434755714
39494 434755714 434044688 431919655 429284169 426070159 421149260 414088681 405997547 398297171
39486 398297171 391220457 383836289 375336382 366115346 357445027 349862683 342075290 332115228
39478 332115228 319705155 306778134 295366752 285684785 276683187 267682333 258713931
39471 258713931 249821837 240923489 232217777 224104619 216734617 209952808 203485023 196950910
39463 196950910 190061359 183082361 176679710 171003272 165402425 159386496 153355836 148002525
39455 148002525 143492378 139580493 135924746 131894473 126803439 120918265 115574486 111645001
39447 111645001 108500689 105125204 101570314 98505152 95934369 93288016 90391535 87544732
39439 87544732 84956800 82687150 80658512 78250404 74726536 70760081 68433850 68576333
39431 68576333 69123538 67637342 64640576 62687658 62660874 62949993 62160085 60646839 59108120
39422 59108120 57466765 55704363 54314004 53321969 52074980 50450263 49095018 48093706
39414 48093706 46653998 44559515 42698609 41659344 41008484 40496259 40768879 42208982
39406 42208982 44047259 45177185 45004561 43292680 40350545 37626690 36719610 37360971
39398 37360971 37746379 37199445 36831226 37068507 36572558 34689503 33083374 33473039 35236677
39389 35236677 36637045 36981803 36252309 34262156 31823605 31071782 32612768 33813488
39381 33813488 32166413 29087169 27914077 29163164 30427518 30288542 29569519 29056902
39373 29056902 28704055 28994446 30407139 31468567 30097531 27218222 26244464 28290015
39365 28290015 30562696 30447132 28611077 26894377 25636270 24647354 24572064 25424479 25593131
39356 25593131 24190751 22873805 23467625 25114130 25680591 24920274 24347135 24776791 25726879
39347 25726879 26617963 27036389 26439663 25012147 24113526 24500185 24916932 23951065 22402034
39338 22402034 22010664 22500742 21887926 19511354 16935321 15823328 16451530 18287182 20538110
39329 20538110 22093486 22307914 21924600 22076557 22586952 22536053 22125470 22342901 22981400
39320 22981400 22810775 21775554 21181673 21441643 21479523 20826955 20471193 20945622 21350060
39311 21350060 21148697 21256346 22233537 22934711 22263915 20974474 20289521 19827798 18490568
39302 18490568 16637970 15733791 16188408 17016062 17483917 17785300 18034868 17763437 16720777
39293 16720777 15428785 14677511 14882667 15886527 16936948 17021355 15774838 13988786 12777157
39284 12777157 12402330 12413848 12739827 13922454 16090961 18196088 18738221 17386162 15677661
39275 15677661 15588074 17086053 17734686 15592152 12036108 10318396 11389452 12910725
39267 12910725 12889791 12312305 12870135 13839723 13297517 11441801 10417120 11095136 12115859
39258 12115859 12291457 12102959 12319760 12665337 12509619 11784406 10778996 10019232 10470333
39249 10470333 12525630 14560763 14122540 11210005 8782719 9026081 10586186 10789448
39241 10789448 9286878 7867455 7621952 8137185 8986467 10141610 10988690 10678375 9695651
39232 9695651 9569337 10652242 11591396 11484866 11140864 11397269 11486182 10259749 8191422
39223 8191422 6870758 6918039 7529873 7878814 7905549 7735367 7261733 6520918 5828313 5390419
39213 5390419 5250714 5537851 6171701 6482676 5931476 5128639 5155009 5817786 5788296 4816486
39203 4816486 4445752 5720830 7465684 8056219 7814016 8031133 8400504 7414967 5113285
39194 5113285 3346686 2980199 2798028 1923750 1454997 2472290 3959261 4237872 3381452
39185 3381452 2641242 2345436 2036000 2044165 3077113 4463196 4609756 3336446 2149652
39176 2149652 1901444 1661525 393069 -1542665 -3087414 -3570431 -2670473 -509512 1710104
39167 1710104 2466691 2020860 2431935 4531467 6219438 5168727 2209595 350339 971043
39158 971043 2664841 3661196 3701990 3265970 2486936 1576101 1249368 1858275 2683001 2812222
39148 2812222 2346760 2091254 2285118 2292769 1612992 697438 450555 1091033 1870121 2019126
39138 2019126 1663506 1477796 1663844 1818701 1788629 1970690 2510101 2839084 2488289 1873922
39128 1873922 1729136 2085541 2327835 1987560 1053956 -157986 -992844 -732723 530548
39119 530548 1698030 1979108 1986119 2743780 4012992 4599847 4135573 3461995 3207876 3054429
39109 3054429 2685068 2505613 2945210 3713384 4175982 3981546 3087435 1738829 657130
39100 657130 639418 1646824 2771383 3320664 3420521 3404068 3284288 3137495 3373947 4199462
39090 4199462 5232349 5945058 6126368 5839100 5426834 5504926 6190689 6404846 5004953
39081 5004953 2741720 1783881 2840567 4128031 3941514 2808977 1960223 1135284 -301222
39072 -301222 -1118702 618064 4323145 6929698 6564361 4536742 3147262 3015671 3359625
39063 3359625 3656596 3953711 4225812 4321636 4193693 3711142 2759213 1917233 2318183 4182697
39053 4182697 6069250 6363168 5198400 4209226 4567531 5886901 6952267 6919750 5756368
39044 5756368 4044726 2616832 2087506 2405836 2830232 2537732 1449644 404752 246100
39035 246100 728053 785306 80693 -338098 533871 2158925 3230075 3514528 3845222
39026 3845222 4495561 4845665 4759657 4945583 5525827 5523093 4421803 3090671 2369467 1822117
39016 1822117 796562 -350596 -1168362 -2169641 -3591312 -4063776 -2303760 426027
39008 426027 1515193 567364 -154989 927100 2814230 3946607 4282459 4350557 3811827
38999 3811827 2383297 1118086 1247409 2348230 3020831 2988591 3200700 4012068 4534992
38990 4534992 3951458 2477118 815453 -511015 -1065154 -520351 842238 2200889 3072872
38981 3072872 3727265 4541142 5399148 5958682 6096556 5834116 5164090 4208896 3271654
38972 3271654 2497817 1713289 781309 -100856 -627819 -716775 -498033 -182814 -24684 -170884
38962 -170884 -458501 -586252 -519166 -428507 -251194 222754 758529 804621 519224 1013278
38952 1013278 2947661 5314118 6358602 5568357 4094361 3280140 3417888 3972580 4361074
38943 4361074 4296916 3877870 3580971 3812888 4341716 4569617 4431024 4489708 5002455 5515569
38933 5515569 5693257 5883822 6339455 6448536 5475915 3733774 2263371 1508155 1017591
38924 1017591 414761 -67364 -138168 60340 207334 112826 -304805 -871772 -935165 107667
38914 107667 1834040 2903869 2466059 1028625 -323834 -1051805 -1135313 -523792 684655
38905 684655 1774838 1856889 881032 -212727 -477218 134487 857942 920974 242816 -575151
38895 -575151 -966026 -1013365 -1110798 -1131815 -504510 750036 1705516 1648243 937670 277773
38885 277773 -234753 -627188 -237947 1524755 3853153 5110066 4815693 4067981 3806842
38876 3806842 3694836 3139672 2465317 2352558 2733620 2947919 2642217 2016719 1534238
38867 1534238 1762118 2976578 4414783 4506618 2630918 263625 -499762 581885 1758218
38858 1758218 1641395 807275 711156 1717416 2823804 3061028 2586949 2313324 2782156
38849 2782156 3671555 4386598 4858250 5446343 6104509 6115319 4982213 3344660 2595643
38840 2595643 3536957 5545772 7039658 6783928 5023502 3430707 3570372 5184080 6347152
38831 6347152 5582708 3386443 1331388 278919 120022 665811 1682069 2243646 1319970
38822 1319970 -675117 -1926016 -1335365 151697 887129 508963 -64249 -76421 424782
38813 424782 1106189 1745239 2159326 2319055 2516074 2955187 3265138 2945204 2278541 2213989
38803 2213989 3170949 4429184 4951762 4490450 3675010 3313209 3817645 5016302 6211204
38794 6211204 6612569 6036663 5095914 4482674 4225838 3941666 3610586 3592157 3882476 3958260
38784 3958260 3599161 3311530 3492553 3646886 3094393 2165629 1885151 2519218 3283760
38775 3283760 3613947 3796513 3975213 3512129 2108562 809939 900725 2235483 3634113
38766 3634113 4567283 5348474 5895483 5644454 4846228 4620605 5220295 5416343 4360063
38757 4360063 3050059 2934651 3740665 3835665 2481516 712477 -38884 593623 1925982
38748 1925982 3080970 3595682 3521091 3154327 2708272 2367976 2558409 3594825 4855344
38739 4855344 4943604 3199444 615045 -1231002 -1692239 -1052535 286879 1774848 2417857
38730 2417857 1619414 134755 -742561 -766921 -598976 -391970 233989 900161 635180
38721 635180 -322851 -320313 1387981 3300231 3600408 2503341 1603768 1558740 1587870 985102
38711 985102 85180 -280044 387498 1886058 3267178 3413670 2236701 986085 751528
38702 751528 1088084 982892 738940 1585637 3393446 4222112 2795325 315774 -1137047
38693 -1137047 -1235477 -1255985 -1726495 -1655268 -379704 1079827 1391749 888713 1044265 2225629
38683 2225629 3164170 2870115 1921504 1241052 665495 -199464 -543990 670513 2595019
38674 2595019 3070197 1563241 -133704 -726758 -1191227 -2554610 -3529680 -2239326 673816
38665 673816 2787120 3343608 3761691 4603218 4319716 1895452 -1125264 -2559885 -2228258
38656 -2228258 -1335186 -288061 1307948 3113055 4124801 4159389 3961165 3850646 3433183
38647 3433183 2680941 2084747 1507023 129866 -1913485 -2990474 -1967813 -10013 675783
38638 675783 -445948 -1779279 -1796319 -743177 145220 372092 480408 914332 1232044
38629 1232044 642845 -961816 -2765188 -3750337 -3480520 -2183101 -390635 1210116 1790417
38620 1790417 867128 -922410 -1971509 -1210438 623537 1742984 1342153 269490 -466461
38611 -466461 -1022678 -1892262 -2462299 -1653808 67974 706530 -634054 -2248316 -2001030
38602 -2001030 -228368 882781 454504 -153773 174250 523642 -384899 -1908506 -2256658
38593 -2256658 -1027123 406140 917733 721698 230373 -853175 -2538937 -3583147 -2649766
38584 -2649766 -190608 1788111 1988950 1216018 1218296 2554091 4024298 4143822 2803598
38575 2803598 1244087 508712 312964 -326637 -1651407 -2871770 -3302347 -3201361 -3197389
38566 -3197389 -3334186 -3143313 -2433245 -1543601 -863452 -429522 -5812 607144 1239502
38557 1239502 1253888 149966 -1486738 -2178887 -1298460 -166340 -521488 -2100713 -2825402
38548 -2825402 -1534570 563688 1612777 1275022 484984 -93825 -406242 -372108 32998
38539 32998 309880 -37823 -654237 -837460 -743316 -1174939 -2194104 -2878146 -2627724 -1902317
38529 -1902317 -1432624 -1427672 -1780856 -2351757 -2787081 -2708485 -2289989 -2013315 -1764657 -1018259
38519 -1018259 -69548 -17880 -1077499 -1953619 -1558925 -411630 407785 743220 927198
38510 927198 817768 406872 575735 1903520 3308019 3303020 2220321 1688515 2122708
38501 2122708 2343467 1758652 1279103 1605930 2032221 1648750 665043 -132679 -364742
38492 -364742 17945 894671 1537673 923128 -914341 -2638566 -3269329 -3262607 -3423038 -3707393
38482 -3707393 -3798669 -3873424 -3883082 -2981043 -806181 1338937 1840248 927967 311298 840456
38472 840456 1610293 1410108 192756 -1028832 -1221190 -330762 423436 -286421 -1981529
38463 -1981529 -2427018 -512109 1743401 1500854 -1042918 -2835266 -2031200 -117023 547986
38454 547986 -301319 -1307780 -1676885 -1586979 -1130216 -195025 754126 873539 97983 -604911
38444 -604911 -380217 542387 1206119 947588 -122060 -1420055 -2370993 -2566467 -1763745
38435 -1763745 -131254 1464572 1896580 925191 -297767 -327317 1020161 2578851 3238704
38426 3238704 3019645 2692592 2692868 2599201 1640545 -233952 -1844709 -1763210 -1122 1810099
38416 1810099 2317007 1908493 1682527 1690403 1283446 698296 884039 1814533 2397915 2303407
38406 2303407 2480225 3365038 3947987 3435114 2610251 2453943 2431025 1513733 219921
38397 219921 76116 1254375 2248181 2107438 1642859 1835009 2184783 1639479 507000
38388 507000 240966 1338981 2528830 2507312 1650333 1117694 776109 -637999 -3095348
38379 -3095348 -4455304 -3098829 -426299 701798 -393975 -1661872 -1406721 -295622
38371 -295622 282870 403626 1032667 2149568 2691809 2120904 1103743 591799 774385
38362 774385 1031019 699074 -110104 -535168 -53070 714953 895612 789406 1377103 2438199
38352 2438199 2493012 1016440 -630022 -1186732 -1134861 -1371632 -1457143 -523380 933323
38343 933323 1616051 1248177 501706 -418815 -1701280 -2709621 -2323991 -633967 820715
38334 820715 678067 -1108240 -3551571 -5203189 -4816731 -2560431 -329947 273150 -7403
38325 -7403 672844 2265382 2733273 1065629 -1284149 -2477275 -2352117 -1741467 -1026179
38316 -1026179 -226665 454255 1010548 1792571 2638139 2631940 1384554 -205572 -1128095
38307 -1128095 -1478098 -1843049 -2221365 -2340607 -2438250 -2893409 -3526488 -3993346 -4406838 -4769709
38297 -4769709 -4227146 -1923759 1396751 3531823 2929989 294432 -2147950 -2790231 -1917032
38288 -1917032 -974703 -903495 -1523587 -2423703 -3628898 -4855037 -4879571 -2819973 181237
38279 181237 1769473 1047253 -584607 -1438675 -1309169 -886311 -537260 -342359 -495265
38270 -495265 -943014 -1186346 -928588 -367320 441644 1706161 3017457 3310842 2328844
38261 2328844 1278997 1330586 2179699 2772374 2723984 2309083 1714819 1028463 402223 -334636
38251 -334636 -1575372 -2993455 -3589968 -3212584 -2918228 -3091020 -2524055 -557083 1129898
38242 1129898 517863 -1773960 -3270580 -2942546 -2002520 -1609399 -1501830 -1110836 -585802
38233 -585802 -289565 -265938 -488147 -883877 -1081068 -858926 -717244 -1214050 -1952557 -2041175
38223 -2041175 -1274262 -59914 1318014 2393288 2163969 411853 -1176457 -807430 861677
38214 861677 1678485 1232907 1136190 2010440 2391715 1276147 -149260 -240390 1137311
38205 1137311 3144600 4984339 5631745 4186899 1551099 259091 1419220 3138758
38197 3138758 3243603 2199652 1777258 2043696 1664536 497964 -197486 -45197 -180859
38188 -180859 -1277608 -2450079 -2711616 -2389480 -2351096 -2552089 -2154003 -841939 599597
38179 599597 1163275 792681 391173 654657 1292919 1717547 2037766 2663939 3247170 3047044
38169 3047044 2309879 2087750 2457234 2211520 874350 -255975 56323 1192855 1753088
38160 1753088 1500149 1137566 974862 1048935 1878096 3707953 5448011 5756956 4960702
38151 4960702 4556489 4924815 4910835 3809685 2467136 2002942 2454108 3135015 3553130
38142 3553130 3565045 3279252 3144225 3561341 4152641 4012292 2988248 2135076 2467796
38133 2467796 3668296 4458732 4022778 2674110 1221552 69393 -837817 -1336781 -801680
38124 -801680 1008211 3097291 3915441 3031496 1589985 1002664 1800931 3777314 6205886
38115 6205886 7557175 6246504 2618897 -718724 -1610895 -680110 93746 250945 830667
38106 830667 2038164 2714496 2218667 1350113 1045835 1292710 1650099 1876338 1766881
38097 1766881 1264005 956441 1616918 3024916 4036516 3981745 3230146 2310177 1332702
38088 1332702 400010 -274126 -781828 -1262766 -1249052 -222668 1183212 1667450 1102295
38079 1102295 757994 1428683 2450731 2909032 2700782 2023470 962785 82701 277564
38070 277564 1395501 2032988 1382855 372929 299372 1169426 2034397 2191111 1516295
38061 1516295 392819 -277460 135468 890157 666331 -296866 -356124 749606 1094070
38052 1094070 -451444 -2269746 -2505204 -1813356 -1712929 -1674337 -232078 1914510 2463097
38043 2463097 897262 -981939 -1903826 -2356077 -2773390 -2592825 -1647421 -703230 16121
38034 16121 1237658 2931438 3744605 2957239 1665139 1148973 1238574 1176065 1012875 1122198
38024 1122198 1138396 419272 -882270 -1947266 -2160894 -1460649 -292439 532883 554760
38015 554760 376799 876676 1669132 1502280 350039 -369084 -154524 -312419 -1511544
38006 -1511544 -2177195 -910583 886177 839335 -775273 -1401185 98911 2155311 2984150
37997 2984150 2503569 1434431 206097 -669367 -604212 17503 41465 -657008 -897256
37988 -897256 -323972 -270135 -1454196 -2286750 -1003066 1569586 3098017 2918340 2306887
37979 2306887 1930563 1024221 -648614 -1851608 -1633725 -654981 61561 546456 1162360
37970 1162360 1509493 1156157 712884 1015851 1709562 1730924 879826 -115845 -827609 -1378952
37960 -1378952 -1691852 -1594704 -1571844 -2232590 -3042158 -2861046 -1884802 -1597578 -2349128 -2519562
37950 -2519562 -1005245 851598 1133346 108965 -411071 187578 888223 1062494 1228848
37941 1228848 1632447 1622701 1005678 775934 1692599 2938714 3014904 1550943 -340692
37932 -340692 -1206005 -363625 1741407 3830826 4612332 3685089 1740638 -56039 -840474
37923 -840474 -566331 -103625 -448076 -1376385 -1449021 -80202 1161003 624644 -696738
37914 -696738 -476782 1065460 1055949 -1561703 -3977277 -3542596 -1652530 -1282583 -2316485
37905 -2316485 -2249669 -697755 4408 -1199574 -2513999 -2508186 -2212346 -2696097 -2934716
37896 -2934716 -1924435 -1040204 -2041457 -3936015 -4184457 -2442182 -828742 -580972 -648283
37887 -648283 -67927 249813 -823346 -2538160 -3104823 -1974503 -237706 916566 1253653
37878 1253653 1131850 889304 784388 1026567 1498306 1623140 870950 -519426 -1609249
37869 -1609249 -1827041 -1734001 -2223231 -3094548 -3239554 -2411636 -1792725 -2178650 -2619341 -1960906
37859 -1960906 -915996 -1063382 -2197898 -2466955 -1239571 2122 201244 368387 1608932
37850 1608932 3030255 3119164 2137442 1460033 1196724 303691 -1103254 -1359430 402984
37841 402984 2906699 4363521 4433866 3868855 3019410 1605695 -334343 -2028747 -2645255
37832 -2645255 -2122956 -1234627 -829487 -1025380 -1259383 -1112791 -746591 -410778 -15846
37823 -15846 495542 854008 945559 1029223 985410 63850 -1850028 -3416817 -3322532 -2041514
37813 -2041514 -1031922 -737283 -708598 -1177476 -2779190 -4836282 -5698194 -4980046 -3819387
37804 -3819387 -2734340 -1087343 911919 1709586 770908 -434239 -858898 -1467014 -3115823
37795 -3115823 -4644234 -4710271 -3998471 -3794364 -3706564 -2760400 -1583645 -1369356 -1590656
37786 -1590656 -981274 -72117 -387549 -1559174 -1694743 -533038 160698 -477107 -1384119
37777 -1384119 -1846769 -2531726 -3571822 -3740052 -2527857 -1313852 -1422934 -2418142 -3186715
37768 -3186715 -3409860 -3192767 -2551582 -2011746 -2427800 -3516080 -3875079 -3090005 -2375682
37759 -2375682 -2477256 -2572432 -2105368 -1926847 -2400378 -2080298 137789 2861768 3787419
37750 3787419 2438292 51587 -2057548 -2700654 -897481 2408895 4004401 1927439
37742 1927439 -1544931 -2594377 -828263 752749 281880 -1015094 -1497230 -1324305 -1277861
37733 -1277861 -1223329 -680515 244184 1128040 1609694 1337382 417944 -220201 34929 304099
37723 304099 -520328 -1787492 -2060843 -1713012 -2411741 -4007013 -4351102 -2794066 -1452778
37714 -1452778 -1905508 -2822497 -2397781 -1251922 -1062113 -1744530 -2029895 -1906519 -2469243
37705 -2469243 -3770122 -4596804 -4299021 -3455897 -2792526 -2579757 -2995402 -4023151 -5065721
37696 -5065721 -5533560 -5635844 -5808648 -5789523 -5265002 -4986908 -5924828 -7451274 -7766792
37687 -7766792 -6368157 -4878184 -4933764 -6166505 -6852918 -5973127 -4140486 -2839762 -3017664
37678 -3017664 -4184826 -4886254 -4330849 -3334836 -3183068 -3915324 -4538507 -4658951 -4797765
37669 -4797765 -5072454 -4809585 -3851892 -3077735 -2959927 -2659203 -1459785 -226984 -270491
37660 -270491 -1313124 -1851634 -1296262 -502395 -188985 -106401 -49159 -435790 -1252492 -1500066
37650 -1500066 -587787 561633 843154 713743 1301764 2192380 1710599 -431485 -2348934
37641 -2348934 -2522808 -1816778 -1950503 -2961448 -3425906 -2579466 -943110 782132 2143566
37632 2143566 2449784 1248007 -576567 -1475402 -1315031 -1503738 -2570374 -3022086 -1605082
37623 -1605082 445529 829689 -720075 -2194048 -2030860 -791707 85969 63414 -510489
37614 -510489 -1364862 -2500337 -3742606 -4717749 -5217751 -5218658 -4618759 -3382941 -2025741
37605 -2025741 -1516572 -2315537 -3661814 -4273663 -3793414 -3060865 -2789089 -2602370 -1927310
37596 -1927310 -1284940 -1757990 -3311549 -4588970 -4496461 -3170174 -1287042 561700 1519739
37587 1519739 703716 -1410730 -2793917 -2063244 -197193 956776 1189655 1645558 2526337
37578 2526337 2737159 1912515 1195519 1399227 1682604 931146 -513658 -1523249 -1891258
37569 -1891258 -2223857 -2471991 -1811532 -125679 1429873 1814252 1349009 1011627 988406
37560 988406 646357 -266923 -1153821 -1402794 -1079057 -539838 86999 660312 777122 360368
37550 360368 137440 782774 1712269 1536173 -160189 -2177583 -3067423 -2551814 -1384910
37541 -1384910 -439296 -231259 -733436 -1272505 -1152228 -687703 -939502 -2033549 -2627212
37532 -2627212 -1763845 -393565 32182 -174306 527616 2324623 3470733 2579895 307098
37523 307098 -1742496 -2784740 -2902572 -2177237 -717198 782702 1359371 759928 -297979
37514 -297979 -888189 -660370 107230 970296 1692089 2220197 2470650 2328621 1848324 1203482
37504 1203482 404131 -583912 -1357083 -1298454 -666812 -844905 -2751333 -5347403 -6556180
37495 -6556180 -5538297 -3283029 -1070644 685923 1926980 2282965 1527403 179968
37487 179968 -864085 -1110163 -671033 40087 685599 1261557 1928624 2405400 1938411
37478 1938411 430172 -868326 -743867 195004 354784 -287845 -9995 1867338 3639634
37469 3639634 3655223 2689389 2453506 2764398 1991966 -102996 -1813852 -1912111 -1026288
37460 -1026288 -120731 969413 2583853 3882088 3689004 2290570 1241881 1331821 1658360
37451 1658360 1082254 -111909 -700464 -378574 -288162 -1426177 -3186851 -4147174 -3992370
37442 -3992370 -3800763 -4300878 -4711762 -3906934 -2204819 -1205028 -1921695 -3718793 -5199974
37433 -5199974 -5618318 -5146811 -4204168 -3065190 -2097261 -1823035 -2332645 -2852215 -2475062
37424 -2475062 -1436630 -1042565 -1870319 -2601591 -1520171 1030603 2763287 2286228 826376
37415 826376 453155 1362029 1935315 1173896 -64683 -488062 -128887 -16111 -499841
37406 -499841 -745674 -96329 727460 496836 -638520 -1063591 107553 1572387 1432295
37397 1432295 -257504 -1635410 -1604273 -1104085 -1627921 -3526756 -6136000 -8557262 -9813382
37388 -9813382 -9241634 -7455881 -6088447 -5872779 -5837572 -5131711 -4525539 -4874646 -5099777
37379 -5099777 -3473092 -486779 1475306 1473915 1223693 2343553 3944371 4037901 2339509
37370 2339509 468631 -149581 467393 1513443 2376260 2827553 2814899 2328372 1317028
37361 1317028 -243612 -2036076 -3306531 -3451433 -2762639 -2284168 -2687284 -3421153 -3321227
37352 -3321227 -2132299 -1005032 -1073456 -1862690 -1856457 -640663 442408 195343 -752933
37343 -752933 -986391 -422709 -315116 -1286265 -2388555 -2349626 -1028489 671462 1826733
37334 1826733 2101994 1637714 670759 -638330 -1957128 -2576627 -2020316 -949308 -675682
37325 -675682 -1364983 -1603165 -469888 900427 962782 160329 159271 1155662 1672436 965196
37315 965196 -104713 -780906 -1246516 -1340318 -270184 1575835 2234116 755222 -1188324
37306 -1188324 -1548060 -542765 318580 735238 1445425 2274656 2151082 909927 -374677
37297 -374677 -883262 -763092 -420558 -96854 -7487 -8313 548752 1657738 1913058 295024
37287 295024 -1728875 -1638396 604558 2306193 1768664 464203 549093 1727254 1975643
37278 1975643 511858 -1339428 -1913200 -810154 1126307 2691301 3209598 2991146 2859941
37269 2859941 3166400 3633877 4110600 4651024 4723075 3489297 1442215 557720 1807505
37260 1807505 3530357 3590439 2373450 2048578 3282790 4460099 4225345 3117159 2243661
37251 2243661 1841871 1839198 2523799 3722433 4319634 3586385 2273032 1570541 1735114
37242 1735114 2512569 3943344 5618362 6078070 4502762 2401215 1892127 2646355 2484539
37233 2484539 981676 177453 1063868 1774498 799492 -73526 1589596 4541495 5041366
37224 5041366 2207629 -578803 -384313 1506852 2019016 779643 133628 1349445 2871210
37215 2871210 2698152 1087216 58329 839769 2575955 3481780 2779022 1300768 380406
37206 380406 441898 783160 523010 -494671 -1616830 -1910490 -883398 960753 2333000
37197 2333000 2291934 1123146 -247173 -1457855 -2660943 -3445852 -2883709 -995110 755729
37188 755729 1059364 195310 -700457 -1086473 -991352 -242371 1187556 2376124 2124045
37179 2124045 525370 -962168 -1170389 -322258 586938 890784 597289 121027 -210650
37170 -210650 -661695 -1889946 -3800487 -4991933 -4191095 -2061397 -599679 -700626 -1341293
37161 -1341293 -1363006 -924690 -681538 -580483 -297643 -106291 -386925 -777056 -704376 -428104
37151 -428104 -681477 -1479440 -2117631 -2279318 -2348761 -2586608 -2739040 -2626729 -2468690 -2377001
37141 -2377001 -2090617 -1514592 -1034415 -903006 -701398 88715 1159779 1563102 903295
37132 903295 -69463 -356484 -2322 -83373 -1321171 -3081299 -4105452 -4043814 -3760983
37123 -3760983 -4084265 -4760311 -4894532 -4021962 -2448032 -902822 -214858 -938322 -2764056
37114 -2764056 -4494422 -5091712 -4620216 -3781505 -2880394 -1901968 -1294550 -1694592 -2805198
37105 -2805198 -3479506 -3192310 -2573830 -2125708 -1368584 34755 1138229 724327 -958689
37096 -958689 -2467552 -2972319 -2835632 -2463774 -1663076 -476902 214641 -412865 -2009770
37087 -2009770 -3341696 -3601723 -3175744 -3122089 -3935942 -4836141 -4530187 -2872748 -1320695
37078 -1320695 -1226082 -2114848 -2485901 -2000814 -1741667 -2304738 -2929378 -2875957 -2415399 -1855666
37068 -1855666 -839697 508113 942981 -163140 -1410985 -1116035 293735 1157745 1193016
37059 1193016 1368357 1548941 472043 -1672864 -2810687 -1939570 -644932 -562658 -1052217
37050 -1052217 -865117 -636708 -1747760 -3590271 -4136113 -3077454 -2417416 -3505123 -5067826
37041 -5067826 -5019233 -3217784 -1520503 -1530949 -2952943 -4084867 -3671057 -2285226 -1781966
37032 -1781966 -3166226 -5280962 -6098659 -5081061 -3551931 -2817348 -2803868 -2789261 -2605925
37023 -2605925 -2518237 -2490695 -2343207 -2406262 -3275230 -4803610 -5901185 -5659594 -4390064
37014 -4390064 -3192994 -2645991 -2348591 -1806415 -1262711 -1292208 -1899938 -2519512 -2748604
37005 -2748604 -2582073 -2028612 -1087104 -98850 470935 626233 618712 238269 -788336 -1690301
36995 -1690301 -1161752 618491 1738910 1094666 -9049 125838 1018196 885998 -588158
36986 -588158 -1945722 -2137063 -1552544 -897803 -363719 -54848 -103970 -160872 294090 1022850
36976 1022850 1259560 805420 14417 -1061407 -2381058 -3033826 -2103200 -408984 160211
36967 160211 -725596 -1444558 -1032818 -531316 -1045070 -2034320 -2479165 -2360451 -1928586 -764815
36957 -764815 1229552 2964604 3488162 3269681 3055691 2492752 1233462 410911 1300660
36948 1300660 3093546 3731671 2720763 1491931 1025187 740519 30437 -590430 -532146
36939 -532146 -282974 -724811 -1821386 -2609131 -2343689 -1367678 -818169 -1405690 -2531514
36930 -2531514 -3021531 -2744363 -2687057 -3114090 -2790495 -961406 902820 749219 -1235276
36921 -1235276 -2942170 -3207469 -2814798 -2647624 -2442506 -1790894 -1020142 -459657 96550
36912 96550 581865 288063 -964703 -2069296 -1867094 -680648 98673 -301656 -1328641
36903 -1328641 -1999142 -2105645 -2384990 -3437164 -4563079 -4238754 -2182757 -327269 -786226
36894 -786226 -3188948 -5148665 -5214454 -4022271 -2460814 -403246 1956701 3050955 1711404
36885 1711404 -761556 -1795575 -600188 1209740 2010421 1947152 1952738 2072139 1623926
36876 1623926 519481 -518048 -1036081 -1365396 -1805067 -2038124 -1924664 -2185448 -3257177
36867 -3257177 -3868171 -2246345 1054025 3150787 2454027 770537 523633 1288733 974287
36858 974287 -581579 -1594356 -1556448 -1912007 -3173349 -3820818 -3000673 -2154456 -2634827
36849 -2634827 -3506980 -3279926 -2316400 -1773936 -1382474 -251939 936590 643317 -957617
36840 -957617 -2081544 -2003104 -1769995 -1960365 -1531368 282918 2307311 2778553 1588378
36831 1588378 145755 -594515 -1015090 -1787238 -2724408 -3039131 -2379563 -1153980 129071
36822 129071 1307344 2044399 1449685 -877236 -3566895 -4392082 -2857421 -886688 -319189
36813 -319189 -704012 -498239 451485 970755 603979 85207 -247513 -1113629 -2940195
36804 -2940195 -4881075 -5735600 -5186781 -3762231 -2215495 -1316493 -1601838 -2785171 -3791828
36795 -3791828 -3816318 -3110498 -2504639 -2515275 -3158836 -4162039 -4909945 -4551189 -2754669
36786 -2754669 -301881 1518527 2112365 1829076 1097077 -69613 -1420467 -1968335 -1014105
36777 -1014105 411871 165088 -2378581 -5024337 -5005935 -2196031 903428 2236712 2109391
36768 2109391 1819402 1605699 769988 -869024 -2506903 -3120761 -2313989 -738465 165980
36759 165980 -470332 -1609307 -1260274 771464 2239468 1423451 -408238 -827511 364152
36750 364152 1254001 840529 67333 -224308 -584991 -1620281 -2774907 -3269786 -3256919
36741 -3256919 -3215482 -2924600 -1890989 -402999 609125 729009 622003 1313588 2953717
36732 2953717 4378999 4163330 2225401 18565 -1089129 -1075650 -587864 131104 853700
36723 853700 751390 -602646 -2123224 -2421764 -1781974 -1540039 -1764640 -1191449 464465
36714 464465 1791181 1682187 641231 -354866 -989897 -1197913 -944788 -846823 -1663086
36705 -1663086 -2770779 -2638866 -1283725 -538015 -1169418 -1598629 -564736 787577 951020
36696 951020 516153 826427 1558807 1567497 1031073 782782 425734 -828561 -2167588 -2128142
36686 -2128142 -1019486 -334062 -196650 441466 1423802 1538981 911218 805434 995295
36677 995295 -25917 -1813565 -1826645 460280 2078730 836505 -1381674 -1696111 -588503
36668 -588503 -623206 -2184056 -3237053 -2752610 -1819825 -1404361 -1199318 -956978 -1068067
36659 -1068067 -1366139 -943655 308696 1283008 1214176 436853 -763424 -2626712 -4595588
36650 -4595588 -4949428 -2916728 -221842 674305 -670957 -2686779 -3987577 -4388696 -4042898
36641 -4042898 -2903234 -1271932 126665 1001312 1675046 2106800 1577819 -59279 -1548916
36632 -1548916 -1550858 -424045 276544 -7021 -207810 513884 1344362 1041217 -122255
36623 -122255 -739881 -379359 -172719 -1083110 -2534099 -3240567 -2684451 -1248541 415237
36614 415237 1449515 877027 -1329249 -3505431 -3674125 -1744107 470081 1417340 1082530
36605 1082530 85319 -1238178 -2396794 -2638975 -2166711 -2404449 -3917860 -4989844 -3791882
36596 -3791882 -1346386 -419077 -1534277 -2183558 -625225 1516458 1780680 462047 -179429
36587 -179429 523955 903684 -275748 -2083954 -2990135 -2875827 -2707326 -2956918 -3099469
36578 -3099469 -2391183 -728600 1121849 2053928 1634078 573262 -101052 -170816 -88033
36569 -88033 3099 348741 763136 555710 -537014 -1950534 -2915262 -2970602 -2023455 -611043
36559 -611043 157569 -96317 -73124 1483965 3287603 2610775 -701231 -3380290 -2965987
36550 -2965987 -999736 -420054 -1396096 -1827316 -869957 391106 1287077 2244417 3077542
36541 3077542 2695940 941331 -952043 -2139107 -2900508 -3277531 -2628812 -1175694 -471957
36532 -471957 -1460477 -3222405 -4404293 -4764529 -4569950 -3661077 -2126482 -964592 -997475
36523 -997475 -1723732 -2075664 -1758839 -1202809 -841319 -1019549 -1847529 -2580652 -2069712 -476627
36513 -476627 519652 20203 -797491 -713115 -448641 -1129816 -2010363 -1725358 -961780 -1569323
36503 -1569323 -3345092 -4106591 -3112089 -2022486 -1874523 -1456959 141377 1461998 863650
36494 863650 -712556 -1052596 166652 1304738 1273603 440327 -635080 -1689692 -2056897
36485 -2056897 -1098013 425397 855859 -52845 -630202 325240 1866094 2446043 2151748
36476 2151748 2293202 3360159 4498604 4807957 4239328 3252824 2342026 1944419 2227357
36467 2227357 2891631 3563518 4200979 4644633 4164007 2341471 247674 -353817 825392
36458 825392 2211701 2433651 1699012 662244 -773072 -2498942 -3197763 -1885894 86178
36449 86178 297325 -1498509 -3012195 -2650929 -1580463 -1802184 -3427477 -4920400 -5186085
36440 -5186085 -4280270 -2610803 -661371 640384 386775 -1229461 -2953543 -3767102 -3679747
36431 -3679747 -3182229 -2492531 -1629700 -861895 -648603 -1067692 -1472295 -1011825 275131
36422 275131 1127532 394655 -1273479 -1808574 -180104 2179912 3016687 1854849 296965
36413 296965 69484 1457095 3398736 4394701 3498765 1174449 -885938 -1422466 -913807
36404 -913807 -562060 -395223 466143 1848315 2396196 1800104 1569862 2602255 3310292
36395 3310292 1682593 -1589146 -3761899 -3588429 -2513420 -2107105 -1990440 -1155270 -11294
36386 -11294 213637 -562922 -1255316 -1326941 -1298303 -1470229 -1321005 -616675 -175279 -844429
36376 -844429 -2318110 -3600640 -4164674 -4046627 -3293375 -2064137 -915463 -222291 333944
36367 333944 892793 546878 -1384446 -3466194 -3181385 -228978 2723579 3294135 2008640
36358 2008640 726205 -161305 -1466181 -3094670 -3942186 -3562436 -2492503 -1155313 210639
36349 210639 830907 170191 -690028 -169039 1171041 961965 -1439322 -3639607 -3511909
36340 -3511909 -2171424 -2111280 -3539041 -4395617 -3483285 -1787787 -647406 -90703 555993
36331 555993 1388449 1791267 1118945 -721559 -3007292 -4485349 -4354561 -3049336 -1772257
36322 -1772257 -1313120 -1593134 -2147612 -2607818 -2803027 -2787367 -2764762 -2856727 -3185967 -4192350
36312 -4192350 -6122267 -7857380 -7294875 -3908974 -157836 1023830 -314218 -1690312
36304 -1690312 -1898258 -2201374 -3498830 -4417523 -3477255 -1628324 -1033669 -2237115 -4034305
36295 -4034305 -5409813 -5999465 -5232924 -2960885 -825790 -970890 -2966800 -3967868 -2754128
36286 -2754128 -1666273 -3011652 -5194239 -4705094 -1221810 1767795 1610757 -482252
36278 -482252 -1851596 -1871471 -1571120 -1171102 65145 1971372 3215638 3044359 1989557
36269 1989557 600021 -1284525 -3453025 -4626360 -3832839 -1962867 -994432 -1751723 -3142551
36260 -3142551 -3687046 -3193926 -2625197 -2693056 -3087912 -3114497 -2681678 -2320267 -2366065 -2580114
36250 -2580114 -2669690 -2713591 -2785182 -2605870 -2056046 -1691558 -2163651 -3334020 -4522802 -5354829
36240 -5354829 -5665761 -4923009 -2821617 -400252 674010 223390 -231792 165308 369876
36231 369876 -573735 -1606911 -1172831 174293 416182 -891351 -1927675 -1282602 105171
36222 105171 413332 -646704 -1777510 -1950907 -1449166 -1116273 -1213849 -1321857 -1158476
36213 -1158476 -1065328 -1398016 -1718330 -1261678 -265236 17022 -942826 -2020470 -1958442 -1026247
36203 -1026247 -237169 300080 950406 1102690 -147982 -2025808 -2568260 -1367569 -169116
36194 -169116 -289145 -1117852 -1879263 -3079890 -4982831 -6213667 -5580639 -4254086 -4349831
36185 -4349831 -5906328 -6928816 -6146817 -4217216 -2348200 -1173232 -968800 -1623549 -2305800
36176 -2305800 -2399574 -2741455 -4467491 -6523834 -6133659 -2527756 1351419 2151657 120097
36167 120097 -1554933 -843095 1099369 1962582 1115777 -96016 -237279 688543 1570261
36158 1570261 1619325 1047837 311241 -697650 -2122169 -3267343 -3224385 -2275344 -1586117
36149 -1586117 -1351397 -517618 1079848 1619258 -482894 -4069108 -6311172 -5929404 -4145534
36140 -4145534 -2646162 -1845496 -1221563 -214618 1460493 3397284 4153506 2449787 -766594
36131 -766594 -2553500 -1193495 1558276 2485813 691489 -1801249 -3024362 -3246003 -3704068
36122 -3704068 -4353620 -4024097 -2396297 -628654 182092 240701 263869 181851 -570327 -1845031
36112 -1845031 -2779140 -2958517 -2759048 -2462182 -1921566 -1325521 -1273877 -1586862 -1087816 558897
36102 558897 1754485 971191 -820038 -1269794 66895 1222565 742720 -522511 -1116013
36093 -1116013 -986432 -911369 -1109364 -1488295 -2320334 -3494302 -3822508 -2363833 -26100
36084 -26100 1314060 1025624 16879 -869430 -1546324 -1864158 -1357426 -66415 1324634
36075 1324634 2369981 3051922 3058302 1968774 434942 -1769 1072002 2036230 1171003
36066 1171003 -1166031 -3128917 -3637742 -3127347 -2345591 -1448566 -474613 86416 -242018
36057 -242018 -1131310 -1596914 -1091813 -244880 -191886 -1144622 -2045162 -1919134 -1105164 -560485
36047 -560485 -353497 219415 1129188 1345835 376235 -926644 -1584012 -1606255 -1279029 -314907
36037 -314907 1292893 2324754 1534361 -489469 -1895594 -2005854 -1988038 -2776578 -3403844
36028 -3403844 -2209438 759723 3338489 3318742 634499 -2628028 -4295277 -3995630 -2857309
36019 -2857309 -1648992 -7515 2227543 3834289 3354884 1073501 -1204988 -2365981
36011 -2365981 -2985350 -3880479 -4668272 -4470256 -3451938 -2790837 -3201364 -4144276 -4653714
36002 -4653714 -4494729 -4140921 -3781757 -2893398 -1151146 542405 677167 -989889 -2811645
35993 -2811645 -3019857 -1675158 -241713 370707 457145 367269 -229334 -1584935 -3187046
35984 -3187046 -4383791 -5193836 -5934513 -6372933 -5875263 -4394022 -2843990 -2289974 -2910319
35975 -2910319 -3887804 -4242094 -3618493 -2293476 -743738 513251 967641 596248 172202
35966 172202 357741 516238 -538752 -2387201 -2975342 -1565908 -324889 -1497659 -4071218
35957 -4071218 -5165625 -4119535 -2977245 -3052621 -3456777 -3562103 -4466693 -6670554 -8253279
35948 -8253279 -7181169 -4224952 -1880113 -1226002 -1425612 -1640871 -1791349 -1771734 -1443640
35939 -1443640 -1303720 -1909558 -2761878 -2903514 -2442769 -2263671 -2355823 -1783256 -446961
35930 -446961 414493 -97505 -1341900 -2042594 -1663943 -616386 218984 -10595 -1396905
35921 -1396905 -2881409 -3305237 -2936150 -3134713 -4385207 -5624913 -5847512 -5398530 -5140307
35912 -5140307 -5186219 -5155785 -5000655 -4801091 -4259069 -3229722 -2420907 -2669502 -3598750 -3860927
35902 -3860927 -2920509 -1858910 -1935229 -2868009 -3265026 -2583340 -1785260 -1747561 -1847961 -927980
35892 -927980 849975 2166849 2382855 2031045 1452589 369368 -757562 -543576 1108411
35883 1108411 1998968 295814 -2810259 -4705770 -4778656 -4467064 -4547056 -4441583 -3988364
35874 -3988364 -3774450 -3610353 -2722702 -1725537 -2257417 -4117362 -4968653 -3828901 -2750905
35865 -2750905 -3732594 -5825552 -6852193 -6383226 -5360135 -4225397 -3247766 -3411119 -4950889
35856 -4950889 -6015637 -4910597 -2923238 -2728140 -4504079 -5932090 -5824528 -5348926 -5420998
35847 -5420998 -5225143 -4067591 -2743297 -2083019 -1687445 -1073103 -738357 -1075528 -1342808
35838 -1342808 -748989 327319 1134118 1745189 2506742 2975470 2437947 1097545 -119349
35829 -119349 -686698 -733918 -450629 90967 623829 705558 75671 -1161275 -2524190 -3272961
35819 -3272961 -2928519 -1813824 -705247 77333 716887 1074844 626306 -562017 -1580149
35810 -1580149 -1751209 -1268556 -505763 427538 1046689 437088 -1410759 -3018904 -2999276
35801 -2999276 -1593229 39127 1279451 1980540 1825198 925098 388251 979950 1692600
35792 1692600 1027019 -647278 -1525888 -1020915 -333184 -201522 213011 1560503 2886657
35783 2886657 2905171 1609713 -234313 -2193074 -3817736 -4156392 -2824742 -1001858 -265931
35774 -265931 -821568 -1753898 -2463513 -2793090 -2318390 -872736 541058 794752 454984
35765 454984 1053796 2548614 3264397 2720858 2573651 3795222 4769352 3738042 1660679
35756 1660679 669970 728777 133357 -1168267 -1360867 -127191 325220 -1316167 -3129920
35747 -3129920 -2684670 -630038 334826 -721977 -2040306 -1807057 -101355 1887206 3227178
35738 3227178 3496067 2708176 1492008 757937 872247 1470979 2041987 2282037 2079975
35729 2079975 1691898 1715273 2314298 2787328 2567669 2186577 2304872 2269844 954974 -1168374
35719 -1168374 -2303571 -1819012 -1004717 -1012681 -1523950 -1997596 -2711428 -3697568 -4056393 -3454378
35709 -3454378 -3091370 -3892359 -4772486 -4144899 -2351168 -1054690 -773477 -582959 37581
35700 37581 587266 683371 460439 -131853 -1154534 -1856927 -1351838 -135816 394980 -15392
35690 -15392 -372198 -445036 -1142864 -2375565 -2375131 -248584 2248676 2848781 1632379 390399
35680 390399 -12060 -125407 -333851 -405145 -527304 -1359513 -2815474 -3877563 -3867029 -3015143
35670 -3015143 -1655349 145164 1884185 2616544 2221441 1825134 2258558 2806227 2353621
35661 2353621 1235584 840069 1532841 2153657 1872547 1491608 2174821 3610075 4405661
35652 4405661 3953345 2833090 1471912 -298096 -1912534 -1625508 1428384 5415256
35644 5415256 7392515 6541453 4607013 3176934 1959108 200782 -1574687 -2283508
35636 -2283508 -1881663 -1151199 -404710 511433 1228489 1031941 87176 -507989 -177943
35627 -177943 400996 373774 -158143 -548270 -648086 -835655 -1211382 -1340687 -896306 -207563
35617 -207563 65475 -279706 -734174 -697660 -178922 396754 1012222 2211672 4183924
35608 4183924 6119891 6968494 6603081 5706640 4641804 3108937 1061725 -650259 -971665
35599 -971665 250939 2067771 3137750 2583006 556314 -1730513 -2822170 -2248747 -882120
35590 -882120 103585 416252 548671 805676 968041 892426 864447 1098584 1309956 1165807
35580 1165807 866286 782748 679817 -69629 -1399730 -2332866 -2205222 -1552026 -1206169
35571 -1206169 -973097 -17025 1642545 2975454 3397169 3472256 3824212 4180311 4035914
35562 4035914 3550198 3111039 2593977 1788441 1060639 795670 631420 142085 -134246
35553 -134246 556452 1675493 1919762 1282045 1193197 2197269 2816232 1564120 -925343
35544 -925343 -2828704 -3522829 -3919591 -4714650 -5409279 -5218047 -4158613 -2881207 -1818169
35535 -1818169 -874560 73201 613116 69086 -1473015 -2804445 -2877159 -2254669 -2417563
35526 -2417563 -3581980 -4274297 -3484702 -2163516 -1776009 -2225189 -2219950 -1151129 389305
35517 389305 1557303 1794136 793525 -1075706 -2560804 -2691715 -2001064 -1772873 -2370466
35508 -2370466 -3161015 -3646651 -3594126 -2538633 -553878 842467 205214 -1549639 -2196160
35499 -2196160 -1576033 -1765796 -3409875 -4352856 -3180879 -1786512 -2370083 -3715000 -3038033
35490 -3038033 -452700 1241551 898682 340061 894850 1192832 -375144 -2873514 -4091365
35481 -4091365 -3537110 -2669318 -2621770 -2985695 -2860528 -2203161 -1769798 -2012793 -2336828 -1657996
35471 -1657996 222669 2131532 2764931 2133210 1304833 1059908 1426668 2147290 2683037
35462 2683037 2062958 -56428 -2169194 -2063298 420132 2854802 2933699 777581 -1830256
35453 -1830256 -3420890 -3487913 -2294690 -925559 -702819 -1693110 -2464028 -2009034 -1058764
35444 -1058764 -669937 -516069 209411 988205 579618 -898147 -1896903 -1446881 -117735
35435 -117735 1023390 1377428 722955 -785097 -2306842 -2828750 -2220635 -1253014 -631563
35426 -631563 -617219 -1340986 -2600130 -3430807 -2815495 -926404 1000892 1937386 1576258
35417 1576258 35328 -1909742 -2704293 -1546899 45239 -282128 -2502240 -3992430
35409 -3992430 -2910987 -291086 1763170 2451729 2125542 1277584 683174 1198124 2318115
35400 2318115 2222469 456760 -776105 451503 2792521 3494254 2388488 1758876 2542199
35391 2542199 3037683 1829100 -50816 -828215 -422985 -104271 -614223 -1583505 -2283146
35382 -2283146 -2242787 -1472279 -567894 -325237 -926228 -1754063 -2153406 -2045135 -1706463 -1345916
35372 -1345916 -1045213 -829661 -701587 -727439 -903480 -775333 308197 2126037 3374079
35363 3374079 3220673 2452391 2163444 2027901 1214767 401077 990750 2420486 2341848
35354 2341848 26355 -2360935 -2830402 -2126556 -1918128 -2051469 -1439243 -596325 -1115967
35345 -1115967 -2856943 -3598300 -1916358 932502 2581502 2158199 788609 27849 331446
35336 331446 1031767 1526088 2076007 3073162 3897267 3462230 1928191 690395 289359
35327 289359 -340110 -1791947 -2794080 -2164882 -938348 -878511 -1777342 -2112240 -1783498
35318 -1783498 -2088995 -3141649 -3449806 -2344625 -901551 5016 751276 1506469 1542811
35309 1542811 802476 450776 912998 991270 30578 -686436 -98355 624512 -55759 -1448203
35299 -1448203 -1840684 -1316837 -1229008 -1472952 -556318 1725930 3796737 4663257 4851592
35290 4851592 4665931 3474023 1413846 56989 390942 1489629 2076846 2125672 1994322
35281 1994322 1320848 -16099 -974504 -749143 -207646 -557319 -1376919 -1486857 -1101239
35272 -1101239 -1339097 -1941830 -1437739 262149 1324549 659675 -520645 -719035 -302731
35263 -302731 -411722 -810079 -348989 957678 1832818 1683239 1360398 1655299 2025385
35254 2025385 1411421 -210376 -1672262 -1894312 -1021606 -253306 -557953 -1563607 -1902210
35245 -1902210 -754161 1250490 2881122 3608572 3587014 2817243 1235263 -459851 -1090247
35236 -1090247 -460857 269962 191625 -91164 458090 1454143 1369852 -252057 -1783628
35227 -1783628 -1301001 1005549 2896116 2626503 870635 -308889 -21737 713469 819709
35218 819709 697572 1189543 1859454 1601676 644587 417891 1212483 1549812 620995 -127358
35208 -127358 857748 2617435 2921521 1575957 647078 1358538 2516704 2574159 1814498
35199 1814498 1563430 2182824 2845648 2828364 2254142 1778189 1964533 2700674 3042464 2173992
35189 2173992 735082 426062 1838263 3484591 3688260 2703857 2038468 2251081 2583740
35180 2583740 2499161 2311816 2161093 1548728 443135 -28456 1189421 3497004 5010803
35171 5010803 4605290 3202743 2787232 4169549 5957266 6035082 4037909 1857855 1420287
35162 1420287 2498266 3362214 3202840 2938813 3570233 4731466 5414565 5446771 5476560
35153 5476560 5768096 5817705 5330682 4971644 5619191 7019481 7736838 6720181 4576304
35144 4576304 2822620 2081718 1716673 1278984 1335615 2267926 3095586 2562464 1007145
35135 1007145 5196 200834 616555 318941 -300658 -345564 420594 1801652 3732024
35126 3732024 5878973 7339239 7567258 7184300 7111072 7279436 6987665 6185602 5500433
35117 5500433 5170312 4897353 4733881 5139425 5970857 6337855 5852729 5245447 5235690 5459383
35107 5459383 5133896 4265549 3469260 2914087 2225044 1343302 763600 813832 1281264 1921348
35097 1921348 2810272 3929561 4856345 5226159 5168281 4929198 4428783 3693444 3402524
35088 3402524 4226179 5641704 6258564 5609389 4806548 4864654 5158433 4514133 3300158
35079 3300158 3077456 4150012 4889817 4101345 2849790 2893445 4107464 4729937 3791494
35070 3791494 2035556 513245 -458318 -725587 60761 1639222 2923497 3281460 3258860
35061 3258860 3370588 3064998 1907924 1052193 2086669 4604658 6341071 5979245 4596009
35052 4596009 3853988 3895847 3797915 3191919 2400240 1492594 297599 -788018 -924127
35043 -924127 142717 1791839 3275345 4178582 4198768 3185061 1570975 217485 -357084
35034 -357084 -198323 585888 1926643 3337028 4088789 4109127 4054624 4214087 4065360 3359923
35024 3359923 2887769 3435579 4511631 4920686 4309668 3383142 2765392 2370892 1837373
35015 1837373 964376 -222734 -1288803 -1387226 -88294 1807171 2908656 2776167 2329444
35006 2329444 2687389 4035366 5588257 6221005 5276318 3283580 1697766 1327136 1305519
34997 1305519 411015 -960621 -1316642 -423776 311552 103303 -70548 714694 1724656
34988 1724656 1816690 1229859 932698 986129 824038 613625 1048061 2045022 2765520 2776118
34978 2776118 2279460 1456593 513546 52647 360924 645279 105102 -576060 -180436
34969 -180436 810679 559553 -1405418 -3466223 -4335715 -4509344 -4553583 -3686356 -1405867
34960 -1405867 809261 1119253 -110226 -966921 -746768 -443263 -676257 -778556 -200961
34951 -200961 570662 974266 1090632 869548 -253722 -2177356 -3466431 -2887447 -1095269
34942 -1095269 208780 510059 835382 1881633 2826510 2444143 740063 -1060401 -1783398
34933 -1783398 -1121474 491816 2241656 3225824 2911349 1529079 -104952 -1175233 -1246107
34924 -1246107 -378558 736893 970394 -296228 -2275245 -3335288 -2714590 -1302359 -468633
34915 -468633 -490349 -489895 313382 1658471 2481382 1945398 354579 -955916 -923683 79170
34905 79170 820508 854438 846899 1193808 1371547 1139635 1273106 2186867 2785421 1910225
34895 1910225 255542 -526147 -177947 156885 13501 104609 713625 1152039 1099607 1052357
34885 1052357 1085402 611078 -162624 -27374 1265566 2240859 1767547 624905 67618
34876 67618 73145 104582 427155 1352477 2134307 1992772 1490788 1596723 2087897 2170209
34866 2170209 1933671 1780071 1143276 -573126 -2320805 -2439168 -1085749 89854 504767
34857 504767 1024373 1769105 1544729 -13979 -1457368 -1448828 -357251 699878 1118617
34848 1118617 507494 -1482808 -4107211 -5449045 -4483600 -2510665 -1661472 -2521618 -3857769
34839 -3857769 -4125420 -2743056 -486595 976226 627820 -530070 -515121 950758 1930624
34830 1930624 938699 -1139355 -2557875 -2883776 -2605487 -1732549 -177182 1246310 1638209
34821 1638209 1399863 1580715 2212351 2430329 1887487 894677 -511453 -2405812 -4053520
34812 -4053520 -4374334 -3369021 -2087686 -1195510 -511345 116915 515370 774699 1139909
34803 1139909 1276494 657068 -259282 -334470 532242 1065778 378206 -907753 -1783257
34794 -1783257 -2175543 -2465825 -2430139 -1541390 -11196 1226611 1573409 1353359 1266622
34785 1266622 1490129 1460503 588559 -883017 -2006794 -2221068 -1931270 -1730177 -1506776
34776 -1506776 -848345 66276 658757 811914 873793 960495 884965 643403 408168 235433
34766 235433 274941 854509 1763446 2106913 1743482 2035225 3806266 5320850 4233431
34757 4233431 1242684 -448360 428163 1615589 957069 -653168 -1299690 -1056740 -1112488
34748 -1112488 -1299692 -561732 915843 1942193 2246275 2486883 2632836 1926493 413217
34739 413217 -847518 -1155815 -720223 37415 734293 836309 261997 -99612 483648
34730 483648 1342662 1454460 1211692 1660120 2388925 1988001 511345 -454044 -402996 -602665
34720 -602665 -1601708 -2042061 -973739 394438 573295 -3110 -94371 203787 8568
34711 8568 -537700 -627811 -393137 -613186 -1229567 -1636447 -2121194 -3396171 -4776763 -4555284
34701 -4555284 -2571344 -879522 -1150667 -2617927 -3436419 -3091796 -2471594 -2249804 -2280193
34692 -2280193 -2247265 -1939936 -1024887 534406 1808918 1553658 -191757 -1893780 -2327292
34683 -2327292 -1924544 -1756148 -1829278 -1394213 -630462 -717988 -1888454 -2575062 -1359725
34674 -1359725 972133 2309632 1722790 129334 -1204817 -1704100 -1124282 589679 2743374
34665 2743374 4145584 4317113 3719499 2646231 910565 -1078008 -2165221 -2052930 -1934601
34656 -1934601 -2688712 -3510691 -3393788 -2913404 -3115023 -3439444 -2504478 -628565 218799
34647 218799 -837099 -2401160 -2761253 -1732087 -118190 1448969 2541020 2834381 2651329
$$ [...]
##END NTUPLES=NMR SPECTRUM
##END=
