##TITLE=31Pdec_SR32_5
 CDCl3, 24 sc
 1.03.2021
##JCAMPDX= 6.0         $$ Bruker NMR JCAMP-DX V2.0
##DATA TYPE= NMR SPECTRUM
##DATA CLASS= NTUPLES
##ORIGIN= UXNMR, Bruker Analytische Messtechnik GmbH
##OWNER= root
$$ XWIN-NMR		Version 3.5
$$ Mon Mar  1 12:55:58 2021 Russian Standard Time (UT+4h)  she@DPX200
##.OBSERVE FREQUENCY= 81.013821
##.OBSERVE NUCLEUS= ^31P
##.ACQUISITION MODE= SIMULTANEOUS
##.ACQUISITION SCHEME= undefined
##.AVERAGES= 24
##.DIGITISER RES= 16
##SPECTROMETER/DATA SYSTEM= spect
##.PULSE SEQUENCE= zgpg30
##.SOLVENT NAME= CDCl3
##.SHIFT REFERENCE= (INTERNAL, CDCl3, 0, 248.564)
##AUDIT TRAIL= $$ (NUMBER, WHEN, WHO, WHERE, WHAT)
$$ ##TITLE= Audit trail, XWIN-NMR		Version 3.5
$$ ##JCAMPDX= 5.01
$$ ##ORIGIN= Bruker BioSpin GmbH
$$ ##OWNER= she
$$ F:/spectra/data/she/nmr/P31/1/pdata/1/auditp.txt
$$ ##AUDIT TRAIL=  $$ (NUMBER, WHEN, WHO, WHERE, WHAT)
(   1,<2021-03-01 12:53:52.04 +0400>,<she>,<DPX200>,
      <created by zg, POWCHK disabled, PULCHK disabled
       configuration hash MD5:
       00 E9 B6 7A A2 85 ED C7 34 08 36 98 17 FE 4E 26
       data hash MD5: 32K
       99 82 1E BB A0 C3 25 25 5E 20 5C 53 EC 14 1C 4B>)
(   2,<2021-03-01 12:53:59.57 +0400>,<she>,<DPX200>,
      <Start of raw data processing
       efp BC_mod = 2 LB = 1 FT_mod = 6 PKNL = 1 PHC0 = -2902.467 PHC1 = -107.1975 SI = 64K 
       data hash MD5: 64K
       C3 B5 5C A1 B4 69 9D 18 4D C0 8F 0E 50 52 E4 CB>)
(   3,<2021-03-01 12:54:28.96 +0400>,<she>,<DPX200>,
      <pk PHC0 = -76.4245 PHC1 = 181.8 
       data hash MD5: 64K
       C5 9F E9 D8 D6 50 6B D9 8F FE 26 1C BD C4 1A 58>)
(   4,<2021-03-01 12:54:32.25 +0400>,<she>,<DPX200>,
      <abs ABSG = 5 
       data hash MD5: 64K
       15 7A 7B 60 5C 99 8F E7 BC F1 26 A3 A5 3D BE A0>)
$$ ##END=
$$ 
$$ hash MD5
$$ 6C EB DF AB 0A C5 58 6E 5F B6 79 28 AD A6 96 5E
##$RELAX= 
##$RELAX= 
##$RELAX= 
##$RELAX= 
##$RELAX= 
##$RELAX= 
##$RELAX= 
##$RELAX= 
$$ Bruker specific parameters
$$ --------------------------
##$DU= <F:/spectra>
##$EXPNO= 1
##$NAME= <P31>
##$PROCNO= 1
##$TYPE= <nmr>
##$USER= <she>
##$AMP= (0..31)
100 100 100 100 100 100 100 100 100 100 100 100 100 100 100 100 100 100 
100 100 100 100 100 100 100 100 100 100 100 100 100 100 
##$AQSEQ= 0
##$AQ_mod= 1
##$AUNM= <au_zg>
##$AUTOPOS= <>
##$BF1= 81.014009
##$BF2= 200.13
##$BF3= 200.13
##$BF4= 200.13
##$BF5= 200.13
##$BF6= 200.13
##$BF7= 200.13
##$BF8= 200.13
##$BYTORDA= 1
##$CFDGTYP= 0
##$CFRGTYP= 5
##$CHEMSTR= <none>
##$CNST= (0..31)
1 1 145 1 1 1 1 1 1 1 1 1 1 1 1 1 1 1 1 1 1 1 1 1 1 1 1 1 1 1 1 1 
##$CPDPRG= <waltz16>
##$CPDPRG1= <>
##$CPDPRG2= <waltz16>
##$CPDPRG3= <>
##$CPDPRG4= <mlev>
##$CPDPRG5= <mlev>
##$CPDPRG6= <mlev>
##$CPDPRG7= <mlev>
##$CPDPRG8= <mlev>
##$CPDPRGB= <>
##$CPDPRGT= <>
##$D= (0..31)
0 1 0 0 0 0 0 0 0 0 0 0.03 2e-05 3e-06 0 0 0 0 0 0 0 0 0 0 0 0 0 0 0 0 
0 0 
##$DATE= 1614588831
##$DBL= (0..7)
120 120 120 11 120 120 24 19 
##$DBP= (0..7)
150 150 150 150 150 150 150 150 
##$DBP07= 0
##$DBPNAM0= <>
##$DBPNAM1= <>
##$DBPNAM2= <>
$$ [...]
##$SUBNAM3= <"">
##$SUBNAM4= <"">
##$SUBNAM5= <"">
##$SUBNAM6= <"">
##$SUBNAM7= <"">
##$SUBNAM8= <"">
##$SUBNAM9= <"">
##$SW= 501.771253377433
##$SWIBOX= (0..15)
0 1 3 0 0 0 0 0 0 0 0 0 0 0 0 0 
##$SW_h= 40650.406504065
##$TD= 32768
##$TD0= 1
##$TE= 0
##$TE2= 300
##$TE3= 300
##$TEG= 300
##$TL= (0..7)
0 120 53 12 22 120 120 120 
##$TP= (0..7)
150 150 150 150 150 150 150 150 
##$TP07= 0
##$TPNAME0= <>
##$TPNAME1= <>
##$TPNAME2= <>
##$TPNAME3= <>
##$TPNAME4= <>
##$TPNAME5= <>
##$TPNAME6= <>
##$TPNAME7= <>
##$TPOAL= (0..7)
0.5 0.5 0.5 0.5 0.5 0.5 0.5 0.5 
##$TPOFFS= (0..7)
0 0 0 0 0 0 0 0 
##$TUNHIN= 0
##$TUNHOUT= 0
##$TUNXOUT= 0
##$USERA1= <user>
##$USERA2= <user>
##$USERA3= <user>
##$USERA4= <user>
##$USERA5= <user>
##$V9= 5
##$VALIST= <valist>
##$VCLIST= <CCCCCCCCCCCCCCC>
##$VD= 0
##$VDLIST= <DDDDDDDDDDDDDDD>
##$VPLIST= <PPPPPPPPPPPPPPP>
##$VTLIST= <TTTTTTTTTTTTTTT>
##$WBST= 1024
##$WBSW= 4
##$XGAIN= (0..3)
0 0 0 0 
##$XL= 0
##$YL= 0
##$YMAX_a= 17374
##$YMIN_a= -19046
##$ZGOPTNS= <>
##$ZL1= 120
##$ZL2= 120
##$ZL3= 120
##$ZL4= 120
##$ABSF1= 248.5645
##$ABSF2= -253.2056
##$ABSG= 5
##$ABSL= 3
##$ALPHA= 0
##$AQORDER= 0
##$ASSFAC= 0
##$ASSFACI= 0
##$ASSFACX= 0
##$ASSWID= 0
##$AUNMP= <proc_1d>
##$AZFE= 0.1
##$AZFW= 0.5
##$BCFW= 0
##$BC_mod= 2
##$BYTORDP= 0
##$COROFFS= 0
##$CY= -3
##$DATMOD= 1
##$DC= 0
##$DFILT= <>
##$DTYPP= 0
##$F1P= 0
##$F2P= 0
##$FCOR= 1
##$FTSIZE= 65536
##$FT_mod= 6
##$GAMMA= 0
##$GB= 0
##$INTBC= 1
##$INTSCL= 5.30512e-09
##$ISEN= 30
##$LB= 1
##$LEV0= 0
##$LPBIN= 0
##$MAXI= 10000
##$MC2= 0
##$MEAN= 0
##$ME_mod= 0
##$MI= 50
##$NCOEF= 0
##$NC_proc= -6
##$NLEV= 6
##$NOISF1= 182.463
##$NOISF2= 159.3651
##$NSP= 0
##$NTH_PI= 0
##$NZP= 0
##$OFFSET= 248.5645
##$PC= 4
##$PHC0= -2978.892
##$PHC1= 74.6025
##$PH_mod= 1
##$PKNL= yes
##$PPARMOD= 0
##$PSCAL= 0
##$PSIGN= 0
##$REVERSE= no
##$SF= 81.014009
##$SI= 65536
##$SIGF1= 159.3651
##$SIGF2= -187.1042
##$SINO= 113.3802
##$SIOLD= 16384
##$SREGLST= <1H.CDCl3>
##$SSB= 0
##$STSI= 65536
##$STSR= 0
##$SW_p= 40650.406504065
##$SYMM= 0
##$S_DEV= 0
##$TDeff= 32768
##$TDoff= 0
##$TI= <>
##$TILT= no
##$TM1= 0
##$TM2= 0
##$TOPLEV= 0
##$USERP1= <user>
##$USERP2= <user>
##$USERP3= <user>
##$USERP4= <user>
##$USERP5= <user>
##$WDW= 1
##$XDIM= 65536
##$YMAX_p= 516613829
##$YMIN_p= -11676958
$$ End of Bruker specific parameters
$$ ---------------------------------
##NTUPLES= NMR SPECTRUM
##VAR_NAME=  FREQUENCY,     SPECTRUM/REAL,   SPECTRUM/IMAG
##SYMBOL=    X,             R,               I
##VAR_TYPE=  INDEPENDENT,   DEPENDENT,       DEPENDENT
##VAR_FORM=  AFFN,          ASDF,            ASDF
##VAR_DIM=   65536,         65536,           65536
##UNITS=     HZ,            ARBITRARY UNITS, ARBITRARY UNITS
##FACTOR=    0.620285442955139, 1,           1
##FIRST=     20137.2065510759, 0,            0
##LAST=      -20513.1999529892, 0,           0
##MIN=       -20513.1999529892, -11676958,   0
##MAX=       20137.2065510759, 516613829,    0
$$ Real data points
##PAGE= N=1
##DATA TABLE= (X++(R..R)), XYDATA
$$ [...]
$$ plain form
40390 -633612 -1549251 -1667576 -1065602 -22400 768639 717097 404732 972694 2214222
40381 2214222 2638584 1725278 634357 252238 52024 -499661 -815297 -173878 1325219
40372 1325219 3293705 5322862 6310369 4937777 1526603 -1713604 -2911063 -2125420
40364 -2125420 -576525 474655 -25188 -2153193 -4017456 -3145019 373463 3450311
40356 3450311 3453052 985535 -1302709 -1547430 108834 1933769 1861574 -525655 -3080786
40347 -3080786 -3336544 -1529279 119940 729121 1178692 1475419 584006 -710278 54260
40338 54260 2869202 4323674 2493910 -104745 -503064 557259 982160 1245025 2712783
40329 2712783 4057054 3087589 1113280 1688393 5117944 7553352 6066626 1969018
$$ packed form
40390f33612r15639j18325O01974J043202P91039n1542l12365N67962J241528
40381B214222M24362r13306j090921l82119k00214n51685l15636O41419J499097
40372A325219J968486K029157R87507j372592l411174l240207j197459P85643
40364b125420J548895J051180m99843k128005j864263Q72437L518482L076848
40356C450311K741k467517k288244k44721J656264J824935p2195k387229k555131
40347c080786k55758J807265J649219O09181M49571K96727q91413j294284P64538
40338E4260K814942J454472j829764k598655l98319J060323M24901K62865J467758
40329B712783J344271r69465j974309N75113L429551K435408j486726m097608
$$ plain form
40321 1969018 -1489886 -2433270 -835348 2067420 4025782 3370223 1301799 965991 3325106
40312 3325106 5587727 5007069 2790810 2367858 4444352 5957185 4479036 1899982
40304 1899982 2052723 5289825 7617638 6079299 3100622 3349154 7204100 10187808
40296 10187808 9222523 6595627 6185675 8017701 8892045 7142690 4313006 2512936
40288 2512936 2252155 2988949 4048705 4528678 3572825 1385803 -661856 -1301735 -462304
40279 -462304 801131 1107474 -206612 -2241525 -2868988 -524763 4062982 7954110 7987701
40270 7987701 3404558 -2867916 -6175227 -4505604 -513638 1963928 2561507 3555846
40262 3555846 5205950 5199924 3156610 2079106 3633657 5127450 3631572 554848 -744110
$$ packed form
40321A969018l458904r43384J597922K902768J958362o55559k068424l35808K359115
40312C325106K262621n80658k216259m22952K076494J512833j478149k579054
40304A899982J52741L237102K327813j538339k978677K48532L854946K983708
40296A0187808r65285k626896m09952J832026Q74344j749355k829684j800070
40288B512936k60781P36794J059756M79973r55853k187022k047659o39879Q39431
40279d62304J263435L06343j314086k034913o27463K344225M587745L891128L3591
40270G987701m583143o272474l307311J669623L991966K477566N97579R94339
40262C555846J650104o026k043314j077504J554551J493793j495878l076724j298958
$$ plain form
40253 -744110 90678 885602 835333 792556 727205 -19012 -647426 17432 966760 395000
40243 395000 -957857 -899402 319755 645501 529595 2608203 6388127 7372378 3433476
40234 3433476 -1334900 -1864962 1135092 2676584 410342 -2938500 -3824431 -2026611
40226 -2026611 211226 1575609 2881192 5154285 7595573 8211303 6285345 3334720
40218 3334720 1319858 752418 980524 1266766 900725 -496379 -1784534 -862648 2156075
40209 2156075 3820591 1359558 -3423786 -6486936 -6609641 -5552998 -4252612 -2093324
40201 -2093324 397029 1480735 1098320 837262 777939 -496962 -2384564 -2286971 -107153
40192 -107153 878271 -782872 -2134162 -655868 1473430 878187 -1697074 -2834021 -1628916
$$ packed form
40253g44110Q34788P94924n0269m2777o5351p46217o28414O64858R49328n71760
40243C95000j352857N8455J219157L25746j15906K078608L779924R84251l938902
40234C433476m768376n30062L000054J541492k266242l348842q85931J797820
40226b026611K237837J364383J305583K273093K441288O15730j925958k950625
40218C334720k014862n67440K28106K86242l66041j397104j288155R21886L018723
40209B156075J664516k461033m783344l063150j22705J056643J300386K159288
40201b093324K490353J083706l82415k61058n9323j274901j887602R7593K179818
40192a07153R85424j661143j351290J478294K129298n95243k575261j136947J205105
$$ plain form
40183 -1628916 -266973 -285114 -1098046 -1839701 -2237488 -1820433 -349027 977389 508714
40174 508714 -1567125 -3281136 -3193403 -1556541 479375 1577742 475105 -2987500 -6931245
40165 -6931245 -8640552 -7073322 -3711238 -944316 5515 -210979 12283 1529001 3563692
40156 3563692 4767511 4809202 4176174 2878379 763149 -1056737 -921921 896984 2261002
40147 2261002 2211907 1992408 2273609 1622722 -833204 -3218362 -3268013 -1407990 367309
40138 367309 1413608 2309433 2875957 2403184 1326686 946144 1770500 3328848 4976301
40129 4976301 5760909 4463181 1222052 -1678200 -2103970 -524057 1011587 1448937 1033650
40120 1033650 124304 -720326 -329084 1792549 4319080 5464288 4780705 2755049 -73628
$$ packed form
40183a628916J361943j8141q12932p41655l97787M17055J471406J326416m68675
40174E08714k075839j714011Q7733J636862K035916J098367j102637l462605l943745
40165f931245j709307J567230L362084K766922R49831k16494K23262J516718K034691
40156C563692J203819M1691o33028j297795k115230j819886J34816J818905J364018
40147B261002m9095k19499K81201o50887k455926k385158m9651J860023J775299
40138C67309J046299Q95825N66524m72773j076498l80542Q24356J558348J647453
40129D976301P84608j297728l241129k900252m25770J579913J535644M37350m15287
40120A033650r09346q44630L91242K121633K526531J145208o83583k025656k828677
$$ plain form
40111 -73628 -2533243 -3077744 -2095214 -2138148 -4173840 -5705195 -4694332 -2944283 -2811655
40102 -2811655 -3057538 -1611683 -184664 -1505575 -3544831 -1899946 2500585 3746674
40094 3746674 -271525 -4874736 -5997786 -5390709 -5882779 -6169608 -3900134 -421580 1408284
40085 1408284 1707525 2324984 2988717 2067171 -135291 -1847256 -2620280 -3097669 -3006322
40076 -3006322 -1851259 -734097 -1092947 -2283825 -2531245 -1678235 -1128003 -1720634 -3266215
40067 -3266215 -5211335 -6219440 -4523382 -646136 1804080 456519 -2216532 -2422558
40059 -2422558 -730982 -748584 -3023245 -4286781 -2872723 -979138 -627071 -850106 -338737
40050 -338737 79782 -675639 -1938092 -2778419 -3406318 -3662957 -2354703 186177 1069774
$$ packed form
40111g3628k459615n44501R82530m2934k035692j531355J010863J750049J32628
40102b811655k45883J445855J427019j320911k039256J644885M400531J246089
40094C746674m018199m603211j123050O07077m92070k86829K269474L478554J829864
40085A408284K99241O17459O63733r21546k202462j711965p73024m77389R1347
40076c006322J155063J117162l58850j190878k47420Q53010N50232n92631j545581
40067c266215j945120j008105J696058L877246K450216j347561k673051k06026
40059b422558J691576j7602k274661j263536J414058J893585L52067k23035N11369
40050c38737M18519p55421j262453q40327o27899k56639J308254K540880Q83597
$$ plain form
40041 1069774 -1407509 -4708371 -5144491 -2773937 -797514 -950017 -1966202 -2234004 -1604280
40032 -1604280 -480054 854212 1620479 878825 -1111219 -3076000 -4394460 -5301910 -5432962
40023 -5432962 -3809202 -771692 1541743 1473163 -386585 -2287520 -3125574 -2535932 -435442
40014 -435442 2360443 3926536 3073135 1132058 598458 1903554 2716483 935068 -2540205
40005 -2540205 -4840928 -4488693 -2753009 -1604513 -1328058 -935356 -319407 -615358 -2130500
39996 -2130500 -3239563 -2439084 -735678 -546309 -2394218 -4175093 -4016287 -2505084 -1400250
39987 -1400250 -1316920 -1697316 -2175437 -2710410 -2837810 -2048833 -807141 -126517 -123021 58349
39977 58349 801301 1457248 1468508 1198647 1250350 1605357 1830208 1637984 979275 107910
$$ packed form
40041A069774k477283l300862m36120K370554J976423j52503j016185k67802O29724
40032a604280J124226J334266P66267p41654j990044j964781j318460r07450j31052
40023e432962J623760L037510K313435o8580j859748j900935q38054N89642K100490
40014d35442K795885J566093q53401j941077n33600J305096Q12929j781415l475273
40005b540205k300723L52235J735684J148496K76455L92702O15949k95951j515142
39996b130500j109063Q00479J703406J89369j847909j780875J58806J511203J104834
39987a400250Q3330l80396m78121n34973j27400P88977J241692O80624L496J81370
39977E8349P42952O55947J1260k69861N1703L55007K24851j92224o58709q71365
$$ plain form
39967 107910 -217958 720580 2441654 3296590 2297908 466580 -328877 429942 1637668
39958 1637668 2361157 2992728 4240685 5654841 5957269 4770610 3285178 2846066 3384675
39949 3384675 3847001 3805975 3717226 3631000 2851485 1327281 192382 79392 16702 -812243
39939 -812243 -1324766 -240147 1395233 1611675 924136 1584875 3306476 2944945 -339631
39930 -339631 -2751766 -1008423 2690909 3868146 2168779 1020699 1805124 2276808 1056558
39921 1056558 -40306 534254 1390596 903468 96483 511384 1088468 -133498 -2322521
39912 -2322521 -2697152 -820204 558256 -573495 -2828839 -3567661 -2119831 167961
39904 167961 1943165 2796931 2947361 2954596 3259399 3298200 1778083 -1257321 -3392760
$$ packed form
39967A07910l25868R38538J721074Q54936r98682j831328p95457P58819J207726
39958A637668P23489O31571J247957J414156L02428j186659j485432m39112N38609
39949C384675M62326m1026q8749q6226p79515j524204j134899j12990o2690q28945
39939h12243n12523J084619J635380K16442o87539O60739J721601l61531l284576
39930c39631k412135J743343L699332J177237j699367j148080P84425M71684j220250
39921A056558j096864N74560Q56342m87128q06985M14901N77084j221966k189023
39912b322521l74631J876948J378460j131751k255344p38822J447830K287792
39904A67961J775204Q53766J50430P235L04803L8801j520117l035404k135439
$$ plain form
39895 -3392760 -2264847 1264337 3811284 3396127 1227860 -623860 -1605860 -1995307 -1645512
39886 -1645512 -883323 -1201429 -3103665 -4318398 -2523851 751507 1738007 -36647 -961293
39877 -961293 968296 2957589 2087943 364025 1719529 5606454 7479564 5435850
39869 5435850 2639423 2313696 3607695 4049646 3352154 2507387 1186961 -1165365 -2910447
39860 -2910447 -1974444 293630 135815 -3153707 -5698582 -4423808 -1400837 -494923 -1696041
39851 -1696041 -2038420 -1095249 -1479935 -3375218 -2807409 2264849 7462746 7119415 1910536
39842 1910536 -2462411 -3057787 -2007463 -1389105 -422490 1127961 1064603 -1435511 -3451696
39833 -3451696 -2386016 234918 1625817 1942978 2704956 3207899 1879556 -297024 -1003188
$$ packed form
39895c392760J127913L529184K546947m15157k168267j851720r82000l89447L49795
39886a645512P62189l18106j902236j214733J794547L275358R86500j774654r24646
39877i61293J929589J989293q69646j723918J355504L886925J873110k043714
39869E435850k796427l25727J293999M41951o97492q44767j320426k352326j745082
39860b910447R36003K268074j57815l289522k544875J274774L022971R05914j201118
39851a696041l42379R43171l84686j895283N67809N072258N197897l43331n208879
39842A910536m372947n95376J050324O18358R66615J550451o3358k500114k016185
39833c451696J065680K620934J390899L17161P61978N02943j328343k176580p06164
$$ plain form
39824 -1003188 -152632 696413 1241587 1722139 858302 -1829185 -3089637 191871 5036035
39815 5036035 5331769 794932 -2351532 -576574 2547844 3083375 2413503 2873876 2478610
39806 2478610 -1397785 -6339910 -7754128 -5517748 -3372871 -2962061 -2662273 -1632345
39798 -1632345 -926894 -574243 780587 2784162 3071854 925690 -1337897 -1634789 -667668
39789 -667668 -169394 -341944 -318356 -99744 -779768 -2999157 -5693184 -6613837 -4538655
39780 -4538655 -1038584 855498 139348 -1198842 -1308233 -914521 -1368889 -2013119 -1526689
39771 -1526689 -576424 -703473 -1422050 -997246 353711 724031 -75405 -117257 1193335
39762 1193335 1962306 1120545 454012 1655483 3176285 2172467 -1240272 -3780898 -3176109
$$ packed form
39824a003188Q50556Q49045N45174M80552q63837k687487j260452L281508M844164
39815E036035K95734m536837l146464J774958L124418N35531o69872M60373l95266
39806B478610l876395m942125j414218K236380K144877M10810K99788J029928
39798a632345P05451L52651J354830K003575K87692k146164k263587k96892R67121
39789f67668M98274j72550K3588K18612o80024k219389k694027r20653K075182
39780d538655L500071J894082p16150j338190j09391L93712m54368o44230M86430
39771a526689R50265j27049p18577M24804J350957L70320p99436m1852J310592
39762A193335P68971q41761o66533J201471J520802j003818l412739k540626O04789
$$ plain form
39753 -3176109 -922661 -72236 -1241089 -2211612 -1457008 -395456 -956376 -2176253 -1400004
39744 -1400004 1489302 3583796 3136659 1690178 1069258 877388 498264 949424 2601312
39735 2601312 3457090 2263481 1152022 2333632 4285662 4510927 4042273 5274955 7018833
39726 7018833 6264982 3806713 3158095 4282456 3623271 715100 -624173 1114606 2615519
39717 2615519 1729508 913929 2040016 2555911 324907 -1850023 -635722 2209728 2985564
39708 2985564 2216786 3045951 5173784 5124939 2017514 -1059319 -1648317 -670780 -146701
39699 -146701 -667501 -1591080 -1992608 -1251744 149511 829697 364849 -199043 -567374
39690 -567374 -1953593 -4187224 -4618192 -2283318 -573958 -2423189 -5050197 -3662228
$$ packed form
39753c176109K253448Q50425j168853r70523P54604J061552n60920j219877P76249
39744a400004K889306K094494m47137j446481o20920j91870l79124M51160J651888
39735B601312Q55778j193609j111459J181610J952030K25265m68654J232682J743878
39726G018833p53851k458269o48618J124361o59185k908171j339273J738779J500913
39717B615519q86011q15579J126087N15895k231004k174930J214301K845450P75836
39708B985564p68778Q29165K127833m8845l107425l076833n88998R77537N24079
39699a46701n20800r23579m01528P40864J401255O80186m64848n63892l68331
39690e67374j386219k233631m30968K334874J709360j849231k627008J387969
$$ plain form
39682 -3662228 1034029 3648190 1975929 -584748 -902953 15713 278156 356245 1194286
39673 1194286 1985170 1743172 953408 213710 -803308 -1895148 -1876025 -700640 -35044
39664 -35044 -604268 -1006020 -341268 75011 -919447 -2176992 -2089512 -993479 -120535 396107
39654 396107 806978 369876 -1414316 -3039920 -2336539 679675 3664274 4619001 3850898
39645 3850898 3334267 4601101 7124752 8735871 8034408 6104561 5002546 4954290 4379078
39636 4379078 2422948 -144617 -2386656 -3684283 -2938861 294089 3610807 3458701
39628 3458701 -40845 -2613719 -1453248 1318398 2464077 2208452 2636915 3780842
39620 3780842 4128458 3479076 2533987 896269 -1763400 -3604308 -2626570 -175745 446138
$$ packed form
39682c662228M696257K614161j672261k560677l18205R18666K62443P8089Q38041
39673A194286P90884k41998p89764p39698j017018j091840J9123J175385O65596
39664c5044n69224m01752O64752M16279r94458j257545Q7480J096033Q72944N16642
39654C96107M10871m37102j784192j625604P03381L016214K984599R54727p68103
39645C850898n16631J266834K523651J611119p01463j929847j102015m8256n75212
39636D379078j956130k567565k242039j297627P45422L232950L316718j52106
39628C458701l499546k572874J160471K771646J145679k55625M28463J143927
39620C780842L47616o49382r45089j637718k659669j840908R77738K450825O21883
$$ plain form
39611 446138 -1390655 -3138846 -3091589 -2120742 -1185091 95553 1637834 2150317 1275604
39602 1275604 477612 697473 859394 -184625 -1801206 -2872531 -3571284 -4492009 -5052240
39593 -5052240 -4167898 -1941804 469062 2261289 3298349 3383387 2251567 333189 -1181382
39584 -1181382 -1278771 96902 2164000 3948737 4802168 4541037 3385604 1878560 580117
39575 580117 -536982 -2120835 -4214226 -5284298 -3666969 -98637 2606749 2899120
39567 2899120 1998067 1372555 676506 -364079 -42559 2921979 6460577 7473447 6271675
39558 6271675 5697343 6239586 5443166 2514230 3894 -268319 255812 142339 741555
39549 741555 3235118 5405054 4499106 1783780 897659 2289516 2612253 18864 -2871405
$$ packed form
39611D46138j836793j748191M7257R70847R35651J280644J542281N12483q74713
39602A275604p97992K19861J61921j044019j616581j071325o98753r20725n60231
39593e052240Q84342K226094K410866J792227J037060Q5038j131820j918378j514571
39584a181382r7389J375673K067098J784737Q53431k61131j155433j507044j298443
39575E80117j117099j583853k093391j070072J617329L568332K705386K92371
39567B899120r01053o25512o96049j040585L21520K964538L538598J012870j201772
39558F271675n74332N42243p96420k928936k510336k72213N24131j13473N99216
39549G41555K493563K169936r05948k715326q86121J391857L22737k593389k890269
$$ plain form
39540 -2871405 -2632646 287537 2302185 1321221 -886678 -1119619 1409829 4391796 5455815
39531 5455815 4915254 4625452 4779683 3610564 627249 -1734100 -1046730 1782966 3832985
39522 3832985 4083890 4132992 5121864 5875975 4847602 2641872 1449356 2280315 3660685
39513 3660685 3449963 1661763 762176 2653797 5924114 7264946 5582112 3219771
39505 3219771 2596744 3225310 3248872 2558043 2553934 3497017 4056722 3550448 2998549 3452383
39495 3452383 4362537 4236562 2473821 260729 -298488 1708824 4554412 5278535 3075004
39486 3075004 357492 -303978 864058 2156597 3329941 5189512 7048217 7105935 5431192
39477 5431192 4285798 4952660 6188902 6516825 6233452 6180804 6051133 5093724 3497492
$$ packed form
39540b871405K38759K920183K014648r80964k207899k32941K529448K981967J064019
39531E455815n40561k89802J54231j169119k983315k361349O87370K829696K050019
39522C832985K50905M9102R88872P54111j028373k205730j192516Q30959J380370
39513C660685k10722j788200q99587J891621L270317J340832j682834k362341
39505C219771o23027O28566K3562o90829m109R43083N59705n06274n51899M53834
39495C452383R10154j25975j762741k213092n59217K007312K845588P24123k203531
39486C075004k717512o61470J168036J292539J173344J859571J858705N7718j674743
39477E431192j145394O66862J236242L27923k83373n2648j29671r57409j596232
$$ plain form
39468 3497492 2087937 1321597 1140252 1141710 701561 -162388 -107207 2007731 4947943
39459 4947943 6214692 5493460 4924826 5548042 5971183 5476949 5632175 7100935 7593719
39450 7593719 5475855 3093546 3478309 5572065 6142408 5072950 4917902 5974098 6024246
39441 6024246 5062480 5900353 8965712 10582643 8401388 5063474 4018140 4673239 4537985
39432 4537985 3624454 3387798 3203686 1559701 -423444 -424422 679740 -259047 -3153161
39423 -3153161 -4085042 -1394203 1351616 648113 -1722435 -1735639 678126 1949577 512974
39414 512974 -1332805 -1477474 -869571 -1147003 -1734330 -1120476 376491 1117931 851829
39405 851829 1017868 2193818 2865996 1595140 -620084 -1401685 -181880 935097 57079
$$ packed form
39468C497492j409555p66340j81345J458m40149q63949N5181K114938K940212
39459D947943J266749p21232n68634O23216M23141m94234J55226J468760M92784
39450G593719k117864k382309L84763K093756N70343j069458j55048J056196N0148
39441F024246r61766Q37873L065359J616931k181255l337914j045334O55099j35254
39432D537985r13531k36656j84112j643985j983145r78J104162r38787k894114
39423c153161r31881K690839K745819p03503k370548j3204K413765J271451j436603
39414E12974j845779j44669O07903k77432n87327O13854J496967P41440k66102
39405H51829J66039J175950O72178j270856k215224p81601J219805J116977q78018
$$ plain form
39396 57079 -1667434 -1356503 1544876 3945834 2786634 -861815 -2868570 -1099807 2151291
39387 2151291 3348696 1933605 182416 -191886 379422 960813 1627533 2686972 3532572
39378 3532572 3267490 1995078 673254 -139988 -735756 -1395349 -1553948 -181131 2865842
39369 2865842 5950809 6645345 4194433 757917 -647425 508843 1899505 1512903
39361 1512903 46571 -515026 435755 2028047 3571333 4760687 4686987 2504549 -634942
39352 -634942 -1974524 -281295 2588364 4083755 3854127 3223436 2788641 2107874 1345183
39343 1345183 1418080 2154082 1899611 -32508 -1667127 -607154 2455154 4092386 2329294
39334 2329294 -910537 -2338195 -1137649 930123 2371514 3176994 3478499 2994795 2315485
$$ packed form
39396E7079j724513L10931K901379K400958j159200l648449k006755J768763L251098
39387B151291J197405j415091j751189l74302N71308N81391O66720J059439Q45600
39378C532572k65082j272412j321824q13242n95768o59593j58599J372817L046973
39369B865842L084967O94536k450912l436516j405342J156268J390662l86602
39361A512903j466332n61597R50781J592292J543286J189354p3700k182438l139491
39352f34942j339582J693229K869659J495391k29628o30691m34795o80767p62691
39343A345183P2897P36002k54471j932119j634619J059973L062308J637232j763092
39334B329294l239831j427658J200546K067772J441391Q05480L01505m83704o79310
$$ plain form
39325 2315485 2913184 4857953 6081490 5250756 3923167 4030357 4426019 2395411 -1841523
39316 -1841523 -4792137 -4273544 -2007139 -744665 -814775 -811875 -132798 704887 1267716
39307 1267716 1383484 849332 64816 219707 1771635 3390780 3441993 1944119 202250
39298 202250 -801663 -814634 -3678 746568 137536 -1792678 -3095021 -2272047 -258085
39289 -258085 1242430 2221066 3509641 4676124 4953554 5313221 7047577 8868259 8246135
39280 8246135 5487661 3501211 3282243 2805298 1141451 333103 1639050 2981255 2271548
39271 2271548 698454 270898 350296 -591602 -1627532 -908245 755466 1065163 173698
39262 173698 168472 994851 328969 -2165734 -3746341 -2720881 -815614 -121268 -238847
$$ packed form
39325B315485N97699J944769J223537q30734j327589J07190L95662k030608m236934
39316a841523k950614N18593K266405J262474p0110K900O79077Q37685N62829
39307A267716J15768n34152p84516J54891J551928J619145N1213j497874j741869
39298B02250j003913j2971Q10956P50246o09032j930214j302343Q22974K013962
39289b58085J500515R78636J288575J166483K77430L59667J734356J820682o22124
39280H246135k758474j986450k18968m76945j663847q08348J305947J342205p09707
39271B271548j573094m27556P9398r41898j035930P19287J663711L09697q91465
39262A73698n226Q26379o65882k494703j580607J025460J905267O94346j17579
$$ plain form
39253 -238847 -115300 -418279 -1882026 -2948313 -1579884 1351454 2829992 1684370 -225453
39244 -225453 -1026339 -1137529 -1752399 -2544386 -2349371 -1454744 -1509344 -2852616 -3405843 -1384630
39234 -1384630 1751004 2762572 967815 -778449 -93307 1849653 2687623 2643001 3636683
39225 3636683 5566674 6223258 4954304 3799697 4250404 5165913 5073498 4561794 4826516
39216 4826516 5339619 4735869 3061448 1463128 276370 -973795 -2041014 -2010027 -918015
39207 -918015 -27246 -195234 -888552 -1107944 -603731 142648 675548 946485 1075685 982200
39197 982200 474838 -194997 -259002 576695 1378686 1057606 81337 109530 1781743 3851357
39187 3851357 4733289 3965707 2060691 122195 -274063 1586882 3905652 3791542 1069815
$$ packed form
39253b38847J23547l02979j463747j066287J368429K931338J478538j145622j909823
39244b25453q00886j11190o14870p91987J95015Q94627n4600j343272n53227K021213
39234a384630L135634J011568j794757j746264O85142J942960Q37970m4622R93682
39225C636683J929991O56584j268954j154607M50707R15509r2415n11704K64722
39216D826516N13103o03750j674421j598320j186758j250165j067219L0987J092012
39207i18015Q90769j67988o93318k19392N04213P46379N32900K70937J29200r3485
39197I82200n07362o69835o4005Q35697Q01991l21080r76269K8193J672213K069614
39187C851357Q81932p67582j905016j938496l96258J860945K318770j14110k721727
$$ plain form
39178 1069815 -1215508 -1134955 -550967 -1741510 -3451904 -2928133 -503967 854626 82315
39169 82315 -779338 -26546 1557863 2446287 2165704 879727 -957443 -2083288 -1339145
39160 -1339145 489313 1502004 1643353 2732404 4967573 5817354 3757622 1042224
39152 1042224 829483 2948357 4577815 4322923 3532568 3685021 4284699 3945215 2491935
39143 2491935 1146868 837332 956379 298601 -870482 -605596 2186998 5865449 7902428
39134 7902428 7925600 7301628 6330669 4260141 2132329 2710871 6358483 9492238 9010794
39125 9010794 6311717 4800789 5087006 5207523 4463309 4079569 4323961 3786231 2024760
39116 2024760 643661 906058 2080274 3055264 4004654 5311228 6106092 5261819 3168897
$$ packed form
39178A069815k285323Q0553N83988j190543j710394N23771K424166J358593p72311
39169H2315q61653P52792J584409Q88424k80583j285977j837170j125845P44143
39160a339145J828458J012691J41349J089051K235169Q49781k059732k715398
39152A042224k12741K118874J629458k54892p90355J52453N99678l39484j453280
39143B491935j345067l09536J19047o57778j169083K64886K792594L678451K036979
39134G902428K3172o23972r70959k070528k127812N78542L647612L133755m81444
39125I010794k699077j510928K86217J20517p44214l83740K44392n37730j761471
39116B024760j381099K62397J174216R74990R49390J306574P94864q44273k092922
$$ plain form
39107 3168897 1317820 479326 341183 694087 1773630 3166553 3452102 1827355 -334152
39098 -334152 -631783 1377449 3227093 2337588 -767643 -3081337 -2776242 -1016812 181397
39089 181397 619474 1501519 3149040 4353292 3968856 2352101 1001271 1066742 2279041
39080 2279041 3289519 3134241 2134387 983315 -558358 -2986267 -5265574 -5313898 -2828961
39071 -2828961 -173570 559496 145187 642526 2244635 3293206 2900326 1975892 1711726
39062 1711726 2284593 3101746 3347864 2307995 53177 -2179306 -3031169 -2413747 -1308791
39053 -1308791 -484397 -51749 95144 150202 375090 619160 438381 274036 1457855
39044 1457855 3949372 5236945 3246434 -462176 -2508197 -2297350 -2438525 -4389468
$$ packed form
39107C168897j851077q38494j38143L52904J079543J392923K85549j624747k161507
39098c34152k97631K009232J849644q89505l105231k313694L05095J759430J198209
39089A81397M38077Q82045J647521J204252l84436j616755j350830O5471J212299
39080B279041J010478j55278r99854j151072j541673k427909k279307m8324K484937
39071b828961K655391P33066m14309M97339J602109J048571l92880r24434k64166
39062A711726N72867Q17153K46118j039869k254818k232483q51863O17422J104956
39053a308791Q24394M32648J46893N5058K24888K44070j80779j64345J183819
39044A457855K491517J287573j990511l708610k046021K10847j41175j950943
$$ plain form
39036 -4389468 -6180797 -5475710 -2861024 -610782 433636 1126642 1941984 2200053 1293641
39027 1293641 -346534 -1712823 -2206951 -2080941 -2025671 -2313218 -2490804 -2068647 -1105868
39018 -1105868 254927 2204487 4469703 5729800 4914365 2674078 493203 -1115299
39010 -1115299 -2263163 -2308050 -736287 993757 748852 -1118593 -2250104 -2121466 -2645522
39001 -2645522 -4165367 -3928939 -410132 3489568 4134352 2159992 969254 1549245 1876048
38992 1876048 912222 54433 241758 260683 -1123916 -3199450 -4424129 -4240025 -3103966
38983 -3103966 -1808564 -1246997 -1784120 -2486957 -2068791 -864052 -566613 -1650804 -2620146
38974 -2620146 -2527705 -2503961 -3446434 -3785857 -1625185 1829987 3393840 2228915 547886
$$ packed form
39036d389468j791329P05087K614686K250242J044418O93006Q15342K58069r06412
39027A293641j640175j366289m94128J26010N5270k87547j77586M22157R62779
39018a105868J360795J949560K265216J260097q15435k240287k180875j608502
39010a115299j147864m4887J571763J730044k44905j867445j131511J28638n24056
39001b645522j519845K36428L518807L899700O44784j974360j190738N79991L26803
38992A876048r63826q57789J87325J8925j384599k075534j224679J84104J136059
38983c103966J295402N61567n37123p02837M18166J204739K97439j084191r69342
38974b620146R2441K3744r42473l39423K160672L455172J563853j164925j681029
$$ plain form
38965 547886 -320612 -1689432 -3953112 -4193460 -331737 4181573 3852414 -944516 -3751051
38956 -3751051 -882504 3535331 3911022 1073064 -65788 1614684 2688273 1535422
38948 1535422 515030 1078986 1199953 -546363 -2107525 -1577582 -602715 -1344986 -2515274
38939 -2515274 -1601801 681753 1436862 38360 -1511761 -2095079 -2433663 -2750093 -2212301
38930 -2212301 -924196 -142166 -185677 -107011 401470 751877 1228752 2847251 5034142
38921 5034142 5588811 3737345 1403801 555476 861243 931352 524933 480129 1350312
38912 1350312 2865635 4115242 4052506 2670177 1571159 2132709 3293613 2850977 884834
38903 884834 -255055 331155 897522 465359 753741 2946353 4871024 3892381 1044950
$$ packed form
38965E47886q68498j368820k263680k40348L861723M513310l29159m796930k806535
38956c751051K868547M417835L75691k837958j138852J680472J073589j152851
38948A535422j020392N63956J20967j746316j561162N29943R74867p42271j170288
38939b515274R13473K283554P55109j398502j550121n83318l38584l16430N37792
38930b212301J288105P82030m3511P8666N08481L50407M76875J618499K186891
38921E034142N54669j851466k333544q48325L05767P0109m06419m4804Q70183
38912A350312J515323J249607o2736j382329j099018N61550J160904m42636j966143
38903H84834j139889N86210N66367m32163K88382K192612J924671r78643k847431
$$ plain form
38894 1044950 -459120 -3968 -85527 -2142943 -4370885 -4303921 -1787876 1385099 3515691
38885 3515691 3892766 2553712 58800 -2601567 -4228949 -3839488 -1440039 1391386
38877 1391386 2469167 1202108 -695307 -1225459 -158429 1442532 2656837 2746461 990173
38868 990173 -1985223 -3585659 -1813324 1892145 4052342 3190812 901987 -855721
38860 -855721 -1715143 -2101128 -2262978 -2430385 -2472709 -1302793 1812110 5389395 7101634
38851 7101634 7074634 7514911 8678186 7975991 4278595 418061 -516318 807976 1793597
38842 1793597 1756163 1426344 383535 -1884529 -3403170 -1549006 2726510 5561439 5261120
38833 5261120 3859781 3209970 2491482 667155 -1262649 -2027166 -2021043 -1873733 -885583
$$ packed form
38894A044950j504070M55152q1559k057416k227942O6964K516045L172975K130592
38885C515691L77075j339054k494912k660367j627382L89461K399449K831425
38877A391386J077781j267059j897415n30152J067030J600961J214305Q9624j756288
38868I90173k975396j600436J772335L705469K160197q61530k288825j757708
38860h55721q59422l85985j61850j67407m2324J169916L114903L577285J712239
38851G101634k7000M40277J163275p02195l697396l860534r34379J324294R85621
38842A793597l7434l29819j042809k268064j518641J854164M275516K834929l00319
38833E261120j401339o49811p18488j824327j929804p64517O123J47310R88150
$$ plain form
38824 -885583 1385354 3472519 3753671 2731091 1878642 1263894 137380 -924502 -444413
38815 -444413 1682022 4004078 5457262 6050088 5834426 4770472 3704187 3976532 5557745
38806 5557745 6589035 5332560 2078827 -1105947 -2255052 -1302812 -300834 -1315785
38798 -1315785 -3714508 -4464284 -1955190 1564567 2748668 1441469 400995 1292516
38790 1292516 3083115 4409792 5337274 6135780 6192350 5160533 3873389 3180126 2914039
38781 2914039 2763679 3121877 4248215 5462339 5957900 5766147 5400662 5258267 5687320
38772 5687320 6734647 7586052 7457657 7307524 8981034 11907305 12582128 8952306 3836364
38763 3836364 1869305 3820535 6130839 5885053 4045975 3213983 3999107 4840295 4514404
$$ packed form
38824h85583K270937K087165K81152j022580q52449o14748j126514j061882M80089
38815d44413K126435K322056J453184N92826k15662j063954j066285K72345J581213
38806E557745J031290j256475l253733l184774j149105R52240J001978j014951
38798a315785k398723p49776K509094L519757J184101j307199j040474Q91521
38790A292516J790599J326677R27482P98506N6570j031817j287144o93263k66087
38781B914039j50360L58198J126338J214124M95561j91753l65485j42395M29053
38772E687320J047327Q51405j28395j50133J673510K926271O74823l629822n115942
38763C836364j967059J951230K310304k45786j839078q31992P85124Q41188l25891
$$ plain form
38754 4514404 3530211 3030204 3099038 2667907 1054048 -868431 -1554318 -768394 5450
38745 5450 -541902 -1754488 -1622118 933868 4603275 6548966 5044840 1575666 -256836
38736 -256836 1331479 4128457 4868563 3561818 2870707 3604780 3717736 2394605 1984162
38727 1984162 4033357 6113358 5280853 2694793 1604974 2035606 1080352 -1788766 -3371034
38718 -3371034 -1640259 925110 626088 -2606607 -5342654 -4820861 -1769772 707870
38710 707870 526755 -1122435 -1194835 1296257 3788891 3582500 1572107 775868 1957228
38701 1957228 3038590 2616148 1545632 747404 -66740 -711354 81712 2384684 4178270
38692 4178270 4187321 4003013 5792523 9068756 11279874 10860611 8444261 5616753 3507194
$$ packed form
38754D514404r84193n00007O8834m31131j613859j922479o85887P85924P73844
38745E450n47352j212586J32370K555986L669407J945691j504126l469174j832502
38736b56836J588315K796978P40106j306745o91111P34073J12956j323131m10443
38727A984162K049195K080001q32505k586060j089819M30632r55254k869118j582268
38718c371034J730775K565369k99022l232695k736047N21793L051089K477642
38710G07870j81115j649190p2400K491092K492634k06391k010393p96239J181360
38701A957228J081362m22442j070516p98228q14144o44614P93066K302972J793586
38692D178270R051j84308J789510L276233K211118m19263k416350k827508k109559
$$ plain form
38683 3507194 2297498 1572396 1405629 2784114 5824687 8011698 6388137 1850076
38675 1850076 -1166869 -289456 1883100 1925376 270071 -325563 1029563 3165689 5249157
38666 5249157 6755119 6361329 3697712 1246344 1585545 3444962 3558058 1913361 1653251
38657 1653251 3637960 4861128 3338085 1143400 801167 1524043 1303578 534313 1023685
38648 1023685 2786044 4180620 4445400 4186618 4006602 4294936 5714727 8258644 10322194
38639 10322194 10203206 8094610 5341475 2471361 -467050 -2325976 -1673592 862507
38631 862507 2899128 3239679 3018415 3548924 4395384 4198957 2506431 231019 -1212086
38622 -1212086 -1052774 189863 1356901 2132708 3096815 3926742 3140359 891398 139364
$$ packed form
38683C507194j209696p25102j66767J378485L040573K187011j623561m538061
38675A850076l016945Q77413K172556M2276j655305n95634J355126K136126K083468
38666E249157J505962l93790k663617k451368L39201J859417J13096j644697k60110
38657A653251J984709J223168j523043k194685l42233P22876k20465p69265M89372
38648A023685J762359J394576K64780k58782j80016K88334J419791K543917K063550
38639A0322194j18988k108596k753135k870114k938411j858926O52384K536099
38631H62507K036621L40551k21264N30509Q46460j96427j692526k275412j443105
38622a212086J59312J242637J167038P75807R64107Q29927p86383k248961p52034
$$ plain form
38613 139364 2630655 5265774 3833041 -515742 -2622015 -1144084 -272939 -2331402
38605 -2331402 -3681435 -1040656 2496661 2148676 -991524 -2147569 -653617 -120688
38597 -120688 -1543941 -1754115 659776 2914399 3046312 2993853 4518310 5745056 4414882
38588 4414882 1739020 310957 355165 577368 883929 1738928 2325247 1806730 1259440
38579 1259440 2080226 3510824 3968548 3896569 4883581 6467361 6223907 3179941 -688349
38570 -688349 -2697852 -2028999 -6389 1241989 489268 -1510140 -2839576 -2612223 -1612557
38561 -1612557 -537985 989879 2982461 4296315 4445457 4662225 5783596 6584243 5778089
38552 5778089 4235116 3485968 3384745 3049478 2744830 2919616 2794421 1965780 1880946
$$ packed form
38613A39364K491291K635119j432733m348783k106273J477931Q71145k058463
38605b331402j350033K640779L537317l47985l140200j156045J493952N32929
38597a20688j423253k10174K413891K254623J31913n2459J524457J226746j330174
38588D414882k675862j428063M4208K22203L06561Q54999N86319n18517n47290
38579A259440Q20786J430598M57724p1979R87012J583780k43454l043966l868290
38570f88349k009503O68853K022610J248378p52721j999408j329436K27353R99666
38561a612557J074572J527864J992582J313854J49142K16768J121371Q00647q06154
38552E778089j542973p49148j01223l35267l04648J74786j25195q28641q4834
$$ plain form
38543 1880946 3338302 4099772 1918742 -1266497 -1421277 1927778 5230689 5757087 3980956
38534 3980956 1485307 -476202 -454203 2141566 5300728 6340875 5471816 4894759 4950087
38525 4950087 4248718 2981307 2414323 1564721 -1304745 -3902119 -1615168 5005773 9520942
38516 9520942 8244330 4815164 3652236 3674826 2170929 676801 2218390 5414666
38508 5414666 6196685 4004972 2009167 1932369 2474982 2594386 2943982 3818292 4355666
38499 4355666 4167991 3802993 3464220 2875569 2308042 2330476 2773156 3093857 3304397 3549972
38489 3549972 3538122 3319047 3545074 3953294 3039132 613426 -817461 999267 4881922
38480 4881922 7688080 7960709 6566123 4825502 3653205 3550873 3941387 3495641 2322715
$$ packed form
38543A880946J457356P61470k181030l185239j54780L349055L302911N26398j776131
38534C980956k495649j961509K1999K595769L159162J040147q69059n77057N5328
38525D950087p01369j267411n66984q49602k869466k597374K286951O620941M515169
38516I520942j276612l429166j162928K2590j503897j494128J541589L196276
38508E414666P82019k191713j995805p6798N42613J19404L49596Q74310N37374
38499D355666j87675l64998l38773n88651n67527K2434M42680L20701K10540K45575
38489C549972j1850k19075K26027M08220r14162k425706j430887J816728L882655
38480D881922K806158K72629j394586j740621j172297j02332L90514m45746j172926
$$ plain form
38471 2322715 2369427 4262726 5596849 4275821 1800539 943749 1691549 2037711 1593210
38462 1593210 1730668 2908087 4287289 5406511 6053480 5190208 2250161 -1013014 -2021846
38453 -2021846 -324492 2508091 5100530 6865393 7560304 7885212 9100505 10430598
38445 10430598 8904049 3981741 -64038 485967 3215775 3175092 368998 -767886
38437 -767886 1512353 4330710 5377868 5616089 5998900 5425538 3386691 1662533 1936934
38428 1936934 3723207 5389685 5563097 3583846 508919 -831568 973877 3452460
38420 3452460 3526151 2105870 2196089 3597346 3491434 1593329 359315 332898 -194730
38411 -194730 -914137 271581 2406426 2006491 -724271 -1506897 820046 2185765 363094
$$ packed form
38471B322715M6712J893299J334123j321028k475282q56790P47800L46162m44501
38462A593210J37458J177419J379202J119222O46969q63272k940047l263175j008832
38453b021846J697354K832583K592439J764863O94911L24908J215293J330093
38445A0430598j526549m922308m045779N50005K729808m0683k806094j136884
38437g67886K280239K818357J047158K38221L82811n73362k038847j724158K74401
38428A936934J786273J666478J73412j979251l074927j340487J805445K478583
38420C452460P3691j420281R0219J401257j05912j898105j234014k6417n27628
38411a94730p19407J185718K134845l99935k730762p82626K326943J365719j822671
$$ plain form
38402 363094 -1361575 -343560 948380 94762 -641957 1018043 2572883 1290037 -295392
38393 -295392 1512505 5128179 6596692 6399974 7892811 10733587 11423842 9543577 8240366
38384 8240366 8672647 8704573 7438901 6732594 7379370 7447038 5591437 3277489 2632098
38375 2632098 3967784 5910573 6547268 4742252 1803345 934410 3226108 5505216
38367 5505216 4467768 1459979 263227 1518311 2821926 3371225 4601713 6474388
38359 6474388 6950958 5442025 3432379 1541724 -623611 -1634150 816219 5457140
38351 5457140 7879543 6666628 5370707 6776812 8835711 8500248 6341735 4618300
38343 4618300 3352778 1324531 -848532 -1497901 -645575 440353 1541857 3281280
$$ packed form
38402C63094j724669J018015J291940q53618p36719J660000J554840j282846j585429
38393b95392J807897L615674J468513j96718J492837K840776O90255j880265j303211
38384H240366M32281L1926j265672p06307O46776O7668j855601k313948o45391
38375B632098J335686J942789O36695j805016k938907q68935K291698K279108
38367E505216j037448l007789j196752J255084J303615N49299J230488J872675
38359F474388M76570j508933k009646j890655k165335j010539K450369M640921
38351E457140K422403j212915j295921J406105K058899l35463k158513j723435
38343D618300j265522k028247k173063o49369Q52326J085928J101504J739423
$$ plain form
38335 3281280 5377145 6877611 7417085 6825388 4559183 1126555 -1052438 -112909 2718258
38326 2718258 4810497 5526240 6043882 6581475 6097050 4613218 3737175 4525481 6310688
38317 6310688 7796015 8069931 6741944 4555399 3639386 5425848 8385257 9676328
38309 9676328 9037732 8869214 10186005 11102867 10321050 9416593 9804428 9827992 7528353
38300 7528353 4555400 4110897 5915552 6652462 5272416 4325662 5351966 6437703 5926478
38291 5926478 5418979 6695141 8144781 7222801 4811221 3984516 5284232 6271844 5532833
38282 5532833 4305794 3961424 4402424 5352275 6840601 7795270 6435914 3031601 350765
38273 350765 313616 1805743 2807487 3170182 4134183 6260507 8877328 10760032 10797695
$$ packed form
38335C281280K095865J500466N39474n91697k266205l432628k178993R39529K831167
38326B718258K092239P15743N17642N37593m84425j483832q76043P88306J785207
38317F310688J485327K73916j327987k186545r16013J786462K959409J291071
38309I676328o38596j68518J316791R16862p81817r04457L87835K3564k299639
38300G528353k972953m44503J804655P36910j380046r46754J026304J085737n11225
38291E926478n07499J276162J449640r21980k411580q26705J299716R87612p39011
38282E532833j227039l44370M41000R49851J488326R54669j359356l404313k680836
38273C50765l7149J492127J001744L62695R64001K126324K616821J882704L7663
$$ plain form
38264 10797695 8914783 6582418 5228406 4157935 1818227 -788999 -443115 3638804
38256 3638804 7941384 9043532 7829216 7414789 8573884 9440720 8687994 6856226 5045064
38247 5045064 3997048 4145437 5256502 6325891 6690158 6667848 6498169 5661285 3974077
38238 3974077 2203732 905211 1222 36360 1883066 4384907 4784323 2944333 2423376
38229 2423376 5175295 7921385 6824537 3387272 1923719 2914720 3223819 2046173
38221 2046173 1980338 3948136 5500429 5331701 5477586 7094022 7452618 3883792 -1473215
38212 -1473215 -3738404 -1188635 3170226 5609026 5471228 4731490 4970677 5657280 5453911
38203 5453911 4545855 4557590 5915287 6695738 5184133 2423983 771812 884567 1805346
$$ packed form
38264A0797695j882912k332365j354012j070471k339708k607226L45884M081919
38256C638804M302580J102148j214316m14427J159095Q66836p52726j831768j811162
38247E045064j048016J48389J111065J069389L64267k2310j69679q36884j687208
38238C974077j770345j298521r03989L5138J846706K501841L99416j839990n20957
38229B423376K751919K746090j096848l437265j463553R91001L09099j177646
38221B046173o5835J967798J552293j68728J45885J616436L58596l568826n357007
38212a473215k265189K549769M358861K438800j37798p39738K39187O86603k03369
38203E453911r08056J1735J357697P80451j511605k760150j652171J12755R20779
$$ plain form
38194 1805346 3118098 4979980 6622020 6970520 6421362 5965157 5048747 2687001 290781
38185 290781 465846 2771671 3699211 1740935 -391045 -70761 1279159 691910 -1578539
38176 -1578539 -2258749 450451 4446343 6055161 3897235 126453 -1963112 -1326407
38168 -1326407 284264 1144157 1632803 2562839 2939091 1418434 -837083 -1172499 883151
38159 883151 3212769 4368949 4908712 5276100 4833131 3703502 3355828 4347212 5225798
38150 5225798 4510631 2250606 -826809 -3899541 -5320470 -3455203 789296 4142136
38142 4142136 4748515 4191513 4807588 6572451 7718831 7157291 5354793 3784285 3910648
38133 3910648 5651740 6922347 6130594 4604820 4411029 4538443 2622727 289092 2295392
$$ packed form
38194A805346J312752J861882J642040L48500n49158m56205r16410k361746k396220
38185B90781J75065K305825R27540j958276k131980L20284J349920n87249k270449
38176a578539o80210K709200L995892J608818k157926l770782k089565O36705
38168a326407J610671Q59893M88646R30036L76252j520657k255517l35416K055650
38159H83151K329618J156180N39763L67388m42969j129629l47674R91384Q78586
38150E225798p15167k260025l077415l072732j420929J865267M244499L352840
38142D142136O06379n57002O16075J764863J146380n61540j802498j570508J26363
38133C910648J741092J270607p91753j525774j93791J27414j915716k333635K006300
$$ plain form
38124 2295392 8918371 13617332 11185749 4756030 1165314 2006667 3277276 2239803
38116 2239803 385787 -129692 571431 1313235 1660825 1905955 2697149 4723583 7636181
38107 7636181 9696927 9617478 8100606 6524054 5132446 3784334 3237533 4059597 5332472
38098 5332472 6073011 6830420 8191318 9006920 8190280 7135593 7985285 10268167 11602245
38089 11602245 11165913 10202978 9605877 9322874 9708980 10982921 11592797 9741356 6644323
38080 6644323 5699414 7977517 10943550 12295377 12733627 13904456 15637414 16586350 16234595
38071 16234595 15166311 14462701 15574154 19456299 24911992 29059341 30539433 31181455
38063 31181455 33320062 36471290 38173919 37503093 35933290 34573495 32329426 27970652
$$ packed form
38124B295392O622979M698961k431583o429719l590716Q41353J270609j037473
38116B239803j854016n15479P01123P41804L47590K45130P91194K026434K912598
38107G636181K060746p9449j516872j576552j391608j348112n46801Q22064J272875
38098E332472P40539P57409J360898Q15602q16640j054687Q49692K282882J334078
38089A1602245m36332r62935n97101k83003L86106J273941O09876j851441l097033
38080F644323r44909K278103K966033J351827M38250J170829J732958R48936l51755
38071A6234595j068284p03610J111453L882145N455693M147349J480092O42022
38063C1181455K138607L151228J702629o70826j569803j359795k244069m358774
$$ plain form
38055 27970652 22976881 20474098 21083827 21469772 18267861 12527456 8565310 8697168
38047 8697168 10960026 12322267 12169438 11600889 10980341 9874548 8580103 8114173 8848305
38038 8848305 10085794 10815571 10421668 9147624 8143552 8237654 8522354 7492073 5835551
38029 5835551 6146258 9004343 11503561 11162744 9246070 8271300 8244353 7911679 8005659
38020 8005659 10004054 12584886 12713754 10203482 8208797 8869843 11030307 12627876
38012 12627876 12924248 11951308 10110762 8875510 9673810 11547371 12140972 11493139 12270507
38003 12270507 15339024 17812287 17092827 14502905 12865334 12390757 11412519 9953701
37995 9953701 9842351 11492665 12885202 12276439 10370428 9070544 9062863 9462207 9374309
$$ packed form
38055B7970652m993771k502783O09729L85945l201911n740405l962146J31858
38047H697168K262858J362241j52829n68549o20548j105793j294445m65930P34132
38038H848305J237489P29777l93903j274044j004072R4102K84700j030281j656522
38029E835551L10707K858085K499218l40817j916674r74770k6947l32674R3980
38020H005659J998395K580832J28868k510272j994685O61046K160464J597569
38012A2627876K96372r72940j840546j235252P98300J873561N93601o47833P77368
38003A2270507L068517K473263p19460k589922j637571m74577r78238j458818
37995I953701j11350J650314J392537o08763j906011j299884p681L99344q7898
$$ plain form
37986 9374309 8910452 8493088 7882840 6699776 5703451 6387609 8827509 11025685 11306538
37977 11306538 10410675 10036301 10237365 9916098 9270655 9742072 11548375 13137694 13388493
37968 13388493 12709742 11581198 9607248 6655532 3672888 1788777 1525806 2970943
37960 2970943 5511460 7448781 7421606 6278249 5874989 6119013 5495375 4766802 7155290
37951 7155290 13411497 19357415 20581579 17711363 14661917 13214501 12161138 10974342
37943 10974342 11158552 13478674 16181776 16995904 15622338 13573380 12459592 12881718
37935 12881718 14266329 15428620 15713699 15546049 15462082 15123937 14160761 13461377 14312986
37926 14312986 16408695 18106257 18749535 19225879 19825680 19210703 16582245 13614800 12781305
$$ packed form
37986I374309m63857m17364o10248j183064r96325O84158K439900K198176K80853
37977A1306538q95863l74374K01064l21267o45443M71417J806303J589319K50799
37968A3388493o78751j128544j973950k951716k982644j884111k62971J445137
37960B970943K540517J937321k7175j143357m03260K44024o23638p28573K388488
37951G155290O256207N945918J224164k870216l049446j447416j053363j186796
37943A0974342J84210K320122K703102Q14128j373566k048958j113788M22126
37935A2881718J384611J162291K85079j67650q3967l38145r63176o99384Q51609
37926A4312986K095709J697562O43278M76344N99801o14977k628458k967445q33495
$$ plain form
37917 12781305 14413166 16756537 18439285 19417754 19802845 19552467 19570058 21251599 24082102
37908 24082102 25318034 23390351 20303449 18975420 19229189 18531170 16192217 14430153
37900 14430153 15007716 17018787 18748879 19849869 20693138 21156829 21121824 20880671 20249806
37891 20249806 18754610 17455705 18662892 22584928 26244154 27376014 27400268 28388608
37883 28388608 29140057 27322612 24140616 23282552 25548762 27908978 28215547 27754311 28323815
37874 28323815 29557723 30388710 30961046 31699730 32092010 31599349 30585806 29553232 28621389
37865 28621389 28267506 29222307 31083983 32361860 32437719 32298219 32998114 34595326 36643519
37856 36643519 38311244 38209678 36015454 34164691 35604933 39663012 42689152 43214702
$$ packed form
37917A2781305J631861K343371J682748R78469L85091k50378J7591J681541K830503
37908B4082102J235932j927683l086902j328029K53769o98019k338953j762064
37900A4430153N77563K011071J730092J100990Q43269M63691l5005k41153o30865
37891B0249806j495196j298905J207187L922036L659226J131860K4254R88340
37883B8388608P51449j817445l181996q58064K266210K360216L06569m61236N69504
37874B8323815J233908Q30987N72336P38684L92280m92661j013543j032574r31843
37865B8621389l53883R54801J861676J277877P5859j39500O99895J597212K048193
37856C6643519J667725j01566k194224j850763J440242M058079L026140N25550
$$ plain form
37848 43214702 43572363 45545142 47613524 48145971 48232913 49029459 49011442 46813739 44724921
37839 44724921 46063966 50265374 53624284 54188905 53087522 51577380 49838178 48865744
37831 48865744 50696685 55579688 60595856 62303525 60250164 57454846 57543695 61121590
37823 61121590 64978871 65842784 64822288 66100120 70718638 74731300 75499375 76537640
37815 76537640 82277572 90339296 94180764 92843062 92526884 97325661 103623192 106445188
37807 106445188 106988898 109734605 115023082 119388489 122079129 126350578 133815574 141747332
37799 141747332 147586548 152690191 159218082 165982516 170648194 174590844 181878943 193410539
37791 193410539 205416405 214856726 223504331 234841967 249027430 263267576 275862825
$$ packed form
37848D3214702L57661J972779K068382N32447Q6942P96546j8017k197703k088818
37839D4724921J339045M201408L358910N64621j101383j510142j739202r72434
37831D8865744J830941M883003N016168J707669k053361k795318Q8849L577895
37823F1121590L857281Q63913j020496J277832M618518M012662P68075J038265
37815G6537640N739932Q061724L841468j337702l16178M798777O297531K821996
37807A06445188N43710K745707N288477M365407K690640M271449P464996P931758
37799A41747332N839216N103643O527891O764434M665678L942650P288099J1531596
37791A93410539J2005866R440321Q647605J1337636J4185463J4240146J2595249
$$ plain form
37784 275862825 287456929 299023780 311039027 324411621 339988313 357024039 374015011
37777 374015011 390951193 408718055 426441093 441942466 455118276 468219321 482053495
37770 482053495 494480227 503650867 510157764 514746947 516613829 515635735 513565504 510755869
37762 510755869 504172861 491447673 474984045 459105630 444612570 429098778 411355173
37755 411355173 392283764 372362327 351526755 331210396 313350338 297350579 280877782
37748 280877782 263770736 248386917 235801425 224368404 212577305 200868392 189994823
37741 189994823 179812117 170247622 161367434 152132020 141429892 130802430 123542801
37734 123542801 120181421 117313338 112060190 105406239 99776827 95528413 91557790 87558281
$$ packed form
37784B75862825J1594104J1566851J2015247J3372594J5576692J7035726J6990972
37777C74015011J6936182J7766862J7723038J5501373J3175810J3101045J3834174
37770D82053495J2426732R170640O506897M589183J866882r78094k070231k809635
37762E10755869o583008j2725188j6463628j5878415j4493060j5513792j7743605
37755D11355173j9071409j9921437k0835572k0316359j7860058j5999759j6472797
37748B80877782j7107046j5383819j2585492j1433021j1791099j1708913j0873569
37741A89994823j0182706r564495q880188r235414j0702128j0627462p259629
37734A23542801l361380k868083n253148o653951n629412m248414l970623l999509
$$ plain form
37726 87558281 83747509 79650782 74964512 70750615 68246357 67111693 65990628 64157230
37718 64157230 61727506 59056559 56784777 55642944 55369154 54574932 52349435 49194308
37710 49194308 45918587 42688500 39678805 37415431 35833049 34269853 33033565 33494219
37702 33494219 35749308 37673619 37378888 35357467 33248808 31903427 31657510 32830914
37694 32830914 34543129 34625518 32405490 30211077 30297581 31515795 31041487 28455738 26018778
37685 26018778 25476447 26461580 27604475 27629762 25958465 23718869 23267275 25079015 26332413
37676 26332413 24640480 21779509 20908890 21337917 19808993 16562005 15726914 18742958
37668 18742958 21640740 21034016 19189105 20035857 22858366 23749853 21895089 20482952
$$ packed form
37726H7558281l810772m096727m686270m213897k504258j134664j121065j833398
37718F4157230k429724k670947k271782j141833k73790p94222k225497l155127
37710D9194308l275721l230087l009695k263374j582382j563196j236288M60654
37702C3494219K255089J924311k94731k021421k108659j345381k45917J173404
37694C2830914J712215Q2389k220028k194413Q6504J218214m74308k585749k436960
37685B6018778n42331R85133J142895K5287j671297k239596m51594J811740J253398
37676B6332413j691933k860971q70619M29027j528924l246988q35091L016044
37668A8742958K897782o06724j844911Q46752K822509Q91487j854764j412137
$$ plain form
37660 20482952 21532584 23289779 23526596 22578546 21658331 20257834 17263409 13723601
37652 13723601 12501334 14902648 18781972 20590741 18904626 15518290 13323873 13679748
37644 13679748 15865637 18281861 19485637 18612939 15992240 13460104 13004881 14672094
37636 14672094 16609202 17478467 17808201 18463026 19019996 18744063 18235846 18664623 19725328
37627 19725328 19718903 17771778 15058461 13656133 14652374 17174496 18864449 17872348 15006958
37618 15006958 13172335 13852179 15142876 14513217 12378616 11014360 10814415 10208805 9045984
37609 9045984 9137210 10862498 12011408 11135903 9566948 8738806 8027947 7060272 7643832
37600 7643832 10826755 14009944 13993722 11605387 10283994 10988580 11641764 11113202 10509790
$$ packed form
37660B0482952J049632J757195K36817r48050r20215j400497k994425l539808
37652A3723601j222267K401314L879324J808769j686115l386336k194417L55875
37644A3679748K185889K416224J203776q72698k620699k532136m55223J667213
37636A4672094J937108Q69265L29734O54825N56970k75933n08217M28777J060705
37627A9725328o425j947125k713317j402328R96241K522122J689953r92101k865390
37618A5006958j834623O79844J290697o29659k134601j364256j99945o05610j162821
37609I045984R1226J725288J148910q75505j568955q28142p10859r67675N83560
37600G643832L182923L183189j6222k388335j321393P04586O53184n28562o03412
$$ plain form
37591 10509790 10458384 10144179 9426399 9147258 8963616 7693183 6269506 7214817 10218979
37582 10218979 11458797 8942933 5638817 5197268 7028621 8012315 7127219 5824878
37574 5824878 5173910 5081792 5521703 6482612 7234448 7105837 6344299 5253484 3659244
37565 3659244 2134272 2083655 3482563 4441656 4248062 4479951 5576025 5258482 2731867
37556 2731867 1301692 3466322 6306551 5913692 3823646 3990196 5358834 3542807
37548 3542807 -844594 -2132378 1296060 4127768 2455747 -636450 -816562 993268
37540 993268 1482837 476199 -241376 -635885 -1260070 -810239 1573642 3583465 2783400
37531 2783400 707681 596496 2463091 3687280 3384207 2976860 3195064 3445220 3617568
$$ packed form
37591A0509790n1406l14205p17780k79141j83642j270433j423677R45311L004162
37582A0218979J239818k515864l304116m41549J831353R83694q85096j302341
37574E824878o50968r2118M39911R60909P51836j28611p61538j090815j594240
37565C659244j524972n0617J398908R59093j93594K31889J096074l17543k526615
37556B731867j430175K164630K840229l92859k090046J66550J368638j816027
37548C542807m387401j287784L428438K831708j672021l092197j80112J809830
37540I93268M89569j006638p17575l94509o24185M49831K383881K009823q00065
37531B783400k075719j11185J866595J224189l03073m07347K18204K50156J72348
$$ plain form
37522 3617568 3982769 3935610 3123068 2851082 3979690 4624646 2715613 -297627 -1374240
37513 -1374240 -556272 -340791 -1075053 -735704 778522 1007711 -734929 -1921901 -900041
37504 -900041 608405 544988 -454467 -576098 628354 2500038 4303885 4937990 3380851
37495 3380851 520934 -1051196 -117197 1639129 1894121 116716 -2682566 -4981552
37487 -4981552 -5112039 -2520288 688129 1370347 -752393 -2674125 -2208442 -389143 1014500
37478 1014500 1986045 2974595 3339176 2721589 2232559 2801448 3910455 5066835 6584725
37469 6584725 7727237 6420646 2502540 -1007971 -1792623 -1142979 -943209 -286626 2157002
37460 2157002 4735066 5099156 4065257 3700388 3243522 929527 -1441594 -435465 2892755
$$ packed form
37522C617568L65201m7159q12542k71986J128608O44956j909033l013240j076613
37513a374240Q17968K15481p34262L39349J514226K29189j742640j186972J021860
37504i00041J508446o3417r99455j21631J204452J871684J803847O34105j557139
37495C380851k859917j572130R33999J756326K54992j777405k799282k298986
37487d981552j30487K591751L208417O82218k122740j921732M65683J819299J403643
37478A014500R71545R88550L64581o17587m89030N68889J109007J156380J517890
37469F584725J142512j306591l918106l510511p84652O49644J99770O56583K443628
37460B157002K578064L64090j033899l64869m56866k313995k371121J006129L328220
$$ plain form
37451 2892755 3657015 531302 -2187266 -1355046 515524 -188404 -2804079 -4427101 -4443610
37442 -4443610 -3928201 -2685641 -185136 1901995 1329751 -1079481 -2224019 -1104929
37434 -1104929 66828 -433463 -1224845 -60241 2623215 3959684 2414849 40971
37426 40971 -73423 1825158 2137818 -966353 -4457897 -4612642 -2606017 -2560940 -4734980
37417 -4734980 -4961684 -1628554 1255338 134521 -2917216 -4213995 -4244101 -5479314 -7037079
37408 -7037079 -6189804 -3702915 -2912762 -4070397 -4181679 -2446344 -1305676 -1564882 -1093136
37399 -1093136 361966 -389394 -4546500 -8311899 -8107829 -5450613 -3535329 -2007690
37391 -2007690 1031395 4034181 3456166 -532650 -3749978 -3618751 -1889984 -1223876 -1777966
$$ packed form
37451B892755P64260l125713k718568Q32220J870570p03928k615675j623022j6509
37442d443610N15409J242560K500505K087131n72244k409232j144538J119090
37434a104929J171757n00291p91382J164604K683456J336469j544835k373878
37426D0971j14394J898581L12660l104171l491544j54745K006625M5077k174040
37417d734980k26704L333130K883892j120817l051737j296779l0106j235213j557765
37408g037079Q47275K486889P90153j157635j11282J735335J140668k59206M71746
37399a093136J455102p51360m157106l765399K04070K657216J915284J527639
37391b007690L039085L002786n78015l988816l217328J31227J728767O66108n54090
$$ plain form
37382 -1777966 -2119376 -1485833 -172915 911729 478267 -2041358 -5109633 -6035605 -3858026
37373 -3858026 -311663 2384973 3615633 3846732 3179244 1330586 -1328707 -3392336
37365 -3392336 -3367239 -1276384 808688 747053 -847437 -1074301 1112160 2876878 1357930
37356 1357930 -1951546 -3286039 -2162098 -1618814 -2976682 -3945267 -2971585 -1963432 -2550567
37347 -2550567 -2597367 462583 4728877 5809550 3010271 219229 397857 2123708 2527239
37338 2527239 1239469 -71580 -417540 -43603 774147 1842923 2332054 1389240 -391737
37329 -391737 -1227001 -302390 1071532 1084464 -204693 -915945 150257 1777509 1670642
37320 1670642 -794918 -3879746 -5544395 -5460409 -4661818 -3939996 -3334975 -2852361 -2748678
$$ packed form
37382a777966l41410O33543J312918J084644m33462k519625l068275r25972K177579
37373c858026L546363K696636J230660K31099o67488j848658k659293k063629
37365c392336K5097K090855K085072o1635j594490k26864K186461J764718j518948
37356A357930l309476j334493J123941N43284j357868r68585R73682J008153n87135
37347b550567m6800L059950M266294J080673k799279k791042J78628J725851M03531
37338B527239j287770j311049l45960L73937Q17750J068776M89131r42814j780977
37329c91737q35264R24611J373922J2932j289157p11252J066202J627252j06867
37320A670642k465560l084828j664649Q3986P98591P21822O05021M82614J03683
$$ plain form
37311 -2748678 -2943670 -2848278 -2185013 -1540045 -1558330 -1776140 -926833 1360151 3722043
37302 3722043 4482354 3581216 2333771 1457999 505692 -495959 -339743 1350843 2738940
37293 2738940 2197785 1229684 2581719 5672089 6723262 4174416 1056056 255608 121146
37284 121146 -2363889 -5949078 -6422757 -3013102 344000 798353 168255 1150007 2936349
37275 2936349 3102945 1835092 1390089 2344657 3132320 3020217 3029840 3690626 4130455 3974314
37265 3974314 4128493 4773643 4376380 2004602 -721279 -1473494 -163329 1296565 1501570
37256 1501570 530706 -961718 -2160428 -1988339 -170038 1681140 1550043 -326166 -1773182
37247 -1773182 -1748733 -1352898 -1397214 -1021647 217559 857508 -175781 -1367297 -810449
$$ packed form
37311b748678j94992R5392O63265O44968j8285k17810Q49307K286984K361892
37302C722043P60311r01138j247445q75772r52307j001651J56216J690586J388097
37293B738940n41155r68101J352035L090370J051173k548846l118360q00448j34462
37284A21146k485035l585189m73679L409655L357102M54353o30098R81752J786342
37275B936349J66596j267853m45003R54568P87663j12103R623O60786M39829j56141
37265C974314J54179O45150l97263k371778k725881p52215J310165J459894K05005
37256A501570r70864j492424j198710J72089J818301J851178j31097j876209j447016
37247a773182K4449L95835m4316L75567J239206O39949j033289j191516N56848
$$ plain form
37238 -810449 597446 621772 -430358 -202858 1398744 1530042 -1045550 -3600228 -3329122
37229 -3329122 -1296099 -363465 -936676 -1209259 -472529 398494 1160854 2387506 3606711
37220 3606711 3632650 2833916 2749867 3216356 2406416 363977 -268658 1547301 2914938
37211 2914938 1061947 -2279632 -3226918 -1171008 984204 1257128 310446 -1037790 -2899166
37202 -2899166 -4366286 -3486123 -516277 1305869 47483 -1878284 -1053137 2114417
37194 2114417 4283169 3944018 2773194 2501388 2813712 2736863 2192475 1484856 668430
37185 668430 134231 731952 2604404 4622888 5442198 4577448 2378220 -232499 -1873267
37176 -1873267 -1492868 612406 3117500 4894476 5232413 3446054 -198811 -3410587
$$ packed form
37238h10449J407895K4326j052130K27500J601602J31298k575592k554678K71106
37229c329122K033023R32634n73211k72583P36730Q71023P62360J226652J219205
37220C606711K5939p98734q4049M66489q09940k042439o32635J815959J367637
37211B914938j852991l341579r47286K055910K155212K72924r46682j348236j861376
37202b899166j467120Q80163K969846J822146j258386j925767Q25147L167554
37194B114417K168752l39151j170824k71806L12324p6849n44388p07619q16426
37185F68430n34199N97721J872452K018484Q19310q64750k199228k610719j640768
37176a873267L80399K105274K505094J776976L37937j786359l644865l211776
$$ plain form
37168 -3410587 -3716109 -1764608 -826430 -2296958 -3812088 -3065804 -1328809 -1080815 -1798869
37159 -1798869 -873656 1914346 3661784 2460458 -69555 -1343412 -1180563 -1197424 -1823425
37150 -1823425 -1623140 307657 2627244 3426423 3031600 3575675 5379828 5603617 2252632
37141 2252632 -1807728 -1721950 2649312 6141163 5321391 2848136 2792998 4558268 4602770
37132 4602770 2336057 646646 1122948 1975271 1018700 -1567554 -3806180 -3764339 -1102771
37123 -1102771 1924638 1976586 -1281098 -4020827 -3270989 -1216869 -1514900 -3287474 -3030694
37114 -3030694 -1219613 -1782594 -4992939 -6351716 -3792199 -855834 -652443 -1443863 -896875
37105 -896875 -253577 -967303 -1198045 542328 1743923 14700 -2250377 -1807887 -469613
$$ packed form
37168c410587l05522J951501R38178j470528j515130P46284J736995K47994p18054
37159a798869R25213K788002J747438j201326k530013j273857J62849j6861o26001
37150a823425K00285J930797K319587P99179l94823N44075J804153K23789l350985
37141B252632m060360Q5778M371262L491851q19772k473255n5138J765270M4502
37132D602770k266713j689411M76302Q52323r56571k586254k238626M1841K661568
37123a102771L027409N1948l257684k739729P49838K054120k98031j772574K56780
37114c030694J811081n62981l210345j358777K559517K936365K03391p91420N46988
37105h96875O43298p13726k30742J740373J201595j729223k265077M42490J338274
$$ plain form
37096 -469613 -2009705 -5169798 -5287039 -1947979 552402 363495 222194 1535545 1567552
37087 1567552 -1331410 -4025715 -3107946 -147804 631326 -1840890 -4673001 -5113928 -3374486
37078 -3374486 -1620970 -1466609 -2515168 -3034263 -2247826 -1562669 -2632799 -4724969 -5484214
37069 -5484214 -4092831 -2053341 -889511 -701773 -985179 -1200904 -559495 1004526 1738831
37060 1738831 -30976 -2920530 -3705124 -1805980 -109626 -655074 -1984068 -1894772 -574433
37051 -574433 446863 602636 89084 -1039105 -2164707 -1973388 -435398 435611 -740665
37042 -740665 -2480426 -2382529 -340369 1634709 2074012 1252641 256366 -129227 33879
37033 33879 -149265 -1308819 -2620512 -2778394 -2180482 -2501698 -3826754 -4315054 -3432099
$$ packed form
37096d69613j540092l160093j17241L339060K500381j88907j41301J313351L2007
37087A567552k898962k694305R17769K960142P79130k472216k832111m40927J739442
37078c374486J753516J54361j048559n19095P86437O85157j070130k092170p59245
37069e484214J391383K039490J163830J87738k83406k15725O41409J564021P34305
37060A738831j769807k889554p84594J899144J696354n45448j328994Q9296J320339
37051e74433J021296J55773n13552j128189j125602J91319J537990Q71009j176276
37042g40665j739761R7897K042160J975078M39303q21371r96275l85593J63106
37033C3879j83144j159554j311693j57882N97912l21216j325056m88300Q82955
$$ plain form
37024 -3432099 -3099483 -4287653 -4950570 -3430171 -1676598 -2279108 -3910082 -3024370 576934
37015 576934 3174636 2360359 11800 -808206 227068 1017030 -130248 -2963968 -5764681
37006 -5764681 -6734992 -5480023 -3346634 -1861742 -1104506 -360515 118685 -686918 -2694392
36997 -2694392 -4369130 -4531609 -3493636 -2115137 -686283 795835 1941887 2144742
36989 2144742 1261353 -112596 -1076230 -1250694 -1086650 -971624 -353050 1193553 2166899
36980 2166899 264758 -3948310 -6483579 -4669145 -846511 775914 -324520 -1200753
36972 -1200753 -428312 266933 -346804 -717213 895300 3685769 5631963 6079551 5713869
36963 5713869 5143596 4750614 5046008 6042564 6882209 6882645 6305482 5504862 4242407 2626595
$$ packed form
37024c432099L32616j188170o62917J520399J753573o02510j630974Q85712L601304
37015E76934K597702q14277k348559q20006J035274P89962j147278k833720k800713
37006e764681r70311J254969K133389J484892P57236P43991M79200q05603k007474
36997b694392j674738j62479J037973J378499J428854J482118J146052K02855
36989B144742q83389j373949r63634j74464J64044J15026O18574J546603R73346
36980B166899j902141m213068k535269J814434L822634J622425j100434q76233
36972a200753P72441O95245o13737l70409J612513K790469J946194M47588l65682
36963E713869n70273l92982K95394R96556Q39645M36n77163q00620j262455j615812
$$ plain form
36953 2626595 1764298 2381173 3438788 3236736 1542339 -292670 -1035947 -560632 561615
36944 561615 1535052 1541099 396666 -834425 -620069 1324634 3544451 4354368 3512251
36935 3512251 2072252 875045 -212585 -1474486 -2479503 -2701851 -2587818 -2975191 -3475573
36926 -3475573 -2714786 -679020 501773 -800424 -3250129 -4036737 -2182746 864005
36918 864005 3246710 3914100 2585573 293239 -594071 1084707 3100791 2477814 10243
36909 10243 -735341 860259 1191987 -1863285 -5376562 -5828070 -4263048 -3910180 -4783151
36900 -4783151 -4244972 -1772430 479192 1467581 2187677 2732886 1814949 -98746 -351464
36891 -351464 1886261 3870672 3227442 1369560 1009464 2090038 2481569 1539905 563618
$$ packed form
36953B626595q62297O16875J057615k02052j694397j835009p43277M75315J122247
36944E61615R73437O047j144433j231091K14356J944703K219817Q09917q42117
36935C512251j439999j197207j087630j261901j005017k22348J14033l87373n00382
36926c475573P60787K035766J180793j302197k449705p86608J853991L046751
36918H64005K382705O67390j328527k292334q87310J678778K016084o22977k467571
36909A0243p45584J595600L31728l055272l513277m51508J565022L52868q72971
36900d783151N38179K472542K251622R88389P20096N45209r17937j913695k52718
36891c51464K237725J984411o43230j857882l60096J080574L91531r41664r76287
$$ plain form
36882 563618 162468 -605008 -2260736 -3826264 -4302954 -4003107 -3629082 -2803457 -520464
36873 -520464 2978003 5627616 5548777 3431413 1935565 2289627 2566299 474545 -3038688
36864 -3038688 -4830309 -3916810 -2592618 -2788314 -3593059 -3549931 -3328781 -4244207 -5573779
36855 -5573779 -5520275 -4088998 -3016361 -3245590 -4239576 -5418090 -6423863 -6179670 -3710156
36846 -3710156 -147532 1919323 1601454 626584 560699 749865 -21723 -1167142 -905301
36837 -905301 1364237 4304611 6060998 5925815 4791639 4153803 4445712 4540227 3365940
36828 3365940 1560259 602715 745384 1070194 1254986 1673179 1893542 1014691 -331553
36819 -331553 -416847 706179 1098692 463980 1044943 3491386 4698759 2323069 -942246
$$ packed form
36882E63618m01150p67476j655728j565528m76690K99847L74025Q25625K282993
36873e20464L498467K649613p8839k117364j495848L54062K76672k091754l513233
36864c038688j791621R13499J324192j95696q04745M3128K21150r15426j329572
36855e573779N3504J431277J072637k29229r93986j178514j005773K44193K469514
36846c710156L562624K066855l17869r74870o5885J89166p71588j145419K61841
36837i05301K269538K940374J756387j35183j134176o37836K91909R4515j174287
36828C365940j805681r57544J42669L24810J84792M18193K20363q78851j346244
36819c31553q5294J123026L92513o34712N80963K446443J207373k375690l265315
$$ plain form
36810 -942246 -956367 1619900 2536300 754089 -83539 2468886 6007236 6927517 4820921
36801 4820921 1574197 -1443270 -3364717 -3033462 -467614 2146998 2905079 2688016 3514970
36792 3514970 5356666 6456247 6082220 4965206 3402172 1033000 -1356888 -1768571
36784 -1768571 495833 3469820 4450612 2663582 -309831 -2082193 -1229659 1709659
36776 1709659 4615403 5662518 5057819 4542285 5264797 6798988 8181319 8991111 9160316
36767 9160316 8572764 7305104 5667315 3710210 1384732 -518710 -537801 1626735 4146798
36758 4146798 4832379 3480592 1724345 967238 1324832 2254928 3185849 3565190 3209624
36749 3209624 2658551 2441079 2192696 1470234 1090943 2082427 3296382 2185906 -1199415
$$ packed form
36810i42246j4121K576267R16400j782211q37628K552425L538350R20281k106596
36801D820921l246724l017467j921447L31255K565848K614612P58081k17063Q26954
36792C514970J841696J099581l74027j117014j563034k369172k389888m11683
36784a768571K264404K973987R80792j787030k973413j772362Q52534K939318
36776A709659K905744J047115o04699n15534P22512J534191J382331Q09792J69205
36767I160316n87552j267660j637789j957105k325478j903442j9091K164536K520063
36758D146798O85581j351787j756247p57107L57594R30096R30921L79341l55566
36749C209624n51073k17472k48383p22462l79291R91484J213955j110476l385321
$$ plain form
36740 -1199415 -3210369 -1423821 1314091 384906 -3920641 -6398684 -4001276 35182
36732 35182 604567 -2856675 -6370830 -6629928 -4144679 -1539381 -486406 -747349 -1241342
36723 -1241342 -1390720 -1479980 -1890346 -2383305 -2617287 -2985276 -3946066 -4724018 -4116931 -2788828
36713 -2788828 -3005520 -5296871 -7114044 -6154758 -3560811 -2075000 -2136961 -1876948 -425767
36704 -425767 917214 904774 -61177 -982726 -1574091 -1984023 -2139878 -1893277 -1371843 -941576
36694 -941576 -911397 -1057021 -550414 757355 1033499 -1783015 -6203040 -7401329 -3127157
36685 -3127157 2425248 3323922 -662712 -4299399 -3994979 -1499062 -316497 -1480676
36677 -1480676 -3741952 -5407491 -4898488 -1607183 2617944 4532148 3033804 226027
$$ packed form
36740a199415k010954J786548K737912r29185m305547k478043K397408M036458
36732C5182N69385l461242l514155k59098K485249K605298J052975k60943m93993
36723a241342j49378q9260m10366m92959k33982l67989r60790p77952O07087J328103
36713b788828k16692k291351j817173R59286K593947J485811o1961K60013J451181
36704d25767J342981j2440r65951r21549n91365m09932j55855K46601N21434M30267
36694i41576L0179j45624N06607J307769K76144k816514m420025j198289M274172
36685c127157N552405Q98674l986634l636687L04420K495917J182565j164179
36677a480676k261276j665539N09003L291305M225127J914204j498344k807777
$$ plain form
36669 226027 -1604643 -2318194 -2609800 -2374348 -1503016 -736683 -616630 -748843 -753986 -684038
36659 -684038 -165998 1289271 2864385 3138492 2382335 2019492 1762481 103078 -2010169
36650 -2010169 -1500352 1690439 3515901 1863802 16683 1320304 3790925 3569370
36642 3569370 932158 -1179840 -2448639 -4608777 -7045844 -7486173 -6394696 -6332686 -7123946
36633 -7123946 -5927999 -2452548 47835 -118441 -753786 141085 1368178 1278863 544361
36624 544361 261234 -239712 -1646603 -2697048 -2016184 -496181 17541 -624753 -1115648
36615 -1115648 -764830 -10974 539486 610827 328078 363336 1289644 2444239 2483493 1455472
36605 1455472 1008656 1894235 2621996 1570032 -698767 -2333366 -2596798 -2344372 -2658176
$$ packed form
36669B26027j830670p13551k91606K35452Q71332P66333J20053j32213n143O9948
36659f84038N18040J455269J575114K74107p56157l62843k57011j659403k113247
36650b010169N09817L190791J825462j652099j847119J303621K470621k21555
36642C569370k637212k111998j268799k160138k437067m40329J091477O2010p91260
36633g123946J195947L475451K500383j66276o35345Q94871J227093q9315p34502
36624E44361k83127n00946j406891j050445O80864J520003N13722o42294m90895
36615a115648L50818P53856N50460P1341k82749L5258R26308J154595L9254j028021
36605A455472m46816Q85579P27761j051964k268799j634599k63432K52426l13804
$$ plain form
36596 -2658176 -3822483 -5218492 -5673621 -4432429 -2245269 -923564 -1405250 -2825198
36588 -2825198 -3736685 -3475199 -2074804 74064 1822991 1501080 -1387288 -5078567 -7007040
36579 -7007040 -6280824 -4260409 -2852418 -2692083 -3002839 -2830524 -2005275 -797394 835349
36570 835349 2883042 4389068 4147530 2592126 1654383 2089394 2375552 1248487 -249463
36561 -249463 -687030 -641458 -1272356 -1922771 -1479154 -945675 -1961462 -3612555 -3679705 -2465569
36551 -2465569 -2105174 -2359219 -867894 1979557 2476164 -614703 -3366260 -2116595 1257456
36542 1257456 2161780 -621899 -4240454 -5802520 -4813562 -2485573 -527117 -114027 -866900
36533 -866900 -1412165 -1365690 -1447536 -1404731 -34496 1994130 2014185 -514908 -2449628 -1530770
$$ packed form
36596b658176j164307j396009m55129J241192K187160J321705m81686j419948
36588b825198r11487K61486J400395K148868J748927l21911k888368l691279j928473
36579g007040P26216K020415J407991J60335l10756J72315Q25249J207881J632743
36570H35349K047693J506026k41538j555404r37743M35011K86158j127065j497950
36561b49463m37567M5572o30898o50415M43617N33479j015787j651093o7150J214136
36551b465569L60395k54045J491325K847451M96607l090867k751557J249665L374051
36542A257456R04324k783679l618555j562066R88958K327989J958456M13090p52873
36533h66900n45265M6475q1846M2805J370235K028626K0055k529093j934720R18858
$$ plain form
36523 -1530770 48723 -837845 -3432603 -4732735 -4113083 -3130749 -2116059 -315155 1434507
36514 1434507 1482808 433371 419709 1549063 1912504 955132 -17948 -604325 -1600359
36505 -1600359 -2408987 -1289851 1168071 1849139 -454618 -2983254 -2742457 -161655 2295933
36496 2295933 3230715 2626669 816576 -1350311 -2610144 -2824254 -3245898 -4299822 -4613574
36487 -4613574 -3454862 -2478195 -3328263 -4838093 -4650951 -2780902 -1432789 -1678307 -2411769
36478 -2411769 -2588950 -2404184 -1837615 -154349 2084544 2373969 -602050 -4352128 -5144377
36469 -5144377 -2644837 177557 1626999 3117407 5655991 7278779 6043382 3443741
36461 3443741 2077582 1419181 -710939 -3289145 -2798721 738515 2597441 2035
$$ packed form
36523a530770J579493q86568k594758j300132O19652R82334J014690J800904J749662
36514A434507M8301j049437j3662J129354L63441r57372r73080n86377r96034
36505a600359q08628J119136K457922O81068k303757k528636K40797K580802K457588
36496B295933R34782o04046j810093k166887j259833k14110m21644j053924l13752
36487d613574J158712R76667q50068j509830J87142J870049J348113k45518p33462
36478b411769j77181J84766N66569J683266K238893K89425k976019l750078p92249
36469e144377K499540K822394J449442J490408K538584J622788j235397k599641
36461C443741j366159o58401k130120k578206M90424L537236J858926k595406
$$ plain form
36453 2035 -3611850 -3587421 -443722 1870245 2019683 2036585 3108673 4012568 3570079 2009188
36443 2009188 -88024 -2065312 -2697366 -1461239 75691 154479 -406128 517319 2893722
36434 2893722 4751961 5404469 5859441 6222047 5377132 3375451 1607197 454334 -733239
36425 -733239 -1276369 398028 3597674 5494762 5046273 4037291 3570916 2510503 420771
36416 420771 -1014204 -1005577 -1239209 -2639549 -3170886 -993029 2341888 3973705 3251464
36407 3251464 1358116 -704459 -1912362 -967719 1644428 3090645 1775948 -197005
36399 -197005 -239804 929409 1152990 646787 957064 1490075 391914 -1789633 -2525915
36390 -2525915 -1262364 -96664 -350245 -1022155 -1040331 -826258 -1067343 -1657726 -2245692
$$ packed form
36453B035l613885K4429L143699K313967J49438J6902J072088R03895m42489j560891
36443B009188k097212j977288o32054J236127J536930P8788n60607R23447K376403
36434B893722J858239O52508M54972L62606q44915k001681j768254j152863j187573
36425g33239n43130J674397L199646J897088m48489j008982m66375j060413k089732
36416D20771j434975Q627k33632j400340n31337K177857L334917J631817p22241
36407C251464j893348k062575j207903R44643K612147J446217j314697j972953
36399a97005m2799J169213K23581n06203L10277N33011j098161k181547p36282
36390b525915J263551J165700k53581o71910j8176K14073k41085n90383n87966
$$ plain form
36381 -2245692 -2471658 -1704591 50801 1312682 825573 -286006 74892 1752768 2593500
36372 2593500 1795613 857452 1047162 1977377 2939175 3667471 3472114 1602538 -1034217
36363 -1034217 -2354143 -1825002 -1059491 -1278371 -1856969 -1784410 -911618 547474 2039915
36354 2039915 2080768 -294345 -3234413 -3580271 -1204810 620167 -63858 -1569069 -2150337
36345 -2150337 -2963305 -5314473 -7455534 -6886630 -4259005 -2282270 -1800615 -1497951 -807042
36336 -807042 -665350 -1599682 -3063763 -4573931 -5905547 -6458637 -5951492 -5376378 -5813136
36327 -5813136 -6773461 -7146917 -7053410 -7048335 -6303419 -3761212 -620449 723589 133520
36318 133520 -265289 328324 341941 -1063371 -2414793 -2612331 -2883889 -4429344 -5976259
$$ packed form
36381b245692k25966P67067J755392J261881m87109j111579L60898J677876Q40732
36372B593500p97887r38161J89710R30215R61798P28296j95357j869576k636755
36363a034217j319926N29141P65511k18880n78598P2559Q72792J459092J492441
36354B039915M0853k375113k940068l45858K375461J824977o84025j505211n81268
36345b150337q12968k351168k141061N68904K627625J976735M81655L02664O90909
36336h07042J41692r34332j464081j510168j331616n53090N07145N75114m36758
36327e813136r60325l73456R3507N075P44916K542207L140763J344038n90069
36318A33520l98809N93613J3617j405312j351422j97538k71558j545455j546915
$$ plain form
36309 -5976259 -5636906 -3928634 -2971695 -3467636 -4290572 -4547159 -4299381 -3577083 -2434637
36300 -2434637 -1903259 -3060014 -4855894 -4712590 -2119861 -5718 -1121792 -4228702
36292 -4228702 -5699760 -4361504 -2626028 -2604740 -3312861 -2908216 -1849910 -1827002 -2654271
36283 -2654271 -2637680 -1656797 -1316447 -1756379 -1010894 1403407 2868830 1489599 -650509
36274 -650509 -516165 1210158 1379305 -633220 -2282365 -2024125 -1154626 -1044700 -1176719
36265 -1176719 -749376 -48173 582682 1155471 818241 -1574960 -4919143 -6298681 -5057442
36256 -5057442 -3920026 -4630102 -5212602 -3745985 -2200012 -3337722 -5624788 -4941283 -689507
36247 -689507 3307803 4076226 2547226 869383 -464420 -1769921 -2758033 -3248246 -3680051
$$ packed form
36309e976259L39353J708272R56939m95941q22936k56587K47778P22298J142446
36300b434637N31378j156755j795880J43304K592729K114143j116074l106910
36292d228702j471058J338256J735476K1288p08121M04645J058306K2908q27269
36283b654271J6591R80883L40350m39932P45485K414301J465423j379231k140108
36274f50509J34344J726323J69147k012525j649145K58240Q69499J09926j32019
36265a176719M27343P01203O30855N72789l37230k393201l344183j379538J241239
36256e057442J137416p10076n82500J466617J545973j137710k287066O83505M251776
36247f89507L997310P68423j529000j677843j333803j305501r88112m90213m31805
$$ plain form
36238 -3680051 -3940833 -3171287 -1603644 -1068448 -2596821 -4775996 -5558126 -4645142 -3121080
36229 -3121080 -1823301 -1211914 -1887427 -3855570 -5739956 -5894747 -4128206 -1570117 802627
36220 802627 2701370 3915057 4068331 3032110 1092538 -1186515 -2953856 -3324170 -2247298
36211 -2247298 -932195 -799282 -1970995 -3158065 -3051698 -1608659 -17407 444723 -395792
36202 -395792 -1461401 -1583015 -803226 -290572 -951782 -2427750 -3516260 -3311019 -1901354
36193 -1901354 -244952 616834 460008 -23242 -154526 17917 242859 788409 1950781
36184 1950781 3202032 3667737 3243094 2396302 1130716 -808068 -2851799 -3948836 -4019544
36175 -4019544 -3862059 -3576176 -2555944 -1310640 -1521704 -3387649 -4467452 -2568914 1177573
$$ packed form
36238c680051k60782P69546J567643N35196j528373k179175p82130R12984J524062
36229c121080J297779O11387o75513j968143j884386j54791J766541K558089K372744
36220H02627J898743J213687J53274j036221j939572k279053j767341l70314J076872
36211b247298J315103J32913j171713j187070J06367J443039J591252M62130q40515
36202c95792j065609j21614P79789N12654o61210j475968j088510K05241J409665
36193a901354J656402Q61786j56826m83250j31284J72443K24942N45550J162372
36184A950781J251251M65705m24643q46792j265586j938784k043731j097037p0708
36175d019544J57485K85883J020232J245304k11064j865945j079803J898538L746487
$$ plain form
36166 1177573 3529510 2871873 550754 -1164608 -1344047 -690724 -369257 -685993 -836794
36157 -836794 -277708 -70493 -1654494 -4118193 -4446130 -1500155 1875345 2371535 591244
36148 591244 -156489 1311783 2785432 2190883 116763 -1819130 -3248045 -4626501 -5823726
36139 -5823726 -6302209 -5995870 -5112038 -3608029 -1649787 -138397 49112 -819845 -1632063
36130 -1632063 -1814587 -1863489 -2378733 -3078871 -3206310 -2716721 -2431794 -2725090 -2645212 -1120853
36120 -1120853 1226790 2536156 2137178 1432550 1833674 2880172 3270735 2849138 2418083
36111 2418083 2229888 1977268 1934668 2713465 3848313 3879025 2180975 -140741 -1420153
36102 -1420153 -819559 1416069 4165343 5761837 5127447 3041300 1601555 2021762 3493274
$$ packed form
36166A177573K351937o57637k321119j715362j79439O53323L21467l16736j50801
36157h36794N59086K07215j584001k463699l27937K945975L375500M96190j780291
36148E91244p47733J468272J473649n94549k074120j935893j428915j378456j197225
36139e823726m78483L06339Q83832J504009J958242J511390J87509q68957q12218
36130a632063j82524m8902n15244p00138j27439M89589K84927k93296P9878J524359
36120a120853K347643J309366l98978p04628M01124J046498L90563m21597m31055
36111B418083j88195k52620m2600P78797J134848L0712j698050k321716j279412
36102a420153O00594K235628K749274J596494o34390k086147j439745M20207J471512
$$ plain form
36093 3493274 4497078 4608127 4563469 5011024 5707623 5833839 4862267 3173716 1815993
36084 1815993 1520917 2067354 2738434 3058245 2771510 1608741 -258047 -1853102 -2260237
36075 -2260237 -1697223 -1044993 -526394 324682 1503742 2255969 2059210 1188221 262321
36066 262321 -176623 197111 1073314 1508426 1201140 1346027 3017182 5067122 5245663
36057 5245663 3393111 1723299 1586978 1846159 1196111 185221 -258921 -534335 -1022538
36048 -1022538 -627800 1334366 2964333 1791260 -1646446 -4416583 -4963086 -4017731 -2155449
36039 -2155449 713044 3119268 2459474 -990221 -3195710 -1505207 1574771 2177707
36031 2177707 727674 658306 2651714 3792226 2437069 429214 -376996 -642200 -1165688
$$ packed form
36093C493274J003804J11049m4658M47555O96599J26216r71572j688551j357723
36084A815993k95076N46437O71080L19811k86735j162769j866788j595055m07135
36075b260237N63014O52230N18599Q51076J179060P52227j96759q70989r25900
36066B62321m38944L73734Q76203M35112l07286J44887J671155K049940J78541
36057E245663j852552j669812j36321K59181o50048j010890m44142k75414m88203
36048a022538L94738J962166J629967j173073l437706k770137n46503R45355J862282
36039b155449K868493K406224o59794l449695k205489J690503L079978O02936
36031B177707j450033o9368J993408J140512j355157k007855q06210k65204n23488
$$ plain form
36022 -1165688 -813047 1116067 2663789 1749783 -579227 -1660694 -723159 1171662 3258089
36013 3258089 4758440 3904988 256267 -3036677 -2602650 116795 790560 -1121347 -1714474
36004 -1714474 871498 3751797 4553934 4963603 6472899 6600236 2977689 -1763453 -3195068
35995 -3195068 -1191071 984537 2051490 3185304 4221554 3531150 1397400 -170349
35987 -170349 -918786 -2226674 -3678088 -3440423 -2153378 -2487828 -4233227 -3950417 -810418
35978 -810418 1315722 -280133 -2868618 -2662477 -425144 558785 -197659 -681944 -592733
35969 -592733 -1648796 -4075609 -5832133 -5553321 -3980010 -2271139 -858941 -175987 -662485
35960 -662485 -1614102 -1564732 -351033 462872 -192382 -1277254 -1002443 782906 2295848
$$ packed form
36022a165688L52641J929114J547722r14006k329010j081467R37535J894821K086427
36013C258089J500351q53452l648721l292944M34027K719445O73765j911907n93127
36004a714474K585972K880299Q02137M09669J509296J27337l622547m741142j431615
35995c195068K003997K175608J066953J133814J036250o90404k133750j567749
35987a70349p48437j307888j451414K37665J287045l34450j745399K82810L139999
35978h10418K126140j595855k588485K06141K237333R83929p56444m84285Q9211
35969e92733j056063k426813j756524K78812J573311J708871J412198O82954m86498
35960f62485r51617M9370J213699Q13905o55254j084872K74811J785349J512942
$$ plain form
35951 2295848 1861875 -144698 -1687094 -1455538 -449625 -575172 -1942581 -2632274 -1322435
35942 -1322435 1013439 2583270 2892019 2589493 2086314 1287833 174540 -1135070 -2473414
35933 -2473414 -3274765 -2813365 -1335177 -122814 235643 693585 1978572 2983109 2200984
35924 2200984 81619 -1452570 -1486730 -799523 -273117 41535 168636 -262386 -1259223
35915 -1259223 -2004988 -1682760 -481970 495346 333114 -629244 -945448 257958 1805630
35906 1805630 1542726 -836234 -3060252 -3068853 -1549101 -656207 -983921 -1171150 -217506
35897 -217506 1200076 1960280 2047921 2363610 3390794 4426138 4238734 2607426 941219
35888 941219 724889 1495616 1478546 374938 -52974 1048382 1783228 225470 -2353429
$$ packed form
35951B295848m33973k006573j542396K31556J005913j25547j367409o89693J309839
35942a322435K335874J569831L08749l02526n03179p98481j113293j309610j338344
35933b473414q01351M61400J478188J212363L58457M57942J284987J004537p82125
35924B200984k119365j534189l4160O87207N26406L14652J27101m31022r96837
35915a259223p45765L22228J200790R77316j62232r62358l16204J203406J547672
35906A805630k62904k378960k224018q601J519752Q92894l27714j87229R53644
35897b17506J417582P60204Q7641L15689J027184J035344j87404j631308j666207
35888I41219k16330P70727j7070j103608m27912J101356P34846j557758k578899
$$ plain form
35879 -2353429 -3131777 -1895653 -1104197 -1809397 -2037720 -124947 2434893 3016742 1424097
35870 1424097 -278675 -842057 -1053247 -1878215 -2838011 -2880264 -2026872 -1289812 -1179546
35861 -1179546 -1071162 -265578 849508 1180943 302084 -1002619 -1596378 -1103931 -143756
35852 -143756 357530 129185 -103435 411424 1040399 173893 -2297453 -3954241 -2762937
35843 -2762937 -346386 -280669 -3107481 -5313217 -4025897 -590367 1829052 2263213 1709903
35834 1709903 466426 -1860957 -4316991 -4927055 -3237204 -844377 816365 1823795
35826 1823795 2703348 3282549 3044352 1833622 -15301 -1774081 -2744384 -3099582 -3772858
35817 -3772858 -4860979 -5032607 -3552534 -1777445 -1048605 -245718 2217062 4755004 4107193
$$ packed form
35879b353429p78348J236124P91456p05200k28323J912773K559840N81849j592645
35870A424097j702772n63382k11190q24968r59796m2253Q53392P37060J10266
35861a179546J08384Q05584J115086L31435q78859j304703n93759M92447R60175
35852a43756N01286k28345k32620N14859O28975q66506k471346j656788J191304
35843b762937K416551O5717k826812k205736J287320L435530K419419M34161n53310
35834A709903j243477k327383k456034o10064J689851K392827J660742J007430
35826A823795Q79553N79201k38197j210730j848923j758780r70303l55198o73276
35817c772858j088121j71628J480073J775089P28840Q02887K462780K537942o47811
$$ plain form
35808 4107193 626398 -1321721 511744 2921102 2224887 -178878 -416981 1528642
35800 1528642 1972920 -443530 -2745113 -2446616 -1037385 -944506 -1682054 -1378145 -311811
35791 -311811 -239698 -1152954 -1382074 -670349 -632977 -1901460 -3089606 -3204324 -3004804 -3109916
35781 -3109916 -2713360 -1300801 158465 997890 2009850 3291490 2866722 -378715 -3969139
35772 -3969139 -4629589 -2749948 -1441083 -1973672 -2952929 -3398053 -3543037 -2858840 -652161
35763 -652161 1190912 -342731 -4386131 -6205616 -3652141 -268335 -52211 -2178280
35755 -2178280 -3278608 -2343070 -742321 459445 604580 -1238119 -4462561 -6182071
35747 -6182071 -4872071 -3012832 -3408755 -4760198 -4145109 -2246576 -2178455 -3952626 -4287092
$$ packed form
35808D107193l480795j948119J833465K409358o96215k403765k38103J945623
35800A528642M44278k416450k301583K98497J409231R2879p37548L03909J066334
35791c11811P2113r13256k29120P11725L7372j268483j188146j14718J99520j05112
35781c109916L96556J412559J459266Q39425J011960J281640m24768l245437l590424
35772c969139o60450J879641J308865n32589r79257m45124j44984O84197K206679
35763f52161J843073j533643m043400j819485K553475L383806K16124k126069
35755b178280j100328R35538J600749J201766J45135j842699l224442j719510
35747f182071J310000J859239l95923j351443O15089J898533O8121j774171l34466
$$ plain form
35738 -4287092 -2097582 -345796 -1425728 -3781163 -4464923 -2892644 -925249 -779623
35730 -779623 -3397832 -7343448 -9139991 -6510715 -1491861 1515323 940907 -687055
35722 -687055 -825387 67926 298480 -451437 -1466863 -2426259 -3319718 -3905307 -4039286
35713 -4039286 -3903370 -3644706 -3435356 -3646501 -4048769 -3404591 -1165810 1087129 1539257
35704 1539257 751280 396643 206329 -1189843 -2836480 -2068841 1078199 3200861 2246760
35695 2246760 142416 -520655 128195 653314 833949 1057997 1035615 758894 1175807
35686 1175807 2446025 3090599 2355824 1848677 3115659 4917562 4766172 2338520 -249056
35677 -249056 -1033980 107045 1781671 2173807 512018 -1805428 -2403918 -867488 647865
$$ packed form
35738d287092K189510J751786j079932k355435o83760J572279J967395J45626
35730g79623k618209l945616j796543K629276N018854L007184n74416j627962
35722f87055j38332Q93313K30554p49917j015426r59396q93459n85589j33979
35713d039286J35916K58664K09350k11145m02268O44178K238781K252939M52128
35704A539257p87977l54637j90314j396172j646637P67639L147040K122662r54101
35695B246760k104344o63071O48850N25119J80635K24048k2382k76721M16913
35686A175807J270218O44574p34775n07147J266982J801903j51390k427652k587576
35677b49056p84924J141025J674626L92136j661789k317446n98490J536430J515353
$$ plain form
35668 647865 423705 -602684 -676067 96926 333551 -351909 -1146645 -1525860 -1676600 -1788458
35658 -1788458 -1866280 -1966876 -2031248 -1886334 -1717985 -1848641 -1834674 -781345 1138736 2610027
35648 2610027 2949077 2692605 2115401 776914 -883355 -1320238 -245592 542804 2578
35639 2578 -160423 1913249 4930188 5758026 3455506 228381 -1434485 -1170587 -296609
35630 -296609 -29882 -390129 -465928 234310 862387 320923 -925210 -1353547 -759475 -556860
35620 -556860 -1300016 -1695818 -974933 -483437 -1525217 -3049652 -3155738 -1916747 -976703
35611 -976703 -870639 -425858 1145477 2851301 3064794 1469500 -581463 -1594793 -1443519
35602 -1443519 -843967 332839 2753192 5232738 4837480 1026972 -2399328 -2109200 -163696
$$ packed form
35668F47865k24160j026389p3383P72993K36625o85460p94736l79215j50740j11858
35658a788458p7822j00596o4372J44914J68349j30656J3967J053329J920081J471291
35648B610027L39050k56472n77204j338487j660269m36883J074646P88396n40226
35639B578j63001K073672L016939Q27838k302520l227125j662866K63898Q73978
35630b96609K66727l60247p5799P00238O28077n41464j246133m28337N94072K02615
35620e56860p43156l95802P20885M91496j041780j524435j06086J238991R40044
35611i76703J06064M44781J571335J705824K13493j595294k050963j013330J51274
35602a443519N99552J176806K420353K479546l95258l810508l426300K90128J945504
$$ plain form
35593 -163696 -710400 -3280351 -3833565 -1795246 -875335 -2404495 -3184307 -1476621 22635
35584 22635 -582406 -1133314 -161674 6924 -1722286 -2004290 814176 2037632 -2437382
35575 -2437382 -8369133 -8661968 -3932494 -917917 -1868146 -2384994 315410 3457947 4108075
35566 4108075 3118761 2144888 1150560 428146 1294795 3299000 3956861 2447708 702326
35557 702326 92430 -43279 -116340 352092 707686 -211143 -1098482 518462 3504384
35548 3504384 3755348 754761 -774442 2148054 5915157 5301196 517423 -3605029
35540 -3605029 -3727779 -879588 1643327 1505497 -750429 -2185788 -821285 1563813
35532 1563813 1784363 38402 -452881 1378187 3069770 3126967 3191033 4294938 4594322
$$ packed form
35593a63696n46704k569951n53214K038319R19911j529160p79812J707686J499256
35584B2635o05041n50908R71640J68598j729210k82004K818466J223456m475014
35575b437382n931751k92835M729474L014577r50229n16848K700404L142537O50128
35566D108075r89314r73873r94328p22414Q66649K004205O57861j509153j745382
35557G02326o09896j35709p3061M68432L55594r18829q87339J616944K985922
35548C504384K50964l000587j529203K922496L767103o13961m783773m122452
35540c605029j22750K848191K522915j37830k255926j435359J364503K385098
35532A563813K20550j745961m91283J831068J691583N7197O4066J103905K99384
$$ plain form
35523 4594322 2911885 1244820 1256169 1204699 -841019 -3260028 -3370580 -1691706 -766194
35514 -766194 -1286866 -2147461 -2969406 -3872024 -3899094 -2362022 -883645 -1553109 -3621108
35505 -3621108 -4335416 -2710606 -521951 143659 -1248632 -3766060 -5523141 -4753799 -1765977
35496 -1765977 806932 884731 -759770 -2097368 -2440289 -2078918 -757676 1586753 3531899
35487 3531899 3505892 1866282 198407 -777107 -1305056 -1471993 -1327829 -1299713 -1284759 -323450
35477 -323450 1635387 2828119 1892666 -109875 -1156638 -594044 1037767 2928709 3573948
35468 3573948 1448820 -2238347 -3613646 -1090360 1822761 1175464 -1972688 -3717782
35460 -3717782 -3095812 -2174379 -1671541 -408636 1327832 1693603 809732 1069463 3352557
$$ packed form
35523D594322j682437j667065J1349n1470k045718k419009j10552J678874R25512
35514g66194n20672q60595q21945r02618k7070J537072J478377o69464k067999
35505c621108p14308J624810K188655O65610j392291k517428j757081P69342K987822
35496a765977K572909P7799j644501j337598l42921L61371J321242K344429J945146
35487C531899k6007j639610j667875r75514n27949j66937J44164K8116J4954R61309
35477c23450J958837J192732r35453k002541j046763N62594J631811J890942O45239
35468C573948k125128l687167j375299K523286K913121o47297l148152j745094
35460c717782O21970R21433N02838J262905J736468L65771q83871K59731K283094
$$ plain form
35451 3352557 5698311 6304281 5442593 4013865 2486774 1598104 1961868 2744090 2631330
35442 2631330 1954466 1857281 1937718 1185906 604570 1886486 3897848 3844659 1893201
35433 1893201 1091446 2403300 3469115 2930544 2279139 2422470 2075487 820355 164177
35424 164177 134774 -1483796 -4810255 -6505813 -4841073 -2494971 -2009992 -2166584 -1505583
35415 -1505583 -1565761 -3303164 -4004688 -1677701 862911 580752 -359753 1330765 3589928
35406 3589928 2480908 -68498 1322207 6225691 8385209 5338039 1574705 827401
35398 827401 1378147 1106212 1341016 2726556 2490194 -524818 -2581806 -806038 1667953
35389 1667953 708675 -1925533 -1648963 1286321 2379902 121510 -2144080 -1534500 1163820
$$ packed form
35451C352557K345754O05970q61688j428728j527091q88670L63764P82222j12760
35442B631330o76864r7185Q0437p51812n81336J281916K011362n3189j951458
35433A893201q01755J311854J065815n38571o51405J43331l46983j255132o56178
35424A64177k9403j618570l326459j695558J664740K346102M84979j56592O61001
35415a505583o0178j737403p01524K326987K540612k82159r40505J690518K259163
35406C589928j109020k549406J390705M903484K159518l047170l763334p47304
35398H27401N50746k71935K34804J385540k36362l015012k056988J775768K473991
35389A667953r59278k634208K76570K935284J093581k258392k265590O09580K698320
$$ plain form
35380 1163820 3894920 5584661 5587692 3797122 1823881 1695661 3086222 3896250 3418013
35371 3418013 2634735 1710712 -61772 -1809052 -1511853 569987 1609342 174716 -1852207
35362 -1852207 -2113928 -362203 2467743 5473222 7222268 6251812 3253754 852617
35354 852617 282510 201114 -477262 -902834 -486688 -345205 -1104724 -1485374 -646947 180863
35344 180863 66336 205313 1495994 2408314 1454233 -129820 -467885 -15540 -75308
35335 -75308 -198109 269160 -83640 -2254784 -3694975 -1409629 2735320 3791255 631932
35326 631932 -2743342 -3120705 -1590709 -379928 262230 579249 -208683 -2017075 -2714704
35317 -2714704 -645892 3164708 6469418 7883748 6750740 3009867 -1578825 -3998816
$$ packed form
35380A163820K731100J689741L031j790570j973241j28220J390561Q10028m78237
35371C418013p83278r24023j772484j747280K97199K081840J039355j434626k026923
35362a852207k61721J751725K829946L005479J749046r70456k998058k401137
35354H52617n70107q1396o78376m25572M16146J41483p59519l80650Q38427Q27810
35344A80863j14527J38977J290681R12320r54081j584053l38065M52345n9768
35335g5308j22801M67269l52800k171144j440191K285346M144949J055935l159323
35326F31932l375274l77363J529996J210781O42158L17019p87932j808392o97629
35317b714704K068812L810600L304710J414330j133008l740873m588692k419991
$$ plain form
35309 -3998816 -3217092 -1374730 -649560 -683782 -405613 -470099 -1947606 -3895664 -4252747
35300 -4252747 -2520354 -53138 1762314 2383547 1761339 323018 -991351 -1471970 -1164300
35291 -1164300 -428447 293582 156769 -1475092 -3772661 -5008151 -4663482 -3662163 -2452341
35282 -2452341 -699071 901568 811174 -688928 -1467438 -1106638 -1792430 -4265699 -5802550
35273 -5802550 -4309675 -1685022 -543152 -224234 824529 1165440 -1169476 -4030409
35265 -4030409 -3364927 584021 3473605 3128171 1605249 785783 7595 -1002780 -725515
35256 -725515 1084321 2241227 1749120 1558461 2847545 3486545 1553270 -1177456 -1999270
35247 -1999270 -1528931 -2227259 -4049795 -4651609 -3298926 -1738885 -1256831 -1332846 -1445835
$$ packed form
35309c998816P81724J842362P25170l4222K78169o4486j477507j948058l57083
35300d252747J732393K467216J815452O21233o22208j438321j314369m80619L07670
35291a164300P35853P22029j36813j631861k297569j235490L44669J001319J209822
35282b452341J753270J600639r0394j500102p78510L60800o85792k473269j536851
35273e802550J492875K624653J141870L18918J048763L40911k334916k860933
35265d030409O65482L948948K889584l45434j522922q19466p78188j010375K77265
35256g25515J809836J156906m92107j90659J289084O39000j933275k730726q21814
35247a999270M70339o98328j822536o01814J352683J560041M82054p6015j12989
$$ plain form
35238 -1445835 -2013592 -2981579 -3290172 -2504853 -1602881 -1407948 -1369340 -637787 551290
35229 551290 1301560 1159766 150948 -1617346 -3643201 -4877959 -4776619 -4202481 -4376193
35220 -4376193 -5066403 -4897963 -3651747 -3026550 -4253269 -5891827 -5424426 -2752455 -532595
35211 -532595 -697975 -2130640 -2654013 -2046136 -1636494 -1675190 -928792 962660 2257660
35202 2257660 1059302 -2212477 -5017315 -5206853 -3043572 -775252 -243972 -953049 -847256
35193 -847256 899330 2624242 2306412 221530 -1597888 -2101923 -2059346 -2194876 -1993427
35184 -1993427 -926188 326561 776290 510708 289192 243202 -104880 -747890 -1033710
35175 -1033710 -709029 -353270 -391609 -257215 802149 2324357 2850335 1713289 -128695
$$ packed form
35238a445835n67757r67987l08593P85319R01972J94933L8608P31553J189077
35229E51290P50270j41794j008818j768294k025855j234758J01340N74138j73712
35220d376193o90210J68440J246216O25197j226719j638558M67401K671971K219860
35211e32595j65380j432665n23373O07877M09642l8696P46398J891452J295000
35202B257660j198358l271779k804838j89538K163281K268320N31280p09077J05793
35193h47256J746586J724912l17830k084882j819418n04035M2577j35530K01449
35184a993427J067239J252749M49729k65582k21516m5990l48082o43010k85820
35175a033710L24681L55759l8339J34394J059364J522208N25978j137046j841984
$$ plain form
35166 -128695 -1441112 -2098181 -2416395 -1998513 -552595 741585 460544 -607159 -272719
35157 -272719 1455537 1865021 -393610 -3008661 -3411840 -2434710 -2383076 -3167124 -3034978
35148 -3034978 -1989859 -1489915 -1325639 103948 2403207 3120077 1620054 229361 619437
35139 619437 1578654 1486746 661390 -67904 -957698 -2015759 -2008997 -465476 974837 829461
35129 829461 -121290 -546050 -750291 -1394503 -1675500 -914258 -511526 -1889528 -3642405
35120 -3642405 -3421147 -1829490 -1489147 -2604739 -2689636 -1034998 -146345 -1476137 -2670347
35111 -2670347 -1202520 1352520 1314584 -1829132 -4712406 -4626535 -2659166 -1639760 -2453436
$$ packed form
35166a28695j312417o57069l18214M17882J445918J294180k81041j067703L34440
35157b72719J728256M09484k258631k615051m03179R77130N1634p84048J32146
35148c034978J045119M99944J64276J429587K299259P16870j500023j390693L90076
35139F19437R59217r1908q25356p29294q89794j058061O762J543521J440313j45376
35129H29461r50751m24760k04241o44212k80997P61242M02732j378002j752877
35120c642405K21258J591657L40343j115592q4897J654638Q88653j329792j194210
35111b670347J467827K555040l7936l143716k883274Q5871J967369J019406q13676
$$ [...]
##END NTUPLES=NMR SPECTRUM
##END=
