##TITLE=31Pdec_SR3-OMe-TFA
 CDcl3, 24 sc
 24.10.2019
##JCAMPDX= 6.0         $$ Bruker NMR JCAMP-DX V2.0
##DATA TYPE= NMR SPECTRUM
##DATA CLASS= NTUPLES
##ORIGIN= UXNMR, Bruker Analytische Messtechnik GmbH
##OWNER= root
$$ XWIN-NMR		Version 3.5
$$ Thu Oct 24 14:42:16 2019 Russian Standard Time (UT+4h)  she@DPX200
##.OBSERVE FREQUENCY= 81.013821
##.OBSERVE NUCLEUS= ^31P
##.ACQUISITION MODE= SIMULTANEOUS
##.ACQUISITION SCHEME= undefined
##.AVERAGES= 24
##.DIGITISER RES= 17
##SPECTROMETER/DATA SYSTEM= spect
##.PULSE SEQUENCE= zgpg30
##.SOLVENT NAME= DMSO
##.SHIFT REFERENCE= (INTERNAL, DMSO, 0, 182.463)
##AUDIT TRAIL= $$ (NUMBER, WHEN, WHO, WHERE, WHAT)
$$ ##TITLE= Audit trail, XWIN-NMR		Version 3.5
$$ ##JCAMPDX= 5.01
$$ ##ORIGIN= Bruker BioSpin GmbH
$$ ##OWNER= she
$$ F:/spectra/data/she/nmr/P31/1/pdata/1/auditp.txt
$$ ##AUDIT TRAIL=  $$ (NUMBER, WHEN, WHO, WHERE, WHAT)
(   1,<2019-10-24 14:41:08.57 +0400>,<she>,<DPX200>,
      <created by zg, POWCHK disabled, PULCHK disabled
       configuration hash MD5:
       00 E9 B6 7A A2 85 ED C7 34 08 36 98 17 FE 4E 26
       data hash MD5: 32K
       0D FC 3D F5 54 79 20 6B 3E BA AE 3C 6F 6D 63 F4>)
(   2,<2019-10-24 14:41:24.92 +0400>,<she>,<DPX200>,
      <Start of raw data processing
       efp BC_mod = 2 LB = 1 FT_mod = 6 PKNL = 1 PHC0 = -876.838 PHC1 = 492.4007 SI = 64K 
       data hash MD5: 64K
       49 93 CE B7 B7 46 D5 B5 D7 7A 97 9A D5 CA 26 95>)
(   3,<2019-10-24 14:41:44.34 +0400>,<she>,<DPX200>,
      <pk PHC0 = -10.42934 PHC1 = 45.6 
       data hash MD5: 64K
       15 EC 57 81 28 F7 11 39 5A 74 B6 DC 1D 85 56 2D>)
(   4,<2019-10-24 14:41:53.48 +0400>,<she>,<DPX200>,
      <abs ABSG = 5 
       data hash MD5: 64K
       D7 DF 18 3A EA 5D 98 83 2F 68 1B 5A 38 21 E1 20>)
$$ ##END=
$$ 
$$ hash MD5
$$ 38 9D 02 65 B8 48 31 5C D0 FB 51 D1 8B D3 37 4A
##$RELAX= 
##$RELAX= 
##$RELAX= 
##$RELAX= 
##$RELAX= 
##$RELAX= 
##$RELAX= 
##$RELAX= 
$$ Bruker specific parameters
$$ --------------------------
##$DU= <F:/spectra>
##$EXPNO= 1
##$NAME= <P31>
##$PROCNO= 1
##$TYPE= <nmr>
##$USER= <she>
##$AMP= (0..31)
100 100 100 100 100 100 100 100 100 100 100 100 100 100 100 100 100 100 
100 100 100 100 100 100 100 100 100 100 100 100 100 100 
##$AQSEQ= 0
##$AQ_mod= 1
##$AUNM= <au_zg>
##$AUTOPOS= <>
##$BF1= 81.014009
##$BF2= 200.13
##$BF3= 200.13
##$BF4= 200.13
##$BF5= 200.13
##$BF6= 200.13
##$BF7= 200.13
##$BF8= 200.13
##$BYTORDA= 1
##$CFDGTYP= 0
##$CFRGTYP= 5
##$CHEMSTR= <none>
##$CNST= (0..31)
1 1 145 1 1 1 1 1 1 1 1 1 1 1 1 1 1 1 1 1 1 1 1 1 1 1 1 1 1 1 1 1 
##$CPDPRG= <waltz16>
##$CPDPRG1= <>
##$CPDPRG2= <waltz16>
##$CPDPRG3= <>
##$CPDPRG4= <mlev>
##$CPDPRG5= <mlev>
##$CPDPRG6= <mlev>
##$CPDPRG7= <mlev>
##$CPDPRG8= <mlev>
##$CPDPRGB= <>
##$CPDPRGT= <>
##$D= (0..31)
0 1 0 0 0 0 0 0 0 0 0 0.03 2e-05 3e-06 0 0 0 0 0 0 0 0 0 0 0 0 0 0 0 0 
0 0 
##$DATE= 1571913668
##$DBL= (0..7)
120 120 120 11 120 120 24 19 
##$DBP= (0..7)
150 150 150 150 150 150 150 150 
##$DBP07= 0
##$DBPNAM0= <>
##$DBPNAM1= <>
##$DBPNAM2= <>
$$ [...]
##$SUBNAM3= <"">
##$SUBNAM4= <"">
##$SUBNAM5= <"">
##$SUBNAM6= <"">
##$SUBNAM7= <"">
##$SUBNAM8= <"">
##$SUBNAM9= <"">
##$SW= 369.568048894756
##$SWIBOX= (0..15)
0 1 3 0 0 0 0 0 0 0 0 0 0 0 0 0 
##$SW_h= 29940.119760479
##$TD= 32768
##$TD0= 1
##$TE= 0
##$TE2= 300
##$TE3= 300
##$TEG= 300
##$TL= (0..7)
0 120 53 12 22 120 120 120 
##$TP= (0..7)
150 150 150 150 150 150 150 150 
##$TP07= 0
##$TPNAME0= <>
##$TPNAME1= <>
##$TPNAME2= <>
##$TPNAME3= <>
##$TPNAME4= <>
##$TPNAME5= <>
##$TPNAME6= <>
##$TPNAME7= <>
##$TPOAL= (0..7)
0.5 0.5 0.5 0.5 0.5 0.5 0.5 0.5 
##$TPOFFS= (0..7)
0 0 0 0 0 0 0 0 
##$TUNHIN= 0
##$TUNHOUT= 0
##$TUNXOUT= 0
##$USERA1= <user>
##$USERA2= <user>
##$USERA3= <user>
##$USERA4= <user>
##$USERA5= <user>
##$V9= 5
##$VALIST= <valist>
##$VCLIST= <CCCCCCCCCCCCCCC>
##$VD= 0
##$VDLIST= <DDDDDDDDDDDDDDD>
##$VPLIST= <PPPPPPPPPPPPPPP>
##$VTLIST= <TTTTTTTTTTTTTTT>
##$WBST= 1024
##$WBSW= 4
##$XGAIN= (0..3)
0 0 0 0 
##$XL= 0
##$YL= 0
##$YMAX_a= 5902
##$YMIN_a= -9659
##$ZGOPTNS= <>
##$ZL1= 120
##$ZL2= 120
##$ZL3= 120
##$ZL4= 120
##$ABSF1= 182.463
##$ABSF2= -187.1042
##$ABSG= 5
##$ABSL= 3
##$ALPHA= 0
##$AQORDER= 0
##$ASSFAC= 0
##$ASSFACI= 0
##$ASSFACX= 0
##$ASSWID= 0
##$AUNMP= <proc_1d>
##$AZFE= 0.1
##$AZFW= 0.5
##$BCFW= 0
##$BC_mod= 2
##$BYTORDP= 0
##$COROFFS= 0
##$CY= -3
##$DATMOD= 1
##$DC= 0
##$DFILT= <>
##$DTYPP= 0
##$F1P= 0
##$F2P= 0
##$FCOR= 1
##$FTSIZE= 65536
##$FT_mod= 6
##$GAMMA= 0
##$GB= 0
##$INTBC= 1
##$INTSCL= 5.30512e-09
##$ISEN= 30
##$LB= 1
##$LEV0= 0
##$LPBIN= 0
##$MAXI= 10000
##$MC2= 0
##$MEAN= 0
##$ME_mod= 0
##$MI= 50
##$NCOEF= 0
##$NC_proc= -8
##$NLEV= 6
##$NOISF1= 182.463
##$NOISF2= 159.3651
##$NSP= 0
##$NTH_PI= 0
##$NZP= 0
##$OFFSET= 182.463
##$PC= 4
##$PHC0= -887.2673
##$PHC1= 538.0007
##$PH_mod= 1
##$PKNL= yes
##$PPARMOD= 0
##$PSCAL= 0
##$PSIGN= 0
##$REVERSE= no
##$SF= 81.0140089999434
##$SI= 65536
##$SIGF1= 159.3651
##$SIGF2= -187.1042
##$SINO= 113.3802
##$SIOLD= 16384
##$SREGLST= <1H.CDCl3>
##$SSB= 0
##$STSI= 65536
##$STSR= 0
##$SW_p= 29940.119760479
##$SYMM= 0
##$S_DEV= 0
##$TDeff= 32768
##$TDoff= 0
##$TI= <>
##$TILT= no
##$TM1= 0
##$TM2= 0
##$TOPLEV= 0
##$USERP1= <user>
##$USERP2= <user>
##$USERP3= <user>
##$USERP4= <user>
##$USERP5= <user>
##$WDW= 1
##$XDIM= 65536
##$YMAX_p= 515094156
##$YMIN_p= -32590651
$$ End of Bruker specific parameters
$$ ---------------------------------
##NTUPLES= NMR SPECTRUM
##VAR_NAME=  FREQUENCY,     SPECTRUM/REAL,   SPECTRUM/IMAG
##SYMBOL=    X,             R,               I
##VAR_TYPE=  INDEPENDENT,   DEPENDENT,       DEPENDENT
##VAR_FORM=  AFFN,          ASDF,            ASDF
##VAR_DIM=   65536,         65536,           65536
##UNITS=     HZ,            ARBITRARY UNITS, ARBITRARY UNITS
##FACTOR=    0.456856943014862, 1,           1
##FIRST=     14782.0589164792, 0,            0
##LAST=      -15158.0608439998, 0,           0
##MIN=       -15158.0608439998, -32590651,   0
##MAX=       14782.0589164792, 515094156,    0
$$ Real data points
##PAGE= N=1
##DATA TABLE= (X++(R..R)), XYDATA
$$ [...]
46365H147399j088960m113878j872857J199568j008238o025452n391728J720868
46357h433278O473372M153836M92685L75631o5333m208339o761700k643230L188970
46348g427386L443958K93440K81950K010553r04793o944864p133832J240000J0031338
46339e109636J1039158M711026l306062q208915p200899m99360O605234P414828
46331E445374J625090m275151n366316k779303P38617M066558M818548l06235
46323C967182q431979r765269K4885J1003471J0061566j224268q092320k504869
46315d961601O835258P953277J683669k308015n62623J792973J857900K597741
46307A4888579M200022J222701o821568j0275750k501066P751567O946679l477778
$$ y = [8147399, 7058439, 2944561, 1071704, 2271272, 1263034, -4762418, -10154146, -8433278, -1959906, 2193930, 2686615, 3062246, 2996913, -1211426, -7973126, -10616356, -7427386, -3983428, -3689988, -3408038, -1397485, -2302278, -9247142, -16380974, -15140974, -5109636, 5929522, 10640548, 7334486, -874429, -8075328, -8574688, -1969454, 5445374, 7070464, 2795313, -2571003, -5350306, -4611689, -545131, 4273417, 3967182, -4464797, -14230066, -14205181, -3201710, 6859856, 5635588, -2456732, -4961601, 1873657, 9826934, 11510603, 9202588, 8639965, 10432938, 12290838, 14888579, 19088601, 20311302, 13489734, 3213984, 712918, 8464485, 15411164, 11933386]
46299A1933386q899031k771416N207536N070165J43635j218443J041995J373235
46291A1881062j086631k745355k495287j521391Q18534M421366M724176j420736
46283A2575738q489856q331573k026686J803686k16155k934297k354911n59048
46275a0533102N80883K875983O207299O353962K103995j397591m73077J152636
46267F870988j201542n179270m916615L29614N649678O713002L149930k258998
46259I156787m925152j449566N815398R717909O524064K67240l714797n559274
46251A5832609p447168p877061m949855j840412k430623l976995j259920L667606
46243a0281819L887461o65686k602117N22369K268190p72755j960356M319318
$$ y = [11933386, 3034355, 262939, 5470475, 10540640, 10684275, 9465832, 10507827, 11881062, 10794431, 8049076, 5553789, 4032398, 4850932, 9272298, 13996474, 12575738, 4085882, -4245691, -6272377, -4468691, -4684846, -7619143, -9974054, -10533102, -9952219, -7076236, -868937, 5485025, 7589020, 6191429, 5718352, 6870988, 5669446, 490176, -4426439, -4096825, 1552853, 8265855, 11415785, 9156787, 4231635, 2782069, 8597467, 18315376, 24839440, 25106680, 21391883, 15832609, 8385441, 508380, -4441475, -6281887, -8712510, -12689505, -13949425, -10281819, -6394358, -7060044, -9662161, -9139792, -6871602, -7644357, -9604713, -5285395]
46235e285395J1653403R880362J81012o585079m854228K58152K461444J794387
46227I504058Q86111k22633k403016m426897m503643k562962O18320M279387O493940
46218G662665M795969l62248m934935n623045l146635j67789J906291K832012
46210B962285K496916J579520J385384J642462M45325k230909l387582j412327
46202C481074P16636n21530l624381l915915l66963K745005J588656k351758m531925
46193f781101l051913l79398N80953N17251K112863M875149M683396L47341k609987
46184B94554J006346P225418P007020r62693q094292q014182m059414j613543
46176g210786k0599K668797L305102p42505m232650n78511P006744R178277L916164
$$ y = [-5285395, 6368008, 16248370, 16429382, 9844303, 4990075, 5248227, 7709671, 9504058, 10390169, 10167536, 7764520, 3337623, -1166020, -3728982, -3110662, 1168725, 7662665, 12458634, 12096386, 7161451, 1538406, -1608229, -1776018, 130273, 2962285, 5459201, 7038721, 8424105, 10066567, 10511892, 8280983, 4893401, 3481074, 4197710, 3676180, 51799, -3864116, -4231079, -1486074, 102582, -2249176, -6781101, -9833014, -10212412, -9631459, -9114208, -7001345, -2126196, 2557200, 2904541, 294554, 1300900, 8526318, 15533338, 14570645, 6476353, -1537829, -5597243, -7210786, -7231385, -4562588, -1257486, -1999991, -6232641, -6811152, 195592, 9373869, 13290033]
46167A3290033j694042k679901j335637p17227m75807m36677j650023k598213
46159A702506n96693K225193R95477l194092m109791q91266O54492r68056j60672
46150d342902M204936M532680k539045q432712n434679J068227J892397j532575
46142a0583673j863823R02506J673388J490640N021803R195153O110442k884521
46134I061915p157083k356440L939273M540888J475627o24212j405964j026059
46126F447945K707871Q406744R028092J549470o620289p054655k010713k22438
46118A2232027l797444o318997l454722J037190J652542j209728l046855k149986
46110e055973j033783j312231q03962K169293M281809J261508m196629m074841
$$ y = [13290033, 11595991, 8916090, 7580453, 6863226, 6387419, 5950742, 4300719, 1702506, 1105813, 3331006, 4326483, 1132391, -2977400, -3868666, -3214174, -4182230, -4342902, -137966, 4394714, 1855669, -6577043, -12011722, -10943495, -9051098, -10583673, -12447496, -11544990, -9871602, -8380962, -3359159, 5835994, 11946436, 9061915, 1904832, -451608, 3487665, 8028553, 9504180, 8879968, 7474004, 6447945, 9155816, 17562560, 26590652, 28140122, 21519833, 14465178, 12454465, 12232027, 8434583, 2115586, -1339136, -301946, 1350596, 140868, -2905987, -5055973, -6089756, -7401987, -8205949, -6036656, -1754847, -493339, -4689968, -8764809]
46102h764809L461875R651964O461823k200572o450045m208962j706101j864747
46094e619574o29400L975737O901818L697691k436928n157588k915454Q67073
46086a316625K820627K156860K15558p05520K51636P56592j692870n176272n318888
46077h008902j975275L32868n98257j784146n19862J803110L210336M243507N431164
46068B134543N454137L765020J556836r86035m213967n191807k38523P035388
46060I315592P120814k362759j1468148j0528524k297289L808077M230307J918206
46052b63724p53674k707654j476209L029721M950278j23392o699594o023244P50848
46043i316644M406389J857143n39423J232074K845980N17375k175400j194280
$$ y = [-8764809, -5302934, 4349030, 10810853, 8610281, 2160236, -2048726, -3754827, -5619574, -6248974, -2273237, 4628581, 8326272, 5889344, 731756, -2183698, -1316625, 1504002, 3660862, 3876420, 3170900, 3422536, 4179128, 2486258, -2690014, -8008902, -9984177, -9651309, -10249566, -12033712, -12553574, -10750464, -7540128, -3296621, 2134543, 7588680, 11353700, 12910536, 11924501, 7710534, 2518727, 2280204, 9315592, 16436406, 14073647, 2605499, -7923025, -10220314, -6412237, -2181930, -263724, -1017398, -3725052, -5201261, -2171540, 2778738, 2655346, -4044248, -10067492, -9316644, -4910255, -3053112, -3592535, -2360461, 485519, 1002894, -1172506, -2366786]
46035b366786N74041j271245m289035k739913K740569N370066K126016k012993
46027a869280j599117J570586J786177j510483k610436J623698O168842M724465
46019H284452o94526k565055O20574K243477j653498o298403o354760l678201
46011a0095940j812580J110402O850145R596957L275440o539134q102491m30961
46003f148162N254794K454026k024217n1824N806999P749170L921613j521734
45995A5440665n070280n521337k580921J739984L277130P63906k386519l933300
45987A729328n817310p999412n221259M303164J2130017R256364o03650n684647
45979B092595k554595Q76464r61045l511971j014657M196642O161925M083315
$$ y = [-2366786, -1792745, -3063990, -7353025, -10092938, -7352369, -1982303, 143713, -1869280, -3468397, -1897811, -111634, -1622117, -4232553, -2608855, 3559987, 8284452, 7589926, 5024871, 5645445, 7888922, 6235424, -62979, -6417739, -10095940, -11908520, -10798118, -3947973, 5648984, 8924424, 2385290, -5717201, -6148162, -893368, 1560658, -463559, -515383, 5291616, 13040786, 16962399, 15440665, 10370385, 4849048, 2268127, 4008111, 7285241, 8049147, 5662628, 1729328, -4087982, -12087394, -17308653, -13005489, -875472, 8380892, 7777242, 2092595, -462000, 414464, -546581, -4058552, -5073209, -876567, 5285358, 9368673]
45971I368673J564583K48085j045637k700147l877503m499339m392115j975827
45963g309227K645708M902798P84409n820153o199221J450609Q555769P328079
45955F338771P94825k741032j519249m39718j300341l33076L667282N811442K770271
45946A3049175j748673l077546k163416j569685J59493M185719N727053L35715
45938A4897835o913633p064010r78420J751318j930983m184261O9788M772695
45930D20329L228903j306600k232868J2728J590414L347590O832531P204697K1658
45921A9119382q081731o445590K700232N638179k710610j0853182p484234K919152
45913e198402P888123L810930k408285m528313k629212N46991K761248K227725
$$ y = [9368673, 10933256, 11181341, 10135704, 7435557, 3558054, -941285, -5333400, -7309227, -4663519, 239279, 1023688, -4796465, -10995686, -9545077, -989308, 6338771, 7133596, 4392564, 2873315, 2433597, 1133256, 800180, 4467462, 10278904, 13049175, 11300502, 8222956, 6059540, 4489855, 4649348, 8835067, 14562120, 14897835, 7984202, 920192, -58228, 1693090, -237893, -4422154, -4352366, 420329, 3649232, 2342632, 109764, 122492, 1712906, 5060496, 11893027, 19097724, 19119382, 11037651, 4592061, 7292293, 12930472, 10219862, -633320, -8117554, -5198402, 2689721, 6500651, 4092366, -435947, -3065159, -2518168, 243080, 2470805]
45905B470805r57509l497041k531898N872R3568k063724k209738J487765N698515
45896a503385O352702L099746j215924l274297j334754K927557M522561N0030
45888I624236o890965q515403k626638L679899K859514l093661n479053o90208
45880a1132279N355618N630430Q66344k775951k300138k71027N29650O75309J315862
45871b106182J379363q8743j174123M46584L601405M869173K852879j221798n928261
45862B630297r548787q899414k772478L671757L337996k676736n065775O70483
45854a8652657O947700M911132k347520m667299k03865K677124q01426m606443
45846a6743254j825783M765279P136077K958291k890734n388642l442403J518446
$$ y = [2470805, 1513296, -1983745, -4515643, -4509771, -4416203, -6479927, -8689665, -7201900, -1503385, 4849317, 7949063, 6733139, 3458842, 2124088, 5051645, 9574206, 9624236, 2733271, -5782132, -8408770, -4728871, -1869357, -4963018, -10442071, -11132279, -5776661, -146231, 720113, -2055838, -4355976, -4627003, -4097353, -3422044, -2106182, -726819, -815562, -1989685, -1543101, 2058304, 6927477, 9780356, 8558558, 2630297, -6918490, -15817904, -18590382, -14918625, -11580629, -14257365, -19323140, -18652657, -11704957, -6793825, -9141345, -13808644, -14012509, -11335385, -12136811, -16743254, -18569037, -13803758, -6667681, -3709390, -6600124, -11988766, -15431169, -13912723]
45838a3912723O688718Q207787M188836k194448n314848l072830J600466M758308
45830I49266M740772J965290j876583m170907l271775o13739Q07875K76522k13856
45821a407135M09568N09411j368314l582749l029438Q55066M896535N290685J757695
45812D331324j822145j694705J080029J989278m67160k404748n19857K495911
45804B987927K094911p34940j175258J046553O95486m344703q820608p191697
45796a5442329o98827N734547R671730J0417004O065017l023380j0071799p902684
45788e250721P05173M792455q11763q619159q731224j511677M546259M626664
45780a0253993J620384o07796j817344j998520P76331N647996O904608J807940
$$ y = [-13912723, -7224005, 983782, 5172618, 2978170, -2336678, -5409508, -3809042, 949266, 5690038, 7655328, 5778745, 1607838, -1663937, -2277676, -1469801, -1193279, -1407135, -997567, -488156, -1856470, -5439219, -8468657, -7613591, -2717056, 2573629, 4331324, 2509179, 814474, 1894503, 3883781, 3416621, 1011873, 492016, 2987927, 5082838, 4347898, 3172640, 4219193, 4914679, 569976, -8250632, -15442329, -16141156, -10406609, -734879, 9682125, 15747142, 12723762, 2651963, -5250721, -4545548, 246907, -564856, -9184015, -17915239, -19426916, -14880657, -10253993, -8633609, -9241405, -11058749, -13057269, -12280938, -6632942, 271666, 2079606]
45772B079606l026837J35185P439940P414368j780697q642311n708298q93810
45764b982854l737437q768976m334049O920367J0483489K493702m443229j521154
45756e890141L463999O60874n743909n883507n59601J915648L05378P58524M735291
45747f237444O773174M146307L64240j471997j917352j585211n02229p99958l993669
45738e224139o318345l269161K158619L073780k01936r58373J899805K036945
45730f802805k386297m548270l27719M976167N924777M731859M297723J509708
45722G375143n308189r190701l588994O044796Q832208L861530M1371J670655
45714I737819L113089o43951n595065m647803K210097P513594N122600k605892
$$ y = [2079606, -947231, -812046, 6627894, 14042262, 12261565, 3619254, -2089044, -2982854, -6720291, -15489267, -19823316, -12902949, -2419460, 74242, -4368987, -5890141, -2426142, -1765268, -7509177, -13392684, -13952285, -12036637, -11731259, -10972735, -6237444, 535730, 4682037, 5046277, 3574280, 1656928, 71717, -430512, -1230470, -5224139, -11542484, -14811645, -12653026, -9579246, -9781182, -10739555, -8839750, -6802805, -9189102, -13737372, -14065091, -9088924, -3164147, 1567712, 5865435, 7375143, 2066954, -7123747, -10712741, -4667945, 4164263, 8025793, 8067164, 9737819, 12850908, 12206957, 6611892, 1964089, 4174186, 11687780, 16810380, 14204488]
45706A4204488p276182m433859N02812m81657n754866n321230L793318J1013405
45698F246229O714139l186095n615721O76846M641455N09850m545561k917934
45690B523208K083739K614113j756318m504532k000096K202551K670315j433506
45682B399474n927501o573428l686833j120281p81634l07980K522624N745293
45674g730266O273937M558106K623537j58366m673022p315304l502533M486661
45666e437250R060433P213404L257221Q24033j716629n729673q066298n850498
45658f445257j162927K381874M061737M215298J999510j668742k749525M46813
45650A078781L717901K999485Q53385K149379N628760N294573m84646o358481
$$ y = [14204488, 6928306, 2494447, 2997259, 2515602, -3239264, -8560494, -4767176, 6246229, 12960368, 9774273, 4158552, 4835398, 9476853, 9986703, 5441142, 2523208, 4606947, 7221060, 5464742, 960210, -1039886, 1162665, 3832980, 2399474, -3528027, -10101455, -13788288, -14908569, -15690203, -15998183, -13475559, -7730266, -1456329, 3101777, 5725314, 5566948, 893926, -6421378, -9923911, -5437250, 3623183, 10836587, 14093808, 14917841, 13201212, 7471539, -594759, -6445257, -7608184, -5226310, -1164573, 3050725, 5050235, 3381493, 631968, 1078781, 4796682, 7796167, 8649552, 10798931, 16427691, 21722264, 21237618, 14879137]
45642A4879137p137951l661373l61080J99511j072223k064949k062563k172046
45634c453537l171076l568613j580826J161817J068523j354103j039040L520201
45626h416654O158880J692304m958761m762272K095360O255099K956586j699563
45618f79021r51526K807331L213266J21968j441843l1795P73191o16781r59480
45609B235310K032375N180157L756514k259053q062338r014454m408582K383937
45601h156134O174260L932554j579917l477722J501995P862660P137465j241793
45593A2153368q596147p827396j815698J918294J668887J771807L717432L081037
45585F071584k858967r304775r609115m136132P56785J563190J164952K963756
$$ y = [14879137, 7741186, 4079813, 3718733, 3918244, 2846021, 781072, -1281491, -3453537, -6624613, -10193226, -11774052, -10612235, -9543712, -10897815, -11936855, -8416654, -2257774, -565470, -5524231, -10286503, -8191143, -1936044, 1020542, -679021, -1630547, 1176784, 4390050, 4512018, 3070175, 3038380, 3811571, 3194790, 2235310, 4267685, 9447842, 13204356, 10945303, 2882965, -6131489, -10540071, -8156134, -1981874, 1950680, 370763, -3106959, -1604964, 6257696, 13395161, 12153368, 3557221, -4270175, -6085873, -4167579, -2498692, -726885, 2990547, 6071584, 3212617, -6092158, -15701273, -19837405, -19080620, -17517430, -16352478, -13388722]
45577a3388722N449655N033656J816044p38036j069406j172057k446272k996132
45569i511270r62633J756006J954135K0243q20549L30585J182590P64693Q33199
45560d453001J659096P75664j736203j276726L976804P888607M142269l613387
45552G363123o205575k280124L87637k369452m904029j465521M574349O164911
45544A265319K577885j349921k843403k882763k287679j007753l18852j529748
45536h376915l030620k097521R69859L597055M849576N348620M469610J547146
45528G276810r48345k0709K043068m42364p388438j0631249m249764O262441R690767
45519A592217K690974o672092r305545m995073R6523K565871M220463O278146
$$ y = [-13388722, -7939067, -2905411, -1089367, -1827403, -2896809, -4068866, -6515138, -9511270, -10473903, -8717897, -6763762, -6743519, -7564068, -7233483, -6050893, -5286200, -4453001, -2793905, -2018241, -3754444, -5031170, -1054366, 6834241, 10976510, 7363123, 1157548, -1122576, -734939, -3104391, -8008420, -9473941, -4899592, 1265319, 3843204, 2493283, -350120, -3232883, -5520562, -6528315, -6847167, -8376915, -11407535, -13505056, -12535197, -8938142, -4088566, 1260054, 5729664, 7276810, 6328465, 6307756, 8350824, 7908460, 520022, -10111227, -14360991, -8098550, 1592217, 4283191, -2388901, -11694446, -16689519, -16592996, -14027125, -9806662, -3528516]
45511c528516O183268K412709j461859j491023L30607p00911l868718m007315
45503f131758n71233R90139j244674j835316K346175N355461J437964m311683
45495c964925k789808M693145P838384K515238m270089n689865l138797l08161
45487e114878L101311P240744P876028K128090n317119p183962k564818L421850
45479C587246O684660O503444K937499k894133o689245m347353J729245M079181
45471A1590544l88628n899091n171885J179277N666853L346875k876406o772893
45463F74646n892492k386181J341347M681331O753978N789814K208563l70300
45455A2800706L34553J698170J8951l753180n636829m835553m123609m219737
$$ y = [-3528516, 2654752, 5067461, 3605602, 2114579, 2445186, 1744275, -2124443, -6131758, -6702991, -5712852, -6957526, -8792842, -6446667, -1091206, 346758, -3964925, -6754733, -2061588, 5776796, 8292034, 4021945, -1667920, -4806717, -5114878, -2013567, 5227177, 13103205, 15231295, 9914176, 2730214, 165396, 3587246, 10271906, 16775350, 19712849, 16818716, 10129471, 5782118, 7511363, 11590544, 11201916, 5302825, 130940, 1310217, 6977070, 10323945, 7447539, 674646, -5217846, -7604027, -6262680, -1581349, 5172629, 10962443, 13171006, 12800706, 13135259, 14833429, 14852380, 11099200, 5462371, 626818, -3496791, -7716528]
45447g716528k448306J774935M436694K354170k003374l811174j910245Q40781
45439h483047J674266L12210j642715k135706k17720L052712N954464P883201
45431F397665Q175851M592055l351133j0302034r546191k322567K918462K315130
45423a122762J353988M507275O894330K310132n747908q757806n705748k925122
45415i193621k930862j655211K677797N510055L143659j669173l981400k490307
45407a0589063P56256L071969K404259p56150k278857R77106N429029M598249
45399C612798q54175k913715K058112P552170O442100Q99074k062299r51496j71598
45390A3610971k121440m148482l182527J34147K395540R94188k931128m902721
$$ y = [-7716528, -10164834, -8389899, -3953205, -1599035, -3602409, -7413583, -9323828, -8483047, -6808781, -6496571, -8139286, -10274992, -10492712, -7440000, -1485536, 6397665, 14573516, 19165571, 15814438, 5512404, -4033787, -6356354, -3437892, -1122762, 231226, 4738501, 11632831, 13942963, 8195055, -562751, -6268499, -9193621, -12124483, -13779694, -11101897, -5591842, -2448183, -4117356, -8098756, -10589063, -9832807, -6760838, -4356579, -5112729, -7391586, -6414480, -985451, 3612798, 2758623, -155092, 1903020, 9455190, 15897290, 16796364, 14734065, 13782569, 13610971, 11489531, 7341049, 4158522, 4292669, 6688209, 7682397, 4751269, -151452]
45382a51452k245433J456589O07245l507049l391714L200825Q553595N743793
45374A0266399j401697m648924l092032j910664k699395k352253L7146K070589
45366c730831L124331M336496M233067N73946m021193m689014k104065q97235
45358c174498q24822K439318P192046N669180l025560q979763n451633R86333
45350e169399P19025m681241n972595j30707O455260O929351P73770o921382r269731
45341a7267649l052239O358856Q975256K550027l581216j340905M962219O469879
45333D074228K985550K6475k287719o759249q766427j032961J1342915J3735448
45325A3318260L029495o454668l753856L251766J576372o768932r312844k424587
$$ y = [-151452, -2396885, -940296, -333051, -3840100, -7231814, -4030989, 4522606, 10266399, 8864702, 4215778, 1123746, -786918, -3486313, -5838566, -5801420, -3730831, -606500, 3729996, 7963063, 8537009, 4515816, -173198, -2277263, -3174498, -3999320, -1560002, 5632044, 11301224, 8275664, -704099, -6155732, -5169399, -4450374, -9131615, -15104210, -15234917, -8779657, -1850306, -1076536, -7997918, -17267649, -20319888, -13961032, -4985776, -2435749, -6016965, -7357870, -2395651, 4074228, 7059778, 7086253, 4798534, -1960715, -10727142, -11760103, -417188, 13318260, 16347755, 9893087, 6139231, 9390997, 10967369, 4198437, -5114407, -7538994]
45317g538994N168426O404194L521237J132645j74047j324592j940152k303636
45309B945081l630976m558891j455340N625717J0741076Q539005R89420m697941
45301A4497151m011166N65004K883158j18933n280172p015086l836149M51891
45293a864302K324950K626174L247283K631530j460530o113079n220836J784568
45285b044242P565233N756383q89650m580413k819511n04161j655170l356773
45277b528304n92970N481821Q203684M157593k558790o139803n765158m166384
45269c908311k585211p11711N62056N37467J394961M900153P524473M289898k733054
45260I270721n826298k455555J492041J142039j074729j453775r63241j130842
$$ y = [-7538994, -2370568, 4033626, 7554863, 8687508, 8513461, 7188869, 5248717, 2945081, -685895, -5244786, -6700126, -1074409, 9666667, 18205672, 19195092, 14497151, 10485985, 11050989, 13934147, 13815214, 8535042, 1519956, -2316193, -1864302, 460648, 3086822, 6334105, 8965635, 7505105, 1392026, -3828810, -2044242, 5520991, 11277374, 10387724, 5807311, 2987800, 2483639, 828469, -2528304, -3121274, 2360547, 10564231, 14721824, 12163034, 6023231, 258073, -3908311, -6493522, -7205233, -6643177, -6105710, -4710749, 189404, 7713877, 12003775, 9270721, 3444423, 988868, 2480909, 3622948, 2548219, 1094444, 131203, -999639]
45252i99639n59K882700L048972j664611n636479l538854R36819J403451q20790
45243d388990n89384J070454N3989j146325K647512P743271N394312l059983o780094
45234I44762k751974l37403m660566p408259r79239Q148156Q820399J053055n952333
45225c123402o814094l496718M85525K766294J843596o51939l62398L117877M339761
45216a895498R64993j161726K313100N576833J429011o220659p665943j973518
45208h633407K987724L142617J668007P42565j018396k483524j3150M893633N550072
45199F836141k54532o940116r117089o860944j962648M421959Q855227P292374
45191B270372K016460L72458M071919O408608L057467j388583j703678m8513n86354
$$ y = [-999639, -1000198, 1882502, 4931474, 3266863, -2369616, -5908470, -4971651, -3568200, -4388990, -4978374, -3907920, -3853931, -5000256, -2352744, 5390527, 10784839, 7724856, 944762, -1807212, -2144615, -6805181, -14213440, -15192679, -7044523, 1775876, 2828931, -3123402, -9937496, -13434214, -12948689, -10182395, -8338799, -8990738, -9353136, -6235259, -1895498, -930505, -2092231, 220869, 5797702, 7226713, 1006054, -6659889, -8633407, -5645683, -2503066, -835059, -92494, -1110890, -3594414, -3607564, 1286069, 6836141, 6581609, -358507, -9475596, -16336540, -18299188, -13877229, -5022002, 2270372, 4286832, 4659290, 8731209, 15139817, 18197284, 16808701, 15105023, 15056510, 14470156]
45182A4470156k231006k707202m341489q914102j1229858n538894M570315J0306543
45174e615537R609293P262903M780876q13245p765535q691662k161372L065719
45166c28560N46828l900186j539232N139703O228345J07617m030137n94919M080483
45157E709942K124816l856979n543271j445041K690272M046017N347873O961262
45149A6034891M430675l113651q979913p972138l963148l086998m129978k167219
45141a2947479J900471K887125L00285j679290j973211k798654k908018R69249
45133a6249522N792069M564478j437957k699883L075964O075485M92187n064589
45125e451768j790595M200994K351714m091292l905204K388868L635942k019350
$$ y = [14470156, 12239150, 9531948, 5190459, -3723643, -14953501, -20492395, -15922080, -5615537, 3993756, 11256659, 16037535, 15224290, 7458755, -1232907, -3394279, -328560, 218268, -3681918, -5221150, -81447, 6146898, 6254515, 2224378, 1629459, 5709942, 7834758, 3977779, -1565492, -3010533, -320261, 3725756, 9073629, 16034891, 20465566, 17351915, 8372002, 399864, -3563284, -6650282, -10780260, -12947479, -11047008, -8159883, -7859598, -9538888, -11512099, -14310753, -17218771, -16249522, -10457453, -5892975, -7330932, -10030815, -6954851, -879366, -387179, -5451768, -7242363, -3041369, -689655, -4780947, -8686151, -6297283, -2661341, -4680691]
45117d680691l697842K923605P441722J967258o114001p042494l703577l510161
45109a6416181l940916J570824Q984491Q218053J57721l854814o627K900286p07095
45100c094258l929863O2207N918932M839711j191529l108024Q62160L483192K43701
45091D086229m954020o607134l977756O47654M959434O360104L199987j835343
45083A879155l357535k23450K484057L19936m855343q132902p427192l717695
45075b3030969J652964O844421Q756776N697184L7965l916671l926402n63252
45067h447984M100701P054148N984369K361500M71386J367765R84840k923515
45059A0953210n836757k991572K425797L423452o03528m186998m939013n268528
$$ y = [-4680691, -8378533, -5454928, 1986794, 3954052, -2159949, -9202443, -12906020, -16416181, -20357097, -18786273, -9801782, -1583729, -1426008, -5280822, -5287449, -2387163, -3094258, -7024121, -6961914, -1042982, 3796729, 2605200, -502824, 359336, 3842528, 4086229, -867791, -7474925, -11452681, -10805027, -5845593, 514511, 3714498, 1879155, -1478380, -1701830, 782227, 1102163, -3753180, -11886082, -19313274, -23030969, -21378005, -14533584, -5776808, -79624, -41659, -3958330, -7884732, -8447984, -4347283, 2706865, 8691234, 11052734, 11524120, 12891885, 13876725, 10953210, 5116453, 2124881, 4550678, 7974130, 7370602, 3183604, -1755409, -7023937]
45051g023937n182515j265778N470203Q341212M853517J021428J686634K936766
45043A0837530l13392m707924l443120K584647N907787L305028r97725k541469
45035A0631362j311484J037253L438015L969471O08670n066390q217692o174554
45027a085349j220806K639294L500231J941254j37840q68495l91886r34759l028237
45018D13407l250806J062194O311992O208193M62553m605052m477738j017896
45010A106847K043890L494235L069984J08813l981037n802355m703989l621616
45002h285228l248776k40130N546259P291949K22583r329956j0526993k178648
44994b0748940N976423N948117k47608n599851o038764j868250M101307P677996
$$ y = [-7023937, -12206452, -13472230, -8002027, 339185, 5192702, 6214130, 7900764, 10837530, 10524138, 5816214, 2373094, 4957741, 10865528, 14170556, 13172831, 10631362, 9319878, 10357131, 13795146, 17764617, 18373287, 13306897, 5089205, -1085349, -2306155, 333139, 3833370, 5774624, 5636784, 4768289, 4376403, 3441644, 413407, -2837399, -1775205, 4536787, 10744980, 11207533, 6602481, 2124743, 1106847, 3150737, 6644972, 9714956, 9823769, 5842732, 40377, -4663612, -8285228, -11534004, -11774134, -6227875, 1064074, 1286657, -8043299, -18570292, -20748940, -14772517, -8824400, -9072008, -14671859, -20710623, -22578873, -18477566, -10799570]
44986a0799570O040987J283574j642141j461704j309171j949871L92474O419019
44978c026403R310525L258763p103604j1896030q525532k807414R66616L707334
44970a6115745N088175J744481m905511o415705J507913J0829790J0805206K447696
44962D986300l657765k287481J164261P77222j728481j707966R12785K754204
44954A213079K319192N71630j794037m406874n582550l362031J789568O658965
44946b593058P751765M176515j024821l033285o72313J086087k831589r495983
44938f636682j0531720l765277L004872K787839j100219j064925L141724N049305
44930i115083J954669j610508j224278J946133M421526N013416M225986K107059
$$ y = [-10799570, -4758583, -3475009, -5117150, -6578854, -7888025, -9837896, -9445422, -3026403, 6284122, 9542885, 2439281, -9456749, -17982281, -20789695, -19823079, -16115745, -11027570, -9283089, -14188600, -20604305, -19096392, -8266602, 2538604, 4986300, 1328535, -958946, 205315, 982537, -745944, -2453910, -1541125, 1213079, 3532271, 4103901, 2309864, -2097010, -7679560, -11041591, -9252023, -2593058, 5158707, 9335222, 8310401, 5277116, 4604803, 5690890, 2859301, -6636682, -17168402, -20933679, -17928807, -15140968, -16241187, -17306112, -14164388, -9115083, -7160414, -8770922, -9995200, -8049067, -3627541, 1385875, 5611861, 7718920]
44922G718920j044888l368229k615849J421937N824942O151907Q46956n360072
44914I575624n356026J047150N117201J64208q685197j0883643m389963L019304
44906a0391342N229502L643292J397676r30543k125686J13037L592201K237713
44898B765850m113087p126972j967639M466105L653827j607014k281335K544930
44890c665335N240710K205707j841520k779689k324065k201851j34786M730519
44882g70310P789121M719449k182303p111115p568301m958519j049348K587110
44874h544216L566492R80887k136793j969439P73452J656456j293551m894038
44866a1860750m874904m78464N655701J0189761J0747362O825767P11945l610110
$$ y = [7718920, 6674032, 3305803, 689954, 2111891, 7936833, 14088740, 14935696, 9575624, 4219598, 5266748, 10383949, 10548157, 1862960, -9020683, -13410646, -10391342, -5161840, -1518548, -120872, -1051415, -3177101, -3064064, 528137, 2765850, -1347237, -8474209, -10441848, -5975743, -2321916, -3928930, -6210265, -3665335, 1575375, 3781082, 1939562, -840127, -3164192, -5366043, -5500829, -770310, 7018811, 11738260, 9555957, 2444842, -5123459, -10081978, -11131326, -8544216, -4977724, -3996837, -6133630, -8103069, -7329617, -5673161, -6966712, -11860750, -16735654, -17214118, -11558417, -1368656, 9378706, 16204473, 16916418, 13306308]
44858A3306308m092616k581042j865204j748374j64390K312873K193852j582585
44850E778822m903927l601913N87933K452759P80793m13347J471041L703708K889299
44841H745168L61701j36653J700963K562211N94168k263655l264387j951612K12633
44832F560537J621101J403825j23533j384530r22152P83571J691497N76671j703107
44823H503880l343613l275239j832997n19978q15969k284771k349577N56150L822447
44814a539667K771628l125375p932247n225885L927267J0963559Q825319K1610
44806H686209n856897k841053M771114P803243L185701k968440l790034m23866
44798H565977K41194m517623r168636p130956L84803N671801M174179m01920k000953
$$ y = [13306308, 9213692, 6632650, 4767446, 3019072, 2854682, 5167555, 7361407, 5778822, 874895, -2727018, -2139085, 313674, 1094467, 681120, 2152161, 5855869, 8745168, 9106869, 8970216, 10671179, 13233390, 13827558, 11563903, 8299516, 6347904, 6560537, 8181638, 9585463, 9461930, 8077400, 7155248, 7938819, 9630316, 10206987, 8503880, 5160267, 1885028, 52031, -467947, -1283916, -3568687, -5918264, -5362114, -1539667, 1231961, -1893414, -9825661, -15051546, -11124279, -160720, 8664599, 8686209, 2829312, -11741, 4759373, 12562616, 15748317, 12779877, 8989843, 8565977, 8807171, 4289548, -4879088, -12010044, -11625241, -5953440, -1779261, -2181181, -4182134]
44789d182134k63742Q05597N31021K569683P237584Q591931L077445l539727l735097
44780A1092561M03741O46156l993394n896175j800363J889609L12059j816883
44772H37311P40126L954747J653507l061763k649327J984755L072831r12042l370787
44763B249358j250957O02336j138920k820341r96377K050020L599844M845671
44755G140634O074036L787379k693248p440719o013152k338171j939472l083249
44747f505962j213599J915345J289637j727041j050154L536084N465914K036825
44739C747049j312561K79775M183444N239294K853502k99870k946260n081355
44731F663018n867653m810061l013877q37456L259842Q716528J0424285M524528
$$ y = [-4182134, -4445876, -3640279, -3109258, -539575, 6698009, 15289940, 18367385, 14827658, 11092561, 11496302, 12142458, 8149064, 2252889, 452526, 2342135, 2654194, 837311, 1577437, 5532184, 7185691, 4123928, 1474601, 3459356, 6532187, 5620145, 2249358, 998401, 1600737, 461817, -2358524, -3354901, -1304881, 2294963, 7140634, 13214670, 17002049, 14308801, 6868082, 854930, -1483241, -3422713, -6505962, -7719561, -5804216, -4514579, -6241620, -7291774, -3755690, 1710224, 3747049, 2434488, 2714263, 6897707, 12137001, 14990503, 14690633, 11744373, 6663018, 795365, -4014696, -7028573, -7866029, -4606187, 4110341, 14534626, 19059154]
44723A9059154m730839q726741n405745j820554l872814p672883n208393L567757
44715a4811058R700912P118748P61215m65807M249356P458788M501107o63065
44707A7850196k348332j289864k154278n619711p558106n594513k278264o74857
44699i667729q8887J678167L875861L560755N97328r25507J912343N589571L520924
44690A0052826m587770j0203430n875883M512872R891229N794998j051223k860730
44682E672889j59781J648156M13974k025213l830471l768519n95846M181896N701008
44673G238093K105213j470797j80650K482431K02741n234344o271299j674112
44665b802724K069123J771821J351696K834998K237464k084267m961924k955589
$$ y = [19059154, 14328315, 5601574, 195829, -1624725, -5497539, -13170422, -18378815, -14811058, -5110146, 2008602, 2769817, 2304010, 6553366, 14012154, 18513261, 17850196, 15501864, 14212000, 12057722, 6438011, -1120095, -6714608, -8992872, -9667729, -9756616, -8078449, -4202588, -641833, -44505, -970012, 942331, 6531902, 10052826, 5465056, -4738374, -10614257, -6101385, 3789844, 9584842, 8533619, 5672889, 5513108, 7161264, 7575238, 5550025, 1719554, -2048965, -2644811, 1537085, 7238093, 9343306, 7872509, 7691859, 10174290, 10377031, 5142687, -1128612, -2802724, -733601, 1038220, 2389916, 5224914, 7462378, 5378111, 416187, -2539402]
44657b539402k10773n18135m44783L203581N547311J303243m721409l903926K483267
44648A98974N120231R08036l566599l051260J06089K003508K213838R01248k645331
44639B188734o484549o726680l617361j392530o86135K340380P119497O547779
44631g10865j753501q886470n848579L594037Q254093M619920n20991r63836K309992
44622I3800N321391N769233K636236l603486q866165q066613j872773K831250
44614e757127J424163k737125l665418r95972O54619q24399k124767K75796M911789
44605h838441P227691N311787J585630j029588k396737l610586m149845k902512
44597h802601j107984j360454l449170m072075j708251R97890J415818Q79250
$$ y = [-2539402, -2750175, -3268310, -3713093, -509512, 5037799, 6341042, 1619633, -2284293, 198974, 5319205, 6227241, 2660642, -390618, -284529, 1718979, 3932817, 4834065, 2188734, -4295815, -11022495, -14639856, -16032386, -16718521, -14378141, -7258644, -710865, -2464366, -11350836, -17199415, -13605378, -5351285, -731365, -1252356, -2216192, 93800, 5415191, 11184424, 13820660, 10217174, 1351009, -6715604, -8588377, -5757127, -4332964, -7070089, -10735507, -11731479, -11076860, -11901259, -14026026, -13750230, -8838441, -1610750, 3701037, 5286667, 4257079, 1860342, -1750244, -5900089, -8802601, -9910585, -11271039, -14720209, -18792284, -20500535, -19502645, -18086827, -17207577]
44589a7207577J984945M060816M417775K787822J258259M97308o43919j946243
44581d790814j614257K59596J210001M39372M06473K663933M547461K456108k781955
44572B795918o130138l893867K170916O416988M699623j354483n466775l002353
44564c764171L842052Q348933O694444J258542l568261o134559o745946n010957
44556e079923r76554K602277K562779k90061k075985j309443m23461r75661o52184
44547f618216K563149N653568L566747l545776r334010q414961k369442K750975
44539a5747966L506417J989827K022639L977675M466263J218505k938187k878420
44531d383247J810948N251982K720457k739829m688836k450029p29146p00288
$$ y = [-17207577, -15222632, -11161816, -6744041, -3956219, -2697960, -2200652, -2844571, -4790814, -6405071, -6145475, -4935474, -4496102, -4089629, -1425696, 3121765, 5577873, 2795918, -3334220, -7228087, -5057171, 1359817, 6059440, 4704957, -761818, -3764171, 77881, 8426814, 15121258, 16379800, 12811539, 6676980, -68966, -5079923, -6056477, -3454200, -891421, -1181482, -3257467, -4566910, -4990371, -5966032, -6618216, -4055067, 1598501, 5165248, 1619472, -7714538, -16129499, -18498941, -15747966, -12241549, -10251722, -8229083, -4251408, 214855, 1433360, -1504827, -4383247, -2572299, 2679683, 5400140, 2660311, -2028525, -4478554, -5207700, -5907988]
44523e907988J639385O380938O603179o50401p018412l974725L669223M703395
44515E444594j166124l772549M11415L444300N64304j996714Q40102L539492K63117
44506G571937m118900k489289J942089J579168k236730k395818J179084K664035
44498C695576J681807K429807L197356j274433p349359n400112L196686N619672
44490E797000j645220n535537K552320J1512691P633362l367175n586670K046817
44482A3407588N580349o37037n557341J60780R441363R269267j515499j1909691
44474A8239779j2579983m472679M684578Q215718N011076j108442n559862o609588
44466E820597m945957j274842L483021O428563M388192j653861o225213n140600
$$ y = [-5907988, -4268603, 2112335, 8715514, 8065113, 1046701, -2928024, 741199, 5444594, 4278470, 505921, 917336, 4361636, 4925940, 2929226, 3769328, 7308820, 7571937, 3453037, 963748, 2905837, 4485005, 2248275, -147543, 1031541, 3695576, 5377383, 7807190, 11004546, 9730113, 2380754, -3019358, 177328, 5797000, 4151780, -1383757, 1168563, 12681254, 20314616, 16947441, 11360771, 13407588, 18987937, 18350900, 12793559, 12954339, 22395702, 31664969, 30149470, 18239779, 5659796, 1187117, 5871695, 14087413, 19098489, 17990047, 12430185, 5820597, 874640, -400202, 3082819, 9511382, 13899574, 12245713, 6020500, 879900]
44458H79900l85690K378517P89862j439792K77994M595046N389409N59424l947147
44449I097523k385636J574129m8502o490666q223630j592176M799575K781351
44441d88032l610520n456546k108115P14511J494244K851146L659472M55325m130325
44432f618840l284679K952495O695058L781290j078488k651954j517873M37975
44424a285016L764801P142712N857230q11873n973717l906927J681589L197795
44416I666594k91688l164771j792068J830269M080085L470623P00789k242060
44408A2257773l158438j653466K56717O11206k62021p07502J77028J790866K079009
44399A1391172j232396p228033j0392465o165504K184038O427865L668503q07749
$$ y = [879900, 494210, 2872727, 3662589, 2222797, 2500791, 7095837, 12485246, 13044670, 9097523, 6711887, 8286016, 8237514, 1746848, -6476782, -8068958, -3269383, -488032, -4098552, -9555098, -11663213, -10948702, -9454458, -6603312, -2943840, -2488515, -6618840, -9903519, -6951024, -255966, 3525324, 2446836, -205118, -1722991, -1285016, 2479785, 9622497, 15479727, 14667854, 8694137, 4787210, 6468799, 9666594, 9374906, 6210135, 4418067, 6248336, 10328421, 13799044, 14499833, 12257773, 9099335, 7445869, 7702586, 8313792, 8051771, 7344269, 7521297, 9312163, 11391172, 10158776, 2930743, -7461722, -13627226, -11443188, -5015323, -1346820, -2154569]
44391b154569j962632r59941n09377J46984J806696J733366j558579l633382J80616
44382f910818O681847P979081K009468n048004p050106m462686j739224j275711
44374i816153j635823m14288K448137M400740L363966M34350j625870j966973
44366d811914j815157j613861n76959J137125K535508L677723M514980L023306
44358F070751j391001m161354j113199L294946Q95289o843398r436923l351069
44350a6035958K559184J671023n97379J951407N100704L086216K9185K015383
44342b20235M899981J718757l499250k162895K918496J972374l753544l476709
44334a603025L514484N252909k574245q403035l304097M891407M489463k785997
$$ y = [-2154569, -4117201, -5077142, -5586519, -5439535, -3632839, -1899473, -3458052, -7091434, -6910818, -228971, 7750110, 9759578, 4711574, -2338532, -6801218, -8540442, -9816153, -11451976, -11866264, -9418127, -5017387, -1653421, -1219071, -2844941, -4811914, -6627071, -8240932, -8817891, -7680766, -5145258, -1467535, 3047445, 6070751, 4679750, 518396, -594803, 2700143, 3595432, -3247966, -12684889, -16035958, -13476774, -11805751, -12403130, -10451723, -5351019, -2264803, -2235618, -220235, 4679746, 6398503, 2899253, 736358, 3654854, 5627228, 1873684, -1603025, 1911459, 7164368, 4590123, -3812912, -7117009, -2225602, 2263861, -522136]
44326e22136o680858l663395J511617M693320N114080K810005m54513r20284J404182
44317C292018P45625n378034r683816m380514O574516J1767660P075541o49957
44309I363039l820555j729584K181823M877273M205112o05055o769015r064939
44301a361901n134721J601868N455544M204013P10897q64823K20209J246956N61838
44292F639880j56036K99627n59472m752034q655187o945583n93648M401078N480833
44283d840542M800957K875388j434861m355280J97355R070402J0641273J724707
44275A8679399n877447k553733M390259K537813o305716r981273n004998J16470
44267c999226n05885l006690k333310Q70311L852029N322212M000284m20190m168209
$$ y = [-522136, -7202994, -10866389, -9354772, -4661452, 452628, 3262633, 2808120, 1887836, 3292018, 4037643, -1340391, -11024207, -15404721, -8830205, 2937455, 10012996, 9363039, 5542484, 3812900, 5994723, 10871996, 15077108, 14472053, 7703038, -1361901, -6496622, -4894754, 560790, 4764803, 5475700, 4610877, 4831086, 6078042, 6639880, 6483844, 6783471, 6223999, 1471965, -7183222, -14128805, -14722453, -10321375, -4840542, -39585, 2835803, 1400942, -2954338, -2756983, 6313419, 16954692, 18679399, 12801952, 10248219, 14638478, 17176291, 10870575, 889302, -4115696, -3999226, -4505111, -7511801, -9845111, -8974800, -5122771, 199441, 4199725, 3779535, -388674]
44258c88674l222168l66393j705379n871724m718137L320779Q889155M940322
44250H77781k763274m233729P06702L674093M67182l961540l433341J423934M992529
44241b249663M096799J225737L24301J233747N07503k493342l741279o71723L095128
44232A327208K620130j274420l981223m106880l551728k163275J753289N945173
44224c431726N562196J051244j237044J649412M755132K833193k139386m495794
44216D547227k521827P94442K320931J340588p75367j573099L23369L086004L459052
44207A1001320Q71700k549015n614856q188829q069009k736382M882612P649381
44199b753078L348821k022919k510467P01493L105671L269731K047184m95613
$$ y = [-388674, -3610842, -3977235, -5682614, -11554338, -16272475, -12951696, -4062541, 877781, -1885493, -6119222, -5412520, -1738427, -1271245, -5232785, -8666126, -7242192, -2249663, 1847136, 3072873, 3397174, 4630921, 5138424, 2645082, -1096197, -1767920, 1327208, 3947338, 2672918, -1308305, -5415185, -8966913, -11130188, -9376899, -3431726, 2130470, 3181714, 1944670, 3594082, 8349214, 11182407, 9043021, 4547227, 2025400, 2819842, 5140773, 6481361, 5705994, 4132895, 4456264, 7542268, 11001320, 11873020, 9324005, 3709149, -4479680, -12548689, -15285071, -10402459, -2753078, 595743, -1427176, -3937643, -3236150, -130479, 3139252, 5186436, 4690823]
44191D690823l444108l670376m0204L701866L744932J269750n31669j483029k794064
44182A443921l290776j473515Q42087J034703J17399Q85287L112266M112339K833885
44173I617596L79110k191398m013129m093296k979783k419807j635735K249700
44165e086742P705693P959931R48069n271987l088831L478574N527473K940807
44157A5112987K161012L086451r56582r871988j3972628p555757L074807Q782135
44149a39563P853035L683199j131200m388029l739426o56764p6012k770706l372177
44140d737643O32217L964576K141114r24721K95368L586633L089022r59806l430736
44131C656024k718889j417610m44088J171651J937265m47380l751096l360118
$$ y = [4690823, 1246715, -2423661, -2463865, 1238001, 4982933, 6252683, 5721014, 4237985, 1443921, -1846855, -3320370, -2478283, -1443580, -1326181, -440894, 2671372, 6783711, 9617596, 9996706, 7805308, 3792179, -301117, -3280900, -5700707, -7336442, -5086742, 2618951, 10578882, 11526951, 6254964, 3166133, 6644707, 12172180, 15112987, 17273999, 20360450, 19403868, 9531880, -4440748, -11996505, -8921698, -139563, 7713472, 11396671, 10265471, 5877442, 2138016, 1481252, 1405240, -1365466, -4737643, -4105426, -140850, 2000264, 1075543, 1370911, 4957544, 8046566, 7086760, 3656024, 937135, -480475, -924563, 247088, 2184353, 1736973, -2014123, -5374241]
44123e374241N27652L301413L263636L086583L962509L806916J721544r01840
44115A3394172l937800p768351q975858l371538N634175Q809192L681330j647743
44107E817579p62727K115152O89752k483787j096211L359111L650342j356718
44099I932493m955105k839651J744421M107938L406243L50447m759528r368900
44091b381642q907926k792624L483700N169762L832731L087299K290339r99609
44083B782030m567606l203821K929614O646315K832471m154854n685112n0493
44075b471456N435832M265400q34790k165078K222483O320966M937939K32201
44067A7943497k786127l427066m022459m146070j382177K937400M126296J045673
$$ y = [-5374241, -4846589, -1545176, 1718460, 4805043, 8767552, 12574468, 14296012, 13394172, 9456372, 1688021, -7287837, -10659375, -5025200, 3783992, 7465322, 5817579, 5054852, 7170004, 7859756, 5375969, 4279758, 7638869, 11289211, 9932493, 4977388, 2137737, 3882158, 7990096, 11396339, 11746786, 6987258, -2381642, -11289568, -14082192, -10598492, -5428730, -1595999, 1491300, 3781639, 2782030, -1785576, -4989397, -2059783, 4586532, 7419003, 3264149, -2420963, -2471456, 2964376, 7229776, 6394986, 4229908, 6452391, 12773357, 17711296, 17943497, 15157370, 11730304, 7707845, 3561775, 2179598, 5116998, 9243294, 10288967]
44059A0288967k039345j900574m14456m09894j478153k151673k557746k545381
44051c208255q50070J467643R33736k068567j850634L475025O646221J396978
44043E942077o360176n835339K448110P091867K550515l925139m475748j219334
44035c783167k62417k039428l125728k720053j850629K13216L684345N406708
44027d477153L128098J25568R09118M420566N994139M197412J280408j446023
44019A4132133m074673n309230l790269j268155k71500K07253K422873M830707
44011F879139M357233K364240K558456L794668J534424l495287n346084k811035
44003I835754j733422m603514n567807n38380M743590L385878j349238j344065
$$ y = [10288967, 8249622, 6349048, 5934592, 5524698, 4046545, 1894872, -662874, -3208255, -4058325, -2590682, -1656946, -3725513, -5576147, -2101122, 4545099, 5942077, -418099, -6253438, -3805328, 3286539, 5837054, 1911915, -2563833, -3783167, -4045584, -6085012, -9210740, -11930793, -13781422, -13568206, -9883861, -4477153, -1349055, -1223487, -314369, 4106197, 10100336, 14297748, 15578156, 14132133, 10057460, 4748230, 957961, -310194, -581694, -374441, 2048432, 6879139, 11236372, 13600612, 16159068, 19953736, 21488160, 17992873, 12646789, 9835754, 8102332, 3498818, -2068989, -2607369, 2136221, 5522099, 4172861, 2828796]
43995B828796L165809M212947j148938o820679p147995l324295J428908O455906
43987c49541J0378436R007125J199941o850364p899433k215412L968636O629534
43979A3868922O329614L806491j457253p391986q871880l944489K427875M159621
43971H926915J841281J157363M250414O833735M893097L37679k596799l480172
43963B2163513m478055n067804k714184J665201L847499K657395J341117J190425
43955B0605107p04887m405196l799427M067497J1097799P351989m141000j0309768
43947A9762114n776928R15532R46376l179549m176014j344419Q04966Q37147Q79658
43938I668883J375078J009335K93584N67253J107503J298172L038500O266502
$$ y = [2828796, 5994605, 10207552, 9058614, 2237935, -4910060, -8234355, -6805447, -349541, 10028895, 19036020, 20235961, 13385597, 5486164, 3270752, 7239388, 13868922, 20198536, 24005027, 22547774, 15155788, 6283908, 2339419, 4767294, 8926915, 10768196, 11925559, 16175973, 23009708, 27902805, 28240484, 25643685, 22163513, 17685458, 12617654, 9903470, 11568671, 15416170, 18073565, 19414682, 20605107, 19900220, 15495024, 11695597, 15763094, 26860893, 34212882, 30071882, 19762114, 13985186, 14900718, 15847094, 12667545, 8491531, 7147112, 7952078, 8789225, 9668883, 11043961, 12053296, 12346880, 12914133, 14021636, 15319808, 18358308, 24624810]
43930B4624810N592365j854076q234404l677032P823014J1533655K772597o146358
43922C2434571m467506J773981J200154m434694m278685L410304Q882097O314313
43914D0834535J026793p96774m40661p87822K51409M795653Q748201O768280O36117
43905F1035731l019097j863564M43466J177525K059188M691896O666438M864868
43897G6056451N25399j618407J300904P526291J3085506J5479707J4766866J2431239
43889A39553956J0287698R880361J1666556J4672556J7787105K1275866K5836076
43882B50960174L0246494L1931740L0708656K9912427L1957284L4308439L2244804
43875D72270018K4666807J4472575L684756q474714k1962830l3589915m0374790
$$ y = [24624810, 30217175, 28363099, 20128695, 16451663, 24274677, 35808332, 38580929, 32434571, 27967065, 29741046, 30941200, 26506506, 22227821, 25638125, 34520222, 40834535, 41861328, 41064554, 40623893, 39836071, 40087480, 44883133, 53631334, 60399614, 61035731, 58016634, 56153070, 56596536, 57774061, 59833249, 64525145, 71191583, 76056451, 76581850, 74963443, 76264347, 83790638, 96876144, 112355851, 127122717, 139553956, 149841654, 159722015, 171388571, 186061127, 203848232, 225124098, 250960174, 281206668, 313138408, 343847064, 373759491, 405716775, 440025214, 472270018, 496936825, 511409400, 515094156, 506619442, 484656612, 451066697, 410691907]
43868D10691907m3177822m4548371m4093070l8833455k8496079j7999487j2861006
43861A80682617j3018890j3281050j0241805o723085p705539j3207637j7774243
43854I8730368j6810564j0894810l729180J222748J548244k934030q093979q235168
43846E0803629l392040k66130k819638o066495l816327J349286K225271j643138
43838C6374418m312883l963750m743625p465620o952302j378873L305027K297552
43830A3159944j024375j393663N38474J311008O70002j88678j794235l201388
43822H077089n11965O178779R425275M351938k731819k932413K123333M061835
43814B8042052J175792j485421l115795p282012j1329561p538254K548442O506346
$$ y = [410691907, 367514085, 322965714, 278872644, 240039189, 211543110, 193543623, 180682617, 167663727, 154382677, 144140872, 137417787, 129712248, 116504611, 98730368, 81919804, 71024994, 67295814, 68518562, 70066806, 67132776, 59038797, 50803629, 47411589, 47145459, 44325821, 38259326, 34442999, 35792285, 38017556, 36374418, 32061535, 28097785, 23354160, 15888540, 8936238, 7557365, 10862392, 13159944, 12135569, 10741906, 11280380, 12591388, 13261390, 13072712, 11278477, 8077089, 7565124, 13743903, 23169178, 27521116, 24789297, 21856884, 23980217, 28042052, 29217844, 27732423, 24616628, 17334616, 6005055, -1533199, 1015243, 7521589]
43806G521589r57104q678251n201955M382812P163540J568455k949866j814964
43798A034256K76487J67060Q17190L305681L613622P50100q1409L186573M571724
43789A7641284K50751l353833L72486N779844K884867n322119n733874L938464
43781A6457870R799973K458123q311722q469844n44543K049735l695055p761378
43773A983159m426230N17976J670151J647212K856167J792076k879271n120631
43765a959391q96329M316818M092278R45371P58790K992432L824928L895342M919185
43756B2889424L169709m790175j3227952j3247847n642909P79267J870500O57505
43748g542478q41643k968761k882551K352186P508868M457216l799314n365401
$$ y = [7521589, 6564485, -2113766, -7315721, -2932909, 4230631, 5799086, 2849220, 1034256, 1310743, 1477803, 2294993, 5600674, 9214296, 9964396, 9882987, 13069560, 17641284, 17892035, 14538202, 14910688, 20690532, 23575399, 18253280, 12519406, 16457870, 26257843, 28715966, 20404244, 11934400, 11389857, 13439592, 9744537, 1983159, -2443071, -1925095, -254944, 1392268, 4248435, 6040511, 3161240, -1959391, -2855720, 1461098, 5553376, 6498747, 7257537, 10249969, 14074897, 17970239, 22889424, 26059133, 21268958, 8041006, -5206841, -10849750, -10070483, -8199983, -7542478, -8384121, -11352882, -14235433, -11883247, -4374379, 82837, -3716477, -9081878]
43740i081878K448444Q743269O252847J349487J236282K248826j031145m415999
43732G750133j728844L116375K145297l028296l968535N22490L090033L29119
43724H227772k479209r84485J307512o91659n412577p062573m139598j274711
43716a2509528j979710k849312J555367Q983422J0134166J624124p312061o863464
43708i216996o53385O63610l550079m147183J402833N172830L340771K038760
43700d948839M306041L728768k217764m577519K262473Q992411N531440k409629
43692A0667382k996837K953506N586128K559648p84393l083159o088355o292638
43684B521282l53138M848083R93003o316798n441293J254902J670725l507974
$$ y = [-9081878, -6633434, 2109835, 8362682, 9712169, 10948451, 13197277, 12166132, 7750133, 6021289, 9137664, 11282961, 8254665, 4286130, 4808620, 7898653, 8227772, 5748563, 4764078, 6071590, 5379931, -32646, -7095219, -11234817, -12509528, -14489238, -17338550, -15783183, -6799761, 3334405, 4958529, -2353532, -9216996, -9870381, -9206771, -12756850, -16904033, -15501200, -10328370, -6987599, -4948839, -642798, 3085970, 868206, -3709313, -1446840, 7545571, 13077011, 10667382, 7670545, 10624051, 16210179, 18769827, 17985434, 14902275, 8813920, 2521282, 2168144, 7016227, 8009230, 1692432, -3748861, -2493959, -823234, -4331208]
43676d331208j282923R239436J2645458K873785n788376k158179M503599K048641
43668A7750233m567014m550299o13793k040165o897769o164317k32290K454210
43660d861204j39029k707196l565661n342170o612190l272344K875273O077378
43652a7547143N788002N441662M369520Q2847l684778j371970L439029K137448
43644a345383m345891o275964j125086K773891R56546m99523K487907L883031
43636c490472j256518o758805m877655J183686L189901J163002J396375M293960
43628e156526L831372j278180m625329k148787J804886J606964j523278k303898
43620i792776Q91313M889162O603527N659340K866166o64868k578957n23890M094228
$$ y = [-4331208, -5614131, 3625305, 16270763, 19144548, 13356172, 11197993, 15701592, 17750233, 13183219, 8632920, 8019127, 5978962, -918807, -7083124, -7315414, -4861204, -5000233, -7707429, -11273090, -16615260, -23227450, -26499794, -23624521, -17547143, -11759141, -6317479, -1947959, -1865112, -5549890, -6921860, -3482831, -1345383, -5691274, -11967238, -13092324, -10318433, -9361887, -9861410, -7373503, -3490472, -4746990, -11505795, -16383450, -15199764, -12009863, -10846861, -9450486, -5156526, -1325154, -2603334, -7228663, -9377450, -7572564, -5965600, -7488878, -9792776, -8901463, -4012301, 2591226, 8250566, 11116732, 10451864, 7872907, 7349017, 11443245]
43611A1443245N906946J590565n250079q048219n471028k294846j947209k183357
43603f253982J09309L509761M436607K276173r52285l758774m805331j910580
43595g349102M368312Q235448M863782j983412m083492k88621K137466j207628
43587D692753n590673n131500j553180l33422j912244k119547L79215K237254
43579i331344J149915o40903M3852K638639L572132R58752k877604m197597k539457
43570a1223615r25502q80785Q6952L577454N626166J803524m304425m135112L349961
43561g025382Q871652N534505j869706m770343k461750P6845J305021K736074
43553B396916K648676j582983o245760m616907K431565O999422N927962L848215
$$ y = [11443245, 17350191, 18940756, 13690677, 5642458, 171430, -2123416, -4070625, -6253982, -6144673, -2634912, 1801695, 4077868, 3125583, -633191, -5438522, -7349102, -2980790, 5254658, 10118440, 8135028, 4051536, 3762915, 5900381, 4692753, -897920, -6029420, -7582600, -7916022, -9828266, -11947813, -11568598, -9331344, -8181429, -8822332, -8778480, -6139841, -2567709, -1608957, -4486561, -8684158, -11223615, -12149117, -13029902, -12942950, -9365496, -3739330, -1935806, -6240231, -10375343, -7025382, 1846270, 7380775, 5511069, 740726, -1721024, -1644179, -339158, 2396916, 5045592, 3462609, -2783151, -7400058, -4968493, 2030929, 7958891, 11807106]
43545A1807106L123091q5184o226032q020806j705847N075318L951428j877768
43537F041306m082531k437008k134810k020214L309324J0935737J0610139R7801
43529B0319744j0330026j1924161p470589l600241j285709R22710J390300n18475
43521a2496447l77885M548621Q667142N152479l050741o348207j580651M335921
43513a149768M291105m81747l199070M8330N971009P474435J790092n091386m870584
43504D782416K003946O394914L106861k571397m436085m649131p112625p695112
43496a0176213l41600J0387975J3090373N468013k754087m006014j482238j174092
43488I012117k921461l287800j786797k56670M15435K11219o66033j082481l26842
$$ y = [11807106, 14930197, 14845013, 8618981, 598175, -1107672, 3967646, 7919074, 6041306, 1958775, -478233, -2613043, -4633257, -1323933, 9611804, 20221943, 20319744, 9989718, -1934443, -9405032, -13005273, -14290982, -13368272, -11977972, -12496447, -12874332, -8325711, 341431, 5493910, 2443169, -3905038, -5485689, -1149768, 3141337, 2659590, -539480, -491150, 5479859, 12954294, 14744386, 9653000, 4782416, 6786362, 13181276, 16288137, 13716740, 9280655, 4631524, -2481101, -10176213, -10517813, -129838, 12960535, 18428548, 15674461, 11668447, 10186209, 9012117, 6090656, 2802856, 1016059, 759389, 1174824, 1386043, 720010, -362471, -689313]
43479f89313j18744j878427l047820p86812K086667R71486j880170j80944N214933
43470c09144O678720K455750l65865J867402L586473N89442k745408k280250j620412
43461G856708m292137o153440k944361J375706J548226J11412J482093K737861
43453A722068o46287m644193k133174M556130O278806P65433n199874o638503
43445e939594n347983m011856k489441o31042O60617J330608J273470p28021l451398
43436a9334640k295536L290731O309767K537533j130409K982251R916195R361109
43428A1637001K178912k141726j685140k785208n735106l784763K494692L789919
43420C968581j808586m473379P73499N602724K781058k319517k236628K59120
$$ y = [-689313, -808057, -2686484, -5734304, -6521116, -4434449, -3462963, -5343133, -5524077, -309144, 6369576, 8825326, 8459461, 10326863, 13913336, 14502778, 11757370, 9477120, 7856708, 3564571, -2588869, -5533230, -4157524, -2609298, -2497886, -1015793, 1722068, 1075781, -3568412, -5701586, -1145456, 5133350, 5898783, 698909, -5939594, -11287577, -15299433, -17788874, -18419916, -17759299, -16428691, -15155221, -15883242, -19334640, -21630176, -18339445, -12029678, -9492145, -10622554, -7640303, 2275892, 11637001, 13815913, 11674187, 9989047, 7203839, 1468733, -2316030, 178662, 3968581, 2159995, -2313384, -1539885, 4062839, 6843897, 4524380, 2287752, 2546872]
43412B546872j222721n322928o233150k653991K897043Q165816R636889L722327
43404A1536157n594734q080189j720139K745143j711983o930374l266021M459284
43396h562856N809998J977328J608908M823807M517888L46613j452579m34875
43388H634232j726240m245440j646190M408662M384288l322100q416012m540629
43380f469429J442773J306354k496115l063592k22280J485786J199348J623241
43372e193914L188169L453292J151871k165075l564653r51415M080193N948448
43364E946916J343513m715634m374219J398712L379926j985063o618305k714840
43356h338994N881058R687848O139504K67010l610219m863646l497723K5892K677092
$$ y = [2546872, 1324151, -3998777, -10231927, -12885918, -9988875, -1823059, 7813830, 11536157, 5941423, -2138766, -3858905, -1113762, -2825745, -9756119, -13022140, -8562856, -2752858, -775530, 833378, 5657185, 10175073, 10521686, 9069107, 8634232, 6907992, 2662552, 1016362, 5425024, 9809312, 6487212, -1928800, -6469429, -5026656, -3720302, -6216417, -9280009, -9502289, -8016503, -6817155, -5193914, -2005745, 1447547, 2599418, 434343, -3130310, -4081725, -1532, 5946916, 7290429, 2574795, -1799424, -400712, 2979214, 994151, -5624154, -8338994, -2457936, 7229912, 13369416, 13636426, 10026207, 5162561, 1664838, 1690730, 4367822]
43347D367822J319078k796219n333974m152982n20392L750535P220145P814367
43339A1668380M189619j893163o600534p143226l126307L100742O276424K002119
43331H474054o558672r606625k561170O560390P123943J67574m318290k433858
43323c152654o0848j197035j866786J142326L807602K357690L68782J994282L778523
43314G171882P78355l497001k071309K988802K695802m112899p759461k315658
43306f121487N131218M862563j879525n732057k139826M268146O819834L902681
43298I111547r24941l372620k811480k459012m031119l824209J671525P605144
43290I64835N489032l066998o404838k29328M967595P44669m957685r83761P717547
$$ y = [4367822, 5686900, 2890681, -2443293, -6596275, -7116667, -3366132, 3854013, 11668380, 15857999, 13964836, 7364302, 221076, -2905231, 195511, 6471935, 8474054, 1915382, -7691243, -10252413, -3692023, 3431920, 3599494, -718796, -3152654, -3213502, -4410537, -6277323, -5134997, -1327395, 1030295, 1399077, 3393359, 7171882, 7950237, 4453236, 2381927, 5370729, 8066531, 3953632, -3805829, -6121487, -990269, 3872294, 1992769, -3739288, -5879114, -1610968, 5208866, 9111547, 8186606, 4813986, 2002506, -456506, -4487625, -8311834, -6640309, 964835, 6453867, 3386869, -3017969, -3247297, 1720298, 2464967, -2492718, -3476479, 4241068]
43281D241068P791669n77450m993046k211063j664766o248966o410983J493414
43273h580123O708250K018696l736174j200385L632944J056465m921617m195872
43265i217816J847163M182818K340132K926998N398549L079072l095877n066976
43257B394063j866002q68744l848708l965756Q85343L247421j322991o703998
43249a2049372n898413j70295N600316R174508Q876757K917987n079510p187899
43241c815921k160148J752614n78074l232666L62027O292625O792060K566926
43233G979443M30674J960341K268219j240831n282344n796433k438314J673685
43225d45560K268125k126218o551530l617308N921673J1316181N332436m934636
$$ y = [4241068, 12032737, 11455287, 6462241, 4251178, 2586412, -3662554, -10073537, -8580123, -1871873, 146823, -3589351, -4789736, -1156792, -100327, -5021944, -9217816, -7370653, -3187835, -847703, 2079295, 7477844, 10556916, 7461039, 2394063, 528061, -340683, -4189391, -8155147, -7269804, -4022383, -5345374, -12049372, -17947785, -18118080, -12517764, -3343256, 5533501, 8451488, 3371978, -3815921, -5976069, -4223455, -4801529, -8034195, -7672168, -1379543, 5412517, 7979443, 8410117, 10370458, 12638677, 11397846, 6115502, 319069, -2119245, -445560, 1822565, -303653, -6855183, -10472491, -4550818, 6765363, 12097799, 7163163]
43217G163163p285653r43068M200043L213333J781985M647208P036474K721144
43209B2534629m975229o899975j017140M412906J859561n434936p665383j168139
43201A646294O918797P829106J910902k960852k247786K74177p45541m395767
43193H229330n291695j363892L262963L369514j206331n505278n147826j043556
43185d696771K457329L191205K600974J706647m83965l071700k403032J511305
43177H11992K441792k940486p781255m095783M267174O595481J423551k353568
43169a631102l87400J915469R91232Q32916L082761K106093m092088p736362l340651
43160h259132K689493K585620m57770N16113L577696K452335j628844k767172
$$ y = [7163163, -122490, -1065558, 3134485, 6347818, 8129803, 12777011, 19813485, 22534629, 17559400, 10659425, 9642285, 14055191, 15914752, 10479816, 2814433, 1646294, 8565091, 16394197, 18305099, 15344247, 13096461, 13370638, 12625097, 8229330, 2937635, 1573743, 4836706, 8206220, 6999889, 1494611, -3653215, -4696771, -2239442, 951763, 3552737, 5259384, 4775419, 1703719, -699313, 811992, 3253784, 313298, -7467957, -11563740, -7296566, -701085, 722466, -1631102, -2018502, -103033, 888199, 1721115, 4803876, 6909969, 2817881, -4918481, -8259132, -5569639, -2984019, -3441789, -2925676, 652020, 3104355, 1475511, -1291661]
43152a291661j043035o79022j253762k28117l24740m202106n741679J600187J0749024
43143b414911Q620267l189587r274726l304532L891896K776954j654331j206496
43135e755466K376981L274705J666539L53630j411981l739260k509483L109883
43127b634452O038942J496668m177285k887472K320682K552653k714391o057279
43119f061934m505853k235001j437080O35348M319320N044674Q98608l311522
43111f653440k796063P99161K892664K561653K274666L049885L205694J545953
43103F880173o69706j612614j385984j411653j722016o53024J842234K472557
43095C739967j278409o288614o466684p14915M931924M334956k014694q302604
$$ y = [-1291661, -2334696, -3013718, -4267480, -4495597, -4820337, -9022443, -14764122, -13163935, -2414911, 6205356, 3015769, -6258957, -9563489, -5671593, -2894639, -4548970, -5755466, -3378485, -103780, 1562759, 1916389, 504408, -3234852, -5744335, -2634452, 3404490, 4901158, 723873, -2163599, 157083, 2709736, -4655, -6061934, -10567787, -12802788, -14239868, -13604520, -9285200, -4240526, -3341918, -6653440, -9449503, -8650342, -5757678, -3196025, -921359, 2128526, 5334220, 6880173, 6210467, 4597853, 3211869, 1800216, 78200, -574824, 1267410, 3739967, 2461558, -3827056, -10293740, -11008655, -6076731, -1741775, -3756469, -12059073]
43087a2059073r155583l452415M917628R289698O084358o56004l485839q28277
43079i345507J708381O1287k938101k884561J92325L821391O651666P008588K553896
43070F829365m760274p852060l253837L135519L811786n48249m106902m647676
43062a1392328l268578Q08293P558093J1060219N695708l617173o098030k68895
43054D77309M259214J564524k970805l030222p92070p52355j288506R04548L268318
43045A639955J756121o94718J990699Q064773Q797267J314350o441475o708681
43037I718291k340198j396674m781215n587208n29694M232654J781525n368831
43029d271350q678498n127135J66302K441660K357441J384066j238106l680096
$$ y = [-12059073, -21214656, -24667071, -19749443, -10459745, -4375387, -5031391, -8517230, -9345507, -7637126, -7575839, -10513940, -13398501, -13206176, -9384785, -2733119, 4275469, 6829365, 2069091, -5782969, -9036806, -5901287, -2089501, -2637750, -6744652, -11392328, -14660906, -13852613, -6294520, 4765699, 10461407, 6844234, 746204, 477309, 4736523, 6301047, 3330242, 300020, -492050, -1244405, -2532911, -1628363, 1639955, 3396076, 2701358, 4692057, 12756830, 21554097, 22868447, 16426972, 9718291, 7378093, 5981419, 1200204, -4387004, -4916698, -684044, 1097481, -4271350, -12949848, -18076983, -17910681, -15469021, -13111580, -11727514, -12965620, -16645716]
43021a6645716l41941Q814479J3567769O074737n832167p646702J314941P216455
43013F521855K466954m028586j899134N166647O420596J07735n750619n381408
43005C624040q85091K853563L324152Q32010k500649m489703n273341o083048
42997h598067n096001R46987R305055J1617103N422966j179963j572280l58745
42989A0487055l853956p797834m732282J565869J213447m884568o231583m41979
42981a4675831L532230J616650O99519M561809O732215L440056J373770M570246
42973A1850664N177986k638589j0024175o851553Q17283O57115n014776l897060
42965i923105M300726P192563J097322l226755M19401L957226L76743m295796
$$ y = [-16645716, -16987657, -8173178, 5394591, 11469328, 5637161, -2009541, -694600, 6521855, 8988809, 4960223, 3061089, 8227736, 14648332, 14756067, 9005448, 3624040, 2738949, 5592512, 8916664, 9748674, 7248025, 2758322, -2515019, -8598067, -13694068, -12747081, -3442026, 8175077, 13598043, 12418080, 10845800, 10487055, 6633099, -1164735, -5897017, -4331148, -3117701, -8002269, -14233852, -14675831, -11143601, -9526951, -8827432, -4265623, 2466592, 5906648, 7280418, 11850664, 17028650, 14390061, 4365886, -2485667, -1668384, -1011269, -6026045, -9923105, -5622379, 1570184, 2667506, -559249, -139848, 3817378, 4194121, -101675]
42957a01675k503530K018475K062871p36924o90941J489878K136964K876560O156114
42948A2707792P391699J568039n882293n322631J880160M966172J71265n062226
42940A2417977n350562m234974m737971l314668J319360K331592m448566j0548210
42932a6566022n150786P950544J3497347N011447o704313q207115L7350O712330
42924c419218N406466J104920J051030M558908N223071P44873l973257m098748
42916F598045j305191k69967j424252j313893P65022J282229j350104l585902
42908f04013k394579m79452j863426m622292l108028K934838O726901L715213
42900C05162j891404l233897l71037R15886j410001k825378n2270L328425K416700
$$ y = [-101675, -2605205, -586730, 1476141, 739217, 48276, 1538154, 3675118, 6551678, 12707792, 20099491, 21667530, 15785237, 10462606, 12342766, 17308938, 17480203, 12417977, 7067415, 2832441, -1905530, -5220198, -3900838, -1569246, -6017812, -16566022, -21716808, -13766264, -268917, 4742530, -1961783, -10168898, -10131548, -3419218, 1987248, 3092168, 4143198, 8702106, 13925177, 14670050, 10696793, 6598045, 5292854, 5022887, 3598635, 2284742, 3049764, 4331993, 2981889, -604013, -2998592, -3478044, -5341470, -9963762, -13071790, -10136952, -3410051, 305162, -1586242, -4820139, -5191176, -4275290, -5685291, -8510669, -8562939, -5234514, -2817814]
42891b817814j339674k530319J5669K394198K579566K986084M870394N060591
42883A1218695J085105m034100n514477l030689j29217P50753j52820j635485
42875a442235k003681N26491N009752O927725L265406k956818o325430n662759
42867b661549l597987j314660J791001M261007L461715M71335o10280J090863
42859B891445K037322K31665k001024k523002k522772l359272l954294l262165
42851a2462097k170714j309084K1101J535758J885739J724614K912599L973433
42843c888651J509459k538252j510199N125498Q564264L353712l469172l139996
42835D006663P76945j313438q314787r380764j436332N570515M084439l62519
$$ y = [-2817814, -4157488, -6687807, -6672138, -4277940, -1698374, 1287710, 6158104, 11218695, 12303800, 8269700, 2755223, -275466, -404683, 346070, 193250, -1442235, -3445916, -2919425, 2090327, 9018052, 12283458, 9326640, 3001210, -2661549, -6259536, -7574196, -5783195, -1522188, 1939527, 2410862, 1800582, 2891445, 4928767, 5160432, 3159408, 636406, -1886366, -5245638, -9199932, -12462097, -14632811, -15941895, -15920794, -14385036, -12499297, -10774683, -7862084, -3888651, -2379192, -4917444, -6427643, -1302145, 7262119, 10615831, 7146659, 4006663, 4783608, 3470170, -4844617, -14225381, -15661713, -10091198, -6006759, -6369278]
42827f369278M83343M546217M331924l33640k797819m96270K279971K169303O68504
42818D482255m80598j987100l476453k511279M47091R16421k416130l804099J461793
42809g368099Q374145P768912p38850p813471o899863j526464J732147J692394
42801d779149O53356p19863k039309q56309L157338N024185J088095l929544k784014
42792e185214L371229O733309M350746O66805r70233j597501j043406K648971
42784H974706O637166M661633k347457n732688k596347l33508k816712k701462
42776C745331M481274Q934705J035203j0750406j0601118N24315O643512J269774
42768E282590n241064m607159j814979k417096k330233J906032M170995k76098
$$ y = [-6369278, -5885935, -1339718, 2992206, 2658566, -139253, -635523, 1644448, 3813751, 4482255, 4001657, 2014557, -1461896, -3973175, -3526084, -2609663, -5025793, -8829892, -7368099, 1006046, 8774958, 8036108, 222637, -6677226, -8203690, -6471543, -4779149, -4125793, -4845656, -6884965, -7741274, -4583936, 440249, 1528344, -2401200, -5185214, -1813985, 4919324, 9270070, 9936875, 8966642, 7369141, 6325735, 8974706, 15611872, 20273505, 17926048, 12193360, 9597013, 9263505, 6446793, 3745331, 8226605, 17161310, 18196513, 7446107, -3155011, -2630696, 4012816, 5282590, 41526, -4565633, -6380612, -8797708, -11127941, -9221909, -5050914, -5327012]
42760e327012m016023J316108R654470Q388408j997338q388148m608869J028045
42752c950359K19169l297658j609961M370457O706777K309552l173665l459532
42744a885220N46096K788132R9544m034448m177327J99938M597907N760924M973687
42735H869233M026863J512729l667969p860221o424629r40576K301127J249379
42727i34064N28827L457020O569528N189035N02254k934569l905161m303863m248291
42718g9284k442547m36853j163894l124651j629296K918017L858766j637870o763409
42709a0501021m037294L947825Q241074N291521o65619n001955o350998l985803
42701a3062270J805459O508805N014581m86944k458245Q24813K947882N26149
$$ y = [-5327012, -9343035, -8026927, 1627543, 10015951, 8018613, -369535, -4978404, -3950359, -3731190, -7028848, -8638809, -4268352, 2438425, 4747977, 1574312, -1885220, -1339124, 1449008, 1548552, -2485896, -6663223, -6463285, -1865378, 3895546, 8869233, 12896096, 14408825, 10740856, 2880635, -3543994, -4484570, -2183443, -934064, -405237, 3051783, 9621311, 14810346, 15312600, 12378031, 8472870, 4169007, -79284, -2521831, -2958684, -4122578, -7247229, -8876525, -5958508, -2099742, -3737612, -10501021, -14538315, -10590490, -2349416, 2942105, 2276486, -2725469, -9076467, -13062270, -11256811, -4748006, 266575, -220369, -2678614, -1853801, 1094081, 1620230]
42693A620230r96546K651934N960705K125921m915714n355079J813827P118246
42685A0023524L876531l515316o464423k850511J692054J281047l077045m372086
42677c406225J414198Q406098P073145k404177r171881o557747q21529j96177
42669e664295k373810n16889M095709M820931J225002j703818l085865n081512
42661h284547m901787J118995P283846M767027k409291j556165P002529Q011804
42653A1032411l845664j3066487o795075M992025N945698j192186j660210N789426
42645A199938Q138826J145290l837584Q39018P141754M887620l204046p438358
42637H872458n055430q28552J706868K665110J900352j108626m159412m056547
$$ y = [1620230, 623684, 3275618, 9236323, 11362244, 6446530, 1091451, 2905278, 10023524, 13900055, 10384739, 3920316, 1069805, 2761859, 4042906, 965861, -3406225, -1992027, 6414071, 13487216, 11083039, 1911158, -4646589, -5468118, -5664295, -8038105, -8554994, -4459285, 361646, 1586648, -117170, -3203035, -8284547, -13186334, -12067339, -4783493, -16466, -2425757, -3981922, 3020607, 11032411, 7186747, -5879740, -12674815, -7682790, -1737092, -2929278, -4589488, 1199938, 9338764, 10484054, 6646470, 7485488, 14627242, 19514862, 16310816, 8872458, 3817028, 2988476, 4695344, 7360454, 9260806, 8152180, 3992768, -63779]
42629f3779j551959m91899j627714j436589J424813K765620o42499m644344l155985
42620i424335J676578J798939l503399m775540L009393J0672685P177912l805144
42612B827089r168986m945040Q77429K832293L838497N319060K968956l634520
42604I14778p276614m154984Q2712O23743R75395M010131M553251j057171o000120
42595g328879k924797L606301M510033O61962m34607J737034J439303j483719
42587b17369j443282K052518L461302J228449l43805L37633K34475j094217n13399
42578C702305J690357J790528L95747K037916N673096M139082m191119j1031869
42570D206043r259321k083924K642746K116689r76943l448177l727744j960348
$$ y = [-63779, -1615738, -2107637, -3735351, -5171940, -3747127, -981507, -1624006, -6268350, -9424335, -7747757, -5948818, -9452217, -14227757, -11218364, -545679, 6632233, 2827089, -6341897, -11286937, -10409508, -7577215, -3738718, 1580342, 4549298, 914778, -6361836, -10516820, -10434108, -9810365, -8834970, -4824839, -271588, -1328759, -7328879, -10253676, -6647375, -2137342, -1475380, -1909987, -172953, 1266350, -217369, -1660651, 391867, 3853169, 5081618, 4737813, 5075446, 5309921, 4215704, 3702305, 5392662, 7183190, 7578937, 9616853, 15289949, 19429031, 15237912, 4206043, -5053278, -7137202, -4494456, -2377767, -3354710, -6802887, -10530631, -12490979]
42562a2490979l0427P44716J983696N150783P255850M475389q75145k862770j058610
42553B292503p33618l751157n969088m518074j091679K849137P327133R507099
42545E912256N694499q66476k165882K464521M701092N57816l404469j502108
42537A1391249J976773R49426k528771l092344r04081P33784J511716J887385
42529A1925137l50716n333675p632687l596947K152588L408979J147428k44527
42521A475580o56511j590823p05068L333876M925149q40907q003987o703564J598665
42512g167590N814580J963267j672664J977308Q862981J0840801N914510k125861
42504B4407332q969770j1368908p998027k023746P25110j235653l208003j618662
$$ y = [-12490979, -12521406, -11776690, -9792994, -4642211, 2613639, 7089028, 6213883, 3351113, 2292503, 1558885, -2192272, -8161360, -12679434, -13771113, -10921976, -3594843, 5912256, 11606755, 10740279, 8574397, 11038918, 15740010, 16297826, 12893357, 11391249, 13368022, 14317448, 11788677, 8696333, 7792252, 8526036, 10037752, 11925137, 11574421, 6240746, -1391941, -4988888, -2836300, 572679, 1720107, 1475580, 819069, -771754, -1476822, 1857054, 6782203, 5941296, -2062691, -8766255, -7167590, -1353010, 610257, -1062407, 914901, 9777882, 20618683, 26533193, 24407332, 15437562, 4068654, -3929373, -5953119, -5228009, -6463662, -9671665, -11290327]
42496a1290327P55023j25259k781372k551481J378266N222603N964156M019859
42488E91468Q43202k757049n148271l706075J782743P094705P352311K516285
42480H569319k882595n310306n082459l439494k70315L374618L992381L15616
42472g33235l355441k638330M04866J103275K96305K193823N453415M325165p70063
42463F279780k354221J960196M966627J762498k046617k24388L210616R85453
42455A4539944m735634n528942J82160N487049N351052J553085k234523m176498
42447A0437693l387075o84242J64549l235386p165310o161885r95472K843729
42439h183399L556015M302487O434212P037443L893675j429488n833734o798310
$$ y = [-11290327, -10535304, -10660563, -13441935, -15993416, -14615150, -9392547, -3428391, 591468, 1434670, -1322379, -6470650, -10176725, -8393982, -1299277, 6053034, 8569319, 5686724, 376418, -4706041, -8145535, -8415850, -5041232, -1048851, -733235, -4088676, -6727006, -6322140, -5218865, -4922560, -2728737, 2724678, 7049843, 6279780, 3925559, 5885755, 10852382, 12614880, 10568263, 10343875, 13554491, 14539944, 9804310, 4275368, 4457528, 9944577, 15295629, 16848714, 14614191, 10437693, 7050618, 6366376, 6530925, 3295539, -3869771, -10031656, -11027128, -8183399, -4627384, -324897, 6109315, 13146758, 17040433, 15610945, 9777211, 2978901]
42431B978901l237778K210070L717670n37736m168532r88996N007687M968437
42423I949723j478431o206972n134002k183541l23033K291357N252840M017000
42415F184941j234921l024511K206892P384728N077072j428348l765417o73141
42407A0727295K258656K043255P92404J44793p60250j784881j170672Q38511J414671
42398A4503782p73074l527329m291276l442926k930806k527940M81283O732447
42390D224161J1363260Q379581r69508p997736p108863k595949j158852k003532
42382B132562o19329J249775j676713o792008n236503L220065P248723O33341
42374A59913p385748n667250K218463M098436k345779p014840k596567N976919
$$ y = [2978901, -258877, 1951193, 5668863, 5131127, 962595, -26401, 4981286, 9949723, 8471292, 2264320, -2869682, -5053223, -5376256, -3084899, 2167941, 6184941, 4950020, 1925509, 4132401, 11517129, 16594201, 15165853, 11400436, 10727295, 12985951, 15029206, 15821610, 15966403, 15206153, 13421272, 12250600, 13089111, 14503782, 13730708, 10203379, 5912103, 2469177, -461629, -2989569, -2508286, 4224161, 15587421, 23967002, 22997494, 14999758, 7890895, 5294946, 4136094, 2132562, 1513233, 2763008, 1086295, -5705713, -10942216, -7722151, -473428, 159913, -7225835, -12893085, -10674622, -6576186, -8921965, -15936805, -18533372, -12556453]
42366a2556453R117080M082607l553176o869292m089716P28262K705598J488744
42358h946346K29917k12000k277760n871489o309445j229332M634536N676454
42350a4305465K859255M49369j122778l559000m780834j419189M195175O275949
42342a1407518M436843L637659M990358L786665j467749n080609k862834J105804
42334b861381J149044j226977q14089K318722L531167J665645R2237j55566j997039
42325A701763n588814o076381j493409K240581m75828n203076k688201P278529
42317a0304836J4423047J1711984L796058j325487k712251l470842k880738J023512
42309A0260447M317591J307000n060277n844182m25876J053556o436964j3071900
$$ y = [-12556453, -3439373, 643234, -2909942, -9779234, -13868950, -13140688, -10435090, -8946346, -8716429, -8928429, -11206189, -17077678, -23387123, -24616455, -19981919, -14305465, -11446210, -10996841, -12119619, -15678619, -20459453, -21878642, -17683467, -11407518, -6970675, -3333016, 1657342, 5444007, 3976258, -1104351, -3967185, -2861381, -1712337, -2939314, -3753403, -1434681, 2096486, 3762131, 3854368, 3698802, 1701763, -3887051, -9963432, -11456841, -9216260, -9692088, -14895164, -17583365, -10304836, 4118211, 15830195, 19626253, 18300766, 15588515, 12117673, 9236935, 10260447, 14578038, 15885038, 10824761, 4980579, 4554703, 5608259, -828705, -13900605]
42301a3900605p397292O664825J4686069J0592230J905126l059813m331501m669592
42293D89447k880904K316921O936859O039661R58115k787267l289162l100353
42285D683317l149097j399843J621853J655504k304225m912667k389923J029031
42277e166050J05458j959477J131918O367813M313969m863586q978650j627271
42269a0675876P526081P180692N33682k089813K37547R56309k11981K146677O473079
42260A2076397M692334l524998q304254m240537K271356L794574J020487k494804
42252E290555o109501q237605m936799K478669N845900J678273k641871o6224
42244f698603N353588N631802J044403k235074k332452k036298j892903L0460
$$ y = [-13900605, -21297897, -14633072, 52997, 10645227, 12550353, 9490540, 5159039, 489447, -2391457, -74536, 6862323, 12901984, 13860099, 11072832, 7783670, 4683317, 1534220, 134377, 1756230, 3411734, 1107509, -3805158, -6195081, -5166050, -5060592, -7020069, -5888151, 479662, 4793631, -69955, -9048605, -10675876, -3149795, 4030897, 4564579, 2474766, 2712313, 3668622, 3456641, 5603318, 12076397, 16768731, 13243733, 4939479, 698942, 2970298, 6764872, 7785359, 5290555, -818946, -9056551, -13993350, -11514681, -5668781, -3990508, -6632379, -6698603, -1345015, 4286787, 5331190, 3096116, 763664, -1272634, -3165537, -3135077]
42236c135077K935657L590384J242759j646114k748366j580333N33498J063658
42228B56066n07497k74404M525491Q287908L069098p735449j1628044n292793
42220i299624O63331l41814r32569M640354Q073329J574974o453545m236324L768206
42211b543682N143591L41849p94052K019663J043083k329586M34485P012630N999891
42202A6327872k399635n104140J469878N133682p58762o293674k886433K623169
42194H111957J106920m018624n031204k780638j653421l61406K976821M204106
42186B554511M23189k975282j004875J766829q16312n530360n459536j387612
42178a2429448J088777J414210K768224M577608M106097K514259K409714K218733
$$ y = [-3135077, -199420, 3390964, 4633723, 2987609, 239243, -1341090, -807592, 256066, -251431, -525835, 3999656, 12287564, 15356662, 7621213, -4006831, -9299624, -8636293, -8978107, -9910676, -5270322, 2803007, 4377981, -2075564, -6311888, -2543682, 2599909, 2941758, 2147706, 4167369, 5210452, 2880866, 3315351, 10327981, 16327872, 13928237, 8824097, 10293975, 15427657, 14668895, 8375221, 5488788, 8111957, 9218877, 5200253, 169049, -2611589, -4265010, -4626416, -1649595, 2554511, 2977700, 2418, -1002457, 764372, -51940, -5582300, -11041836, -12429448, -11340671, -9926461, -7158237, -2580629, 1525468, 4039727, 6449441, 8668174]
42170H668174q13702n027378p232745p555861o369903j383467O253912Q639396
42162d821574J543891o847603o146786J482121N847305M343662K845083L240809
42154A486908J194497l353756l995220J137695M767818R12441o140345p389548
42146a1379510j19761R360395J1937814M105440p653921j1841920m381401N528745
42138d444119O047444k591552r190425o312683J992816P337796O205059Q05880
42130a49784m509488n939269k760960J438372K427448M01307j063161m55837M72482
42121a0138890M97143M88562J207974K370171L663604M359229K879250p98575
42113D528468l788009l903170k574610j472437O86300M208142M913814j35145
$$ y = [8668174, 7854472, 2827094, -4405651, -11961512, -18331415, -19714882, -13460970, -4821574, -3277683, -10125286, -16272072, -14789951, -8942646, -4598984, -1753901, 1486908, 2681405, -672351, -4667571, -3529876, 1237942, 2150383, -3989962, -11379510, -11499271, -2138876, 9798938, 13904378, 6250457, -5591463, -9972864, -4444119, 1603325, -988227, -10178652, -16491335, -14498519, -7160723, -955664, -149784, -4659272, -10598541, -13359501, -11921129, -9493681, -9092374, -10155535, -10611372, -10138890, -9641747, -9153185, -7945211, -5575040, -1911436, 2447793, 5327043, 4528468, 740459, -3162711, -5737321, -7209758, -6523458, -2315316, 2598498, 2463353]
42105B463353o373650p206860l279735M7063J789769M306831N482407J294194
42097a476628m422878l045506M563857P302833Q68572m693762m55118P438673
42089F080043P569266L19216m497460l253502j830948m193579o749118n874595
42081a2430677l789065l503920l035595J079848P323248J0431136Q245550L973520
42073H294045J359937L30721j337233l984810n726798n234191k794333R91955
42065h100707N272306P651442N489838n35766o270031q404943p057756l715985
42057a5671602M65589L530061L436018J491830J552718M107332N253914L545617
42049G711477K635560L860802K224166m828869j0282704o706721J555810L983195
$$ y = [2463353, -3910297, -11117157, -14396892, -14349829, -12560060, -8253229, -2770822, -1476628, -5899506, -8945012, -4381155, 2921678, 3790250, -903512, -1358630, 6080043, 13649309, 13968525, 9471065, 6217563, 4386615, 193036, -6556082, -12430677, -16219742, -19723662, -22759257, -21679409, -14356161, -3925025, 4320525, 8294045, 9653982, 9984703, 8647470, 4662660, -1064138, -6298329, -9092662, -8100707, -2828401, 4823041, 10312879, 9777113, 3507082, -4897861, -11955617, -15671602, -15206013, -11675952, -8239934, -6748104, -5195386, -1088054, 4165860, 7711477, 10347037, 14207839, 16432005, 11603136, 1320432, -5386289, -3830479, 152716]
42041A52716o65585l532688K93592N827207P318702N225845J948325k175552n665605
42032H726957m825560N26607M670307K581630l925731q579345o970791j21298
42024g917224N919440M953697k023850o536446l432149J650554J393274j095242
42016g087946J744579P164722N148493m084787q318698j945007N592134M961419
42008C174909j31757j667255L08654J568341K463505M851795N835041K005897
42000A8409130l939107o690900n038661j034730L244295M828165J177366m403788
41992F551770m876271L1221K877016J078236R18106M510110L972609m084594r627049
41983A351154m790630K009079k41057o446932m552728L659720O419640K061320
$$ y = [152716, -512869, -4045557, -3751965, 2075242, 9393944, 14619789, 16568114, 14392562, 8726957, 3901397, 4428004, 9098311, 11679941, 7754210, -825135, -7795926, -7917224, -1997784, 2955913, 932063, -5604383, -9036532, -7385978, -5992704, -7087946, -5343367, 1821355, 6969848, 2885061, -5433637, -7378644, -1786510, 3174909, 3043152, 1375897, 1684551, 3252892, 5716397, 10568192, 16403233, 18409130, 14470023, 7779123, 2740462, 1705732, 4950027, 9778192, 10955558, 6551770, 1675499, 1706720, 4583736, 5661972, 6580078, 11090188, 15062797, 10978203, 1351154, -3439476, -1430397, -1671454, -8118386, -12671114, -9011394, -2591754, -530434]
41975e30434n50968P23433n74817m491571l189976L791597P065558L236704K34114
41966E713640K991171N806141L543092m48810k477987m543595p194411n807769
41958b418528M81071M641668K202006j710187j180778J666759K032718K65393
41950E980122q93323j395123j781000j067949m7777j243155l237394j691318J894281
41941c482636O50353n544963p814095k445463K628401J353598o64596K370199
41933a2949202N200591J758746k056391K176000R671290R132666J062443l798842
41925A0197301k350189k236959o676747q820519m339885J127272J861309Q20277
41917a0418140K907630N976454M833199L15900j649136J258156M661743L609974
$$ y = [-530434, -1081402, -357969, -932786, -5424357, -8614333, -4822736, 2242822, 5479526, 5713640, 8704811, 14510952, 18054044, 17605234, 15127247, 10583652, 3389241, -2418528, -1937457, 2704211, 4906217, 3196030, 2015252, 3682011, 5714729, 5980122, 5086799, 3691676, 1910676, 842727, 794950, -448205, -3685599, -5376917, -3482636, -2832283, -8377246, -16191341, -18636804, -16008403, -14654805, -15319401, -12949202, -7748611, -5989865, -8046256, -5870256, 3801034, 12933700, 13996143, 10197301, 7847112, 5610153, -1066594, -9887113, -14226998, -13099726, -11238417, -10418140, -7510510, -1534056, 3299143, 3615043, 1965907, 3224063, 7885806, 11495780]
41909A1495780j049267m050101k621345J72817L15854j023366J97311L415535
41901F853218L557219n11303l421158j696252Q98782j24678l475039n958534p204110
41892a1081855o188687L02253R807651J1869401J837645r132854p753563K643218
41884g696791Q060812M714882J280814J985355J244248l294726n345704j641184
41876f92294J982994J011289o86175P75512K407137J037016q30757r40048j732070
41867B332604l919931l111227J761462M225115O59966k553574M79920M534349
41859D408684J708317n136633o824917j991777K489076K876722J708720R74034
41851B12226K04540O51320L843144O272838K743399m699170q020120m315623N40579
$$ y = [11495780, 10446513, 6396412, 3775067, 3947884, 4263738, 3240372, 3437683, 6853218, 10410437, 9899134, 6477976, 4781724, 5680506, 5555828, 2080789, -3877745, -11081855, -17270542, -16968289, -7160638, 4708763, 6546408, -2586446, -10340009, -7696791, 364021, 5078903, 6359717, 8345072, 9589320, 6294594, 948890, -692294, 1290700, 2301989, 1615814, 2391326, 4798463, 5835479, 5004722, 4064674, 2332604, -1587327, -4698554, -2937092, 1288023, 1947989, -605585, -125665, 4408684, 6117001, 980368, -5844549, -7836326, -5347250, -2470528, -761808, 212226, 416766, 1068086, 4911230, 11184068, 13927467, 9228297, 1208177, -3107446, -2566867]
41842b566867Q01283k116835l391639j137982K877141N521317M171608p69823
41834C388203m813686l802168N94468K883413R93830j823790k141253k4413K395256
41825b350140L049603R88009k091147k559494J34760J464247j431034m052727
41817f847923j172663L546214J953242n663616j0134639o478253L80252M423255
41809a9994131N346421M315611Q34639k687637q89826N463219P596715J503630
41801A488641m344911j199206O102325O373581q12070n228105j979182K441726
41793B842799J619367j767330k175610k10890l91733l326942m957739k670784
41785a1038862J291354K969423J445902l96849M54454L388868M895973L047865
$$ y = [-2566867, -1765584, -3882419, -7274058, -8412040, -5534899, -13582, 4158026, 3388203, -1425483, -5227651, -4633183, -1749770, -755940, -2579730, -4720983, -4745396, -2350140, 699463, 1687472, -403675, -2963169, -2828409, -1364162, -2795196, -6847923, -8020586, -4474372, -2521130, -8184746, -18319385, -24797638, -24417386, -19994131, -14647710, -10332099, -9497460, -12185097, -13074923, -7611704, -14989, 1488641, -2856270, -4055476, 2046849, 8420430, 7608360, 2380255, 401073, 2842799, 4462166, 2694836, 519226, 308336, -83397, -3410339, -8368078, -11038862, -9747508, -6778085, -5332183, -5729032, -5274578, -1885710, 3010263, 6058128]
41777F058128j59444j787950j769539k033920k829221k213098N64358L011495
41769a159191K003736j911777m054458o08146O152253R568627O371400L46936
41761A6709380l531332n354987o984666o129715l50383N084181K181133o313623
41753d690012q156365L87668P712132M210962k974492j901820N010955N843575
41745E442603j002809n080208j558726K066361l21027l987540k479368K366530
41737d554184N304095O085239P057982P073412L548022k243274o464427p300879
41729H505986n217654j144785K854997L779566J274911j400590k177390k957928
41721C517113n173213n921352k050194M206446P194062M333953j669539n962262
$$ y = [6058128, 5898684, 4110734, 2341195, 307275, -2521946, -4735044, -4170686, -1159191, 844545, -1067232, -5121690, -5729836, 422417, 9991044, 16362444, 16709380, 13178048, 7823061, 838395, -5291320, -5641703, -557522, 1623611, -4690012, -12846377, -12458709, -4746577, -535615, -3510107, -5411927, -400972, 5442603, 4439794, -640414, -2199140, -132779, -453806, -4441346, -6920714, -4554184, 749911, 6835150, 13893132, 20966544, 24514566, 22271292, 15806865, 8505986, 3288332, 2143547, 4998544, 8778110, 10053021, 8652431, 6475041, 3517113, -1656100, -7577452, -9627646, -5421200, 1772862, 6106815, 4437276, -1524986]
41713a524986n388343r07972K556858O95214m754043p497944m327260J783092
41705a9365384O788438R612574R743781N751575r26182n018333l680954k49920
41697B655595J173462R89753R10920N1135j840735j817868Q56897J310085l219973
41688A069271o702776k567652M800385N325558j575282o013518k312694L850177
41680d126531N301599K872404J219976J078733N09751P730J369777L235288J994534
41671A3463261k903915p312735o868262j958395K704811L424382J326907k91016
41663A585038r94212k425763l177367L16739O285851P053551k11171p802886p973715
41654g343935l899720l075430m303565m82084P969596J2427583Q895924K489531
$$ y = [-1524986, -6913329, -7821301, -5264443, -4569229, -9323272, -16821216, -21148476, -19365384, -12576946, -2964372, 6779409, 12530984, 11604802, 6586469, 2905515, 2655595, 3829057, 4818810, 5729730, 5780865, 3940130, 2122262, 2979159, 4289244, 1069271, -5633505, -8201157, -3400772, 1924786, 349504, -5664014, -7976708, -4126531, 1175068, 4047472, 5267448, 6346181, 6855932, 6863662, 8233439, 11468727, 13463261, 10559346, 3246611, -3621651, -5580046, -2875235, 549147, 1876054, 1585038, 590826, -1834937, -5012304, -4695565, 1590286, 8643837, 8432666, 629780, -7343935, -11243655, -14319085, -18622650, -19104734, -11135138, 1292445, 10188369, 12677900]
41646A2677900j850379m460976n294801k078681L011380L166424k750728p104909
41638d684770m706461j18974O34637j029508o89085J568634L157949L629407L031861
41629G93690N93667j519363Q41049N643991M967522k058712n373727M14924N862594
41620A0165635J413509o278614m809516L646944O343339O25946l907879k850799
41612D348565k050539l858738k480357L015903M072157k827166q165603l577908
41604a1523686M957740O421742L66732n050134n428862k540780J714056O107026
41596d976166P389340L651714j231243k168268j59867J61569j698100k444926
41588a475947j649379k018861l340358j960531K702434O010736M423504N10866
$$ y = [12677900, 10827521, 6366545, 1071744, -1006937, 2004443, 5170867, 2420139, -4684770, -9391231, -9510205, -8875568, -9905076, -10594161, -9025527, -5867578, -2238171, 793690, 1387357, -132006, 709043, 6353034, 11320556, 9261844, 3888117, 4303041, 10165635, 11579144, 5300530, 491014, 4137958, 10481297, 11107243, 7199364, 4348565, 2298026, -1560712, -4041069, -1025166, 3046991, 219825, -7945778, -11523686, -6565946, -144204, 222528, -4827606, -10256468, -12797248, -11083192, -4976166, 2413174, 6064888, 4833645, 2665377, 2505510, 2667079, 968979, -1475947, -3125326, -5144187, -8484545, -10445076, -7742642, -1731906, 2691598, 3202464]
41580C202464o78304J641266L166683L28641m522696n452013r45422L064509J217955
41571A023083k759021j379533L951657M057958k558665n363904J520242P990115
41563F481932K905721p264265p429585K711083Q513599L197908l611490l219719
41555B285184j10785o03001j186515K802956O074471J558213o357463p522534
41547c059474j490646K908955J820151M16097K339862L840749Q94700m158643
41539C511751o043874k813566L011578O853067N341032j72833l953941k372673
41531C360541J574492L240152K902882K916239J689047l160244q314085q739504
41523d530480o077164n111373m187602J002383N853186J631870p536621o881798
$$ y = [3202464, 2524160, 4165426, 7332109, 7660750, 3138054, -2313959, -3259381, -194872, 1023083, -1735938, -3115471, 836186, 4894144, 2335479, -3028425, -1508183, 6481932, 9387653, 2123388, -5306197, -2595114, 5918485, 9116393, 5504903, 2285184, 2174399, 1571398, 384883, 3187839, 9262310, 10820523, 4463060, -3059474, -4550120, -1641165, 178986, 595083, 2934945, 6775694, 7670394, 3511751, -2532123, -5345689, -2334111, 4518956, 9859988, 9687155, 5733214, 3360541, 4935033, 8175185, 11078067, 13994306, 15683353, 12523109, 4209024, -4530480, -10607644, -15719017, -19906619, -18904236, -13051050, -11419180, -18955801, -25837599]
41515b5837599N723793J3654525O514351l245231l84956R123219R484926J078591
41507A6111619k768878J97475p84724q119824j0759318l865315K506828N15229
41499f966908l151331J11842O589061P266554J468351m362125n938353l009717
41491g992626K855578P157047M435686l776900q346885m424149J874494L349607
41483d868148J747277K048052L132800J444120j085046m88544J460292K24904
41475C615707l438629m969632l287573q66395J037286K048361N34984l052581
41467h378472m083265j58469M283426N025329M685173N978418M474180l218443
41459H607877r607788n645841L797329N834794q67877n042750j473953K195361
$$ y = [-25837599, -20113806, -6459281, 55070, -3190161, -3575117, 5548102, 15033028, 16111619, 13342741, 13540216, 12755492, 4635668, -6123650, -9988965, -7482137, -6966908, -10118239, -10006397, -3417336, 3849218, 5317569, 955444, -4982909, -7992626, -5137048, 2019999, 6455685, 2678785, -5668100, -10092249, -8217755, -4868148, -3120871, -1072819, 2059981, 3504101, 2419055, 1930511, 3390803, 3615707, 177078, -4792554, -8080127, -8946522, -7909236, -5860875, -5325891, -8378472, -12461737, -12620206, -8336780, -3311451, 1373722, 7352140, 11826320, 8607877, -999911, -6645752, -2848423, 2986371, 2118494, -2924256, -4398209, -2202848]
41451b202848j30394l873353l655673j826808j417308N51978O277077J0693122
41443D415793Q245954J162138m127776m558099r18317M174483N663743o75888
41435A3382031j0704882j3797698o413256K449612M018803J339361K026366N571463
41427b128200N730111J628385j596864j623236j536515l786820o583989o643946
41419a6541074k659419L419157P130978N637537K066269K069412N075100M476937
41411A0674897j403165n491294l136702J55542j729060m942880k633998K791237
41403e715423L562929n23783k362493O89310L836950L443809J175554p51349k203553
41394A151951k815567k238700k049713k706081p56522N270275R189300M714981
$$ y = [-2202848, -2333242, -6206595, -9862268, -11689076, -13106384, -12554406, -6277329, 4415793, 12661747, 13823885, 9696109, 5138010, 4219693, 8394176, 14057919, 13382031, 2677149, -11120549, -17533805, -15084193, -11065390, -9726029, -7699663, -2128200, 3601911, 5230296, 3633432, 2010196, 473681, -3313139, -9897128, -16541074, -19200493, -15781336, -8650358, -3012821, -946552, 1122860, 6197960, 10674897, 9271732, 3780438, 643736, 799278, -929782, -5872662, -8506660, -5715423, -2152494, -2676277, -5038770, -4349460, -512510, 2931299, 4106853, 3355504, 1151951, -1663616, -3902316, -5952029, -8658110, -9414632, -4144357, 5044943, 9759924]
$$ [...]
##END NTUPLES=NMR SPECTRUM
##END=
