##TITLE=31Pdec_SR3-Host
 D2O, 24 sc
 25.10.2019
##JCAMPDX= 6.0         $$ Bruker NMR JCAMP-DX V2.0
##DATA TYPE= NMR SPECTRUM
##DATA CLASS= NTUPLES
##ORIGIN= UXNMR, Bruker Analytische Messtechnik GmbH
##OWNER= root
$$ XWIN-NMR		Version 3.5
$$ Fri Oct 25 15:29:05 2019 Russian Standard Time (UT+4h)  she@DPX200
##.OBSERVE FREQUENCY= 81.013821
##.OBSERVE NUCLEUS= ^31P
##.ACQUISITION MODE= SIMULTANEOUS
##.ACQUISITION SCHEME= undefined
##.AVERAGES= 24
##.DIGITISER RES= 17
##SPECTROMETER/DATA SYSTEM= spect
##.PULSE SEQUENCE= zgpg30
##.SOLVENT NAME= CDCl3
##.SHIFT REFERENCE= (INTERNAL, CDCl3, 0, 182.463)
##AUDIT TRAIL= $$ (NUMBER, WHEN, WHO, WHERE, WHAT)
$$ ##TITLE= Audit trail, XWIN-NMR		Version 3.5
$$ ##JCAMPDX= 5.01
$$ ##ORIGIN= Bruker BioSpin GmbH
$$ ##OWNER= she
$$ F:/spectra/data/she/nmr/P31/1/pdata/1/auditp.txt
$$ ##AUDIT TRAIL=  $$ (NUMBER, WHEN, WHO, WHERE, WHAT)
(   1,<2019-10-25 15:28:02.60 +0400>,<she>,<DPX200>,
      <created by zg, POWCHK disabled, PULCHK disabled
       configuration hash MD5:
       00 E9 B6 7A A2 85 ED C7 34 08 36 98 17 FE 4E 26
       data hash MD5: 32K
       A7 E7 2E B8 AB 18 E8 0D 55 EE 9F 48 25 1D 71 B7>)
(   2,<2019-10-25 15:28:18.87 +0400>,<she>,<DPX200>,
      <Start of raw data processing
       efp BC_mod = 2 LB = 1 FT_mod = 6 PKNL = 1 PHC0 = -811.7883 PHC1 = 212.8007 SI = 64K 
       data hash MD5: 64K
       F5 6E 3D 4E 53 38 D9 3E C8 91 AD E9 1F 0A 2F 6E>)
(   3,<2019-10-25 15:28:36.68 +0400>,<she>,<DPX200>,
      <pk PHC0 = 23.04564 PHC1 = -57.80001 
       data hash MD5: 64K
       20 60 DC 17 01 0D DA 9B 5D C1 8E 52 4C 10 E4 ED>)
(   4,<2019-10-25 15:28:39.90 +0400>,<she>,<DPX200>,
      <abs ABSG = 5 
       data hash MD5: 64K
       73 9B 0E A2 72 9E 43 2E F3 C7 58 CA DD 40 C5 8C>)
$$ ##END=
$$ 
$$ hash MD5
$$ 07 76 11 4A 58 4C A5 CA 62 CC BA AB E3 5D C4 29
##$RELAX= 
##$RELAX= 
##$RELAX= 
##$RELAX= 
##$RELAX= 
##$RELAX= 
##$RELAX= 
##$RELAX= 
$$ Bruker specific parameters
$$ --------------------------
##$DU= <F:/spectra>
##$EXPNO= 1
##$NAME= <P31>
##$PROCNO= 1
##$TYPE= <nmr>
##$USER= <she>
##$AMP= (0..31)
100 100 100 100 100 100 100 100 100 100 100 100 100 100 100 100 100 100 
100 100 100 100 100 100 100 100 100 100 100 100 100 100 
##$AQSEQ= 0
##$AQ_mod= 1
##$AUNM= <au_zg>
##$AUTOPOS= <>
##$BF1= 81.014009
##$BF2= 200.13
##$BF3= 200.13
##$BF4= 200.13
##$BF5= 200.13
##$BF6= 200.13
##$BF7= 200.13
##$BF8= 200.13
##$BYTORDA= 1
##$CFDGTYP= 0
##$CFRGTYP= 5
##$CHEMSTR= <none>
##$CNST= (0..31)
1 1 145 1 1 1 1 1 1 1 1 1 1 1 1 1 1 1 1 1 1 1 1 1 1 1 1 1 1 1 1 1 
##$CPDPRG= <waltz16>
##$CPDPRG1= <>
##$CPDPRG2= <waltz16>
##$CPDPRG3= <>
##$CPDPRG4= <mlev>
##$CPDPRG5= <mlev>
##$CPDPRG6= <mlev>
##$CPDPRG7= <mlev>
##$CPDPRG8= <mlev>
##$CPDPRGB= <>
##$CPDPRGT= <>
##$D= (0..31)
0 1 0 0 0 0 0 0 0 0 0 0.03 2e-05 3e-06 0 0 0 0 0 0 0 0 0 0 0 0 0 0 0 0 
0 0 
##$DATE= 1572002882
##$DBL= (0..7)
120 120 120 11 120 120 24 19 
##$DBP= (0..7)
150 150 150 150 150 150 150 150 
##$DBP07= 0
##$DBPNAM0= <>
##$DBPNAM1= <>
##$DBPNAM2= <>
$$ [...]
##$SUBNAM3= <"">
##$SUBNAM4= <"">
##$SUBNAM5= <"">
##$SUBNAM6= <"">
##$SUBNAM7= <"">
##$SUBNAM8= <"">
##$SUBNAM9= <"">
##$SW= 369.568048894756
##$SWIBOX= (0..15)
0 1 3 0 0 0 0 0 0 0 0 0 0 0 0 0 
##$SW_h= 29940.119760479
##$TD= 32768
##$TD0= 1
##$TE= 0
##$TE2= 300
##$TE3= 300
##$TEG= 300
##$TL= (0..7)
0 120 53 12 22 120 120 120 
##$TP= (0..7)
150 150 150 150 150 150 150 150 
##$TP07= 0
##$TPNAME0= <>
##$TPNAME1= <>
##$TPNAME2= <>
##$TPNAME3= <>
##$TPNAME4= <>
##$TPNAME5= <>
##$TPNAME6= <>
##$TPNAME7= <>
##$TPOAL= (0..7)
0.5 0.5 0.5 0.5 0.5 0.5 0.5 0.5 
##$TPOFFS= (0..7)
0 0 0 0 0 0 0 0 
##$TUNHIN= 0
##$TUNHOUT= 0
##$TUNXOUT= 0
##$USERA1= <user>
##$USERA2= <user>
##$USERA3= <user>
##$USERA4= <user>
##$USERA5= <user>
##$V9= 5
##$VALIST= <valist>
##$VCLIST= <CCCCCCCCCCCCCCC>
##$VD= 0
##$VDLIST= <DDDDDDDDDDDDDDD>
##$VPLIST= <PPPPPPPPPPPPPPP>
##$VTLIST= <TTTTTTTTTTTTTTT>
##$WBST= 1024
##$WBSW= 4
##$XGAIN= (0..3)
0 0 0 0 
##$XL= 0
##$YL= 0
##$YMAX_a= 34382
##$YMIN_a= -44518
##$ZGOPTNS= <>
##$ZL1= 120
##$ZL2= 120
##$ZL3= 120
##$ZL4= 120
##$ABSF1= 182.463
##$ABSF2= -187.1042
##$ABSG= 5
##$ABSL= 3
##$ALPHA= 0
##$AQORDER= 0
##$ASSFAC= 0
##$ASSFACI= 0
##$ASSFACX= 0
##$ASSWID= 0
##$AUNMP= <proc_1d>
##$AZFE= 0.1
##$AZFW= 0.5
##$BCFW= 0
##$BC_mod= 2
##$BYTORDP= 0
##$COROFFS= 0
##$CY= -3
##$DATMOD= 1
##$DC= 0
##$DFILT= <>
##$DTYPP= 0
##$F1P= 0
##$F2P= 0
##$FCOR= 1
##$FTSIZE= 65536
##$FT_mod= 6
##$GAMMA= 0
##$GB= 0
##$INTBC= 1
##$INTSCL= 5.30512e-09
##$ISEN= 30
##$LB= 1
##$LEV0= 0
##$LPBIN= 0
##$MAXI= 10000
##$MC2= 0
##$MEAN= 0
##$ME_mod= 0
##$MI= 50
##$NCOEF= 0
##$NC_proc= -5
##$NLEV= 6
##$NOISF1= 182.463
##$NOISF2= 159.3651
##$NSP= 0
##$NTH_PI= 0
##$NZP= 0
##$OFFSET= 182.463
##$PC= 4
##$PHC0= -788.7427
##$PHC1= 155.0007
##$PH_mod= 1
##$PKNL= yes
##$PPARMOD= 0
##$PSCAL= 0
##$PSIGN= 0
##$REVERSE= no
##$SF= 81.0140089999434
##$SI= 65536
##$SIGF1= 159.3651
##$SIGF2= -187.1042
##$SINO= 113.3802
##$SIOLD= 16384
##$SREGLST= <1H.CDCl3>
##$SSB= 0
##$STSI= 65536
##$STSR= 0
##$SW_p= 29940.119760479
##$SYMM= 0
##$S_DEV= 0
##$TDeff= 32768
##$TDoff= 0
##$TI= <>
##$TILT= no
##$TM1= 0
##$TM2= 0
##$TOPLEV= 0
##$USERP1= <user>
##$USERP2= <user>
##$USERP3= <user>
##$USERP4= <user>
##$USERP5= <user>
##$WDW= 1
##$XDIM= 65536
##$YMAX_p= 277229269
##$YMIN_p= -9646351
$$ End of Bruker specific parameters
$$ ---------------------------------
##NTUPLES= NMR SPECTRUM
##VAR_NAME=  FREQUENCY,     SPECTRUM/REAL,   SPECTRUM/IMAG
##SYMBOL=    X,             R,               I
##VAR_TYPE=  INDEPENDENT,   DEPENDENT,       DEPENDENT
##VAR_FORM=  AFFN,          ASDF,            ASDF
##VAR_DIM=   65536,         65536,           65536
##UNITS=     HZ,            ARBITRARY UNITS, ARBITRARY UNITS
##FACTOR=    0.456856943014862, 1,           1
##FIRST=     14782.0589164792, 0,            0
##LAST=      -15158.0608439998, 0,           0
##MIN=       -15158.0608439998, -9646351,    0
##MAX=       14782.0589164792, 277229269,    0
$$ Real data points
##PAGE= N=1
##DATA TABLE= (X++(R..R)), XYDATA
$$ [...]
43494I66752J163319R65395K39151m07178n79042m81499m90219o29782o50322
$$ 966752 2130071 3095466 3334617 2927439 2348397 1866898 1376679 746897 96575
43485I6575m29962j01019J42481K14188J45158K0731r0810j61593j39919P2499
$$ 96575 -333387 -434406 -291925 -77737 67421 88152 -2658 -164251 -304170 -231671
43475b31671M68687Q07882P94378L84801j96711o82250q43265m99761K27397P48940
$$ -231671 237016 1044898 1839276 2224077 2027366 1345116 501851 2090 229487 978427
43465I78427N25405j90940n80432l57028j47485m95329r88868q57674q1088O57715
$$ 978427 1503832 1312892 732460 375432 227947 -267382 -1256250 -2113924 -2195012 -1537297
43455a537297R16208Q18158N36221O1448m19904m55057J04086P62335Q53444K21702
$$ -1537297 -621089 197069 733290 794738 374834 -80223 23863 786198 1639642 1861344
43445A861344o47834j043402n84292M13988J107029Q66796r1435r64309j184855
$$ 1861344 1213510 170108 -414184 -196 1106833 1973629 1882194 917885 -266970
43436b66970q01656j66771L95683O18994L84840p6276l39545k53015m0889Q6491
$$ -266970 -1068626 -1235397 -839714 -220720 164120 87844 -251701 -504716 -545605 -459114
43426d59114J35035Q7665j71394n19714n17815M9072P53386R31870M22371k98309
$$ -459114 -324079 -236414 -407808 -927522 -1445337 -1396265 -642879 288991 711362 413053
43416D13053o38957m21985J9128J56093k15843o88384o17120J12149Q87004J088103
$$ 413053 -225904 -647889 -628761 -472668 -688511 -1376895 -1994015 -1881866 -994862 93241
43406I3241P76110M07957J03124l52451q26735p54717j7181N78326K70283m40986
$$ 93241 869351 1277308 1380432 1027981 201246 -553471 -570652 7674 277957 -163029
43396a63029l21050P49832J322998L50186j117946j212903J20122J037318M68074
$$ -163029 -484079 265753 1588751 1938937 820991 -391912 -271790 765528 1233602
43387A233602m65240l38342M62532O27025P3386j82623Q9030O6010m80077o86406
$$ 1233602 768362 430020 892552 1519577 1592963 1410340 1499370 1565380 1085303 398897
43377C98897j37076L42247Q0711k68666J84135J044358J167315L31684n19503
$$ 398897 261821 604068 684779 416113 600248 1644606 2811921 3143605 2624102
43368B624102o02060j43341J20285k10666r23709j429918j242531m36317L95956
$$ 2624102 2022042 1878701 1998986 1788320 864611 -565307 -1807838 -2244155 -1848199
43359a848199P57323O70833M05307P5917k60309l88378j28326L89740Q47120J003755
$$ -1848199 -1090876 -420043 -14736 61181 -199128 -587506 -715832 -326092 521028 1524783
43349A524783P59952K05254k90706l50930q6616J9475j65017k56443p1014L1145
$$ 1524783 2284735 2489989 2199283 1848353 1761737 1781212 1616195 1359752 1288738 1319883
43339A319883j90118l87673k28197K8026L481j91382l04497m32460o32568n19366
$$ 1319883 1129765 742092 513895 541921 545402 354020 49523 -382937 -1015505 -1534871
43329a534871J09880O73271N61865J45471K03000O10214N25322j78973o19836
$$ -1534871 -1424991 -751720 -189855 -44384 158616 768830 1294152 1115179 495343
43320D95343k30615M22954N08870L3821l15852r9642M33253O85063L45802k73880
$$ 495343 264728 687682 1196552 1230373 914521 814879 1248132 1933195 2278997 2005117
43310B005117o02166n04154l26286j77805K62316R02834R16289p2735j099068
$$ 2005117 1402951 898797 572511 394706 657022 1559856 2476145 2403410 1304342
43301A304342j054454k78612R2362m9140J10656N86127M66725l33432p02166j99864
$$ 1304342 249888 -28724 63638 14498 125154 711281 1178006 844574 142408 -57456
43291e7456R6238o01316j368613r86835J73989Q48469P83035P43777J005096J012823
$$ -57456 38782 -562534 -1931147 -2917982 -2743993 -1895524 -1112489 -368712 636384 1649207
43281A649207M77480j83296n60981o30773l52643L52580J073628J046717J45340
$$ 1649207 2126687 1943391 1382410 751637 398994 751574 1825202 2871919 3017259
43272C017259p60382q08765k01209J37650j88931n72754l18583L03422L87456
$$ 3017259 2256877 1448112 1246903 1384553 1195622 622868 304285 607707 995163
43263I95163k55402o93604j95373O07081N89514j78880n59755q0167M82890M43761
$$ 995163 739761 46157 -149216 457865 1047379 868499 308744 228577 711467 1155228
43253A155228J22648J3666j3729j12630P5945O55308R35656M49299j73099j76436
$$ 1155228 1277876 1291542 1277813 1165183 1241128 1896436 2832092 3281391 3108292 2931856
43243B931856J17181K3804j96333J18099O22962L77988n18858r75129o02276j41682
$$ 2931856 3049037 3072841 2876508 2994607 3617569 3995557 3476699 2501570 1899294 1757612
43233A757612k6679K32268Q15455R36585J29852p41582o34188J67523N90592L84254
$$ 1757612 1730933 1963201 2778656 3715241 3845093 3103511 2469323 2636846 3227438 3611692
43223C611692K34769M40203M55769j7266l04516L00796J310598J510841O62718
$$ 3611692 3846461 4286664 4742433 4725167 4420651 4721447 6032045 7542886 8205604
43214H205604o267N53650J644721J700745N16667m09486M3121J222699J947481
$$ 8205604 8199337 8752987 10397708 12098453 12615120 12205634 12248755 13471454 15418935
43205A5418935K192212K611146L093979K989831K441254K290690K683217K824670
$$ 15418935 17611147 20222293 23316272 26306103 28747357 31038047 33721264 36545934
43197C6545934K217342J168478m0015j493178k934136l681665l598374l297323
$$ 36545934 38763276 39931754 39891739 38398561 35464425 31782760 28184386 24887063
43189B4887063l085177k583792j734835j205680j291082j334581q53533l81096
$$ 24887063 21801886 19218094 17483259 16277579 14986497 13651916 12798383 12417287
43181A2417287n13691r37338j130290j226397j378662j107536k58447K00192m77334
$$ 12417287 11903596 10966258 9835968 8609571 7230909 6123373 5864926 6065118 5587784
43172E587784j349218j038844M2720K80043n57590r89223k53811N75413M61951
$$ 5587784 4238566 3199722 3242442 3522485 2964895 1975672 1721861 2297274 2759225
43163B759225o7591j25002j164m22830j083437j061611k80544M55101O74062O38132
$$ 2759225 2691634 2566632 2565468 2142638 1059201 -2410 -282954 172147 846209 1484341
43153A484341O05214M37766L7683l52514m27076j34791K81616M10399J590o49974
$$ 1484341 2089555 2527321 2565004 2212490 1785414 1650623 1932239 2342638 2344228 1694254
43143A694254r07003n83061k00768j95156k80561j6497M11214N21332L29770K09315
$$ 1694254 787251 204190 3422 -191734 -472295 -488792 -77578 443754 773524 982839
43133I82839J87120j792l24673n18077n91871o55230m33722L05419R92517P92719
$$ 982839 1169959 1168167 843494 325417 -266454 -921684 -1355406 -1049987 -57470 735249
43123G35249r1557n72708k57938R0904n7424j95018J43009M77170K98882L9132
$$ 735249 643692 70984 -186954 -96050 -153474 -348492 -205483 271687 570569 609701
43113F09701K35638M31889p0192q64237r45082k72064K60191K81546K89905M99839
$$ 609701 845339 1277228 1207036 342799 -602283 -874347 -614156 -332610 -42705 457134
43103D57134M27017j08246n02768l22606Q691m4420k65813q4722N16210R44331
$$ 457134 884151 775905 273137 -49469 -40778 -85198 -351011 -435733 80477 1024808
43093A024808P22496L3462m32335k06089L09026K07385o50229j217136o46838
$$ 1024808 1747304 1780766 1348431 1142342 1451368 1658753 1008524 -208612 -855450
43084h55450M23742P96301M38043J92914J34450l96520j192644j175039k34950
$$ -855450 -431708 364593 802636 995550 1130000 733480 -459164 -1634203 -1869153
43075a869153M47136L37001K33399M72980J97031p07481p67040O50940J785622
$$ -1869153 -1422017 -1085016 -851617 -378637 -181606 -889087 -1656127 -1005187 780435
43066G80435J057930l36350m33048K55918n7440j001833o59060P88395J026262
$$ 780435 1838365 1502015 1068967 1324885 1267445 265612 -393448 394947 1421209
43057A421209m99379j538851p10116M29788K54175l37300J25890J034868R52003
$$ 1421209 921830 -617021 -1327137 -897349 -643174 -980474 -854584 180284 1132287
43048A132287J42470j17567J68055J5164n32813m83705K69036P54954N28947J58229
$$ 1132287 1274757 1157190 1325245 1340409 807596 323891 592927 1347881 1876828 2035057
43038B035057O8315J8971j63750k51161j35403j1628k5106k47096p87668j402054
$$ 2035057 2103372 2122343 1958593 1707432 1572029 1560401 1535295 1288199 500531 -901523
43028i01523j375044m66770M56436N06170L5824m9760K39703K72016J39638M42868
$$ -901523 -2276567 -2743337 -2286901 -1780731 -1744907 -1794667 -1554964 -1282948 -1143310 -700442
43018g00442R21783O71515k13680n55557O9505O66417M38357r7670j98303l6519
$$ -700442 221341 892856 679176 123619 193124 859541 1297898 1200228 1001925 965406
43008I65406l1121L9499L95541M76011k36796j120110j111116k32170M80128M51472
$$ 965406 934285 973784 1369325 1845336 1608540 488430 -622686 -854856 -374728 76744
42998G6744J33910M9856N0116k01799n62206o04906k11277L27325O55182O15111
$$ 76744 210654 260510 310626 108827 -453379 -1058285 -1269562 -942237 -287055 328056
42988C28056K92552k5502k2665L24243O16149M19786j75584o06396n69034m51354
$$ 328056 620608 595106 572441 896684 1512833 1932619 1757035 1150639 581605 130251
42978A30251p21826j090437q03122K09926J071165J077360N35611J05694j46585
$$ 130251 -591575 -1682012 -2485134 -2275208 -1204043 -126683 408928 514622 368037
42969C68037m63289o17268k10924M47669N87270J09516k63213r7691K11649K52174
$$ 368037 -95252 -712520 -923444 -475775 111495 221011 -42202 -139893 71756 323930
42959C23930K39040M30223M84037n07o50321o79225p902N45555L30271l03634
$$ 323930 562970 993193 1477230 1476723 826402 147177 139275 684830 1015101 711467
42949G11467n26534j49214J94605K4484k55982M0449Q03687J187635P44541o8529
$$ 711467 184933 35719 230324 254808 -1174 39275 842962 2030597 2775138 2706609
42939B706609o52092r25630r48362n38942K20328O71291M06418o6157j48325j27229
$$ 2706609 2054517 1128887 180525 -358417 -138089 533202 939620 873463 725138 597909
42929E97909m95837q07906l12179N81972P45728J85764J04516Q73808J313877
$$ 597909 102072 -705834 -1018013 -436041 309687 495451 599967 1473775 2787652
42920B787652N68725n11096o96176j41129J38478j22779l42049k16207n9449j49142
$$ 2787652 3356377 2845281 2149105 2007976 2146454 2023675 1681626 1465419 1405970 1256828
42910A256828l57044l60739Q6310Q28371J095542K27389j100566j232307K64661
$$ 1256828 899784 539045 625355 1453726 2549268 2776657 1676091 443784 708445
42901G08445J636283J149616m80025j135572l06160M51942N5564o23634l50428
$$ 708445 2344728 3494344 3014319 1878747 1572587 2024529 2080093 1456459 1106031
42892A106031N95632J000377M83212j86723k71389J15725L49771N2404n46575
$$ 1106031 1701663 2702040 3185252 2998529 2727140 2842865 3192636 3245040 2698465
42883B698465q62672n91574p2691J46720M1729P3112M12046O37544L89820p3315
$$ 2698465 1835793 1244219 1171528 1318248 1359977 1433089 1845135 2482679 2872499 2799184
42873B799184k90816k77636l80076n86150m40773K40524R23134R13878K46724
$$ 2799184 2508368 2230732 1850656 1264506 823733 1064257 1987391 2901269 3147993
42864C147993l14446k14794K48135M22392J81515o6662j13980j95537m25033m71709
$$ 3147993 2833547 2618753 2866888 3289280 3470795 3404133 3290153 3094616 2669583 2197874
42854B197874o0597N42139Q26185N99484O9905l81867l71707J95606Q14919P72269
$$ 2197874 2137277 2679416 3505601 4105085 4174990 3793123 3421416 3617022 4431941 5204210
42844E204210J08717k63819K28097R71137J017576L46771l25559o09389n80974
$$ 5204210 5312927 5049108 5277205 6248342 7265918 7612689 7287130 6677741 6096767
42835F096767j42700Q84050K035796K379657J617749M81235j11861J37876R32286
$$ 6096767 5954067 6838117 8873913 11253570 12871319 13352554 13240693 13378569 14310855
42826A4310855J687247J840125J401036J184968J907072L090222L583874L183167
$$ 14310855 15998102 17838227 19239263 20424231 22331303 25421525 29005399 32188566
42818C2188566K888154L382130M165855M595914M899587N507237O026172N597383
$$ 32188566 35076720 38458850 42624705 47220619 52120206 57627443 63653615 69250998
42810F9250998L886453J201963j907698m642914o080809o044056n494645n397794
$$ 69250998 73137451 74339414 72431716 67788802 61707993 55663937 50169292 44771498
42802D4771498n534281n110442m136073l323621k889840k436826j932025j789531
$$ 44771498 39237217 34126775 29990702 26667081 23777241 21340415 19408390 17618859
42794A7618859j896853j592265q79716o56597j259104j725549j209668l38831
$$ 17618859 15722006 14129741 13250025 12593428 11334324 9608775 8399107 8060276
42786H060276k64948r06112j147497n50351J38737K11296j51427m61275o24065
$$ 8060276 7795328 6889216 5741719 5191368 5330105 5541401 5389974 4928699 4304634
42777D304634p20836o50457l78424j47521r8876j6753K31049L35936K5688l65712
$$ 4304634 3583798 2933341 2554917 2407396 2308520 2291767 2522816 2858752 2884440 2518728
42767B518728k73653K62890N94571L22681j97370l49262k8859K43440o1182q14742
$$ 2518728 2245075 2507965 3102536 3425217 3227847 2878585 2849726 3093166 3031984 2217242
42757B217242j238987p03572M65544J202867Q72423l788m18732p9944L94321L66211
$$ 2217242 978255 274683 740227 1943094 2815517 2811729 2392997 2313053 2707374 3073585
42747C073585j18290n53169n89261l10871p0397j25190l60812m13661j49293J30241
$$ 3073585 2955295 2402126 1812865 1501994 1431597 1306407 945595 531934 382641 512882
42737E12882J18243n5866q1585L1520P1048R2925L22665O19182N06594j52449
$$ 512882 631125 575259 493674 525194 596242 689167 1011832 1631014 2137608 1985159
42727A985159q69118j037573n07657L47846Q96110O71215j26680o56272l35187
$$ 1985159 1116041 78468 -429189 -81343 814767 1485982 1359302 703030 367843
42718C67843M04437O86376L51134M904N4693L38472O18340P23087K83682q14858
$$ 367843 772280 1458656 1809790 1814694 1869387 2207859 2826199 3549286 3832968 3018110
42708C018110j719391j345795R36P89684L50114l01182j75479L09388L61220J16273
$$ 3018110 1298719 -47076 -46140 743544 1093658 792476 616997 926385 1287605 1403878
42698A403878M590k08446p14300q58833j79278N09198K73434l58238k88575K52197
$$ 1403878 1408468 1200022 485722 -373111 -552389 -43191 230243 -127995 -416570 -164373
42688a64373J82789m11503l24989P11621J481665J031291k12007j297431j698417
$$ -164373 18416 -393087 -718076 -6455 1475210 2506501 2294494 997063 -701354
42679g01354j253375j75368P06231O34135l9058l40690j03188Q6480J51271M85532
$$ -701354 -1954729 -2130097 -1423866 -789731 -828789 -1169479 -1272667 -1186187 -1034916 -549384
42669e49384P76093L16181m55482l09501O46977Q77258q9091q05902l02209L80754
$$ -549384 226709 542890 87408 -222093 424884 1302142 1213051 407149 104940 485694
42659D85694Q4364n98301o20302k84167l18848l17856L39763R41221M60734n39056
$$ 485694 570058 -28243 -648545 -932712 -1251560 -1569416 -1229653 -288432 172302 -366754
42649c66754o69853O0285L97706k2832k72537J28676N11907L49843M6342P5657
$$ -366754 -1036607 -976322 -578616 -601448 -873985 -745309 -233402 116441 162783 238440
42639B38440K64281K87440J79323O6602q3749k85513m78440o37411o36317k49960
$$ 238440 502721 790161 969484 1036086 952337 666824 188384 -449027 -1085344 -1335304
42629a335304L42905M74649q3017n77072k88016L89676N86339J97488k64846n48325
$$ -1335304 -992399 -517750 -600767 -1177839 -1465855 -1076179 -489840 -292352 -557198 -1105523
42619a105523n83467j13588O86630Q70725O3358n64702M4160R37012N52463n87272
$$ -1105523 -1688990 -1802578 -1115948 -245223 -181865 -746567 -702407 234605 787068 199796
42609A99796o17085M83616P40382m97148j403305o52673N71129P37783K90719
$$ 199796 -417289 66327 806709 309561 -1093744 -1746417 -1175288 -437505 -146786
42600a46786L24886N03153J7513n55724k07701N14766L37608m41173l79496N62818
$$ -146786 178100 681253 698766 143042 -64659 450107 787715 346542 -32954 529864
42590E29864Q20189j80565r94578m31065O03815N74127l82096q34495k54936L76926
$$ 529864 1350053 1169488 174910 -256155 347660 921787 539691 -294804 -549740 -172814
42580a72814J73497m55861o01984j96915P1650q2767j62280K32355P03882O08676
$$ -172814 683 -455178 -1057162 -1254077 -1182427 -1265194 -1427474 -1195119 -491237 117439
42570A17439m8871o97232r39330p72558k71338M17006Q61526P01081K07753k9320
$$ 117439 68568 -628664 -1567994 -2340552 -2611890 -2194884 -1333358 -632277 -424524 -453844
42560d53844L4578n5274l42849l18352J38487M02411N2009m35353l87759J24359
$$ -453844 -419266 -474540 -817389 -1135741 -997254 -594843 -542834 -978187 -1365946 -1241587
42550a241587N06508M65762K26830J32149K67140L26310j35641j002477j332571
$$ -1241587 -735079 -269317 -42487 89662 356802 683112 547471 -455006 -1787577
42541a787577m39339Q94008J202104L90535j35238K92952N63384k49544j144633
$$ -1787577 -2226916 -1332908 -130804 259731 124493 417445 980829 731285 -413348
42532d13348o86138O47209J110013K67739n59665l84522K58430M36026K6851n49206
$$ -413348 -1099486 -452277 657736 925475 365810 -18712 239718 675744 702595 153389
42522A53389r41493q44688q4964R08746J301922Q27174O9358m02484o19244p25658
$$ 153389 -788104 -1632792 -1717756 -809010 492912 1320086 1389444 986960 367716 -357942
42512c57942n59705r1796K62370K20593J06957K95905N53035M43898J17887P2906
$$ -357942 -917647 -1009443 -747073 -526480 -419523 -123618 429417 873315 991202 1064108
42502A064108K43792M660p40362j087683k64498J110048J575763O49952n86126
$$ 1064108 1307900 1312560 572198 -515485 -779983 330065 1905828 2555780 1969654
42493A969654r83790p23788o35835p26482l53539L98720O73595K94489J32683
$$ 1969654 985864 262076 -373759 -1100241 -1453780 -1055060 -381465 -86976 45707
42484D5707O16891R41977M17038l49133m57918j17167n3579j88689J2708L71865
$$ 45707 662598 1604575 2021613 1672480 1214562 1097395 1043816 855127 867835 1239700
42474A239700L25205P1958K11911M86793J36888o03301p01895r2822J34410m07340
$$ 1239700 1564905 1636863 1848774 2335567 2472455 1869154 1167259 1074437 1208847 801507
42464H01507p39601k53337K16950j18057n83163j85143O63688P77843P1989l89272
$$ 801507 61906 -191431 25519 -92538 -675701 -860844 -197156 580687 652676 263404
42454B63404o6852L82493K43578k60319m27970o9974K96017J26787m12547n16379
$$ 263404 196552 579045 822623 562304 134334 64360 360377 487164 74617 -441762
42444d41762K67091J229249J184668L3693r91308r25323k40037P7678n3471o2297
$$ -441762 -174671 1054578 2239246 2272939 1281631 356308 116271 193949 140478 78181
42434G8181J12753N9712j47026J304M27401M10767k49992q15208o72305j53872
$$ 78181 190934 250646 103620 104924 532325 943092 693100 -122108 -794413 -948285
42424i48285J20482J51598L05578N62818N75931K71691p1421k37285j98740M5819
$$ -948285 -827803 -676205 -370627 192191 768122 1039813 968392 731107 532367 578186
42414E78186L89685M67495k210p20209j023255o55873o922M62119O50220N87667
$$ 578186 967871 1435366 1433156 712947 -310308 -966181 -973103 -510984 139236 726903
42404G26903K28870k65091m52324k08968n0706l58266n96392p017J052616J319207
$$ 726903 955773 690682 238358 29390 -21316 -379582 -975974 -982991 69625 1388832
42394A388832L42094q23635j041472m78266Q705K01447M14812N16962O6163o72177
$$ 1388832 1730926 907291 -134181 -612447 -603742 -402295 12517 529479 595642 -76535
42384g6535q07694r8330O42456O80384K28303j47891l58121n46287n11644J4718
$$ -76535 -884229 -982559 -340103 340281 568584 420693 62572 -483715 -995359 -980641
42374i80641P20853Q97457L08227m73731p20000l64420r997j09971l22627J3394
$$ -980641 -259788 637669 945896 472165 -247835 -612255 -622252 -732223 -1054850 -1041456
42364a041456P70206R51971R9517p87960n07199N17251P10357l26252j136585
$$ -1041456 -271250 680721 780238 -7722 -514921 2330 712687 386435 -750150
42355g50150n28651O74324Q63790o2926o89403j16080R56228J297578O08095l77680
$$ -750150 -1278801 -604477 259313 196387 -493016 -609096 347132 1644710 2252805 1875125
42345A875125q46429o58800k61947o0746j7745O7508J04819j11435l81348k61253
$$ 1875125 1028696 369896 107949 47203 29458 96966 201785 90350 -290998 -552251
42335e52251K11574N10869M59506M45840N83056L79346l34380q55478n81358O5362
$$ -552251 -340677 170192 629698 1075538 1658594 2037940 1703560 848082 266724 332086
42325C32086L28026J77807j3053k88634p48184q63667j59833P47307Q26748J49420
$$ 332086 660112 837919 824866 536232 -211952 -1075619 -1235452 -488145 338603 488023
42315D88023l04188k13049j88649n00095o77174n25512m19471l55862J61235R75521
$$ 488023 183835 -29214 -217863 -717958 -1395132 -1920644 -2340115 -2695977 -2534742 -1559221
42305a559221J173569N65326J02051K57488K29536m62245q55083j44843P10268
$$ -1559221 -385652 179674 281725 539213 768749 306504 -548579 -693422 16846
42296A6846M08213n26900o01564J91306N30676J30653P2488O23840O24110l17042
$$ 16846 425059 -101841 -703405 -512099 18577 149230 221718 845558 1469668 1152626
42286A152626p46529L98470J826747J554202l06743j811422j781090q42152o2221
$$ 1152626 406097 804567 2631314 4185516 3878773 2067351 286261 -555891 -618112
42277f18112K39930K23111M7599o1585P0617K26273O4917k81068m19439l79480
$$ -618112 -378182 -155071 -107472 -169057 -98440 127833 192750 -88318 -507757 -887237
42267h87237m20805l35670J92791O38563J43140q77750q77495N73755J877578
$$ -887237 -1308042 -1643712 -1450921 -812358 -669218 -1546968 -2424463 -1850708 26870
42258B6870J545357J99090n84713n11608l77274l43318P5305O22531M68521k15481
$$ 26870 1572227 1771317 1186604 674996 297722 -45596 29709 652240 1120761 905280
42248I05280l34483K57591M31596k33630o32198o6239M01823l06690j309438j000170
$$ 905280 570797 828388 1259984 1026354 394156 327917 729740 423050 -886388 -1886558
42238a886558M07537J147157N08972l07758j58602N09984O31794J04700l09677
$$ -1886558 -1479021 -331864 177108 -130650 -289252 220732 852526 957226 647549
42229F47549j70046K15292L70273J95834p4297k03744j61463q0119q8122k24646
$$ 647549 477503 692795 1063068 1258902 1184605 980861 819398 739279 651157 426511
42219D26511m38179n25763j89126N36741R90930N20036n32369j061321o29372
$$ 426511 -11668 -537431 -726557 -189816 801114 1321150 788781 -272540 -901912
42210i01912j0400K9723k26947j73225O5334N3669m2827J60073M08923K40094
$$ -901912 -912312 -882589 -1109536 -1282761 -1217427 -1163758 -1206585 -1046512 -637589 -397495
42200c97495q6559o120L01337K40126q8481j12433J18230J43433J50569N96303
$$ -397495 -484054 -490174 -188837 51289 -37192 -149625 -31395 112038 262607 858910
42190H58910R69322L50860q27041j148900m91611k33004p97847q44572L08313
$$ 858910 1828232 2179092 1352051 203151 -288460 -521464 -1319311 -2163883 -1855570
42181a855570J263774P51470l51602o49954m59030p13862q61529J54400J599869
$$ -1855570 -591796 159674 -191928 -841882 -1300912 -2014774 -2876303 -2721903 -1122034
42172a122034J761367O95360J11449N47192O72983k46011j053580o04816M80583
$$ -1122034 639333 1334693 1446142 1993334 2666317 2420306 1366726 761910 1242493
42163A242493Q55125K47476n34503p16761j48271O59195Q14135k8794r71913q82598
$$ 1242493 2097618 2345094 1810591 1093830 945559 1604754 2418889 2390095 1418182 535584
42153E35584n1438J98835m20292p87638l18712J46696k5725j66136K95013O10722
$$ 535584 484146 682981 262689 -524949 -843661 -696965 -722690 -888826 -593813 16909
42143A6909K3231p79829p60295k19917q3127j96905K23334R21715Q68450L2257
$$ 16909 40140 -739689 -1499984 -1719901 -1803028 -1999933 -1776599 -854884 13566 45823
42133D5823n05303k49349J39319J18992m0817q8008k48301n08373l78586K11119
$$ 45823 -459480 -708829 -569510 -450518 -491335 -579343 -827644 -1336017 -1714603 -1503484
42123a503484N88488L48628k1338L3504L21242L70160J64704m1185j92226k96513
$$ -1503484 -914996 -566368 -587706 -554202 -232960 137200 301904 260719 68493 -228020
42113b28020k17621L0206J47347K7248j4237K07140L72467J84587j31367k22472
$$ -228020 -445641 -415435 -268088 -240840 -255077 -47937 324530 509117 377750 155278
42103A55278j38625r1986l6825J07507J33560j23350l84614k68626J64820N39949
$$ 155278 16653 -75333 -112158 -4651 128909 5559 -379055 -647681 -482861 57088
42093E7088O11557L22044k48485o82258m22187L80262O89819j18655j208056j295898
$$ 57088 668645 990689 742204 59946 -362241 18021 707840 589185 -618871 -1914769
42083a914769m08707L04268L54092M17713R00794J108445M13470o09494r91421
$$ -1914769 -2323476 -2019208 -1665116 -1247403 -346609 761836 1175306 565812 -425609
42074d25609p52904o48577q24956n96132L89336J441242J587102P10654l23526
$$ -425609 -1178513 -1827090 -2652046 -3248178 -2858842 -1417600 169502 880156 556630
42065E56630n81987N780O07464M10378m19531q95755m32143L79663N22598j16247
$$ 556630 -25357 -19577 587887 998265 578734 -317021 -749164 -369501 153097 36850
42055C6850o28858l07857M83052Q86255O45261K29591J3957j78138n53164p75136
$$ 36850 -592008 -899865 -416813 469442 1114703 1344294 1358251 1180113 626949 -148187
42045a48187l62236M54058P90917K26746n68824o77168r7223L96497L55850M5320
$$ -148187 -510423 -56365 734552 961298 392474 -284694 -381917 14580 370430 415750
42035D15750j97957l31720k42839K87446R59826R54674K0235r78485j137314o52003
$$ 415750 217793 -113927 -356766 -69320 890506 1845180 1865415 886930 -250384 -902387
42025i02387k67713q5132K66182O32465N18430J34084J90201N66158L07649p01960
$$ -902387 -1170100 -1255232 -989050 -356585 161845 295929 486130 1052288 1359937 657977
42015F57977j204549l89336P20528O68656l47820r14353n06204N5714J61216J98663
$$ 657977 -546572 -935908 -215380 453276 105456 -808897 -1315101 -1259387 -1098171 -899508
42005h99508N19564O87100L17745j15482j387M03759L75264j71491o03411m77457
$$ -899508 -379944 307156 624901 509419 508032 911791 1287055 1115564 512153 34696
41995C4696o701L48351L49718N0208k94901l98104k40348r7250p3799J18014N70778
$$ 34696 27995 376346 726064 776272 481371 83267 -157081 -254331 -328130 -210116 360662
41984C60662P04935p272j019084j185329l32127M46548L49404n7536J33374P36420
$$ 360662 1065597 1058325 39241 -1146088 -1478215 -1031667 -682263 -739799 -606425 129995
41974A29995Q46383K57066l43924m69145l32404k29186j34076o0459j93489m60189
$$ 129995 976378 1233444 889520 420375 87971 -141215 -275291 -335750 -529239 -989428
41964i89428n12261l28943k85864m18930k41845L83752Q34919O44099K34691J68972
$$ -989428 -1501689 -1830632 -2116496 -2535426 -2777271 -2393519 -1558600 -914501 -679810 -510838
41954e10838K27051l1467k77295P5290O40742M20899n77590j137247n54729L48610
$$ -510838 -283787 -315254 -592549 -517259 123483 544382 -33208 -1170455 -1725184 -1376574
41944a376574M59279j23424m68110j71479L71104P40744Q45987O32176Q3301m44486
$$ -1376574 -917295 -1040719 -1508829 -1680308 -1309204 -568460 277527 909703 993004 548518
41934E48518m14741J96131P33208N67180k11348q98496q73435j73576N30890N64693
$$ 548518 133777 329908 1063116 1630296 1418948 520452 -352983 -526559 4331 569024
41924E69024o6041o81143o86719j82314L03604M72405M10676K47586j4572l38987
$$ 569024 502983 -178160 -864879 -1047193 -743589 -271184 139492 387078 372506 33519
41914C3519n77789n95653l36846J58754O36722O66438R8484n87704p48875m01254
$$ 33519 -544270 -1139923 -1476769 -1318015 -681293 -14855 83629 -504075 -1252950 -1654204
41904a654204j96863m77726p63656m47819L14563P88377N75603j2799m38639m34927
$$ -1654204 -1851067 -2328793 -3092449 -3540268 -3225705 -2437328 -1861725 -1874524 -2313163 -2748090
41894b748090j7301O17810J059341Q79837J43805m82524m25243J14231M64946
$$ -2748090 -2765391 -2147581 -1088240 -208403 -64598 -547122 -972365 -858134 -393188
41885c93188L66818J60335J14292M2069k27200m29635k68809O4533J76581O5271
$$ -393188 -26370 133965 248257 290326 63126 -366509 -635318 -570785 -394204 -328933
41875c28933P280J6235r4924k01164J4235L84260L13925k71148o07450j15683
$$ -328933 -321653 -305418 -400342 -601506 -587271 -203011 110914 -160234 -767684 -883367
41865h83367P13801R51873M37184j80786m12354l70360k87697j56490L2225J51621
$$ -883367 -169566 782307 1219491 1038705 626351 255991 -31706 -188196 -155971 -4350
41855d350K24995M51193P32066N91041r3042o59238n07153j03362l96643j222332
$$ -4350 220645 671838 1403904 1994945 1901903 1242665 735512 632150 235507 -986825
41845i86825j202616K94744J913922J923886N71963l35566n5716K63211k86872
$$ -986825 -2189441 -1894697 19225 1943111 2515074 2179508 2123792 2387003 2100131
41836B100131q41718l02820P24841Q63133J21419l35994j95481k13516n17034
$$ 2100131 1258413 955593 1680434 2543567 2664986 2328992 2133511 1919995 1402961
41827A402961l10137M44445O19842k01308q56567m18335L64599L97716q7936k73802
$$ 1402961 1092824 1537269 2157111 1955803 1099236 680901 1045500 1443216 1355280 1081478
41817A081478j88158k08289Q744P53261J126775J87405j211289j299063N2282
$$ 1081478 893320 685031 693775 1447036 2573811 2761216 1549927 250864 303146
41808C03146J170509J029890L83512J96503L51101M20143N34627Q18358Q76178
$$ 303146 1473655 2503545 2887057 3083560 3434661 3854804 4389431 5207789 6083967
41799F083967M98185J67971L06851N95809N11649K7722n53002r41677q20293r1110
$$ 6083967 6582152 6750123 7056974 7652783 8164432 8192154 7639152 6697475 5877182 5786072
41789E786072N99961L19555q40370j627726j216407k47990J68483j32174m72603
$$ 5786072 6386033 6705588 5865218 4237492 3021085 2773095 2941578 2809404 2336801
41780B336801l34688K17193P18987N94777l04715j252339j295390n33522n1972
$$ 2336801 2002113 2219306 2938293 3533070 3228355 1976016 680626 147104 95132
41771I5132l58295p05181l26517M86765R99838R43955L94527m26565q35143j64749
$$ 95132 -263163 -968344 -1294861 -808096 191742 1135697 1530224 1103659 268516 103767
41761A03767R67300J031057j63270r25674k73830M56808q4073q66963k83739Q73887
$$ 103767 1071067 2102124 1938854 1013180 739350 1196158 1112085 245122 -38617 835270
41751H35270N98178q53530j245781m6860P63880M3138p89286l42785N30655M57277
$$ 835270 1433448 579918 -665863 -712723 51157 94295 -694991 -1037776 -507121 -49844
41741d9844j98109l07943L9853P9252m8045K41087N79923K03582n13960m83151
$$ -49844 -247953 -555896 -516043 -436791 -484836 -243749 336174 539756 25796 -457355
41731d57355K96981O47875K04q27081q83669k58234L40529N36859M45351K54379
$$ -457355 -160374 487501 487705 -339376 -1223045 -1481279 -1140750 -603891 -158540 95839
41721I5839R87l18425n61627m77465p8155J64749q1933l02007K82314J312232
$$ 95839 96826 -221599 -783226 -1260691 -1338846 -1174097 -1256030 -1558037 -1275723 36509
41711C6509J428934K55362p76610m10657N53978N49510l26542o83242k69354k76749
$$ 36509 1465443 1720805 944195 533538 1087516 1637026 1310484 627242 357888 81139
41701H1139j059916j320621k81382Q41015O60887k03332j63741Q11419J220690
$$ 81139 -978777 -2299398 -2580780 -1739765 -1078878 -1282210 -1445951 -634532 586158
41692E86158M15214m67222k67954O19176J033812O36675Q724l83370n97038p30277
$$ 586158 1001372 534150 266196 885372 1919184 2555859 2564583 2181213 1584175 853898
41682H53898o50591l19187O728Q0272k1178l0549J51845L27702K12753k19099
$$ 853898 203307 -115880 -109152 -28880 -50058 -80607 71238 398940 611693 392594
41672C92594o01525m99276M2105M22933J75753l95746n77822j96094K08888K28870
$$ 392594 -208931 -708207 -666102 -243169 -67416 -463162 -1040984 -1237078 -1028190 -799320
41662g99320J21073K24525L25237R6394j87183l4254L39773K39068l19225m45324
$$ -799320 -678247 -453722 -128485 -32091 -219274 -253528 86245 325313 6088 -439236
41652d39236K76432J009441P81386j60391p76855o65007l24177j67313m1549J97230
$$ -439236 -162804 846637 1628023 1467632 690777 25770 -298407 -465720 -507269 -310039
41642c10039L22174J91889M6594O9364P6131p0322j29873Q7732L05019J99467
$$ -310039 12135 204024 250618 319982 396113 325791 195918 283650 588669 788136
41632G88136r996J26946N29646O41201K69630r4007K4577M14234M77447J6043
$$ 788136 778140 905086 1434732 2075933 2345563 2251556 2276133 2690367 3167814 3183857
41622C183857n41891o71405l46789n2579j99764n60169m42935M19894J344976
$$ 3183857 2641966 1970561 1623772 1571193 1371429 811260 368325 788219 2133195
41613B133195J395506N54440k28506k48603J66253L18209J09976q6578j59602
$$ 2133195 3528701 4083141 3854635 3606032 3772285 4090494 4200470 4113892 3954290
41604C954290k72258l46162j46512J71927K01730j1544n443K58967K24529l76692
$$ 3954290 3682032 3335870 3189358 3361285 3563015 3551471 3546028 3804995 4029524 3652832
41594C652832j069598j364817j349674j182663o35605K93235Q67719M74105l44180
$$ 3652832 2583234 1218417 -131257 -1313920 -1949525 -1656290 -788571 -314466 -658646
41585f58646m96884J73714P74045O59327J20938k75882l58624k10646L0912O8418
$$ -658646 -1155530 -981816 -207771 451556 572494 296612 -62012 -272658 -241746 -173328
41575a73328l17895p50820n25241L79756J092973R42303K61276k21140l17868
$$ -173328 -491223 -1242043 -1767284 -1387528 -294555 647748 909024 687884 370016
41566C70016k94228k54652j39260q1469k40387l70029l2033P12489J186300Q26389
$$ 370016 75788 -178864 -318124 -399593 -639980 -1010009 -1042042 -329553 856747 1683136
41556A683136j47380r36992r89261n03201p1131O3658J45656L06784K58261j37435
$$ 1683136 1535756 598764 -390497 -893698 -964829 -901171 -755515 -448731 -190470 -327905
41546c27905m08239j07083L98080M29200R8989J21945N83354P85669M41108Q1823
$$ -327905 -736144 -843227 -445147 -15947 83042 204987 788341 1574010 2015118 2096941
41536B096941k672k60921q29896r66101k57106M54220K64899l73774m61849q9569
$$ 2096941 2094269 1833348 1003452 37351 -219755 234465 499364 125590 -336259 -425828
41526d25828r4116m64407l87605K19659N27649K74601J76041N02106M52725m12619
$$ -425828 -519944 -984351 -1371956 -1152297 -624648 -350047 -174006 328100 780825 368206
41516C68206j150952p16415M51667J055551P03194J29520q6278r2516o4356J84249
$$ 368206 -782746 -1499161 -1047494 8057 711251 840771 754493 661977 597621 781870
41506G81870O03962O09345j30226r82040r83345q7381P14112O29465J9503k09254
$$ 781870 1385832 1995177 1864951 882911 -100434 -187815 526297 1155762 1175265 966011
41496I66011J04571K25947k99827q87598p12914Q7157N57605J79910n26924p47596
$$ 966011 1070582 1296529 996702 109104 -603810 -516653 40952 220862 -306062 -1053658
41486a053658l10836K81840M83159J72761l14368m94308j94343K34513L06935
$$ -1053658 -1364494 -1082654 -599495 -426734 -741102 -1235410 -1429753 -1195240 -888305
41477h88305J4998j55729J36744O61339R10498O40123L0339n16229o53066l36885
$$ -888305 -873307 -1029036 -892292 -230953 679545 1319668 1350007 833778 180712 -156173
41467a56173J06999K94077J98991J08749J44635P8706k63166o51234p01943l38918
$$ -156173 -49174 244903 443894 552643 697278 775984 512818 -138416 -840359 -1179277
41457a179277J75708N65338P18233O30556L82386J57963Q7582K0566l46408r77533
$$ -1179277 -1003569 -438231 280002 910558 1292944 1450907 1538489 1559055 1212647 235114
41447B35114j311331q50005J03510O61846M47398R3499L22865Q71325Q97132K87779
$$ 235114 -1076217 -1926222 -1822712 -1160866 -713468 -619969 -297104 574221 1471353 1759132
41437A759132j72131k1323K43706P4786k72522k91769p0710K2631M8891K22023
$$ 1759132 1587001 1565678 1809384 1884170 1611648 1319879 1249169 1271800 1320691 1542714
41427A542714K83349j13834o41325o82596l29078k02511l53098j76958M83148
$$ 1542714 1826063 1712229 1070904 388308 59230 -143281 -496379 -673337 -190189
41418a90189R76142Q19466L29985j2675k02881l76227l98251j65634J06043K09510
$$ -190189 785953 1605419 1935404 1922729 1719848 1343621 945370 779736 885779 1095289
41408A095289J96291R7315j75397m60243l79162L2398K62227J50225J78121N61911
$$ 1095289 1291580 1388895 1213498 753255 374093 406491 668718 818943 997064 1558975
41398A558975P03461J27734n68347m48256L72384Q08833K30456p90871j221802
$$ 1558975 2262436 2390170 1821823 1373567 1745951 2554784 2785240 1994369 772567
41389G72567o59081L71050R38119N37753m18850j009974p88016j54307L19252
$$ 772567 113486 484536 1422655 1960408 1541558 531584 -256432 -410739 -91487
41380i1487N29805N64623K76318l64289q39589o26935j9172J91212j73780m40680
$$ -91487 438318 1002941 1279259 914970 75381 -551554 -570726 -379514 -553294 -993974
41370i93974p3248N84275Q03043M06847p8963j17840K29048M47774K17190k55113
$$ -993974 -1067222 -482947 320096 726943 647980 530140 759188 1206962 1424152 1169039
41360A169039n72773n98156l75920J19344P60439J001188M29069m45444o11011
$$ 1169039 596266 -1890 -377810 -258466 501973 1503161 1932230 1486786 875775
41351H75775J17968Q54585Q90161M60057p362n56624j117546j089690k65542M99889
$$ 875775 993743 1848328 2738489 3198546 3191184 2634560 1517014 427324 161782 661671
41341F61671L83522j89799l04580r717J68k59629k00551O3781j53289o68826m08488
$$ 661671 1045193 855394 550814 541097 541265 281636 81085 144866 -8423 -677249 -1085737
41330a085737Q16724J671414J065249l19315j017086o97306l04269n68265j088747
$$ -1085737 -269013 1402401 2467650 2148335 1131249 433943 129674 -438591 -1527338
41321a527338r72273k050J040229J242893O51762J71099K71834L49080j80127
$$ -1527338 -2499611 -2501661 -1461432 -218539 433223 604322 876156 1225236 1045109
41312A045109p64956n75376r23j08244p79613p72154J86293P98214K50401m74412
$$ 1045109 280153 -295223 -296146 -404390 -1184003 -1956157 -1769864 -971650 -721249 -1195661
41302a195661k22086N36403O55456J87031K8497K63723J64996m01942p74634o32610
$$ -1195661 -1417747 -881344 -225888 -38857 -10360 253363 418359 16417 -758217 -1390827
41292a390827k92135J13219P21201J158946P32297l60207r76941n71589R3604
$$ -1390827 -1682962 -1569743 -848542 310404 1042701 682494 -294447 -866036 -772432
41283g72432K25178J24609L75640O50611K49194n75452q12409j73332M78017L69218
$$ -772432 -547254 -422645 -47005 603606 852800 277348 -535061 -708393 -230376 138842
41273A38842k06448n14184m21889k93138j75098K50150R22579J221881P75609
$$ 138842 -67606 -581790 -1003679 -1296817 -1471915 -1221765 -299186 922695 1698304
41264A698304K3403l71035l68315m02409n91357o06487k99093L3655J22182P4476
$$ 1698304 1721707 1350672 982357 579948 -11409 -617896 -916989 -883334 -761152 -686676
41254f86676J10649K63717M48926N21728K25968n09705j168296j058840k84853
$$ -686676 -576027 -312310 136616 658344 884312 374607 -793689 -1852529 -2137382
41245b137382K87012K62629K34118O49297R42927N18937o5689J12830P90583Q59102
$$ -2137382 -1850370 -1587741 -1353623 -704326 238601 757538 691849 804679 1595262 2454364
41235B454364J08850n06266m25036j91338l22193m92538l19977p4676n1388j0425
$$ 2454364 2563214 2056948 1631912 1440574 1118381 625843 305866 231190 179802 169377
41225A69377J79917J11738k95833k90314N07101J123034N47028n23681n40422
$$ 169377 349294 461032 165199 -125115 381986 1505020 2052048 1528367 987945
41216I87945N48178J170158M28464p88154j326697j178196q06498j94221O20985
$$ 987945 1536123 2706281 3134745 2346591 1019894 -158302 -964800 -1159021 -538036
41207e38036R56778M19897j86899J01814Q90551R49963M0725p95152p50034j56257
$$ -538036 418742 838639 651740 753554 1644105 2594068 2634793 1839641 1089607 933350
41197I33350K45972J84524j79067n31678n00586J752M68817L80498K4999L4115
$$ 933350 1179322 1363846 1184779 653101 152515 154267 623084 1003582 1028581 1062696
41187A062696J98917k52602j087616r89664M33034J704491J403306J05321o23514
$$ 1062696 1261613 1009011 -78605 -1068269 -635235 1069256 2472562 2577883 1954369
41178A954369m30349j69950k12949j17297J60344L3910n72618r50616p26623l12049
$$ 1954369 1524020 1354070 1141121 1023824 1184168 1218078 645460 -305156 -1031779 -1343828
41168a343828M470M48350R14119P33284j62058p30816j98056P51507R27659K44843
$$ -1343828 -1339358 -891008 23111 756395 594337 -136479 -334535 416972 1344631 1589474
41158A589474m27298o15126n76559n00605k46791P7892K1337n11101r47178o78958
$$ 1589474 1162176 547050 -29509 -530114 -776905 -699013 -677676 -1188777 -2135955 -2814913
41148b814913K62274J253973J592002R94141j07015q02450n66803J17930L32036
$$ -2814913 -2552639 -1298666 293336 1287477 1180462 378012 -188791 -70861 261175
41139B61175r0996l77566L5916O17387M12732n99038j314081p90672N83100J478666
$$ 261175 170179 -207387 -171471 445916 858648 259610 -1054471 -1845143 -1262043 216623
41129B16623J092518l8482p26830m07156M24258Q65302M85116l69940r37166p38873
$$ 216623 1309141 1270659 543829 136673 560931 1426233 1911349 1541409 604243 -134630
41119a34630p9593K35773j60092o98095n76639J89280Q04860P24512K26964q5448
$$ -134630 -214223 21550 -138542 -836637 -1413276 -1223996 -419136 305376 532340 446892
41109D46892J3059K75602L03687q8110n94168n86741J11335P81373O22360j26066
$$ 446892 459951 735553 1039240 951130 356962 -229779 -118444 662929 1285289 1159223
41099A159223m97745j62054K80504L81794L39381K36761k12325p63571n20569
$$ 1159223 661478 499424 779928 1161722 1501103 1737864 1525539 761968 241399
41090B41399O13463J301961N00253r22654j304530l99496N65300O63514R0221
$$ 241399 854862 2156823 2657076 1734422 429892 30396 595696 1259210 1349431
41081A349431n27925o93367j26535Q14341J061551J00235j020989r70956o2069
$$ 1349431 821506 128139 1604 815945 1877496 1977731 956742 -14214 -76283
41072g6283L52965R2311J85877P52826O46299l62573q45310j9473Q18261L40081
$$ -76283 276682 368993 554870 1307696 1953995 1591422 746112 726639 1544900 1884981
41062A884981o99052q13372j53576R2665j15831J50277Q19735P91308j13627p60794
$$ 1884981 1185929 372557 218981 311646 195815 346092 1165827 1957135 1843508 1082714
41052A082714n07507J9023K89739O30443J069997P87658m25307j289557p29050
$$ 1082714 575207 594230 883969 1514412 2584409 3372067 2946760 1657203 928153
41043I28153L91443M53288n18592r76132k21203O53634M92598l19633n99613o0894
$$ 928153 1319596 1772884 1254292 278160 56957 710591 1203189 883556 283943 223049
41033B23049M37281J25465p23881j154210o25641L63838Q41666N29024J26303
$$ 223049 660330 785795 61914 -1092296 -1717937 -1354099 -512433 16591 142894
41024A42894K12092L28496k15155r93498r12953K0422N45546J07146k43333L44918
$$ 142894 354986 683482 468327 -525171 -1438124 -1417702 -872156 -765010 -1008343 -663425
41014f63425R81301N07809l95389j69221J026110J439598M60842n41831n21968
$$ -663425 317876 825685 430296 261075 1287185 2726783 3187625 2645794 2123826
41005B123826k02308m28833o09432K5132P91542N80837k72471n51356j04745J00451
$$ 2123826 1921518 1492685 883253 908385 1699927 2280764 2008293 1456937 1352192 1452643
40995A452643l65403q85269q56228k76043N94353J258219R50113l99246j442726
$$ 1452643 1087240 201971 -654257 -930300 -335947 922272 1872385 1473139 30413
40986C0413q45149P35613J381808N77239k88108k33642L1500l24302q36679p49268
$$ 30413 -814736 -79123 1302685 1879924 1591816 1358174 1389674 1065372 228693 -520575
40976e20575l05549q2297Q0012N11298P92746L97903k55656l28836K07650O65211
$$ -520575 -826124 -908421 -828409 -317111 475635 873538 617882 289046 496696 1161907
40966A161907O68306L82217J653k96844j56508N11586J078154Q53900O1031m62478
$$ 1161907 1830213 2212430 2214083 1917239 1760731 2272317 3350471 4204371 4265402 3802924
40956C802924m15758k80896m40962o35376m42129P4572L94658J21383n08064p49663
$$ 3802924 3387166 3106270 2665308 2029932 1587803 1662375 2057033 2178416 1670352 920689
40946I20689j83233O49684Q15135J89921m03441l38672J19551M15181L57301l8685
$$ 920689 737456 1387140 2202275 2392196 1988755 1650083 1769634 2184815 2542116 2503431
40936B503431o74620j061951o48822K08462M40572j56970n11357p121M71792J00513
$$ 2503431 1828811 766860 118038 326500 767072 610102 98745 91624 563416 663929
40926F63929l96054k1697O63935M77643k94261l65089L49606O64081J84888j77067
$$ 663929 267875 246178 910113 1387756 1093495 728406 1078012 1742093 1926981 1749914
40916A749914O1917K16659j89533o12523n29392j81440J60095O25899J026946
$$ 1749914 1811831 2028490 1838957 1226434 697042 515602 675697 1301596 2328542
40907B328542P37831k21297r40455r05801n93490l92911j1975N40512N41237j52233
$$ 2328542 3066373 2845076 1904621 998820 405330 12419 444 540956 1082193 929960
40897I29960m96830J36097P62785K84193o60158o16384M41880J121877O71868
$$ 929960 433130 569227 1332012 1616205 956047 339663 781543 1903420 2575288
40888B575288j60541m02985l6674L17393K35091j92146n02456l12157J43239J63236
$$ 2575288 2414747 2011762 1975088 2292481 2527572 2335426 1832970 1520813 1664052 1827288
40878A827288m22970q48566m70002K57717N33626M70869P24693J173054J004848
$$ 1827288 1404318 555752 85750 343467 877093 1347962 2072655 3245709 4250557
40869D250557J03196o48674o38587k58989q8106r4826n2977j13159m55759p85707
$$ 4250557 4353753 3705079 3066492 2807503 2719397 2624571 2571594 2458435 2002676 1216969
40859A216969o55920q0034N15020P79447O41176K03747k97098n39689l42691J42907
$$ 1216969 561049 481015 996035 1775482 2416658 2620405 2323307 1783618 1440927 1583834
40849A583834N35697N26184J42780k15871j38689K81521M72396J24780l33410
$$ 1583834 2119531 2645715 2788495 2572624 2433935 2715456 3187852 3312632 2979222
40840B979222l45883o1724l9213k55557q7576O16255J111964P47087j26850o52132
$$ 2979222 2633339 2571615 2532402 2276845 2189269 2805524 3917488 4664575 4537725 3885593
40830C885593n38338k21831j86867n16372r49372j035901m09440P02002J375515
$$ 3885593 3347255 3125424 2938557 2422185 1472813 436912 27472 729474 2104989
40821B104989Q76390l61400j094674p05408J63030N84822M93866M39646N57186
$$ 2104989 2981379 2619979 1525305 819897 982927 1567749 2061615 2501261 3058447
40812C058447M28368m1951k70719J47112O85490N27503k34149o47827k32176L36605
$$ 3058447 3486815 3444864 3174145 3321257 4006747 4534250 4300101 3652274 3420098 3756703
40802C756703K23639l33850m06088J87390N56114P9410n90914m50363L22637N66876
$$ 3756703 3980342 3646492 3240404 3427794 3983908 4063318 3472404 3022041 3344678 3911554
40792C911554j12606o57371p8935R97076J122503Q6310p49524l21144P52595J121556
$$ 3911554 3798948 3141577 3062642 4059718 5182221 5268531 4519007 4197863 4950458 6072014
40782F072014M63424l35695m75275q6172J99954N2116l16872m71583k30243J26236
$$ 6072014 6535438 6199743 5724468 5638296 5838250 5890366 5573494 5101911 4871668 4997904
40772D997904K01387M2330P8011M20304O46271N13537M13855O93904R71633P06376
$$ 4997904 5199291 5241621 5319632 5739936 6386207 6899744 7313599 8007503 8979136 9685512
40762I685512J03194k12484j73050k13196l99991l65924o4400J19330L2696r4692
$$ 9685512 9788706 9576222 9403172 9189976 8789985 8424061 8359661 8478991 8511687 8416995
40752H416995j31544n7577L56459J124643J475627O66082o91729j189106n67571
$$ 8416995 8285451 8227874 8584333 9708976 11184603 11850685 11158956 9969850 9402279
40743I402279O0335Q7230J49645N86424O34618m4236m14189K55556R40467M14240
$$ 9402279 9462614 9549844 9699489 10285913 10920531 10876295 10462106 10717662 11658129 12072369
40733A2072369o88932q52661o4252L44214r5787m73262j60470L73184N78300N25047
$$ 12072369 11383437 10530776 10466524 10810738 10714951 10241689 10081219 10454403 11032703 11557750
40723A1557750L76364J27428N7956N54208J281343J357197N85365j97195k19975
$$ 11557750 11934114 12061542 12119498 12673706 13955049 15312246 15897611 15700416 15480441
40714A5480441L79402R57552J057211O17725M259j69830K85709P82285P59669
$$ 15480441 15859843 16817395 17874606 18492331 18496590 18326760 18612469 19394754 20154423
40705B0154423N35261O88389R92978Q59065N06203O18949J026003R10154L08579
$$ 20154423 20689684 21378073 22371051 23230116 23736319 24355268 25381271 26291425 26600004
40696B6600004J76542Q09513J383264J320659J009651Q82352Q69363J062298J796250
$$ 26600004 26776546 27586059 28969323 30289982 31299633 32181985 33051348 34113646 35909896
40687C5909896K725273K951018K453946K224813K581088K685973K293007K484939
$$ 35909896 38635169 41586187 44040133 46264946 48846034 51532007 53825014 56309953
40679E6309953L777492M904452M712396M082028M554202N961380O934312P125054
$$ 56309953 60087445 64991897 69704293 73786321 78340523 84301903 91236215 98361269
40671I8361269P392570Q122723Q812341R234699R762054J0476272J0992645J1237657
$$ 98361269 105753839 113876562 122688903 131923602 141685656 152161928 163154573 174392230
40663A74392230J1533206J1877457J1910554J1579062J1127911J0494020R388239
$$ 174392230 185925436 197802893 209713447 221292509 232420420 242914440 252302679
40656B52302679P906236O429203N023154L500277J874625J93095j777876m058316
$$ 252302679 260208915 266638118 271661272 275161549 277036174 277229269 275451393 271393077
40648B71393077o010850p127995p903528r104231j0525160j1381139j1624300
$$ 271393077 265382227 258254232 250350704 241246473 230721313 219340174 207715874
40641B07715874j1848438j2084767j1786473j0977973j0365922j0208833j0004195
$$ 207715874 195867436 183782669 171996196 161018223 150652301 140443468 130439273
40634A30439273r403611q588343p680436o638695n781713n533223n594423n261327
$$ 130439273 121035662 112447319 104766883 98128188 92346475 86813252 81218829 75957502
40626G5957502m604798m377255m667591m682462m062919l395984l121989k904980
$$ 75957502 71352704 66975449 62307858 57625396 53562477 50166493 47044504 44139524
40618D4139524k451494k061564j981846k006124k021777k162503k213066j763071
$$ 44139524 41688030 39626466 37644620 35638496 33616719 31454216 29241150 27478079
40610B7478079j142462j160813j663595j541148n84306l0951o07995j316418j067300
$$ 27478079 26335617 25174804 23511209 21970061 21385755 21354804 20746809 19430391 18363091
40601A8363091l51330j91712m67577n21498n71453j121362j573480r07955N13550
$$ 18363091 18011761 17820049 17352472 16830974 16259521 15138159 13564679 12656724 13170274
40592A3170274J180072M52595p70731j444423j416789r80418l19122L28662O22026
$$ 13170274 14350346 14802941 14032210 12587787 11170998 10190580 9871458 10200120 10822146
40583A0822146M82627J14551l41701p91072r74577p50543m21260l06877k08169
$$ 10822146 11304773 11419324 11077623 10286551 9311974 8561431 8140171 7833294 7625125
40574G625125J93739O37685N60688p8503p62134j044468q12016j84839M29020
$$ 7625125 7818864 8456549 9017237 8938734 8176600 7132132 6320116 6135277 6564297
40565F564297N27293J61336o5171n602k46111q38339p47735M76859J464072Q12125
$$ 6564297 7091590 7252926 7187755 7182153 6936042 6097703 5349968 5826827 7290899 8103024
40555H103024o50706j024541k28765J15542n12647q51428k00038M93393M68204
$$ 8103024 7452318 6427777 6199012 6314554 5801907 4950479 4750441 5243834 5712038
40546E712038L21129N48928N09237k06484p74119n64234k88243n87488p00432
$$ 5712038 6033167 6582095 7091332 6884848 6110729 5546495 5258252 4670764 3970332
40537C970332J37131J036393P45724j85660k06812O83199Q65649l82931j770010
$$ 3970332 4107463 5143856 5889580 5703920 5497108 6180307 7045956 6663025 4893015
40528D893015j770381m95816O89276P84228N931o45414m82503J38568L39782k6295
$$ 4893015 3122634 2626818 3316094 4100322 4106253 3460839 2978336 3116904 3456686 3430391
40518C430391k01267K11993O04299M49388J63363J70114J3284o46744j031104
$$ 3430391 3229124 3441117 4045416 4494804 4658167 4828281 4841565 4194821 3163717
40509C163717m48085K80660L8929n87866k25773Q01948Q32757l35983j015687
$$ 3163717 2715632 2996292 3035221 2447355 2221582 3023530 3856287 3520304 2504617
40500B504617l56361M16092J75474m59759n69770m11165l64343J02286J115988
$$ 2504617 2148256 2564348 2739822 2280063 1710293 1299128 934785 1037071 2153059
40491B153059J392941R7591j365675j131222L28215R75748L03425k27168K55689
$$ 2153059 3546000 3643591 2277916 1146694 1474909 2450657 2754082 2526914 2782603
40482B782603Q63923O64313L692m32604o30475p08026m19736J78569M76068L19746
$$ 2782603 3646526 4310839 4314531 3881927 3251452 2543426 2123690 2302259 2778327 3098073
40472C098073M13428J048291J305491L97174r06445j246430o32891k84440o42049
$$ 3098073 3511501 4559792 5865283 6262457 5356012 4109582 3476691 3192251 2550202
40463B550202p49680P2413R85543P97433k66255q68870m41378J64366Q5929l19391
$$ 2550202 1800522 1872935 2858478 3655911 3389656 2520786 2079408 2243774 2329703 2010312
40453B010312k20953L03021M79327J86836J11260M42795M07646m23858j201693
$$ 2010312 1789359 2092380 2571707 2758543 2869803 3312598 3720244 3296386 2094693
40444B094693r16540J23049P64359N75832R3990k15866l43434k18791K54794O39545
$$ 2094693 1178153 1301202 2065561 2641393 2735383 2519517 2176083 1957292 2212086 2851631
40434B851631L19623m83840q92716o67564m31048m54001k36634L78299P34255
$$ 2851631 3171254 2687414 1794698 1127134 696086 242085 5451 383750 1118005
40425A118005N25009M01116P15747O70369l41747j405167j260464k00811M52288
$$ 1118005 1643014 2044130 2759877 3430246 3088499 1683332 422868 222057 674345
40416F74345L60155L35356O77711P18958J82879k54223j57029l5598l51750p01523
$$ 674345 1034500 1369856 2047567 2766525 2949404 2695181 2538152 2502554 2150804 1449281
40406A449281n66228j63674M5604J13110K72322L61395J92465Q1483L57285O42977
$$ 1449281 883053 719379 764983 878093 1150415 1511810 1704275 1785758 2143043 2786020
40396B786020L11234m83296q87370m99151J28771L10210J18170J49943O00260
$$ 2786020 3097254 2613958 1726588 1227437 1356208 1666418 1784588 1934531 2534791
40387B534791R14109M79408m75479r46571k83315R11450J334087M50687q88245
$$ 2534791 3448900 3928308 3452829 2506258 2222943 3134393 4468480 4919167 4030922
40378D030922j411895p55767L18344Q13825M20401l48620p83603p13247n62189
$$ 4030922 2619027 1863260 2181604 2995429 3415830 3067210 2283607 1570360 1008171
40369A008171o68150q05535o22660k54956n5785M7294L17424M86306O8573n66787
$$ 1008171 340021 -465514 -1088174 -1343130 -1398915 -1351621 -1034197 -547891 -479318 -1046105
40359a046105l78159P59539J558883J021899j30431n28959o8134K07980j88836
$$ -1046105 -1424264 -664725 894158 1916057 1785626 1256667 1188533 1396513 1207677
40350A207677o04242l76372K71240O83338N65166J18506k59158l00309j11819
$$ 1207677 603435 227063 498303 1181641 1746807 1865313 1606155 1305846 1194027
40341A194027n3206k14277k63134m1439J09328O161R1116O32235R82948M83005
$$ 1194027 1140821 926544 663410 621971 731299 737460 828576 1460811 2443759 2926764
40331B926764l33682m67150q0055j69011p25456o63926J78073M84972m14105j235205
$$ 2926764 2593082 2125932 2045877 1876866 1151410 487484 665557 1150529 736424 -498781
40321d98781o09778P80249J207040L67614m69261m60807o1131J04041J17583K51905
$$ -498781 -1108559 -328310 878730 1246344 777083 316276 255145 359186 476769 728674
40311G28674L81475K85380N9201l4931J35088M62622N61023J2647r67314j372112
$$ 728674 1110149 1395529 1454730 1419799 1554887 2017509 2578532 2591179 1623865 251753
40301B51753m85736J007485J631355Q43163m26136r94052o13854J50059O57109
$$ 251753 -233983 773502 2404857 3248020 2821884 1827832 1213978 1364037 2021146
40292B021146N92978Q2711l95524n12505n18905p84566j011192n60798L76014
$$ 2021146 2614124 2696835 2301311 1788806 1269901 485335 -525857 -1086655 -710641
40283g10641P44708J08854n66029j94996Q98290J439519Q78508j14092p15387
$$ -710641 34067 142921 -423108 -618104 280186 1719705 2598213 2484121 1768734
40274A768734q17025p08391m79609q0148L30453M62113K93859J54089K96038N00133
$$ 1768734 951709 243318 -236291 -316439 14014 476127 769986 924075 1220113 1720246
40264A720246K94914l68420q76143o20635K11029Q28013P74823L21298j04071
$$ 1720246 2015160 1646740 770597 149962 360991 1189004 1963827 2285125 2181054
40255B181054m19443o39489n50183r960O55981R22549O26302K6153n45680q46748
$$ 2181054 1761611 1122122 571939 561979 1217960 2140509 2766811 2792964 2247284 1400536
40245A400536p05487j59537M39823P09324N93859L01672J5261j48090q2033J13227
$$ 1400536 695049 535512 975335 1684659 2278518 2580190 2595451 2447361 2365328 2478555
40235B478555M5185m91061j038738r15594j54701M22682K39967k99058l90501
$$ 2478555 2523740 2032679 993941 78347 -76354 346328 586295 287237 -103264
40226a03264J07163N62453M52253j5283k80253j61894N4397J47113K32755M23842
$$ -103264 3899 566352 1018605 1003322 723069 561175 615572 762685 995440 1419282
40216A419282N28289L38203k119k33345m06494o69114p81865m14716J02904L8196
$$ 1419282 1947571 2285774 2283655 2050310 1643816 974702 192837 -221879 -118975 -80779
40206h0779n48371o36172K65828J193326J019637R1972l71882j51742j52908p12633
$$ -80779 -629150 -1265322 -999494 193832 1213469 1305441 933559 781817 628909 -83724
40196h3724r90746m18776K95078K70218k17057k94018J49917M92092M51143L19356
$$ -83724 -1074470 -1493246 -1198168 -927950 -1145007 -1439025 -1289108 -797016 -345873 -26517
40186b6517K51126Q7150r0371O2920M63891N24735L9493l91798k05460K88633
$$ -26517 224609 311759 221388 284308 748199 1272934 1312427 920629 715169 1003802
40176A003802L93221O4010j03989J40767L18636o583n32182o69426m21060l29226
$$ 1003802 1397023 1461033 1357044 1497811 1816447 1809864 1277682 608256 187196 -142030
40166a42030n87037o86513j52702P25147J220475J031524M86331J8672j85227
$$ -142030 -729067 -1415580 -1568282 -843135 377340 1408864 1895195 1913867 1728640
40157A728640p2277L06379O15087M26065k05782o80323n91658k35043j12184k35665
$$ 1728640 1656363 1962742 2577829 3003894 2798112 2117789 1526131 1291088 1178904 943239
40147I43239k96875k73209l75950n06219l05506J96470M91175L22903N8020N9479
$$ 943239 646364 373155 -2795 -509014 -814520 -618050 -126875 196028 254048 313527
40137C13527J17771q9796l12528o8525M54274M71692k81263j045523r77851k23808
$$ 313527 431298 341502 28974 -39551 414723 886415 605152 -440371 -1418222 -1642030
40127a642030L58727L16399k0556j84985j11493N2271K50435M36665M96651M65746
$$ -1642030 -1283303 -966904 -987460 -1172445 -1283938 -1231667 -981232 -544567 -47916 417830
40117D17830N63293P93859P87995L28225k14412l40213j37065j03988l49874m53560
$$ 417830 981123 1774982 2562977 2891202 2676790 2336577 2199512 2095524 1745650 1292090
40107A292090j71081J81238K24883K6152j30519j97375l26782n36463o24756l67924
$$ 1292090 1121009 1302247 1527130 1553282 1422763 1225388 898606 362143 -262613 -630537
40097f30537K40892Q30310Q07926L424q59813q15658O6694N95691J5637q59970
$$ -630537 -389645 440665 1248591 1252015 392202 -423456 -356762 238929 254566 -605404
40087f05404o94693N02387J337710Q80435j90251n95047o9747N27946M78158K6475
$$ -605404 -1300097 -797710 540000 1420435 1230184 635137 565390 1093336 1571494 1597969
40077A597969j33029J71051M40875K50787k02744m71095n21029o46360p97058
$$ 1597969 1464940 1635991 2076866 2327653 2124909 1653814 1132785 486425 -310633
40068c10633n30170J88681O60476L53264k65086l56658P4934K72112m9558l00044
$$ -310633 -840803 -652122 8354 361618 96532 -260126 -185192 86920 37362 -262682
40058b62682k2396L72059K87410j24125k47626L2610K07648m8603m11475l91001
$$ -262682 -285078 86981 374391 250266 2640 35250 242898 194295 -217180 -608181
40048f08181K2810M31192N87256N99078N52256K43629m27511r84101p75822N9742
$$ -608181 -585371 -154179 433077 1032155 1584411 1828040 1400529 416428 -359394 -299652
40038b99652N73668K55081k23569n7985L76462J30783o51253p82656R9530Q47486
$$ -299652 274016 529097 305528 247543 624005 754788 103535 -679121 -579591 267895
40028B67895N19287k10407j92080M16105N64705L8831l89683l63121l30035m39265
$$ 267895 787182 576775 384695 800800 1365505 1404336 1014653 651532 321497 -117768
40018a17768j52483O65558J208121Q20240p6875o80636p87906n52577N0127Q06207
$$ -117768 -270251 395307 1603428 2423668 2346793 1666157 878251 325674 375801 1182008
40008A182008R23502J7509r79054q78902M9489N00855J36110o5959L82072O43878
$$ 1182008 2105510 2123019 1143965 265063 314552 815407 951517 885558 1267630 1911508
39998A911508J00916m98909l45541O499k94472o99523j15667R61655Q71214n56243
$$ 1911508 2012424 1513515 1167974 1174473 880001 180478 64811 1026466 1897680 1341437
39988A341437j443114n78927P79297Q32700j83482o63870j40837L51254J82744
$$ 1341437 -101677 -680604 98693 931393 747911 84041 -56796 294458 477202
39979D77202l6018K46008N62026K93428l12271n69812k90418J99336N82795O66715
$$ 477202 441184 687192 1249218 1542646 1230375 660563 370145 569481 1152276 1818991
39969A818991L04851l44530p23088m80800m0570j11488o61019q16648K0238J255857
$$ 1818991 2123842 1779312 1056224 575424 534854 423366 -237653 -1054301 -1034063 221794
39959B21794J640391P14086n72951q85820l610R90982R89940n044j089691j422400
$$ 221794 1862185 2576271 2003320 1117500 1113890 2104872 3094812 3089768 2000077 577677
39949E77677q17219K19877P68101K15457r12032j252049k23613J069525J187184
$$ 577677 -239542 -19665 748436 963893 51861 -1200188 -1423801 -354276 832908
39940H32908K28506m52702j55308N00184P47398N12783l5253p62724j124505m46659
$$ 832908 1061414 608712 453404 953588 1700986 2213769 2178516 1415792 291287 -155372
39930a55372R04340J561936R13146n0952k41012O0928J4907l22980l55936j49584
$$ -155372 748968 2310904 3224050 3173098 2932086 2993014 3007921 2684941 2329005 2179421
39920B179421k11520m45236l42693J2671P8871j63662k31472q957K13809M18109
$$ 2179421 1967901 1522665 1179972 1192643 1271514 1107852 876380 867423 1081232 1499341
39910A499341P36381Q14839K02843p02325j011779o09203j52068J23475N53913
$$ 1499341 2235722 3050561 3253404 2551079 1539300 930097 778029 901504 1455417
39901A455417R69476O45885l60149r33585m48550L52092N57781L13545K60744
$$ 1455417 2424893 3070778 2710629 1777044 1328494 1680586 2238367 2551912 2812656
39892B812656N10188P58937P78309L16123p37216j618091j074270P98660K062961
$$ 2812656 3322844 4081781 4860090 5176213 4438997 2820906 1746636 2545296 4608257
39883D608257J287765m14355r13646k823O37054J33223n01414k40298M03269L83568
$$ 4608257 5896022 5481667 4568021 4565198 5202252 5335475 4834061 4593763 4997032 5380600
39873E380600k58451o02072j90388N19313Q57267O27022J47221j36380q9939J6026
$$ 5380600 5122149 4520077 4329689 4849002 5706269 6333291 6480512 6344132 6254193 6270219
39863F270219p5018k19344j43824M9145L8755j34354j20195R3052R5077k46228
$$ 6270219 6195201 5975857 5832033 5881178 5919933 5785579 5665384 5758436 5853513 5607285
39853E607285m83001k34051K48283M41283J99076k21346n34743n63697k07036
$$ 5607285 5124284 4890233 5138516 5579799 5778875 5557529 5022786 4459089 4252053
39844D252053M19592Q86942P47161k7034r63715j443715j166754l97919K36844
$$ 4252053 4671645 5558587 6305748 6278714 5314999 3871284 2704530 2306611 2543455
39835B543455L25279M3435j44929p5325L1743p055j13085j47932q8816Q763J3615
$$ 2543455 2868734 2912169 2767240 2691915 2723658 2716603 2603518 2455586 2366770 2375533 2389148
39824B389148k34772o05321n61689J74427R66079R05752J41312k22432K07757
$$ 2389148 2154376 1549055 987366 1161793 2127872 3033624 3174936 2952504 3160261
39815C160261M23916m00241j420174j189645K00806J157771P32940k71590n87857
$$ 3160261 3584177 3183936 1763762 574117 774923 1932694 2665634 2394044 1806187
39806A806187k2733O96571R51585O14329j02690o71512n00198L42894R56148O47924
$$ 1806187 1783454 2480025 3431610 4045939 3943249 3271737 2771539 3114433 4070581 4718505
39796D718505j18531l78325n3765j720o46097j242538q35097M60448J520012J436974
$$ 4718505 4599974 4221649 4167884 4166164 3520067 2277529 1442432 1902880 3422892 4859866
39786D859866M50346l41497j29911P44247J186305O74405r1430j77519K56321
$$ 4859866 5310212 4968715 4838804 5583051 6769356 7443761 7352331 7174812 7431133
39777G431133K48856m28144q36795k55813P21979J006075M10182l62466p45750
$$ 7431133 7679989 7251845 6415050 6159237 6881216 7887291 8297473 7935007 7189257
39768G189257o60079j29232O81019J148139P15240j76435m05772L60630J190717
$$ 7189257 6529178 6399946 7080965 8229104 8944344 8767909 8362137 8722767 9913484
39759I913484J195338O66947M21345N54007N50167L44083M90911J221342J930815
$$ 9913484 11108822 11775769 12197114 12751121 13301288 13645371 14136282 15357624 17288439
39750A7288439J871074J015841J3218n10585m20940k5007K42621J57839j17680
$$ 17288439 19159513 20175354 20188572 19677987 19257047 19232040 19474661 19632500 19514820
39741A9514820k31454r0794j3287k74973o27649n78439j75806j10901p60220j473109
$$ 19514820 19283366 19192572 19179285 18904312 18276663 17698224 17522418 17411517 16651297 15178188
39731A5178188j318589l87844K64608K6123n82404q43516p85690p36024n66502
$$ 15178188 13859599 13471755 13736363 13762486 13180082 12336566 11550876 10814852 10248350
39722A0248350q2117K90089J7584n86887p62253m97693m50167o99522n65101J39547
$$ 10248350 10166233 10456322 10473906 9887019 9124766 8627073 8176906 7477384 6912283 7051830
39712G051830O20664K91555l51393n53451l38113j63391j04843J7245J20934M7540
$$ 7051830 7672494 7964049 7612656 7059205 6721092 6557701 6452858 6470103 6591037 6638577
39702F638577n3406o764K0234j50435l35572l42730l27335l98267k72899K28981
$$ 6638577 6585171 6578407 6598641 6448206 6112634 5769904 5442569 5044302 4771403 5000384
39692E000384P42867Q53036O12905J75949n08753j109425p54275O95897J859321
$$ 5000384 5743251 6596287 7209192 7385141 6876388 5766963 5012688 5708585 7567906
39683G567906J414231L7927m69394K30527O99129R1674o11038l07660N15383O95813
$$ 7567906 8982137 9020064 8550670 8781197 9480326 9572000 8960962 8653302 9168685 9864498
39673I864498J93199o9796K29087M01114r2912q30620j050336o63608k88938l79875
$$ 9864498 10057697 9987901 10216988 10618102 10525190 9694570 8644234 7980626 7691688 7311813
39663G311813o47367n34449p8153J08854k28565n56896l47289J42460L29277J77325
$$ 7311813 6664446 6129997 6051844 6160698 5932133 5375237 5027948 5170408 5499685 5677010
39653E677010N6161K7167r3669j78009K3498K63684P3086m14586o06926l86303
$$ 5677010 5733171 5760338 5666669 5488660 5512158 5775842 5848928 5434342 4827416 4441113
39643D441113j89927j76800p5668R7345k6187l84259m35997j02640J8231l50254
$$ 4441113 4251186 4074386 3998718 4096063 4069876 3685617 3249620 3146980 3165211 2814957
39633B814957o89511n27965q6102K35747L69612K81113j79368p92121r63411n35448
$$ 2814957 2125446 1597481 1511379 1747126 2116738 2397851 2218483 1426362 462951 -72497
39623g2497j1495K69077M94888O85196M50739j76342n02689k27888O1367o4771
$$ -72497 -83992 185085 679973 1365169 1815908 1639566 1136877 908989 970356 905585
39613I05585j93909k294K8832m31301p32515k46702N14419P10062M74100M48176
$$ 905585 711676 709382 738214 306913 -425602 -672304 -157885 552177 1026277 1474453
39603A474453N61683K92138k72797o11223o65130o59536l96852L24032R32111
$$ 1474453 2036136 2328274 2055477 1444254 779124 119588 -277264 46768 978879
39594I78879P25554L0328k48117J1917K03541J61806K33313L41728O3108m14160
$$ 978879 1704433 1734761 1486644 1498561 1702102 1863908 2097221 2438949 2502057 2087897
39584B087897m37108j1140J87906n5816k78283k45121j68143m1686L11284N93495
$$ 2087897 1650789 1639649 1827555 1771739 1493456 1248335 1080192 1038506 1349790 1943285
39574A943285L91105M6427J19191J88149n12187j411290j140408J54748P83981
$$ 1943285 2334390 2380817 2500008 2688157 2175970 764680 -375728 -220980 563001
39565E63001J92195j61891O41010J378896Q22357j57129j43201M51362K88261
$$ 563001 755196 593305 1234315 2613211 3435568 3278439 3135238 3586600 3874861
39556C874861n54640r34555p09658o52772o68565O2928J201750J308652J20401
$$ 3874861 3320221 2385666 1676008 1023236 354671 417599 1619349 2928001 3048402
39547C048402q34420m80035L18557K94830l33880n20379j45248n643l57642m75569
$$ 3048402 2213982 1733947 2052504 2347334 2013454 1493075 1347827 1342184 984542 508973
39537E08973J98028J112693J192544J75812r54424j065542k67929K31456j84217
$$ 508973 707001 1819694 3012238 3188050 2233626 1168084 900155 1131611 947394
39528I47394o17185l648J133942J283904J60780q13335n25810L76227O49385K06179
$$ 947394 330209 326561 1460503 2744407 2905187 2091852 1566042 1942269 2591654 2797833
39518B797833j28110k6722J08777N4968K2326O8501J5680k2457K74981P43988
$$ 2797833 2669723 2643001 2751778 2806746 2829072 2897573 2913253 2890796 3165777 3909765
39508C909765Q06193L95559J41560L48259M51589n4827p17651p53642k04065J98792
$$ 3909765 4715958 5111517 5253077 5601336 6052925 5998098 5280447 4526805 4322740 4521532
39498D521532J23018m2951Q9854M35547P06625O98418L07999k64798l88421L41756
$$ 4521532 4644550 4601599 4691453 5127000 5833625 6532043 6840042 6575244 6186823 6528579
39488F528579J287595J285599J60562r53301j104866o59580m83263o31332n14552
$$ 6528579 7816174 9101773 9262335 8309034 7204168 6544588 6061325 5429993 4915441
39479D915441N5395O80696R94204Q79953L25751l73218n43902P0533O75797L23147
$$ 4915441 4970836 5651532 6645736 7525689 7851440 7478222 6934320 7004853 7680650 8003797
39469H003797p06256j219377p81910k05404k16270m97217m36188j25841q0788
$$ 8003797 7297541 6078164 5296254 5090850 4874580 4377363 3941175 3815334 3734546
39460C734546l98525p02716o82817l37609J33488M40176L92872J64008J55050
$$ 3734546 3336021 2633305 1950488 1612879 1746367 2186543 2579415 2743423 2898473
39451B898473M55910O47179K88189n49745j311584j407122p05456K22426N08745
$$ 2898473 3354383 4001562 4289751 3740006 2428422 1021300 315844 538270 1047015
39442A047015n8048o65261m59933L10441O88024L68112k0870K5232K90584M14994
$$ 1047015 988967 323706 -136227 174214 862238 1230350 1209480 1234712 1525296 1940290
39432A940290L52446O4986n39345j086461q30925L22954J408213J399167K84797
$$ 1940290 2292736 2357722 1818377 731916 -99009 223945 1632158 3031325 3316122
39423C316122j062300j699356j213177k9946P72116N05476k41938l99436J0866
$$ 3316122 2253822 554466 -658711 -688657 83459 588935 346997 -52439 -41573
39414d1573M0770m46184m76909K43710O23728O94o18151j79993O58913O98080
$$ -41573 -803 -446987 -923896 -680186 -56458 -55764 -673915 -853908 -194995 503085
39404E03085K39684M62549J260468J287020R3599j163498j373313p55959k09107
$$ 503085 742769 1205318 2465786 3752806 3846405 2682907 1309594 553635 344528
39395C44528j90918n30875p47796l83595N04976J170566R63475K20558j53595
$$ 344528 153610 -377265 -1125061 -1508656 -1003680 166886 1130361 1350919 1197324
39386A197324R4360L29795M203o35055q91475m04088M04226O22523j05620q75167
$$ 1197324 1291684 1621479 1625682 990627 99152 -304936 99290 721813 616193 -258974
39376b58974n26201N80732Q41132j73320q83669j34774Q99403N88731n42365q21788
$$ -258974 -785175 -204443 636689 463369 -420300 -555074 344329 933060 390695 -431093
39366d31093k06075m6806n25580m34948M97466J097124Q39785N85933P63563N90114
$$ -431093 -637168 -683974 -1209554 -1644502 -1147036 -49912 789873 1375806 2139369 2729483
39356B729483k65164q82341o97196m10509n23886m32942J55343L50329l33032
$$ 2729483 2464319 1581978 884782 474273 -49613 -482555 -327212 23117 -309915
39347c09915q44876k59342N90804M39422l98832o83274j94150K80607L68410L01648
$$ -309915 -1154791 -1414133 -823329 -383907 -782739 -1466013 -1660163 -1379556 -1011146 -709498
39337g09498Q8473l78020o69068k76008M99274R26091Q38031N27090O0982n02405
$$ -709498 -621025 -999045 -1668113 -1944121 -1444847 -518756 319275 846365 907347 404942
39327D04942o50648n7259O31819N22858k39959p05099m41596Q0314K80505M0824
$$ 404942 -245706 -302965 328854 851712 611753 -93346 -534942 -454628 -174123 -133299
39317a33299l47013l73702K32729R20269P60248j32534m58606L84042J254164
$$ -133299 -480312 -854014 -621285 298984 1059232 926698 468092 852134 2106298
39308B106298R94475J97123M2564L04365K2793n59614m94682j17816o13073j672647
$$ 2106298 3100773 3297896 3340460 3644825 3667618 3108004 2613322 2495506 1882433 209786
39298B09786j587477k0181J196657P43926l45499m88970J77539M87342J82270
$$ 209786 -1377691 -1397872 -201215 542711 197212 -291758 -114219 373123 555393
39289E55393o1208O3677K39680K43964J08901j72611m94957n01057j09384J89308
$$ 555393 494185 557862 797542 1041506 1150407 977796 482839 -18218 -127602 61706
39279F1706N6449r5842K15826O77632O29385Q6580l36270l37268j52322J4725
$$ 61706 118155 22313 238139 915771 1545156 1631736 1295466 958198 805876 820601
39269H20601J89486K61083l2872o26553j026873q56207k47265L96483Q02554Q86711
$$ 820601 1010087 1271170 1238298 611745 -415128 -1271335 -1518600 -1122117 -319563 567148
39259E67148O37930J66434k19258k35719o146j1022m50505q25646n30103K02091
$$ 567148 1205078 1371512 1152254 916535 910389 899367 448862 -376784 -906887 -704796
39249g04796M80972L4606l41130j1789M69220K81909k38775j22040N29763N53430
$$ -704796 -223824 -189218 -530348 -542137 -72917 208992 -29783 -151823 377940 931370
39239I31370l67572r80639k54033J023077J294262L41868n87058n54853L0945
$$ 931370 563798 -416841 -670874 352203 1646465 1988333 1401275 846422 877367
39230H77367K56624j00350n34888n92611l18046l7340L2653r0575k74143l94680
$$ 877367 1133991 1033641 498753 -93858 -411904 -449244 -416591 -507166 -781309 -1175989
39220a175989l69571j73261J29316M04194N07544L14109j71348n85368l20486
$$ -1175989 -1545560 -1718821 -1589505 -1185311 -677767 -363658 -535006 -1120374 -1440860
39211a440860P19803J606460J238936j90517j244760j005656j01093M11367M12617
$$ -1440860 -721057 885403 2124339 1933822 689062 -316594 -417687 -6320 406297
39202D06297L43565K00275j95636m69318k41232j5550m59471j076167p61907M07906
$$ 406297 749862 950137 754501 285183 43951 28401 -431070 -1507237 -2269144 -1861238
39192a861238J150025Q43646K93766L50117P73511Q54102L44043n28280j263597
$$ -1861238 -711213 132433 426199 776316 1549827 2403929 2747972 2219692 956095
39183I56095j190843j67079P94645N71836l76218n50589K65567O93360J25045
$$ 956095 -234748 -401827 392818 964654 588436 37847 303414 996774 1121819
39174A121819k57720L61905Q86700J66888r39338r16805k0512L20340j11243k34425
$$ 1121819 864099 1226004 2112704 2279592 1340254 423449 402937 723277 612034 377609
39164C77609L12317O85343L89542r0898l89651p43417j095907q32181J41784R20603
$$ 377609 689926 1375269 1764811 1673913 1284262 540845 -555062 -1387243 -1245459 -324856
39154c24856P08578j66034p38496n04768K23538P47090O22658J03091j05914K51720
$$ -324856 383722 217688 -520808 -1025576 -802038 -54948 567710 670801 564887 816607
39144H16607N62236J86226n81934r09717n26095J28534O07402P16253L19094m28728
$$ 816607 1378843 1565069 983135 73418 -452677 -324143 283259 999512 1318606 889878
39134H89878q38052l99779L70025N10019n2458m88615l43587l0984K9341K971
$$ 889878 51826 -347953 22072 532091 479633 -8982 -352569 -383553 -354212 -351241
39124c51241J42229L11184K90744J42309O4443J53805L46745L93176N1215m49711
$$ -351241 -209012 102172 392916 535225 599668 753473 1100218 1493394 1544609 1094898
39114A094898m94989J441K82672q6812l63544J96313Q76548M20647r02381j512135
$$ 1094898 599909 601350 884022 797210 433666 629979 1506527 1927174 1024793 -487342
39104d87342p99883J39928K94949j7627j22206n4657n4326Q2998M88044P51037
$$ -487342 -1287225 -1147297 -852348 -869975 -992181 -1046838 -1101164 -1018166 -530122 220915
39094B20915N27453M8851l48695o15670o40920k14915L69622M26597r1105m13362
$$ 220915 748368 797219 448524 -167146 -808066 -1022981 -653359 -226762 -317867 -731229
39084g31229j16811L09771L66206J77634p1464m31967n98540m8473Q23966Q41921
$$ -731229 -848040 -538269 -172063 5571 -65893 -497860 -1096400 -1144873 -320907 521014
39074E21014j50138q21055l74574K51381J13782j38241L68645R70088O01077k28736
$$ 521014 370876 -450179 -824753 -573372 -459590 -597831 -229186 740902 1341979 1113243
39064A113243k62423L49818M29509j13682k66068J65840K89768j69773m57273
$$ 1113243 850820 1200638 1630147 1516465 1250397 1416237 1706005 1536232 1078959
39055A078959k53182j16788k07236O3695P39695R61939L55465l62008n92784o03307
$$ 1078959 825777 708989 501753 565448 1305143 2267082 2622547 2260539 1667755 1064448
39045A064448o44287m32437R149R0936k07442l2391Q52202J344835O11133n45821
$$ 1064448 420161 -12276 -3127 87809 -119633 -152024 700178 2045013 2656146 2110325
39035B110325q78497m65781k53450m38413m12118L3637M54949N55584M28599J41692
$$ 2110325 1231828 766047 512597 74184 -337934 -304297 150652 706236 1134835 1276527
39025A276527k09202k07229L98013J027783Q31808q4130o48987j74757P82806
$$ 1276527 1067325 860096 1258109 2285892 3117700 3033570 2384583 2209826 2992632
39016B992632J080120K05964j227154k026484j509116k06741O64165N51380Q0790
$$ 2992632 4072752 4278716 3051562 1025078 -484038 -690779 -26614 524766 605556
39007F05556N0034L78979M61042J36482k27446l44744j78706K40549O52947N20899
$$ 605556 655590 1034569 1495611 1632093 1404647 1059903 881197 1121746 1774693 2295592
38997B295592k52328q47479n07396K23537J26022q47699j341040n13010O95783
$$ 2295592 2043264 1195785 688389 911926 1037948 190249 -1150791 -1663801 -968018
38988i68018Q27079j53282r17975n58486L73077P04614R4696o35452n23688M11928
$$ -968018 -140939 -294221 -1212196 -1770682 -1397605 -692991 -598295 -1233747 -1757435 -1345507
38978a345507J224376J135808L19619m87779q18405o66278j93344L07325L68090
$$ -1345507 -121131 1014677 1334296 846517 28112 -638166 -831510 -524185 -156095
38969a56095j92953q31418q12864j82186L18405L10708J68450K33313K89870J19173
$$ -156095 -349048 -1180466 -1993330 -2175516 -1857111 -1546403 -1377953 -1144640 -854770 -735597
38959g35597n214J77701L48426N7364n21444p78738m85113j0505K11740J20305
$$ -735597 -740811 -563110 -214684 -157320 -678764 -1457502 -1942615 -1953120 -1741380 -1621075
38949a621075l6226M3993M62117R29103R39677L41994l86657o56133m39162j87757
$$ -1621075 -1657301 -1613308 -1151191 -222088 717589 1059583 672926 16793 -422369 -610126
38939f10126j75811k18603n2686K50019L48751L4969m69877o37381j57557O37891
$$ -610126 -785937 -1004540 -1057226 -807207 -458456 -423487 -893364 -1530745 -1688302 -1050411
38929a050411J038976P15520N2934l36437k42959Q4542K86655J70527j49484k76186
$$ -1050411 -11435 704085 757019 420582 177623 262165 548820 719347 569863 293677
38919B93677O7610N69124N84972J5272m77423l65002N2434J95572L0077j12142
$$ 293677 361287 930411 1515383 1530655 1053232 688230 740664 936236 966313 854171
38909H54171j53419j66317J1572M16569N00249j90779j032185r06572J67885Q85264
$$ 854171 700752 534435 546007 962576 1462825 1272046 239861 -666711 -498826 386438
38899C86438M04909n55483q34974l52260J05101J42770R6572K62403M06225J68755
$$ 386438 791347 235864 -599110 -951370 -846269 -703499 -606927 -344524 61701 230456
38889B30456l56056o30853k62819M52912P53975L44156j44989j2429M49491L93800
$$ 230456 -125600 -756453 -1019272 -566360 187615 531771 386782 374353 823844 1217644
38879A217644k10575n01772j29071K07002j4581k98263j31728M2460l03532o48755
$$ 1217644 1007069 505297 376226 583228 568647 270384 138656 181116 -122416 -771171
38869g71171j87142P35732J033743M91046r0186k52131l34630n02530l60538J75807
$$ -771171 -958313 -222581 811162 1302208 1212022 959891 625261 122731 -237807 -62000
38859f2000N09054K55022j89152l53338l63757n18544p12187o66610l41875J51519
$$ -62000 447054 702076 512924 159586 -204171 -722715 -1434902 -2101512 -2443387 -2291868
38849b291868O58109Q29554L76420l24798m34685K47040R15178Q21588J85770
$$ -2291868 -1633759 -804205 -427785 -752583 -1187268 -940228 -25050 796538 982308
38840I82308l09538m09684k63980m827J91026N7007l01346l32920J29040M54523
$$ 982308 672770 263086 -894 -5721 185305 242312 -59034 -391954 -262914 191609
38830A91609J59767k52599p2922M33604M35484j37717n21379k95404J34704K84290
$$ 191609 351376 98777 25855 459459 894943 757226 235847 -59557 75147 359437
38820C59437J54741m9361k15405k31435n0175J18866Q6614P5848L54647O08146
$$ 359437 514178 464817 249412 17977 -32198 86668 173282 249130 603777 1211923
38810A211923L04078l61927o00052j89511K17887J64022L6167K82683N91516L58595
$$ 1211923 1516001 1154074 554022 364511 582398 746420 782587 1065270 1656786 2015381
38800B015381m07904j101636j198553o29815K54873Q47563P13948J29180j13573
$$ 2015381 1607477 505841 -692712 -1322527 -1067654 -220091 493857 623037 509464
38791E09464L26004Q83566Q74851L69261p3633k13988k38309k66160k07011n2130
$$ 509464 835468 1719034 2593885 2963146 2889513 2675525 2437216 2171056 1964045 1911915
38781A911915M6097K225j10684j94236k34354l16136n25476o95532l73038N77394
$$ 1911915 1958012 1960237 1849553 1655317 1420963 1104827 579351 -116181 -489219 88175
38771H8175J404507J128694p5748q60850m47378L22929K83110l73363n76889r2879
$$ 88175 1492682 2621376 2545628 1684778 1237400 1560329 1843439 1470076 893187 800308
38761H00308L00774J79956m6795r9382k51629n27388m06274K23710O24259K71548
$$ 800308 1101082 1281038 1234243 1134861 883232 355844 -50430 173280 797539 1069087
38751A069087l08609l75197m0148J90125L94962Q82948J210348N95302o83582
$$ 1069087 760478 385281 345133 535258 930220 1813168 3023516 3618818 2935236
38742B935236j287410n39086O17883Q59484J19772n89767o46570m28490m85740
$$ 2935236 1647826 1108740 1726623 2586107 2705879 2116112 1469542 1041052 555312
38733E55312o90334n06237J49081O69833M75617k05518n11038Q626P37467O92976
$$ 555312 -135022 -641259 -492178 177655 653272 447754 -63284 -54658 682809 1375785
38723A375785j96615r43039p72463j13796Q1947k86636l78913L02594J139931
$$ 1375785 1179170 236131 -536332 -650128 -568181 -854817 -1233730 -931136 208795
38714B08795J230458N82242K875m3343N0951k36744p46075q67652l94757K24043
$$ 208795 1439253 2021495 2024370 1981027 2031978 1795234 1049159 181507 -213250 10793
38704A0793M93172M10695K46869M7026l15736o81250o13384l4109M74808L18574
$$ 10793 503965 914660 1161529 1208555 892819 211569 -401815 -435924 38884 357458
38694C57458l19929o64950k68148N49392J130763J046029K76948p37621j209086
$$ 357458 37529 -627421 -895569 -346177 784586 1830615 2107563 1369942 160856
38685A60856o64842L02598M75766m53914j292276p98877O67781J621064J307183
$$ 160856 -503986 -201388 274378 -179536 -1471812 -2270689 -1602908 18156 1325339
38676A325339L54162l35288n24585l64483L1016L87630K76911k58156n57451k19620
$$ 1325339 1679501 1344213 819628 455145 486161 873791 1150702 892546 335095 115475
38666A15475L03028L81243O2451j91787k26408j51100P1533M39467N99963L12535
$$ 115475 418503 799746 862197 670410 444002 292902 364435 803902 1403865 1716400
38656A716400k3100O6430K64695p4043p33078q04106j44797K83057r4521n16762
$$ 1716400 1693300 1759730 2024425 1950382 1217304 413198 268401 551458 456937 -59825
38646e9825r2827P32232Q14514P0209l80902J22041Q38468P12439k05370r52309
$$ -59825 -152652 579580 1394094 1464303 1083401 1205442 2043910 2756349 2550979 1598670
38636A598670r40613m71853n3429K15538L99828L56824J5268k53969m7508L80997
$$ 1598670 658057 186204 132775 348313 748141 1104965 1120233 866264 818756 1199753
38626A199753L68967j70674n74179m24218j19465o6464Q3786P31893J333572J006438
$$ 1199753 1568720 1398046 823867 399649 280184 213720 297506 1029399 2362971 3369409
38616C369409m4114o63216l88288o706j67487l53246J52520R73398J121041M10396
$$ 3369409 3325295 2662079 2273791 2267085 2099598 1746352 1898872 2872270 3993311 4403707
38606D403707l60439n09580j24596L38743N63694M37410N4978k50259k02462L9602
$$ 4403707 4043268 3533688 3409092 3747835 4311529 4748939 4803917 4553658 4351196 4390798
38596D390798P7953j38660k25149P5407N07401O32807M04563K50842N55954J106365
$$ 4390798 4468751 4330091 4104942 4180349 4687750 5320557 5725120 5975962 6531916 7638281
38586G638281J211369N35210l42749n51543n3685L49450K10345J2642K73905P30796
$$ 7638281 8849650 9384860 9042111 8490568 8436883 8786333 8996678 9009320 9283225 10014021
38576A0014021R37632J078772J460317J671971J164792L89013L49044J072876
$$ 10014021 10951653 12030425 13490742 15162713 16327505 16716518 17065562 18138438
38568A8138438J543075J291010J029067J329499J667287J433786J111607J569242
$$ 18138438 19681513 20972523 22001590 23331089 24998376 26432162 27543769 29113011
38560B9113011K636491L264081K958442K318693K117512K434020K837026L005971
$$ 29113011 31749502 35013583 37972025 40290718 42408230 44842250 47679276 50685247
38552E0685247K964750K902571K888255K697872J975274O90068o40901j374943
$$ 50685247 53649997 56552568 59440823 62138695 64113969 64804037 64163136 62788193
38544F2788193j394281j218383j438060k085549k615912k576283k250713k385173
$$ 62788193 61393912 60175529 58737469 56651920 54036008 51459725 49209012 46823839
38536D6823839l145401l709589l285491k234965j606082j716052j907243j694849
$$ 46823839 43678438 39968849 36683358 34448393 32842311 31126259 29219016 27524167
38528B7524167j367300j278991j322801j394600j632570j845326j493708o95836
$$ 27524167 26156867 24877876 23555075 22160475 20527905 18682579 17188871 16493035
38520A6493035m01828r43124j282758n72444L61023K15426p28383j085174n56151
$$ 16493035 16091207 15148083 13865325 13292881 13653904 13869330 13140947 12055773 11499622
38511A1499622j94037n00848p12801l08876P2434j89426o68895p51850o64500
$$ 11499622 11305585 10804737 10091936 9783060 9855494 9666068 8997173 8245323 7580823
38502G580823q62903j055361o77448P2209M74851L68632K81510N19856O97459
$$ 7580823 6717920 5662559 4985111 5057320 5532171 5900803 6182313 6702169 7399628
38493G399628L21234m68058r31850n02538N03721J078352O03778m05856r53279
$$ 7399628 7720862 7252804 6320954 5818416 6322137 7400489 8004267 7598411 6645132
38484F645132p68324l96208k25846j12518j4114k41460p79654j008952n23765
$$ 6645132 5876808 5480600 5254754 5142236 5128122 4886662 4107008 3098056 2574291
38475B574291K40970N84511L56883j02053m50829n01169k69677r6112l02719o00400
$$ 2574291 2815261 3399772 3756655 3654602 3203773 2702604 2432927 2336815 2034096 1433696
38465A433696l78017K70216N11140M3761l78552j43345K79911J95851k23833m09781
$$ 1433696 1055679 1325895 1837035 1880796 1502244 1358899 1638810 1834661 1610828 1201047
38455A201047l50328l21936j90496K31355N69539M07339M0122m326K09137L72549
$$ 1201047 850719 528783 338287 569642 1139181 1546520 1586642 1582316 1791453 2164002
38445B164002N99618R49028Q53767j537p56729m64269L11868K49178o50883j110808
$$ 2164002 2763620 3712648 4566415 4564878 3808149 3343880 3655748 3904926 3254043 2143235
38435B143235o44672j49103k40916l83154r3198K00774P9582j13510l4620J7678
$$ 2143235 1498563 1349460 1108544 725390 632192 832966 912548 799038 764418 782096
38425G82096k00978l15214k7598K92965K41895k007j29822j83041j91228N7230
$$ 782096 581118 265904 238306 531271 773166 771159 641337 458296 267068 324298
38415C24298M95602O31379K85524r8352j79467j34657j08951L3926J71313o2646
$$ 324298 819900 1451279 1736803 1638451 1458984 1324327 1215376 1249302 1420615 1357969
38405A357969m56371l17796K99481M91306L0745j54935L72686O83386J02595m90530
$$ 1357969 901598 583802 883283 1374589 1405334 1250399 1623085 2306471 2409066 1918536
38395A918536j30359N05666J82241q42263j246360o24428K55285P70663Q24824
$$ 1918536 1788177 2293843 2476084 1633821 387461 -236967 18318 788981 1613805
38386A613805L11470n87897r59143k53912N44317J88478p51999o22607O45860
$$ 1613805 1925275 1337378 378235 124323 668640 857118 105119 -517488 128372
38377A28372J282640L33785r92463j174999k77990O52449J039565R26386M58658
$$ 128372 1411012 1744797 752334 -422665 -700655 -48206 991359 1917745 2376403
38368B376403j34546n26467o24317n26021j40811N41853R29482M37319m30961
$$ 2376403 2241857 1715390 1091073 565052 424241 966094 1895576 2332895 1901934
38359A901934o02426m9236K06207k09600n19215k30065J60963K68366L97077N59608
$$ 1901934 1299508 1250272 1456479 1246879 727664 497599 658562 926928 1324005 1883613
38349A883613J60698p46839j115771n13412J07181J4567j27515L83721R25974
$$ 1883613 2044311 1297472 181701 -331711 -224530 -209963 -337478 46243 972217
38340I72217O50761n1926l45458l28923m76374n26246j20455K32529M7985o6805
$$ 972217 1622978 1571052 1225594 896671 420297 -105949 -226404 6125 54110 -12695
38330a2695M89196R63816M41979m02085l74898J03247k19661j024195q50954K83952
$$ -12695 476501 1440317 1882296 1480211 1105313 1208560 988899 -35296 -886250 -602298
38320f02298Q54745M82560M23335J012685Q63079n66428j667732j119373J31075
$$ -602298 252447 735007 1158342 2171027 3034106 2467678 799946 -319427 -188352
38311a88352O18600N34112P10545Q27742K61756l73924k24451J45073k12630o92151
$$ -188352 430248 964360 1674905 2502647 2764403 2390479 2166028 2311101 2098471 1406320
38301A406320j12541Q98991N78876r97386j705620n60314P82285N52794o43335
$$ 1406320 1293779 2192770 2771646 1774260 68640 -491674 290611 843405 200070
38292B00070j011966j75184O53975N35957k46884q91639r05403k94619M99800
$$ 200070 -811896 -987080 -333105 202852 -44032 -935671 -1841074 -2135693 -1635893
38283a635893Q65314N80344P2842q3822K19850O65016Q84642O45928k1897o76392
$$ -1635893 -770579 -190235 -117393 -201215 18635 683651 1568293 2214221 2192324 1515932
38273A515932p84804m24592k66442n80139p37393j71214O05217O19723j27274
$$ 1515932 731128 306536 40094 -540045 -1277438 -1448652 -843435 -223712 -350986
38264c50986o01821j70990N68276O80125J24821l24152j68052K59411L64213R0891
$$ -350986 -952807 -1123797 -555521 124604 249425 -74727 -242779 16632 380845 471736
38254D71736j11308k2774J1753l14636o36411l50786M00635P70645L67028k20288
$$ 471736 360428 337654 349407 34771 -601640 -952426 -551791 218854 585882 365594
38244C65594l59719k32160k36962j50871L29463O58792R9772q50973q55053K68208
$$ 365594 5875 -226285 -463247 -614118 -284655 374137 473909 -377064 -1232117 -963909
38234i63909J081200N67634m03055m41605L55169P82633M03063n9734k7062K50445
$$ -963909 117291 684925 281870 -159735 195434 978067 1381130 1321396 1294334 1544779
38224A544779L73006K97687J8521n02041q95412o05970J90813N83926J92187k29560
$$ 1544779 1917785 2215472 2233993 1731952 836540 230570 421383 1005309 1197496 967936
38214I67936O8674O69696O05408k45517j046189j109503n30421K01828O81070
$$ 967936 1036610 1706306 2311714 2066197 1020008 -89495 -619916 -418088 262982
38205B62982O68074J83032l69451m98982j52781K71732M20103K50326j08809m40746
$$ 262982 931056 1114088 744637 245655 92874 364606 784709 1035035 926226 485480
38195D85480m27985N8056O15079O33935N8435n27721o75587n46246m44563l04059
$$ 485480 57495 115551 730630 1364565 1423000 895279 219692 -326554 -771117 -1075176
38185a075176L4587L64338L59943J06234l4307J2413n867j74930k73872j61450
$$ -1075176 -1040589 -676251 -316308 -210074 -244381 -231968 -237835 -412765 -686637 -848087
38175h48087N5642L01206O09265Q17038N73979j14950o90706o80880k82305m228
$$ -848087 -792445 -491239 118026 935064 1509043 1394093 703387 22507 -259798 -264026
38165b64026J5198k9469r9491k85513m12727j96701K01771K92662J6049j30996
$$ -264026 -248828 -278297 -377788 -663301 -1076028 -1272729 -1070958 -778296 -762247 -893243
38155h93243R7306K87199P4686k19720j17069K16990K31065j38331l78653j49305
$$ -893243 -795937 -508738 -434052 -653772 -770841 -553851 -322786 -461117 -839770 -989075
38145i89075L17860O01169N43667K85303Q0942Q7401J64239j1185m56530p25399
$$ -989075 -671215 -70046 473621 758924 839866 927267 1091506 1080321 623791 -101608
38135a01608n00643q4418P8616Q7153K81936N07106L38113q3337k07156o9220
$$ -101608 -602251 -686669 -608053 -520900 -238964 268142 606255 522918 315762 246542
38125B46542k76112q20701q36710J8724Q02589O07156n3758o5241N68804Q53316
$$ 246542 -29570 -850271 -1686981 -1668257 -865668 -258512 -312270 -377511 191293 1044609
38115A044609M32143m978l7215j56470o65722q73348j53475Q22927Q79857Q8381
$$ 1044609 1476752 1471774 1434559 1278089 612367 -260981 -414456 408471 1288328 1376709
38105A376709l01366K37958P14119K15868n87957m68704L80161N61967l77874
$$ 1376709 1075343 1313301 2027420 2243288 1655331 1186627 1566788 2128755 1750881
38096A750881j229445r29878n3425K17008j87861m17810r4754M12826P81970R19162
$$ 1750881 521436 -408442 -461867 -244859 -432720 -850530 -945284 -532458 249512 1168674
38086A168674N91585k46347r44820q72678m63131n62980r02720m20674Q41603
$$ 1168674 1760259 1513912 569092 -303586 -766717 -1329697 -2232417 -2653091 -1811488
38077a811488J506665Q90550p126j35951J57431J11142n8831K37915P03735N48007
$$ -1811488 -304823 585727 578601 442650 600081 711223 652392 890307 1594042 2142049
38067B142049k55092r53320r99060m55535K45667N07180j1049p81964q19302n4793
$$ 2142049 1886957 933637 -65423 -520958 -275291 231889 220840 -561124 -1380426 -1435219
38057a435219M65046J52746l40383m49953n90089r04723m80376R62937J874096
$$ -1435219 -970173 -817427 -1157810 -1607763 -2197852 -3102575 -3582951 -2620014 -745918
38048g45918R69790n17424n24865P27468J324141P57863K38941J87000k52390
$$ -745918 223872 -293552 -818417 -90949 1233192 1991055 2229996 2416996 2164606
38039B164606j071690j068803q6357N48816M05906O54714J609544J717885J66970
$$ 2164606 1092916 24113 -62244 486572 892478 1547192 3156736 4874621 5041591
38030E041591j456508j551455q50708p95655j075832o11657K05896K32522k66241
$$ 5041591 3585083 2033628 1182920 387265 -688567 -1300224 -1094328 -861806 -1128047
38021a128047j11629N96048O38395j52449o15193k17159K56953K33194K01027
$$ -1128047 -1239676 -643628 -5233 -157682 -772875 -990034 -733081 -499887 -298860
38012b98860N80777Q41420L64142n26636r64011n95801J33454N74177N48245M42084
$$ -298860 281917 1123337 1487479 960843 -3168 -598969 -465515 108662 656907 1098991
38002A098991N79100O20520R981r98766j444386r92198l78528j66611L6125N51886
$$ 1098991 1678091 2298611 2308592 1309826 -134560 -1126758 -1505286 -1671897 -1635772 -1083886
37992a083886P91991K82427l32000k87478P0648J08766J52038O60149R15665O6460
$$ -1083886 -291895 -9468 -341468 -628946 -558298 -449532 -297494 362655 1278320 1344780
37982A344780j066736r56365J10409L24756p27536j317714k80975J213578J498186
$$ 1344780 278044 -678321 -567912 -243156 -970692 -2288406 -2569381 -1355803 142383
37973A42383O82338K6576N524J20938O9958N8216J59344J31840j42924m76320
$$ 142383 824721 851297 856821 977759 1047717 1105933 1265277 1397117 1254193 777873
37963G77873n98879l75513Q4727M63857N60832N27034N15370K94562l24386q80596
$$ 777873 178994 -196519 -111792 352065 912897 1439931 1955301 2249863 1925477 1044881
37953A044881p25225j0303M55575L22448O047r8036p229K24517N33796N16971
$$ 1044881 319656 309353 764928 1087376 1093423 995387 988158 1212675 1746471 2263442
37943B263442j14346p53960m99456M06357P57849J98895k53411J19101O42807
$$ 2263442 2149096 1395136 895680 1302037 2059886 2258781 2005370 2124471 2767278
37934B767278M39844k57118p18319q54087r46635q66091l51965L42364P53420
$$ 2767278 3207122 2950004 2231685 1377598 430963 -435128 -787093 -444729 308691
37925C08691Q24213P15716L92362j32377n22683n21653k72063M3324L96606N22354
$$ 308691 1132904 1848620 2240982 2108605 1585922 1064269 792206 835530 1232136 1754490
37915A754490K0153p91949r07342n1399O83221K98207o89734j065075n82801K1910
$$ 1754490 1774643 982694 75352 23953 707174 1005381 315647 -749428 -1332229 -1310319
37905a310319K78055L77519N32387O33024M75335n7501q13967j173935n66120
$$ -1310319 -1032264 -654745 -122358 510666 986001 928500 114533 -1059402 -1625522
37896a625522N45029R37306L06364k34305Q6212M86359Q1130n16443k93024L46734
$$ -1625522 -1080493 -143187 163177 -71128 15084 501443 582573 66130 -226894 119840
37886A19840L52286l5351K09535Q32942N46514o77358j327087o87854J50850J53006
$$ 119840 472126 436775 646310 1479252 2025766 1348408 21321 -666533 -515683 -362677
37876c62677k40014k40894k3072p2593k30196j93385j64687k78263j46457L22765
$$ -362677 -602691 -843585 -866657 -939250 -1169446 -1362831 -1527518 -1805781 -1952238 -1629473
37866a629473M28085k15345p59038k12639J037121J681827J162539J18405o06417
$$ -1629473 -1201388 -1416733 -2175771 -2388410 -1351289 330538 1493077 1611482 1005065
37857A005065p10007l42848J12853K38029j4087k21463j07064M6870m6419j13341
$$ 1005065 295058 -47790 65063 303092 289005 67542 -39522 7348 -39071 -152412
37847a52412J80335N35973M61177J40129J62330M91976M25061l32700j143917
$$ -152412 27923 563896 1025073 1165202 1327532 1819508 2244569 1911869 767952
37838G67952j226949n77062J30252L34803J09346m5478J58387M36874L54729J4141
$$ 767952 -458997 -1036059 -905807 -571004 -461658 -507136 -348749 88125 442854 456995
37828D56995n9941K37099L97615J76720L6203K62279K74489m54030j278441j127247
$$ 456995 397054 634153 1031768 1208488 1244691 1506970 1781459 1327429 48988 -1078259
37818a078259j28828N09928K45557j67864K2051N58509Q36452P73023N47297J34396
$$ -1078259 -1207087 -697159 -451602 -619466 -597415 -38906 797546 1570569 2117866 2252262
37808B252262l89300o22401m17518k10083l27105m69840l30318j50664j40577
$$ 2252262 1862962 1240561 823043 612960 285855 -183985 -514303 -664967 -805544
$$ [...]
##END NTUPLES=NMR SPECTRUM
##END=
