##TITLE=31Pdec_SR2_rmo
 CDCl3, 24 sc
 14.10.2019
##JCAMPDX= 6.0         $$ Bruker NMR JCAMP-DX V2.0
##DATA TYPE= NMR SPECTRUM
##DATA CLASS= NTUPLES
##ORIGIN= UXNMR, Bruker Analytische Messtechnik GmbH
##OWNER= root
$$ XWIN-NMR		Version 3.5
$$ Mon Oct 14 14:18:58 2019 Russian Standard Time (UT+4h)  she@DPX200
##.OBSERVE FREQUENCY= 81.013821
##.OBSERVE NUCLEUS= ^31P
##.ACQUISITION MODE= SIMULTANEOUS
##.ACQUISITION SCHEME= undefined
##.AVERAGES= 24
##.DIGITISER RES= 17
##SPECTROMETER/DATA SYSTEM= spect
##.PULSE SEQUENCE= zgpg30
##.SOLVENT NAME= D2O
##.SHIFT REFERENCE= (INTERNAL, D2O, 0, 182.463)
##AUDIT TRAIL= $$ (NUMBER, WHEN, WHO, WHERE, WHAT)
$$ ##TITLE= Audit trail, XWIN-NMR		Version 3.5
$$ ##JCAMPDX= 5.01
$$ ##ORIGIN= Bruker BioSpin GmbH
$$ ##OWNER= she
$$ F:/spectra/data/she/nmr/P31/1/pdata/1/auditp.txt
$$ ##AUDIT TRAIL=  $$ (NUMBER, WHEN, WHO, WHERE, WHAT)
(   1,<2019-10-14 14:17:53.96 +0400>,<she>,<DPX200>,
      <created by zg, POWCHK disabled, PULCHK disabled
       configuration hash MD5:
       00 E9 B6 7A A2 85 ED C7 34 08 36 98 17 FE 4E 26
       data hash MD5: 32K
       0F C3 24 4F 50 40 6A 37 C8 8D 0A E4 C7 54 0D 7A>)
(   2,<2019-10-14 14:17:59.62 +0400>,<she>,<DPX200>,
      <Start of raw data processing
       efp BC_mod = 2 LB = 1 FT_mod = 6 PKNL = 1 PHC0 = -255.2562 PHC1 = -203.1996 SI = 64K 
       data hash MD5: 64K
       29 53 2A 38 47 ED 09 B1 69 F3 F9 7D 4B B2 21 68>)
(   3,<2019-10-14 14:18:27.85 +0400>,<she>,<DPX200>,
      <pk PHC0 = -12.82766 PHC1 = -24.4 
       data hash MD5: 64K
       29 E9 9B BE EB E2 66 E2 B9 3A 2A EB 18 7F CE DE>)
$$ ##END=
$$ 
$$ hash MD5
$$ B7 AC 1F FD 07 8C 49 17 0D 0D 1A 8F 99 AF 6A B1
##$RELAX= 
##$RELAX= 
##$RELAX= 
##$RELAX= 
##$RELAX= 
##$RELAX= 
##$RELAX= 
##$RELAX= 
$$ Bruker specific parameters
$$ --------------------------
##$DU= <F:/spectra>
##$EXPNO= 1
##$NAME= <P31>
##$PROCNO= 1
##$TYPE= <nmr>
##$USER= <she>
##$AMP= (0..31)
100 100 100 100 100 100 100 100 100 100 100 100 100 100 100 100 100 100 
100 100 100 100 100 100 100 100 100 100 100 100 100 100 
##$AQSEQ= 0
##$AQ_mod= 1
##$AUNM= <au_zg>
##$AUTOPOS= <>
##$BF1= 81.014009
##$BF2= 200.13
##$BF3= 200.13
##$BF4= 200.13
##$BF5= 200.13
##$BF6= 200.13
##$BF7= 200.13
##$BF8= 200.13
##$BYTORDA= 1
##$CFDGTYP= 0
##$CFRGTYP= 5
##$CHEMSTR= <none>
##$CNST= (0..31)
1 1 145 1 1 1 1 1 1 1 1 1 1 1 1 1 1 1 1 1 1 1 1 1 1 1 1 1 1 1 1 1 
##$CPDPRG= <waltz16>
##$CPDPRG1= <>
##$CPDPRG2= <waltz16>
##$CPDPRG3= <>
##$CPDPRG4= <mlev>
##$CPDPRG5= <mlev>
##$CPDPRG6= <mlev>
##$CPDPRG7= <mlev>
##$CPDPRG8= <mlev>
##$CPDPRGB= <>
##$CPDPRGT= <>
##$D= (0..31)
0 1 0 0 0 0 0 0 0 0 0 0.03 2e-05 3e-06 0 0 0 0 0 0 0 0 0 0 0 0 0 0 0 0 
0 0 
##$DATE= 1571048273
##$DBL= (0..7)
120 120 120 11 120 120 24 19 
##$DBP= (0..7)
150 150 150 150 150 150 150 150 
##$DBP07= 0
##$DBPNAM0= <>
##$DBPNAM1= <>
##$DBPNAM2= <>
##$DBPNAM3= <>
##$DBPNAM4= <>
##$DBPNAM5= <>
##$DBPNAM6= <>
##$DBPNAM7= <>
##$DBPOAL= (0..7)
0.5 0.5 0.5 0.5 0.5 0.5 0.5 0.5 
##$DBPOFFS= (0..7)
0 0 0 0 0 0 0 0 
$$ [...]
##$SUBNAM2= <"">
##$SUBNAM3= <"">
##$SUBNAM4= <"">
##$SUBNAM5= <"">
##$SUBNAM6= <"">
##$SUBNAM7= <"">
##$SUBNAM8= <"">
##$SUBNAM9= <"">
##$SW= 369.568048894756
##$SWIBOX= (0..15)
0 1 3 0 0 0 0 0 0 0 0 0 0 0 0 0 
##$SW_h= 29940.119760479
##$TD= 32768
##$TD0= 1
##$TE= 0
##$TE2= 300
##$TE3= 300
##$TEG= 300
##$TL= (0..7)
0 120 53 12 22 120 120 120 
##$TP= (0..7)
150 150 150 150 150 150 150 150 
##$TP07= 0
##$TPNAME0= <>
##$TPNAME1= <>
##$TPNAME2= <>
##$TPNAME3= <>
##$TPNAME4= <>
##$TPNAME5= <>
##$TPNAME6= <>
##$TPNAME7= <>
##$TPOAL= (0..7)
0.5 0.5 0.5 0.5 0.5 0.5 0.5 0.5 
##$TPOFFS= (0..7)
0 0 0 0 0 0 0 0 
##$TUNHIN= 0
##$TUNHOUT= 0
##$TUNXOUT= 0
##$USERA1= <user>
##$USERA2= <user>
##$USERA3= <user>
##$USERA4= <user>
##$USERA5= <user>
##$V9= 5
##$VALIST= <valist>
##$VCLIST= <CCCCCCCCCCCCCCC>
##$VD= 0
##$VDLIST= <DDDDDDDDDDDDDDD>
##$VPLIST= <PPPPPPPPPPPPPPP>
##$VTLIST= <TTTTTTTTTTTTTTT>
##$WBST= 1024
##$WBSW= 4
##$XGAIN= (0..3)
0 0 0 0 
##$XL= 0
##$YL= 0
##$YMAX_a= 25286
##$YMIN_a= -26717
##$ZGOPTNS= <>
##$ZL1= 120
##$ZL2= 120
##$ZL3= 120
##$ZL4= 120
##$ABSF1= 0
##$ABSF2= 0
##$ABSG= 0
##$ABSL= 0
##$ALPHA= 0
##$AQORDER= 0
##$ASSFAC= 0
##$ASSFACI= 0
##$ASSFACX= 0
##$ASSWID= 0
##$AUNMP= <proc_1d>
##$AZFE= 0.1
##$AZFW= 0.5
##$BCFW= 0
##$BC_mod= 2
##$BYTORDP= 0
##$COROFFS= 0
##$CY= -3
##$DATMOD= 1
##$DC= 0
##$DFILT= <>
##$DTYPP= 0
##$F1P= 0
##$F2P= 0
##$FCOR= 1
##$FTSIZE= 65536
##$FT_mod= 6
##$GAMMA= 0
##$GB= 0
##$INTBC= 1
##$INTSCL= 5.30512e-09
##$ISEN= 30
##$LB= 1
##$LEV0= 0
##$LPBIN= 0
##$MAXI= 10000
##$MC2= 0
##$MEAN= 0
##$ME_mod= 0
##$MI= 50
##$NCOEF= 0
##$NC_proc= -6
##$NLEV= 6
##$NOISF1= 182.463
##$NOISF2= 159.3651
##$NSP= 0
##$NTH_PI= 0
##$NZP= 0
##$OFFSET= 182.463
##$PC= 4
##$PHC0= -268.0839
##$PHC1= -227.5996
##$PH_mod= 1
##$PKNL= yes
##$PPARMOD= 0
##$PSCAL= 0
##$PSIGN= 0
##$REVERSE= no
##$SF= 81.0140089999434
##$SI= 65536
##$SIGF1= 159.3651
##$SIGF2= -187.1042
##$SINO= 113.3802
##$SIOLD= 16384
##$SREGLST= <1H.CDCl3>
##$SSB= 0
##$STSI= 65536
##$STSR= 0
##$SW_p= 29940.119760479
##$SYMM= 0
##$S_DEV= 0
##$TDeff= 32768
##$TDoff= 0
##$TI= <>
##$TILT= no
##$TM1= 0
##$TM2= 0
##$TOPLEV= 0
##$USERP1= <user>
##$USERP2= <user>
##$USERP3= <user>
##$USERP4= <user>
##$USERP5= <user>
##$WDW= 1
##$XDIM= 65536
##$YMAX_p= 395666987
##$YMIN_p= -18505369
$$ End of Bruker specific parameters
$$ ---------------------------------
##NTUPLES= NMR SPECTRUM
##VAR_NAME=  FREQUENCY,     SPECTRUM/REAL,   SPECTRUM/IMAG
##SYMBOL=    X,             R,               I
##VAR_TYPE=  INDEPENDENT,   DEPENDENT,       DEPENDENT
##VAR_FORM=  AFFN,          ASDF,            ASDF
##VAR_DIM=   65536,         65536,           65536
##UNITS=     HZ,            ARBITRARY UNITS, ARBITRARY UNITS
##FACTOR=    0.456856943014862, 1,           1
##FIRST=     14782.0589164792, 0,            0
##LAST=      -15158.0608439998, 0,           0
##MIN=       -15158.0608439998, -18505369,   0
##MAX=       14782.0589164792, 395666987,    0
$$ Real data points
##PAGE= N=1
##DATA TABLE= (X++(R..R)), XYDATA
$$ [...]
45731a495928N81047P68243J205795J265086O55736k51633q19664p36142k45325
$$ -1495928 -914881 -146638 1059157 2324243 2979979 2728346 1908682 1172540 927215
45722I27215J87630L98115N04555L92127k48090j076576r92652M01728J753644
$$ 927215 1114845 1512960 2017515 2409642 2161552 1084976 92324 494052 2247696
45713B247696J392063m43948j887768j836332q88246O9869P95022R54698N1730
$$ 2247696 3639759 3195811 1308043 -528289 -1416535 -1346666 -551644 403054 454784
45704D54784j224770j116077O56280J868074P66817j168136j332662J3424K40216
$$ 454784 -769986 -1886063 -1229783 638291 1405108 236972 -1095690 -1082266 -842050
45695h42050j312210k056997r1212K731970L266658J276098o65791q52744j63568
$$ -842050 -2154260 -4211257 -4302469 -1570499 1696159 2972257 2306466 1453722 1290154
45686A290154m0990m53673o20303n54560p24647p88374J1903J246647J409037
$$ 1290154 1249164 795491 175188 -379372 -1104019 -1892393 -1880490 -633843 775194
45677G75194R4932j109005q36694m4190m83180j705209j495513O16300K275456
$$ 775194 870126 -238879 -1075573 -1119763 -1602943 -3308152 -4803665 -4187365 -1911909
45668a911909J529414n76402j810412j679536j062557k34823Q62623J339942M80835
$$ -1911909 -382495 -958897 -2769309 -4448845 -5511402 -5746225 -4883602 -3543660 -3062825
45659c062825m29223L27666J801372J392256q69556j869210j23782J802219J260112
$$ -3062825 -3492048 -3164382 -1363010 29246 -840310 -2709520 -2833302 -1031083 229029
45650B29029n11174p07121N62896R35187q7621o69149j00895J43812o49765j004762
$$ 229029 -282145 -989266 -426370 508817 421196 -247953 -348848 -205036 -854801 -1859563
45640a859563J01286J230272O80166q00908j250190m97650r4943o23147q97968
$$ -1859563 -1758277 -528005 152161 -648747 -1898937 -2396587 -2491530 -3114677 -4012645
45631d012645r8865Q70244Q89948L76739M75163J119431J113622Q0672q37089
$$ -4012645 -4111510 -3241266 -2351318 -1974579 -1499416 -379985 733637 814309 -22780
45622b2780o64203j8590j2429m10875j18616P12024N49054j072087k322376j372275
$$ -22780 -686983 -705573 -718002 -1128877 -1247493 -535469 13585 -1058502 -3380878 -4753153
45612d753153R64570K183887J270351l66918j012824m36886N59050J189493R43254
$$ -4753153 -3788583 -1604696 -334345 -701263 -1714087 -2150973 -1591923 -402430 540824
45603E40824j50700j090416p16769N90702J095079J60360o79416o2733R61617
$$ 540824 390124 -700292 -1417061 -826359 268720 429080 -250336 -313069 648548
45594F48548M72666j360145k543234k101487r15993J82923J298794K138681J697639
$$ 648548 1121214 -238931 -2782165 -4883652 -5799645 -5616722 -4317928 -2179247 -481608
45585d81608R6202r17117m11435K27991m08625j303528o19099J192730J936842
$$ -481608 -385406 -1302523 -1713958 -1485967 -1894592 -3198120 -3817219 -2624489 -687647
45576f87647R25911l29747o49778m62361l08679N2971N17683L43943l23558l08943
$$ -687647 238264 -91483 -741261 -1203622 -1512301 -1459330 -941647 -597704 -921262 -1230205
45566a230205M30544K78555j286870k237019r30434J043777J025549p86475j816635
$$ -1230205 -799661 -521106 -1807976 -4044995 -4975429 -3931652 -2906103 -3692578 -5509213
45557e509213r35477M73223J123423J312555J503542J339735O76599J30752L5169
$$ -5509213 -6444690 -5971467 -4848044 -3535489 -2031947 -692212 -15613 115139 150308
45548A50308n578j82470j77457P4646L93754R72369J685339J207979j260646l638482
$$ 150308 144730 -37740 -215197 -140551 253203 1225572 2910911 4118890 2858244 -780238
45538g80238k825549P10121K887395J481321j044689j607618p16219m84054q08124
$$ -780238 -3605787 -2895666 -8271 1473050 428361 -1179257 -1895476 -2379530 -3187654
45529c187654l23715M89834J75500p16155m31292P54379R24663r4334m95964K76209
$$ -3187654 -3511369 -3021535 -2846035 -3562190 -3993482 -3239103 -2314440 -2408774 -2904738 -2628529
45519b628529P19674J06357l66110O6310N04005L68120N02158J251628J384346
$$ -2628529 -1908855 -1802498 -2168608 -2102298 -1598293 -1230173 -728015 523613 1907959
45510A907959J87459j015847q26783R4066K32728n13306j098648j003784m42661
$$ 1907959 2095418 1079571 252788 346854 579582 66276 -1032372 -2036156 -2478817
45501b478817L75349J092059R66990j54928j197695j112522k44351M04935O41846
$$ -2478817 -2103468 -1011409 -44419 -199347 -1397042 -2509564 -2753915 -2348980 -1707134
45492a707134Q44868Q56929K60762n51287p00831j75346R7020l24233o43797J17986
$$ -1707134 -862266 -5337 255425 -295862 -996693 -1172039 -1075019 -1399252 -2043049 -1925063
45482a925063J682541K537704J566410m67393j548589q20067L06078K36981l38896
$$ -1925063 -242522 2295182 3861592 3394199 1845610 1025543 1331621 1568602 1229706
45473A229706L95536K090073K184623k85843k899398l118843j647358q06074q94475
$$ 1229706 1625242 3715315 5899938 5614095 2714697 -404146 -2051504 -2857578 -3752053
45464c752053l45175J127488J854553R05404m45953o53745L8092L34524j61305
$$ -3752053 -4097228 -2969740 -1115187 -209783 -655736 -1309481 -1271389 -936865 -1098170
45455a098170o33449l31957N40533J217702J238920P80457K94879Q2302K43300
$$ -1098170 -1731619 -2063576 -1523043 -305341 933579 1714036 2008915 2091217 2334517
45446B334517O61952P58905k17757k003472k916552j689791N94943J681663J085852
$$ 2334517 2996469 3755374 3537617 1534145 -1382407 -3072198 -2477255 -795592 290260
45437B90260K97671N7199n11136j514322j381113L62244J585038P10298n18672
$$ 290260 587931 645130 133994 -1380328 -2761441 -2399197 -814159 -103861 -622533
45428f22533J78759J620166Q99982j715468k874366j172828R49143J097475O3508
$$ -622533 -443774 1176392 2076374 360906 -2513460 -3686288 -2737145 -1639670 -1576162
45419a576162j91812M12348O54527K59238k5041J08081K16069k6005m11774n21841
$$ -1576162 -1767974 -1355626 -701099 -441861 -466902 -358821 -142752 -168757 -580531 -1102372
45409a102372j73216K82779K72910k4184M16806J795606K497368J151154r84797
$$ -1102372 -1275588 -992809 -719899 -744083 -327277 1468329 3965697 5116851 4132054
45400D132054j551801o18106m13441j487204j735308o3668J491432Q28719j011147
$$ 4132054 2580253 1962147 1548706 61502 -1673806 -1737474 -246042 582677 -428470
45391d28470j547829l87121P86944Q22921O3441o75496p40320J76835J379846
$$ -428470 -1976299 -2363420 -1576476 -753555 -690114 -1365610 -2105930 -1929095 -549249
45382e49249J382839j27905j317275m04473J807359K854572J624748o36674j975732
$$ -549249 833590 705685 -611590 -1016063 791296 3645868 5270616 4633942 2658210
45373B658210j539474j29835M86325n68005j848516j213333P98879J175621r95249
$$ 2658210 1118736 988901 1475226 907221 -941295 -2154628 -1355749 -180128 -1175377
45364a175377k530062p32125K205975K291015l06633j828243p40713P02216Q05414
$$ -1175377 -3705439 -4437564 -2231589 59426 -247207 -2075450 -2816163 -2113947 -1308533
45355a308533O65122J112349P77821j091737k560414j788195P2512P49763P2518
$$ -1308533 -643411 468938 1246759 155022 -2405392 -4193587 -4121075 -3371312 -3298794
45346c298794n81018p23645o73678o7177J469795K742573K065351k02998j845723
$$ -3298794 -3879812 -4603457 -5277135 -5344312 -3874517 -1131944 933407 730409 -1115314
45337a115314j594447l95670K94145K72262K36318N18906P39156M43889k04541
$$ -1115314 -2709761 -3105431 -2811286 -2539024 -2302706 -1783800 -1044644 -600755 -805296
45328h05296m74601M9035P66588P60762J37978j21546K28113K53623n74732j373859
$$ -805296 -1279897 -1230862 -464274 296488 434466 312920 541033 794656 219924 -1153935
45318a153935j087350J10224J287407J803388J331064j14030j476962j223613
$$ -1153935 -2241285 -2131061 -843654 959734 2290798 2176768 699806 -523807
45310e23807M52018J280790K54j589407j280409J50498L68499o56515q08339M60979
$$ -523807 -71789 1209001 1209255 -380152 -1660561 -1510063 -1141564 -1798079 -2606418 -2145439
45300b145439J252211M25545p02806o63056J39256O21696O17330L56676k33766
$$ -2145439 -893228 -467683 -1170489 -1833545 -1694289 -1072593 -455263 -98587 -332353
45291c32353q73984q19388q8253M12986M36976O27817Q69043K79776n92867R7184
$$ -332353 -1206337 -2025725 -2113978 -1700992 -1264016 -636199 232844 512620 -80247 16937
45281A6937K082179K256209p51402l663713k851037L36546J686616L31758p19103
$$ 16937 2099116 4355325 3603923 -59790 -2910827 -2574281 -887665 -555907 -1275010
45272a275010J31603R41095M4073j254805j228585m64685l32532n36273Q381J042655
$$ -1275010 -1143407 -202312 -158239 -1413044 -2641629 -3106314 -3438846 -3975119 -3966738 -2924083
45262b924083J367194P36478P5848J47595Q17645J339191R28565m69420j766975
$$ -2924083 -1556889 -820411 -744563 -596968 220677 1559868 2488433 2019013 252038
45253B52038j762807p12500J7123n1046j3445O73855J304159J244201Q33425L88118
$$ 252038 -1510769 -2223269 -2206146 -2257192 -2270637 -1596782 -292623 951578 1785003 2173121
45243B173121l47657j096954q44700L82295R61291j4523j211964j082507j63567
$$ 2173121 1825464 728510 -116190 266105 1227396 1212873 909 -1081598 -1245165
45234a245165M3717n62548r06171m85527M11427J438717J968992J125773p34949
$$ -1245165 -1201448 -1763996 -2670167 -3155694 -2744267 -1305550 663442 1789215 1054266
45225A054266j710883q64999K55987J58025j19729Q49243J808334O69249j615573
$$ 1054266 -656617 -1521616 -1265629 -1107604 -1227333 -378090 1430244 2099493 483920
45216D83920k129318m68801R25899P62103J25426l39858j230254j941742p82203
$$ 483920 -1645398 -2114199 -1188300 -426197 -300771 -640629 -1870883 -3812625 -4594828
45207d594828J609623K261092M83576q10540M9974P78612n55656j857525o52011
$$ -4594828 -2985205 -724113 -240537 -1051077 -1001103 -222491 -778147 -2635672 -3287683
45198c287683J423829J344856k13783l83768P47606N80439j057400j488114J09847
$$ -3287683 -1863854 -518998 -732781 -1116549 -368943 211496 -845904 -2334018 -2224171
45189b224171J306572N50330n52662l09455M62421M03367o6529k6725Q4020m77157
$$ -2224171 -917599 -367269 -919931 -1229386 -766965 -363598 -430127 -456852 -372832 -849989
45179h49989j123998q76148k0914M40488L08056O4668j67096n72784r60411r32381
$$ -849989 -1973987 -2850135 -2871049 -2430561 -2122505 -2057837 -2224933 -2797717 -3758128 -4690509
45169d690509n02096j1671L53777O81670J174006J872293K232382J341972p27103
$$ -4690509 -5192605 -5204276 -4850499 -4168829 -2994823 -1122530 1109852 2451824 1724721
45160A724721k258543j748613r4804N52220m3094m8298J204369K000347J126220
$$ 1724721 -533822 -2282435 -2377239 -1825019 -1868113 -1916411 -712042 1288305 2414525
45151B414525j25405k66209q1489q75641j714789p98806J189892J610833k85394
$$ 2414525 2289120 2022911 1941422 1065781 -649008 -1447814 -257922 1352911 1067517
45142A067517k235814k126516m68006R12425J127460M22362o13718j181065o30492
$$ 1067517 -1168297 -3294813 -3762819 -2850394 -1722934 -1300572 -1914290 -3095355 -3725847
45133c725847M97526P02060m07825j213049k72434J438926J817795O49592k03391
$$ -3725847 -3228321 -2526261 -2934086 -4147135 -4419569 -2980643 -1162848 -513256 -716647
45124g16647L85918J328142J136470l2366r98259j330115j468457j551756j161186
$$ -716647 -330729 997413 2133883 2101517 1103258 -226857 -1695314 -3247070 -4408256
45115d408256j75089Q93098J455775J236104K55908r14532j099140L45530K232706
$$ -4408256 -4583345 -3690247 -2234472 -998368 -742460 -1656992 -2756132 -2410602 -177896
45106a77896K407079L95631j644756j408115O38039J720571J18043k681749l560178
$$ -177896 2229183 2624814 980058 -428057 209982 1930553 2048596 -633153 -4193331
45097d193331j291188J936670K877494J005134q40471r9154K085373K391842j29916
$$ -4193331 -5484519 -3547849 -670355 334779 -505692 -604846 1480527 3872369 3742453
45088C742453k812494l007950j223312K77173M82324m8287o86769j021711m18593
$$ 3742453 929959 -2077991 -3301303 -3024130 -2541806 -2590093 -3276862 -4298573 -4717166
45079d717166J174935K448018K098920N96574o26579j189686j622013j788601
$$ -4717166 -3542231 -1094213 1004707 1601281 974702 -214984 -1836997 -3625598
45071c625598j099211M338M21665J60436J96640O86037Q96710Q11650J079532
$$ -3625598 -4724809 -4720471 -4298806 -4138370 -3941730 -3255693 -2358983 -1547333 -467801
45062d67801J399164Q15945k71846m15531L02374J72322j106385j629359n00954
$$ -467801 931363 1747308 1475462 1059931 1362305 1534627 428242 -1201117 -1702071
45053a702071M97424r3027r23380k77457Q61001N28417p69110r15117K26828P08083
$$ -1702071 -1204647 -1297674 -2221054 -2498511 -1637510 -1109093 -1878203 -2793320 -2566492 -1858409
45043a858409r8710m74048O65797J806753J029252j105409k199953j108053P44417
$$ -1858409 -1957119 -2431167 -1765370 41383 1070635 -34774 -2234727 -3342780 -2598363
45034b598363J321474N24184L0074O94580J202449R5130j775852k314385j241053
$$ -2598363 -1276889 -752705 -722631 -28051 1174398 1269528 -506324 -2820709 -4061762
45025d061762k13827O4304O19747J601364J422562k30165r91440N94584K233569
$$ -4061762 -4275589 -4211285 -3591538 -1990174 -567612 -797777 -1789217 -1194633 1038936
45016A038936J222833j069705j221918P53703J469842l46743j952117j116297
$$ 1038936 2261769 1192064 -29854 723849 2193691 1846948 -105169 -1221466
45008a221466N06801K99025j266001j663216j62846J477569J745602J028434L60968
$$ -1221466 -714665 -415640 -1681641 -3344857 -3507703 -2030134 -284532 743902 1104870
44999A104870j41466r05366j639510j417289j29055R58847P68551j1292M3103
$$ 1104870 963404 58038 -1581472 -2998761 -3127816 -2168969 -1400418 -1411710 -1368607
44990a368607Q27925R55296K23985n3929L61499m1946j559538k033325l92248
$$ -1368607 -540682 414614 638599 584670 946169 904223 -655315 -2688640 -3080888
44981c080888R31960l02436k123379j310361J189018J722033j7285p11748P23679
$$ -3080888 -2148928 -2451364 -4574743 -5885104 -4696086 -2974053 -2991338 -3703086 -2979407
44972b979407J421323k50029j886139j283149O1926j0344p07566k20499J075323
$$ -2979407 -1558084 -1808113 -3694252 -4977401 -4915475 -4925819 -5633385 -5853884 -4778561
44963d778561J818482K099562K385582J839556K2067j434288j152314l65988o51847
$$ -4778561 -2960079 -860517 1525065 3364621 3386688 1952400 800086 434098 -217749
44954b17749j078541k11437Q06966K24988p89676m1188J416849P69265j339722
$$ -217749 -1296290 -1507727 -700761 -475773 -1265449 -1306637 110212 879477 -460245
44945d60245j298397J389779K738300M04178k539578k204154O00460K114435R84844
$$ -460245 -1758642 -368863 2369437 2773615 234037 -1970117 -1369657 744778 1729622
44936A729622q20183j419903r22853k25005K45352M58415N30017N75846L74422
$$ 1729622 909439 -510464 -1433317 -1658322 -1412970 -954555 -424538 151308 525730
44927E25730l44067r68903m05337R86119J188065n70125k007404o73554K212642
$$ 525730 181663 -787240 -1192577 -206458 981607 411482 -1595922 -2269476 -56834
44918e6834L007275N99577k117708k336214q48613j62468o47780n25733R02253
$$ -56834 2950441 3550018 1432310 -903904 -1752517 -1914985 -2562765 -3088498 -2186245
44909b186245K083448J632635L00652l66981k21276j97910m85423l53870L20277
$$ -2186245 -102797 1529838 1830490 1463509 1242233 1044323 558900 205030 525307
44900E25307O44971J50463l72708k7298Q81098J252459M89536r92085k155436
$$ 525307 1170278 1320741 948033 920735 1801833 3054292 3543828 2551743 396307
44891C96307k026026n36331J066943J299899J98956p47730p07320m91697q41377
$$ 396307 -1629719 -2166050 -1099107 200792 399748 -347982 -1055302 -1546999 -2388376
44882b388376r33857K20472J804385K121629J067772J77712K98317O26346K69661
$$ -2388376 -3322233 -3101761 -1297376 824253 1892025 2069737 2368054 2994400 3264061
44873C264061m70815q30104o81568m15679k98574l10220k61517M5403M88991O16447
$$ 3264061 2793246 1963142 1281574 865895 567321 257101 -4416 40987 529978 1146425
44863A146425L30234K16807O19236Q49566J45617j007535j509589j261457j013653
$$ 1146425 1476659 1693466 2312702 3162268 3307885 2300350 790761 -470696 -1484349
44854a484349q52385j79109P91777R30738m2953q85649m40016R50213K024927
$$ -1484349 -2336734 -2515843 -1724066 -793328 -836281 -1721930 -2161946 -1211733 813194
44845H13194J886698N48247j015114j396680k98392O41236j63309j649257j317841
$$ 813194 2699892 3248139 2233025 836345 537953 1179189 1015880 -633377 -1951218
44836a951218Q20077J768239r3901k409788k246118k61737P06629K718m14456
$$ -1951218 -1131141 637098 543197 -1866591 -4112709 -4374446 -3667817 -3665099 -4079555
44827d079555N36282J590228J489043P58190L49424O0870o47770j316588j108543
$$ -4079555 -3543273 -1953045 -464002 294188 643612 704482 56712 -1259876 -2368419
44818b368419k33089K98957J71951Q3710M23690M89321l80463j443390j299050
$$ -2368419 -2601508 -2302551 -2130600 -2046890 -1623200 -1133879 -1514342 -2957732 -4256782
44809d256782O1200J055696P63655K17578N72748J124811O05331m18711l79814
$$ -4256782 -4195582 -3139886 -2376231 -2158653 -1585905 -461094 144237 -274474 -654288
44800f54288M88060M28670o94776r58800L33941J369243Q73852O2337Q2153r8079
$$ -654288 -166228 262442 -432334 -1391134 -1057193 312050 1185902 1248239 1330392 1232313
44790A232313j277330j774355j66503J623303J010788r23332j170771J28663J23530
$$ 1232313 -45017 -1819372 -1985875 -362572 648216 -275116 -1445887 -1317224 -1193694
44781a193694j545252j993446j18830J495576J023213K06175Q38924J594356P77195
$$ -1193694 -2738946 -4732392 -4851222 -3355646 -2332433 -2126258 -1287334 307022 1084217
44772A084217l77858O0724J210616J013141j29148l30419K32189k02979j535816
$$ 1084217 706359 767083 1977699 2990840 2861692 2531273 2763462 2560483 1024667
44763A024667j851377q09418j09079l01668O0977J388245J828269L45825j239105
$$ 1024667 -826710 -1636128 -1745207 -2046875 -1985898 -597653 1230616 1576441 337336
44754C37336r63680K56740K35016j010436j425980j41626J320070J272826K795
$$ 337336 -626344 -369604 -134588 -1145024 -2571004 -2712630 -1392560 -119734 -116939
44745a16939q55149l91466O48947Q58626j66326j324674j314747k09714P45690
$$ -116939 -972088 -1363554 -714607 144019 -22307 -1346981 -2661728 -2871442 -2125752
44736b125752P71079K57093k02333n81898q98921q01893k53299J20515P462N5120
$$ -2125752 -1354673 -1097580 -1299913 -1881811 -2780732 -3582625 -3835924 -3715409 -3707947 -3652827
44726c652827P99868J579607J399382M16777l57501m98500l66825j22146M49628
$$ -3652827 -2852959 -1273352 126030 542807 185306 -313194 -680019 -802165 -352537
44717c52537J154709J356211Q38134P650p74493j388342j561545j062820k60535
$$ -352537 802172 2158383 2996517 3004167 2229674 841332 -720213 -1783033 -2043568
44708b043568K86441P06767J392941J826380J020765p08283j702794j160342j82315
$$ -2043568 -1757127 -1050360 342581 2168961 3189726 2481443 778649 -381693 -564008
44699e64008J9197j94019R9264O83283O93508J57826j47791o5385j99159p74092
$$ -564008 -544811 -738830 -639566 43717 737225 895051 747260 681875 482716 -291376
44689b91376j214429r24774N7422J176217J798016J713523J365425J190088P60942
$$ -291376 -1505805 -2430579 -2373157 -1196940 601076 2314599 3680024 4870112 5631054
44680E631054n35378j896106j625796J16251P97204r32241k761365j786760J126469
$$ 5631054 5095676 3199570 1573774 1690025 2487229 1554988 -1206377 -2993137 -1866668
44671a866668K476123J013431j058502j683451j185306n17370K94893J136902
$$ -1866668 609455 1622886 564384 -1119067 -2304373 -2821743 -2526850 -1389948
44663a389948J274109P67922O89094J135348P91241p49436k038469k005437j300869
$$ -1389948 -115839 652083 1341177 2476525 3267766 2518330 479861 -1525576 -2826445
44654b826445n84632M57408J415758Q45399r78787j483526K31461J399254j38424
$$ -2826445 -3411077 -2953669 -1537911 -692512 -1671299 -3154825 -2923364 -1524110 -1662534
44645a662534k217762j871132k30421k64142j423940p72606J560986K496401J314554
$$ -1662534 -3880296 -5751428 -5981849 -6245991 -7669931 -8442537 -6881551 -4385150 -3070596
44636c070596M69652Q18539M53416q77511o71588J441101K056904m07867k433902
$$ -3070596 -2600944 -1782405 -1328989 -2206500 -2878088 -1436987 619917 212050 -2221852
44627b221852p43739K423738K912543Q58894n35133m70435p37572j561781j251008
$$ -2221852 -2965591 -541853 2370690 3229584 2694451 2224016 1486444 -75337 -1326345
44618a326345K81564J136963O98402K56350J73395o54063k043702k048388j23509
$$ -1326345 -1044781 92182 790584 1046934 1220329 566266 -1477436 -3525824 -3649333
44609c649333J618083J412825J56941l79240J6650M62361N22471K28377m06057
$$ -3649333 -2031250 -618425 -461484 -840724 -824074 -361713 160758 389135 -16922
44600a6922j031604r78255k31053M09222M98776L76561K11659k51961p38300m65043
$$ -16922 -1048526 -2026781 -2257834 -1848612 -1349836 -973275 -761616 -1013577 -1751877 -2216920
44590b216920N01724J140502J068527R20194P97232n1851j384368j543430N2896
$$ -2216920 -1715196 -574694 493833 1414027 2211259 2159408 775040 -768390 -715494
44581g15494J595078J409322L95430L19140Q57862L38517j231143j963373r22939
$$ -715494 879584 2288906 2684336 3003476 3861338 4199855 2968712 1005339 82400
44572H2400O17198J119842N98167k1403k65432k13905M1974M16356O32723M05886
$$ 82400 699598 1819440 2417607 2396204 2130772 1916867 1958841 2375197 3007920 3413806
44562C413806k81603j131032j608084j256364k69034M52446K72425k87288j54052
$$ 3413806 3132203 2001171 393087 -863277 -1132311 -679865 -407440 -694728 -848780
44553h48780Q54500J752013J621301O28443l86946r30611j164951j400637j570845
$$ -848780 5720 1757733 3379034 4007477 3620531 2689920 1524969 124332 -1446513
44544a446513j258146j87187J306839K313600J980302L24786j492801j989738
$$ -1446513 -2704659 -2891846 -1585007 728593 2708895 3033681 1540880 -448858
44536d48858q68249M27050L05408p99546q54458P53517J894884N73472j926758
$$ -448858 -1317107 -890057 -584649 -1384195 -2238653 -1485136 409748 983220 -943538
44527i43538k561843p01598J232590J307550J89738o90774j022150q53456Q8788
$$ -943538 -3505381 -4206979 -2974389 -1666839 -1477101 -2167875 -3190025 -4043481 -3954693
44518c954693J213748R93930o11522j369503Q6198J988011K063296Q19619J12922
$$ -3954693 -2740945 -1747015 -2358537 -3728040 -3641842 -1653831 409465 1229084 1342006
44509A342006p5205q89661j750322j114329M59419Q52110j73286p97888l88582
$$ 1342006 1266801 377140 -1373182 -2487511 -2028092 -1175982 -1349268 -2147156 -2535738
44500b535738r8107o3352R31416K386980J904086o89328k126054m80385J620944
$$ -2535738 -2633845 -2697197 -1765781 621199 2525285 1835957 -290097 -770482 850462
44491H50462R71080j359160k015881n56595N12770O7064l94968J56462O71454
$$ 850462 1821542 462382 -1553499 -2110094 -1597324 -1530260 -1925228 -1768766 -1097312
44482a097312J56230o26291n20630K86291P51466M25605j90724l68125K7707L21688
$$ -1097312 -941082 -1567373 -2088003 -1801712 -1050246 -624641 -815365 -1183490 -1155783 -834095
44472h34095j46557r12744q03640K46283Q39877K39454l50143L10405J451178
$$ -834095 -980652 -1893396 -2697036 -2450753 -1610876 -1371422 -1721565 -1411160 40018
44463D0018J558948O92732p5737o40953j407416j592563k17125J518599J237625
$$ 40018 1598966 2291698 2215961 1575008 167592 -1424971 -1642096 -123497 1114128
44454A114128j007420k383018j165354R93661J583178L74143r67623j140318j38197
$$ 1114128 106708 -2276310 -3441664 -2448003 -864825 -490682 -1458305 -2598623 -2736820
44445b736820J132444J513079O84625j56242K52784J160686P34686q79459j511660
$$ -2736820 -1604376 -91297 593328 437086 689870 1850556 2585242 1705783 194123
44436A94123m86079J85264p49147j531082l92870J287072J164061l26461j006921
$$ 194123 -291956 -106692 -855839 -2386921 -2779791 -1492719 -328658 -655119 -1662040
44427a662040o10045n77029q48292J18769K044467K448922L76295j900826k027391
$$ -1662040 -2272085 -2849114 -3697406 -3578637 -1534170 914752 1291047 -609779 -2637170
44418b637170n23122N90584N30906j42242q64417j200669o09016P45558J720183
$$ -2637170 -3160292 -2569708 -2038802 -2181044 -3045461 -4246130 -4855146 -4109588 -2389405
44409b389405J707746J525304J782153J456368m29588k571608k688521p99010
$$ -2389405 -681659 843645 2625798 4082166 3652578 1080970 -1607551 -2406561
44401b406561O39206N7327j423885k026658j610747j036972m72083M50163J498801
$$ -2406561 -1767355 -1710028 -3133913 -5160571 -6771318 -7808290 -8280373 -7830210 -6331409
44392f331409K076044K195460K173692J659426J52798j571038j855126l75059
$$ -6331409 -4255365 -2059905 113787 1773213 1926011 354973 -1500153 -1875212
44384a875212J132390J039411j13813o05348Q467N00951q4788j129724j402475
$$ -1875212 -742822 296589 182776 -422572 -414105 86846 2058 -1127666 -2530141
44375b530141o80101R1864O2201m66666l98664P04298J763489J302989m81045
$$ -2530141 -3210242 -3118378 -3056177 -3522843 -3921507 -3217209 -1453720 -150731 -631776
44366f31776j547369m89465J498379K094106Q33852n92982q67910m16367K2859
$$ -631776 -2179145 -2668610 -1170231 923875 1757727 1164745 296835 -119532 -96673
44357i6673O80326J719420K107586Q26333j366495k603294k132181q96589l1553
$$ -96673 583653 2303073 4410659 5236992 3870497 1267203 -864978 -1761567 -1793120
44348a793120K53931K56452J46501M7617J37975L82444N32577N01125L69220K5835
$$ -1793120 -1539189 -1282737 -1136236 -1088619 -950644 -568200 -35623 465502 834722 860557
44338H60557o94240j430946j426170n06447N16146Q00385N03869M08204P18831
$$ 860557 166317 -1264629 -2690799 -3197246 -2681100 -1880715 -1376846 -968642 -249811
44329b49811Q12751K74378l72286l94876L1308J09613k29214j13844P61637J275099
$$ -249811 562940 837318 465032 70156 101464 211077 -18137 -131981 629656 1904755
44319A904755L92566j011609j049774N47129J900740J390357m35863j837474j925676
$$ 1904755 2297321 1285712 235938 783067 2683807 4074164 3638301 1800827 -124849
44310a24849j163597m83016m47686q17899o32422P05090K261881K337910O29015
$$ -124849 -1288446 -1771462 -2219148 -3037047 -3669469 -2964379 -702498 1635412 2264427
44301B264427j369947k391950k547342k039320m57924J629904K177244M20957
$$ 2264427 894480 -1497470 -4044812 -6084132 -6542056 -4912152 -2734908 -2313951
44293b313951j312182n82061J574575K343259J433136Q91211J136435M24873j394775
$$ -2313951 -3626133 -4208194 -2633619 -290360 1142776 2033987 3170422 3595295 2200520
44284B200520j906169j68499J198870m6979k079902j714909P55320K110592Q72590
$$ 2200520 294351 125852 1324722 1277743 -802159 -2517068 -1761748 348844 1221434
44275A221434j076106j512836m53447O61430Q15011l6840j164149j431872l47924
$$ 1221434 145328 -1367508 -1820955 -1159525 -344514 -381354 -1545503 -2977375 -3325299
44266c325299J015472R96380n17896j768808j303377K83572J291450J015875K60426
$$ -3325299 -2309827 -1313447 -1831343 -3600151 -4903528 -4619956 -3328506 -2312631 -2052205
44257b052205K6961L70561O74154O02483L98225L25562K30078j30556n73965o54106
$$ -2052205 -2025244 -1654683 -980529 -378046 20179 345741 575819 445263 -128702 -782808
44247g82808k38707L77222Q43362R45725N96941K8536k02500R7329K70177l47370
$$ -782808 -1021515 -644293 199069 1144794 1741735 1770271 1567771 1665100 1935277 1587907
44237A587907j277963j425617o58464J02382M18337Q00238J334664J125966j35540
$$ 1587907 309944 -1115673 -1774137 -1671755 -1253418 -453180 881484 2007450 1871910
44228A871910j147981o29599P48659J237412M20637m15285k56450L69620M13871
$$ 1871910 723929 94330 842989 2080401 2501038 2085753 1829303 2198923 2612794
44219B612794j41522l06882N18556J597789J583494J97810j223280j273970k44185
$$ 2612794 2471272 2164390 2682946 4280735 5864229 6062039 4838759 3564789 3320604
44210C320604L40607k35748j182593j567751j361171q42717o568Q92932J082058
$$ 3320604 3661211 3425463 2242870 675119 -686052 -1528769 -1535337 -642405 439653
44201D39653K68101o96089p62762J26253J189529J655239J216200K15959m78217
$$ 439653 707754 11665 -751097 -624844 564685 2219924 3436124 3652083 3173866
44192C173866m40936m28854j195871j853296r85250O80121Q74838m71337o38476
$$ 3173866 2732930 2304076 1108205 -745091 -1730341 -1050220 -175382 -646719 -1285195
44183a285195J493870L062760J368936j775659k645035j013083J82893k35705
$$ -1285195 208675 3271435 4640371 2864712 219677 -793406 -610513 -846218
44175h46218m32951P37337J832924J385836j011j026766j361828j192591o10859
$$ -846218 -1279169 -541832 1291092 2676928 2675917 1649151 287323 -905268 -1516127
44166a516127m6049l126o4249N34771J296322R96344j69298p79877o16537q58657
$$ -1516127 -1562176 -1565302 -1629551 -1094780 201542 1197886 1028588 248711 -367826 -1226483
44156a226483j570616j223276O04560K188706K221054J429407P34413j48292j196009
$$ -1226483 -2797099 -4020375 -3415815 -1227109 993945 2423352 3157765 3009473 1813464
44147A813464j310377m06754j78120j225028j577237J0597J465435N98382r98930
$$ 1813464 503087 96333 -81787 -1306815 -2884052 -2873455 -1408020 -809638 -1808568
44138a808568l71354J765922J944471m90622k297312j357576M32343N67500m10534
$$ -1808568 -2179922 -414000 1530471 1039849 -1257463 -2615039 -2182696 -1615196 -2025730
44129b025730m88931M28439P47846j44777j191583j280681l42277R00129J389650
$$ -2025730 -2514661 -2086222 -1338376 -1483153 -2674736 -3955417 -4297694 -3397565 -2007915
44120b007915L65834j547781k310910o17189K123354L129597J653341j80804l57107
$$ -2007915 -1642081 -3189862 -5500772 -6117961 -3994607 -865010 788331 607527 250420
44111B50420M57477L01141j073494k058470j714722q13534j48346N81783J494403
$$ 250420 707897 1009038 -64456 -2122926 -3837648 -4651182 -4799528 -4217745 -2723342
44102b723342J623677M86422o41595m79863J60175k72686j332214j190490L19825
$$ -2723342 -1099665 -613243 -1254838 -1734701 -1574526 -1847212 -3179426 -4369916 -4050091
44093d050091J434083J347360J195152J610658J446310l7988j533944j540859
$$ -4050091 -2616008 -1268648 -73496 1537162 2983472 2945484 1411540 -129319
44085a29319m80036K92203M08422K72381L6430p6290M74757J364661J157627n22155
$$ -129319 -609355 -317152 91270 363651 400081 323791 798548 2163209 3320836 2798681
44075B798681j810759j086514N02129P42364l00236o23891M56359J362934O86659
$$ 2798681 987922 -98592 403537 1145901 845665 221774 678133 2041067 2727726
44066B727726r52486j838710j066612O23727J458580M12775j306080j455853R9460
$$ 2727726 1775240 -63470 -1130082 -506355 952225 1365000 58920 -1396933 -1297473
44057a297473R28449k95498j478770k88902J986917K312567N60942o30558k51458
$$ -1297473 -369024 -664522 -2143292 -2432194 -445277 1867290 2428232 1797674 1546216
44048A546216q8153j164949j906034q97508P86369J316125N45079m19153q13429
$$ 1546216 1458063 293114 -1612920 -2510428 -1724059 -407934 137145 -282008 -1095437
44039a095437m76736M01512J080515Q04712J2818l4881Q49657J451306R95572
$$ -1095437 -1572173 -1170661 -90146 714566 727384 692503 1542160 2993466 3989038
44030C989038J4308r17319j843823k418716j791365j63787R34552O28877k57296
$$ 3989038 4003346 3086027 1242204 -1176512 -2967877 -3131664 -2197112 -1568235 -1825531
44021a825531o37879l31884N71438J908121K509039R51015j904692l025053j077254
$$ -1825531 -2463410 -2795294 -2223856 -315735 2193304 3144319 1239627 -1785426 -2862680
44012b862680J541671J978959O41966n1274O64369J386854R46710l33684j378062
$$ -2862680 -1321009 657950 1299916 1248642 1913011 3299865 4246575 3912891 2534829
44003B534829j242923J54222J412540P82585j257320k035791m66684J006246N9251
$$ 2534829 1291906 1446128 2858668 3641253 2383933 348142 -118542 887704 946955
43994I46955j697669j158268J271646K218139M99790j392179j344861k94046R9683
$$ 946955 -750714 -1908982 -637336 1580803 2080593 688414 -656447 -950493 -850810
43985h50810o554J98182L57427j39171p19560n88370k08332m69036j039159q54544
$$ -850810 -857364 -659182 -301755 -440926 -1160486 -1748856 -1957188 -2426224 -3465383 -4319927
43975d319927J13158P75692N47349L1179q4226k240k71338p61622p82092j33202
$$ -4319927 -4206769 -3431077 -2883728 -2852549 -2936775 -2939015 -3210353 -3971975 -4754067 -4887269
43965d887269N23046N76239K74304J59607J51247l8957O5902J098772K317558
$$ -4887269 -4364223 -3787984 -3513680 -3354073 -3202826 -3241783 -3175881 -2077109 240449
43956B40449K109783L78097j081749j219666j085088j525759j382932L05636J958625
$$ 240449 2350232 2728329 1646580 426914 -658174 -2183933 -3566865 -3261229 -1302604
43947a302604J636315L70859N88523J916805J640364o88394k283443j491658j55726
$$ -1302604 333711 704570 1293093 3209898 4850262 4161868 1878425 386767 231041
43938B31041l11244j145604r87711j36815K89988N64136J305425J697197R21452
$$ 231041 -80203 -1225807 -2213518 -2350333 -2060345 -1496209 -190784 1506413 2427865
43929B427865J58255Q21259J749573P20444j742223k750503j301692M15280N05754
$$ 2427865 2586120 3407379 5156952 5877396 4135173 1384670 82978 498258 1004012
43920A004012j78851o0225O81205R64114O69949K72610k87726j027466j103671
$$ 1004012 825161 764936 1446141 2410255 3080204 3352814 3065088 2037622 933951
43911I33951N2419J395304J397182J67492p82091o75224j87686p3925k23483k84177
$$ 933951 986370 2381674 3778856 3946348 3164257 2489033 2301347 2227422 2003939 1719762
43901A719762k76728k84690k62455l86337r04801j420749j058617L05289J616014
$$ 1719762 1443034 1158344 895889 509552 -395249 -1815998 -2874615 -2569326 -953312
43892i53312J827958R90000j51694j009174j240250o77286K60514O56137J96907
$$ -953312 874646 1864646 1712952 703778 -536472 -1213758 -953244 -297107 -100200
43883a00200l49886l58499l43311q60454j119563k7399J711194K108450P13751
$$ -100200 -450086 -808585 -1151896 -2012350 -3131913 -3159312 -1448118 660332 1374083
43874A374083n93687k91888O25688K88155j165272j783674o76067O97749N65234
$$ 1374083 780396 488508 1114196 1402351 237079 -1546595 -2222662 -1524913 -959679
43865i59679p65551j407124m59685Q86993J116075M16794O8717K63651n9698j032443
$$ -959679 -1725230 -3132354 -3592039 -2705046 -1588971 -1172177 -1103460 -839809 -899507 -1931950
43855a931950j143570L29915J667194J084921l63095l55788R53656J290276J82800
$$ -1931950 -3075520 -2745605 -1078411 6510 -356585 -712373 241283 1531559 1714359
43846A714359l20975N51530P29548j031215k562970j556270O17075R40458p18419
$$ 1714359 1393384 1944914 2674462 1643247 -919723 -2475993 -1858918 -918460 -1636879
43837a636879j778823r39541M85134R59783L58402o16160q74821O88191L350471
$$ -1636879 -3415702 -4355243 -3870109 -2910326 -2551924 -3168084 -4042905 -3354714 -4243
43828d243L883106K97698m237347m409202P1180L692278K581119o39650j427373
$$ -4243 3878863 4176561 -60786 -4469988 -4398808 -706530 1874589 1234939 -192434
43819a92434K32924R94658j56110r55510j43711N94905k90899j606520j249421
$$ -192434 40490 1035148 879038 -76472 -220183 374722 83823 -1522697 -2772118
43810b772118O73757J981770J227412p03381j890573j576718o07544J6556K63038
$$ -2772118 -2098361 -116591 1110821 407440 -1483133 -3059851 -3667395 -3650839 -3387801
43801c387801M77876M72995L3577j90173N45384J600037J511768J30661j063463
$$ -3387801 -2909925 -2436930 -2403353 -2593526 -2048142 -448105 1063663 1194324 130861
43792A30861j024777k76187L27141O08295L88477p16315k096683k226848q78734
$$ 130861 -893916 -1170103 -842962 -234667 153810 -562505 -2659188 -4886036 -5764770
43783e764770J86233j55770n81330M22880J945835K159783J289231R22388J128440
$$ -5764770 -5578537 -5734307 -6315637 -5892757 -3946922 -1787139 -497908 424480 1552920
43774A552920N96509o59650j090065k53217M79874K66920j55414l13092q95230
$$ 1552920 2149429 1489779 399714 146497 626371 893291 737877 424785 -470445
43765d70445j947512k042267m85876J205416J439826Q48364Q98557J341437R10062
$$ -470445 -2417957 -4460224 -4946100 -3740684 -2300858 -1452494 -553937 787500 1697562
43756A697562j38006k55862P08162J061558l1873j141393p73708L71369N99092
$$ 1697562 1559556 1303694 2011856 3073414 3041541 1900148 1126440 1497809 2096901
43747B096901k05106o24594P145P67583P22693J56256k34446m36145p49999r88609
$$ 2096901 1891795 1267201 1274346 2041929 2764622 2920878 2686432 2250287 1500288 511679
43737E11679p96784l73850j79819k09051j93805k22788m47369m71018J21049Q35061
$$ 511679 -285105 -658955 -838774 -1047825 -1241630 -1464418 -1911787 -2382805 -2261756 -1426695
43727a426695Q31635L07275K34849P00531P25285O410m57659k3531N67171N81322
$$ -1426695 -595060 -287785 -52936 647595 1372880 1379290 921631 898100 1465271 2046593
43717B046593N20493R30270J061430M4264j345757j522012l21590Q45537Q72414
$$ 2046593 2567086 3497356 4558786 4603050 3257293 1735281 1413691 2259228 3131642
43708C131642p0588j186115j696771j161256q3992K68992l40302l07795J401612
$$ 3131642 3061054 1874939 178168 -983088 -1067080 -798088 -1138390 -1446185 -44573
43699d4573K925907J754386j159812k232404m64094J092475J90207j188001l76701
$$ -44573 2881334 4635720 3475908 1243504 779410 1871885 2062092 874091 497390
43690D97390J416764J142197r13448j459622M71959J899652N11866j861617k089436
$$ 497390 1914154 3056351 2142903 683281 1155240 3054892 3566758 1705141 -384295
43681c84295j15125J530240J470703O69173K47247J4389n18308j016936q40910
$$ -384295 -499420 1030820 2501523 3170696 3417943 3432332 2914024 1897088 1056178
43672A056178L5933J048011J534561J063744k00639j301104j219908m0876J091982
$$ 1056178 1092111 2140122 3674683 4738427 4537788 3236684 2016776 1975900 3067882
43663C067882J314314P83293k5963r47478j635767j299869K47519J769862J736771
$$ 3067882 4382196 5165489 5139526 4192048 2556281 1256412 1503931 3273793 5010564
43654E010564J24614j590392k102217j348221j17996P27729P22491Q0073m93184
$$ 5010564 5135178 3544786 1442569 94348 -23648 704081 1426572 1506645 1013461
43645A013461o26936o29399o14148M4722J553010K659797K038738L37554n33508
$$ 1013461 386525 -242874 -857022 -812300 740710 3400507 5439245 5776799 5243291
43636E243291K1773Q80930J265401J508469J632509J055010J98617M27072J542157
$$ 5243291 5265064 6145994 7411395 8919864 10552373 11607383 11806000 12233072 13775229
43627A3775229J360855r31170k933846k311025k94661K49147r11959j466185l51423
$$ 13775229 15136084 14204914 11271068 8960043 8665382 8914529 8002570 6536385 6184962
43618F184962R59303J030096K58130l21480m27992k32859J46944M64007N22646
$$ 6184962 7144265 8174361 8432491 8111011 7683019 7450160 7597104 8061111 8583757
43609H583757O46780J169583J639430J459287J002649J008701J221366Q69139
$$ 8583757 9230537 10400120 12039550 13498837 14501486 15510187 16731553 17600692
43601A7600692J60257q2833J464l89480j043827r56694j51852L57447L75231N13459
$$ 17600692 17760949 17678116 17679580 17290100 16246273 15289579 15137727 15495174 15870405 16383864
43591A6383864L93879j022787k942506k856013j40057K438492K175335j37058
$$ 16383864 16777743 15754956 12812450 9956437 9816380 12254872 14430207 14293149
43583A4293149j652450j160774J37620P67921N10873P6716J29403N26468L26249
$$ 14293149 12640699 11479925 11617545 12385466 12896339 12973055 13102458 13628926 13955175
43574A3955175r51002k163827j683020K75634J742913J594531N96205l89742j466425
$$ 13955175 13004173 10840346 9157326 9432960 11175873 12770404 13366609 12976867 11510442
43565A1510442k406446k194645q28115J52823k7236k65908J37590N6806j141991
$$ 11510442 9103996 6909351 6081236 6234059 6206823 5940915 6078505 6135311 4993320
43556D993320j864832q25297M78938J26611r05778l89110J337455K025640J327319
$$ 4993320 3128488 2303191 2782129 2908740 2002962 1613852 2951307 4976947 6304266
43547F304266J045554J768050K069744J331418P62733J051393J305006J049668
$$ 6304266 7349820 9117870 11187614 12519032 13281765 14333158 15638164 16687832
43539A6687832J152839J873500J931774N85337j010794j609987j611793j909487
$$ 16687832 17840671 19714171 21645945 22231282 21220488 19610501 17998708 16089221
43531A6089221k284204k098619j541407j080081n65811R1806J94605p24550j809089
$$ 16089221 13805017 11706398 10164991 9084910 8519099 8610905 8805510 8080960 6271871
43522F271871j843505q46706J71077O08813O40813O09285Q14020J511625K393022
$$ 6271871 4428366 3581660 3752737 4361550 5002363 5611648 6425668 7937293 10330315
43513A0330315K471343J274291k13983o46252p2295L02433l4952l17001J02271
$$ 10330315 12801658 14075949 13861966 13215714 13143419 13445852 13410900 13093899 13196170
43504A3196170P20698P13277P0464o55730j216058j613876j566900q38245k080
$$ 13196170 13916868 14630145 14700609 14044879 12828821 11214945 9648045 8809800 8807720
43495H807720J533p41999j047647l89828J39487n52708j696906j591993p1084
$$ 8807720 8809253 8067254 7019607 6629779 6769266 6216558 4519652 2927659 2856575
43486B856575J272307J371284R24334J008524J605287K052183K023059J515254
$$ 2856575 4128882 5500166 6424500 7433024 9038311 11090494 13113553 14628807
43478A4628807P11314L28799J179253K841733L737828L123424K015121J533450
$$ 14628807 15340121 15668920 16848173 19689906 23427734 26551158 28566279 30099729
43470C0099729J490497J411547J680939K559895L203643K905879K321102K229393
$$ 30099729 31590226 33001773 34682712 37242607 40446250 43352129 45673231 47902624
43462D7902624K172292J624100J227543J190547j85534m093009q286850r198638
$$ 47902624 50074916 51699016 52926559 54117106 53931572 49838563 41551713 32353075
43454C2353075o648758l926981l224631l524329l292892k644568j963280o73125
$$ 32353075 25704317 21777336 18552705 15028376 11735484 9090916 7127636 6454511
43446F454511J299554K483110J602245o60229k526651k898610j788616K2445J325906
$$ 6454511 7754065 10237175 11839420 11179191 8652540 5753930 3965314 3987759 5313665
43437E313665J382237P08256J97031k27264r20423j133993j29607Q68828J71209
$$ 5313665 6695902 7404158 7601189 7373925 6453502 5319509 5189902 6058730 6229939
43428F229939j223714p86306J098101J113787j641046l631759j983888J298462
$$ 6229939 5006225 4219919 5318020 6431807 4790761 1159002 -824886 473576
43420D73576K489696J181800k75966m87642L03004J686662K833758K079927q76178
$$ 473576 2963272 4145072 3869106 3381464 3684468 5371130 8204888 10284815 9408637
43411I408637l485549l288263j232827J11471L53036P44280J032107j14113k018242
$$ 9408637 5923088 2634825 1401998 1513469 1866505 2610785 3642892 3528779 1510537
43402A510537k309444m08996J764644K694307K628533K001072P54822n25296q85256
$$ 1510537 -798907 -1207903 556741 3251048 5879581 7880653 8635475 8110179 7224923
43393G224923o59223r66169j518209r83344M27891R99024L60833l1431L06609
$$ 7224923 6565700 5599531 4081322 3097978 3525869 4524893 4885726 4854295 5160904
43384E160904N4396j214227j904777j069859k0562J5360j43249N37165J290793
$$ 5160904 5215300 4001073 2096296 1026437 1005875 1021235 877986 1415151 2705944
43375B705944R82959P6292m34751p54446j348152j468878l40398J128897J503264
$$ 2705944 3688903 3765195 3330444 2575998 1227846 -241032 -581430 547467 2050731
43366B050731R17792M09610m5706j003830j680757p19164J279138K042640Q00312
$$ 2050731 2968523 3378133 3332427 2328597 647840 -71324 1207814 3250454 4050766
43357D050766o79681q60586n11905r18824j481068p74930P33559R63373o33741
$$ 4050766 3371085 2510499 1998594 1079770 -401298 -1176228 -442669 520704 -113037
43348a13037j898756q34917J545534K615921J759036Q99160J309399J680972L62062
$$ -113037 -2011793 -2846710 -1301176 1314745 3073781 3972941 5282340 6963312 7325374
43339G325374j843386k679164j592786k63469o4493m58166k41646P15136J464730
$$ 7325374 5481988 2802824 1210038 946569 882076 423910 182264 897400 2362130
43330B362130J089876l75732j664041j160954J148459L002012K253538l46940
$$ 2362130 3452006 3076274 1412233 251279 1399738 4401750 6655288 6308348
43322F308348k131937k034638j362579j025788k36561J215964J614146j28699
$$ 6308348 4176411 2141773 779194 -246594 -483155 732809 2346955 2218256
43314B218256k168771j952750K35353J854804J629179O14905L4595r7790l7830
$$ 2218256 49485 -1903265 -1667912 186892 1816071 2430976 2465571 2367781 2329951
43305B329951L61620Q78214P06817l65741j391999j362431l11463R19117J462961
$$ 2329951 2691571 3569785 4276602 3910861 2518862 1156431 844968 1764085 3227046
43296C227046Q67156n78689j772811j704318o24786K73800M58164N65557J057959
$$ 3227046 4094202 3515513 1742702 38384 -586402 -312602 145562 711119 1769078
43287A769078J244504L11560j248287k046517j456548k19684N78867O19237L45175
$$ 1769078 3013582 3325142 2076855 30338 -1426210 -1645894 -1067027 -447790 -102615
43278a02615K52057L89410M35773J50551k78373m59095l95502n38259r62025q76011
$$ -102615 149442 538852 974625 1125176 846803 387708 -7794 -546053 -1508078 -2384089
43268b384089L68226J886137J825681k22451k176689j709557Q46165K816204K336233
$$ -2384089 -2015863 -129726 1695955 1473504 -703185 -2412742 -1566577 1249627 3585860
43259C585860K19582j455676j627194o90936M39726J000165O52351j97400o19369
$$ 3585860 3805442 2349766 722572 31636 471362 1471527 2123878 1926478 1307109
43250A307109j18588R16711J872750K384043J968664K17810k051560k899872j507436
$$ 1307109 1188521 2105232 3977982 6362025 8330689 8548499 6496939 3597067 2089631
43241B089631N25442J181984N20554m6702j21917l73560p59127m79846L79303
$$ 2089631 2615073 3797057 4317611 4270909 4148992 3775432 3016305 2536459 2915762
43232B915762P65805L00341l53119p10662p12992K7312J614007K693065J776913
$$ 2915762 3681567 3981908 3628789 2918127 2205135 2232447 3846454 6539519 8316432
43223H316432k44932r61215J3779O01074j89209p56754Q6036J076548Q87556K94785
$$ 8316432 8071500 7110285 7124064 7725138 7535929 6779175 6865211 7941759 8829315 9124100
43213I124100K46076j33102j560599k508318j476147J57949J29370j047003j120926
$$ 9124100 9370176 9237074 7676475 5168157 3692010 3849959 3979329 2932326 1811400
43204A811400J9883M21787l39381n80510K65791O41993k02099p34210K70254J634082
$$ 1811400 1831283 2253070 1913689 1333179 1598970 2240963 2038864 1304654 1574908 3208990
43194C208990J599465L13167p57245q46621k66340M18437O94981K84251k73744
$$ 3208990 4808455 5121622 4364377 3517756 3251416 3669853 4364834 4649085 4375341
43185D375341O7253J291047J820955M26845j902347k855848j373283J274026K847318
$$ 4375341 4442594 5733641 7554596 7981441 6079094 3223246 1849963 3123989 5971307
43176E971307K198702J41570j383536j092185M90959J696897J499828M20577l31365
$$ 5971307 8170009 8311579 6928043 5835858 6326817 8023714 9523542 9944119 9612754
43167I612754k65469L7280j62630p38410q28839r7307N42038M4779j150237j538908
$$ 9612754 9347285 9384565 9221935 8483525 7654686 7557379 8099417 8144196 6993959 5455051
43157E455051o08432O17830J325102J865633K393077K038468N53858n82827j86460
$$ 5455051 4846619 5464449 6789551 8655184 11048261 13086729 13640587 13057760 12871300
43148A2871300O36823K09379r62416j132890l22688j45310r03664j166147l98455
$$ 12871300 13508123 13717502 12755086 11622196 11299508 11154198 10250534 9084387 8685932
43139H685932J86601j07738l80164k2087J54881m31340r77246p46920k48039p976
$$ 8685932 8872533 8764795 8384631 8362544 8517425 8086085 7108839 6361919 6113880 6105904
43129F105904M39788J302245J575163N66699p15977r71475m87540l21103l71935
$$ 6105904 6545692 7847937 9423100 9989799 9273822 8302347 7814807 7493704 7121769
43120G121769K51032J331574J493464J85323j367993j604821m26083Q42339J068255
$$ 7121769 7372801 8704375 10197839 10383162 9015169 7410348 6984265 7826604 8894859
43111H894859N40007L71362Q32183R12698o5633j126998q56260M98407J293497
$$ 8894859 9434866 9806228 10638411 11551109 11485476 10358478 9502218 10000625 11294122
43102A1294122P34425k84020n96452M3139J195865K069383J642265l36104k424745
$$ 11294122 12028547 11744527 11148075 11191214 12387079 14456462 16098727 15762623 13337878
43093A3337878k773114j326857M53170J800940K936580L391138K225723K04667
$$ 13337878 10564764 9237907 9691077 11492017 14428597 17819735 20045458 20250125
43085B0250125n12045M91310J247318P23824M29592J476315K393023J656294M32722
$$ 20250125 19738080 20229390 21476708 22200532 22630124 24106439 26499462 28155756 28588478
43076B8588478P38565K332870L426911L328327K609999J756671J306583K226850
$$ 28588478 29327043 31659913 35086824 38415151 41025150 42781821 44088404 46315254
43068D6315254M532430O609430P328688P528008Q086196Q380132Q388260J0137697
$$ 46315254 50847684 57457114 64785802 72313810 80400006 88780138 97168398 107306095
43060A07306095J4567440J8929118K0300724K0027749K1343552K3972028K4849613
$$ 107306095 121873535 140802653 161103377 181131126 202474678 226446706 251296319
43053B51296319K3325526K1733345K1222811K0808858J9958568J7648283R219091
$$ 251296319 274621845 296355190 317578001 338386859 358345427 375993710 385212801
43046C85212801r888440l5358182n4170237n6969416m7009901l4256043k4374151
$$ 385212801 375324361 339966179 285795942 228826526 181816625 147560582 123186431
43039A23186431j7031824j1475074q422958p325131o102241m026370k188917j097648
$$ 123186431 106154607 94679533 86256575 78931444 72829203 68802833 66613916 65516268
43031F5516268k9913J328157K473729L136137L327669K979254K794750M270483
$$ 65516268 65486355 66814512 69288241 72424378 75752047 78731301 81526051 85796534
43023H5796534P323380R505231R614836J0229214J3859393J8404215K0074163
$$ 85796534 93119914 102625145 112239981 122469195 136328588 154732803 174806966
43016A74806966J9442112K0132194K2182698K1975956J9290482J8696267K1799254
$$ 174806966 194249078 214381272 236563970 258539926 277830408 296526675 318325929
43009C18325929K3616585K0283635J5231475J2190549O018814j1693798l8311081
$$ 318325929 341942514 362226149 377457624 389648173 395666987 383973189 345662108
43002C45662108n8825832o1375806m9189550l4456343k4758615j9340579j5281374
$$ 345662108 286836276 225460470 176270920 141814577 117055962 97715383 82434009
42995H2434009j1852094r152815o764553m915093m520462n196103n094269l456692
$$ 82434009 70581915 61429100 54664547 49749454 45228992 40032889 34938620 31481928
42987C1481928j735424j416840k089222k477999k257212j940646j787149j621411
$$ 31481928 29746504 28329664 26240442 23762443 21505231 19564585 17777436 16156025
42979A6156025j231529m66259N25195R10552j59605k139295l201386k273153k43446
$$ 16156025 14924496 14458237 14983432 15893984 15734379 13595084 10393698 8120545 7877099
42970G877099J245506J421832N01333p90579j356291m82671R77629J324335M37598
$$ 7877099 9122605 10544437 11045770 10255191 8898900 8416229 9393858 10718193 11155791
42961A1155791J8614O69619O54920r86320k079714l84606K469104K992923R86054
$$ 11155791 11174405 11844024 12498944 11512624 9432910 9048304 11517408 14510331 15496385
42952A5496385m60236L7189M38415p46297j897410j240789J33968J98847q21213
$$ 15496385 15036149 15073338 15511753 14765456 12868046 11627257 11761225 11960072 11138859
42943A1138859j219057n94783L4496J65258J58024J30181p5311j79833O4792J09983
$$ 11138859 9919802 9325019 9359515 9524773 9682797 9812978 9737667 9557834 9622626 9732609
42933I732609n32531j127676o99042J71481j1087j209296j543758N4666K056506
$$ 9732609 9200078 8072402 7373360 7544841 7533754 6324458 4780700 4835366 6891872
42924F891872K111495K5481k021797k197022j068775m34152o97329n12467Q62579
$$ 6891872 9003367 9028848 7007051 4810029 3741254 3307102 2609773 2097306 2959885
42915B959885K128639J754101K82328m89526q8004L81822K88720J29328J03923
$$ 2959885 5088524 6842625 7124953 6635427 6547423 6929245 7217965 7347293 7451216
42906G451216k44521o77214k56538Q37896J217030N88948K99222P77781N14029
$$ 7451216 7206695 6529481 6272943 7110839 8327869 8916817 9216039 9993820 10507849
42897A0507849j161258k322270j260814O81468J174834L82525Q4837M06706o0817
$$ 10507849 9346591 7024321 5763507 6444975 7619809 8002334 8087171 8493877 8433060
42888H433060j411301k125309j542321n67166J21400P48730J288383J262961P26890
$$ 8433060 7021759 4896450 3354129 2786963 2908363 3657093 4945476 6208437 6935327
42879F935327Q1139p94328j833467j906313m47218Q42389J86916j104339m55757
$$ 6935327 7016466 6222138 4388671 2482358 2035140 2877529 3064445 1960106 1504349
42870A504349J495459J627522l57135j166686N70392J940524P85499n98038L88447
$$ 1504349 2999808 4627330 4270195 3103509 3673901 5614425 6399924 5801886 6190333
42861F190333J988748J212120p59795m54389J937242K803070R83548p47498n99503
$$ 6190333 8179081 9391201 8631406 8177017 10114259 12917329 13900877 13153379 12553876
42852A2553876l03435j391690k279489j122127R00387J482717O89234K83652P12446
$$ 12553876 12250441 10858751 8579262 7457135 8357522 9840239 10529473 10813125 11525571
42843A1525571R49464O75969N53398N95473J48986m56911O2080J916701L637320
$$ 11525571 12475035 13151004 13704402 14299875 14448861 13991950 14054030 15970731 19608051
42834A9608051L991008L371473K764844K385350K009734J774272J806441J659137
$$ 19608051 23599059 26970532 29735376 32120726 34130460 35904732 37711173 39370310
42826C9370310Q92509k04766j136802j986930k955903l550602l141196k129120
$$ 39370310 40262819 40058053 38921251 36934321 33978418 30427816 27286620 25157500
42818B5157500j663988k188302k984531l154911k393678r02924O93582J460909
$$ 25157500 23493512 21305210 18320679 15165768 12772090 11869166 12562748 14023657
42810A4023657J032092K84357K16638L69771l53448j416853r83698J051963K310119
$$ 14023657 15055749 15340106 15556744 15926515 15573067 14156214 13172516 14224479 16534598
42801A6534598J283356k90913K3309J853434K961904K706074K440710K930992
$$ 16534598 17817954 17527041 17550350 19403784 22365688 25071762 27512472 30443464
42793C0443464L416912L215605K482060J300690l79575j833936k146014j778904
$$ 30443464 33860376 37075981 39558041 40858731 40479156 38645220 36499206 34720302
42785C4720302k008086k777444k875103k335427k607618l860738m266817k889341
$$ 34720302 32712216 29934772 27059669 24724242 22116624 18255886 13989069 11099728
42777A1099728j288006j017390j359274j045710n71214r31336j370847n19907
$$ 11099728 9811722 8794332 7435058 6389348 5818134 4886798 3515951 2996044
42769B996044R91592J182249k69934j546197j285170p7421Q58296J126555R01745
$$ 2996044 3987636 5169885 4899951 3353754 2068584 1991163 2849459 3976014 4877759
42760D877759L13298m13635q66027q24533l70549L44493J005603J044616K40442
$$ 4877759 5191057 4777422 3911395 3086862 2716313 3060806 4066409 5111025 5351467
42751E351467p77298j181819q67442k30860M82860R50270N10399q51556j755503
$$ 5351467 4574169 3392350 2524908 2294048 2776908 3727178 4237577 3386021 1630518
42742A630518r14467Q78194J595882P67101l4261K90429R02384P47218K91891
$$ 1630518 716051 1594245 3190127 3957228 3922967 4213396 5115780 5862998 6154889
42733F154889L84985M59846n85665k190078k450781q30606Q87326J012124J51617
$$ 6154889 6539874 6999720 6414055 4223977 1773196 942590 1829916 2842040 2993657
42724B993657p8286K90402j79764j579585j987403l10954J754739J981213P24938
$$ 2993657 2915371 3205773 3026009 1446424 -540979 -851933 902806 2884019 3608957
42715C608957O8132N17775O04718l25932j050876o69578L4116K00067J68935K78884
$$ 3608957 3677089 4194864 4799582 4473650 3422774 2753196 2787312 2987379 3156314 3435198
42705C435198K7572n75451m90899L76107M71690p19252j215283K93452J695115
$$ 3435198 3462770 2887319 2396420 2772527 3244217 2524965 1309682 1603134 3298249
42696C298249M47458k161196k777984j069255K76979K31542N29705J747764J880366
$$ 3298249 3745707 1584511 -1193473 -2262728 -1985749 -1754207 -1224502 523262 2403628
42687B403628P8346j362146o00397P05747J11095j792674k508710j251037O54583
$$ 2403628 2481974 1119828 519431 1225178 1336273 -456401 -2965111 -4216148 -3561565
42678c561565K010053K481634J848349L17217q71288o95572J37893K21470m57532
$$ -3561565 -1551512 930122 2778471 3095688 2224400 1528828 1666721 1888191 1430659
42669A430659p24990j44320N22302N64667N176p43674j085790n21394N22737P87605
$$ 1430659 705669 561349 1083651 1648318 1653494 909820 -175970 -697364 -174627 612978
42659F12978n0799n79844K68732J312902Q44446n38815p58342M45996J124760
$$ 612978 562179 -17665 251067 1563969 2408415 1869600 1111258 1557254 2682014
42650B682014K02967r93500r27175J9377M64650o2012r65119j520148j291910
$$ 2682014 2884981 1891481 964306 983683 1448333 1386321 421202 -1098946 -2390856
42641b390856k70581Q75567J224005O45964n3430k01014J19709N45519P94019
$$ -2390856 -2661437 -1785870 -561865 84099 30669 -170345 -50636 494883 1288902
42632A288902N14711l67172j111299r11873k07319j18620n58404l52079N22753
$$ 1288902 1803613 1436441 325142 -586731 -794050 -912670 -1471074 -1823153 -1300400
42623a300400O15468l66092n63947J007948K268442R81692j446387j683624N60747
$$ -1300400 -684932 -1051024 -1614971 -607023 1661419 2643111 1196724 -486900 73847
42614G3847K061169Q46808j190606j489852l94991P3909n62078j122291r41477
$$ 73847 2135016 2981824 1791218 301366 -93625 -19716 -581794 -1704085 -2645562
42605b645562l73369L72984J242642J469897L65086j064858r65523O12326J476781
$$ -2645562 -3018931 -2645947 -1403305 66592 431678 -633180 -1598703 -986377 490404
42596D90404M46635q78862n93382O70623R34105j0778n26056J25872Q08214N64141
$$ 490404 937039 58177 -535205 135418 1069523 1058745 532689 658561 1466775 2030916
42586B030916M1767J67558O25827N73626M4372k73281j31549J71721L67613K39837
$$ 2030916 2072683 2240241 2866068 3439694 3484066 3210785 3079236 3250957 3618570 3858407
42576C858407m78958j538953j926245r70518O01169J478646J349344Q64159L48748
$$ 3858407 3379449 1840496 -85749 -1056267 -455098 1023548 2372892 3237051 3585799
42567C585799m00614j122851j061055k11341L75000j1241p86363r40550k06263
$$ 3585799 3185185 2062334 1001279 789938 1164938 1153697 367334 -573216 -779479
42558g79479R74943J946955J977816P75010o43358n62358J169923K441542J509901
$$ -779479 195464 2142419 4120235 4895245 4251887 3689529 4859452 7300994 8810895
42549H810895m99342j131659m6272Q15120L39315m05264l34759m86j23146p7504
$$ 8810895 8311553 7179894 7133622 7948742 8288057 7882793 7548034 7547548 7424402 7346898
42539G346898P98689J590370J072977k33454q99611q61285j106153j500845r51326
$$ 7346898 8145587 9735957 10808934 10575480 9675869 8814584 7708431 6207586 5256260
42530E256260K52797M19543o71806j005334M73613J835717R77723j074105j705670
$$ 5256260 5509057 5928600 5256794 4251460 4725073 6560790 7538513 6464408 4758738
42521D758738n89646K01949m07595j174552q10989K85976J109505J348555J045395
$$ 4758738 4169092 4371041 3963446 2788894 1977905 2263881 3373386 4721941 5767336
42512E767336K56237l65610J05342J307338J581491L23267q37777k59640J308618
$$ 5767336 6023573 5657963 5763305 7070643 8652134 8975401 8137624 7877984 9186602
42503I186602J833564Q60402j20101K5562O73068O11880k19299o71089J26598
$$ 9186602 11020166 11880568 11760467 11786029 12459097 13070977 12851678 12180589 12307187
42494A2307187J466758J542765m39448k908333l504618j985114m61255m85932
$$ 12307187 13773945 15316710 14877262 11968929 8464311 6479197 6017942 5532010
42486E532010j221298j205397n96278m33623o67978l93445M91217J164819J094101
$$ 5532010 4310712 3105315 2509037 2075414 1407436 1013991 1505208 2670027 3764128
42477C764128L50224p70707j499644q25095P91293R95954j379107l774887k784275
$$ 3764128 4114352 3343645 1844001 1018906 1810199 2806153 1427046 -2347841 -5132116
42468e132116R38395L306688K335000K12580o60888p31785j128886j208375k12338
$$ -5132116 -4193721 -887033 1447967 1660547 999659 267874 -861012 -2069387 -2281725
42459b281725P50558N08565o2735J85928L56068p55680j943544j188840R50631
$$ -2281725 -1531167 -1022602 -1085337 -899409 -543341 -1299021 -3242565 -4431405 -3480774
42450c480774K132877J761343J114010M76946r29390k261286j442796J151823
$$ -3480774 -1347897 413446 1527456 2004402 1075012 -1186274 -2629070 -1477247
42442a477247K386560Q77583q59281l11153J365454J546858J27411r26512p74399
$$ -1477247 909313 1786896 927615 616462 1981916 3528774 3656185 2729673 1955274
42433A955274l11576k95353o61786j198646j442479n44682J346387K335064J012302
$$ 1955274 1643698 1348345 686559 -512087 -1954566 -2499248 -1152861 1182203 2194505
42424B194505j224485j817995n12925O50020M70075k21295m85665m94615m97143
$$ 2194505 970020 -847975 -1360900 -710880 -240805 -462100 -947765 -1442380 -1939523
42415a939523j84008M83748J073047J485050J750619J190248o24322k245668j724071
$$ -1939523 -2123531 -1639783 -566736 918314 2668933 3859181 3234859 989191 -734880
42406g34880K76756J034228j19463q05646L42429J399785O12754n02695J8626
$$ -734880 -458124 576104 456641 -349005 -6576 1393209 2005963 1503268 1521894
42397A521894Q63839l62399k652405k744200k15741J903334J752626P90487O80953
$$ 1521894 2385733 2023334 -629071 -3373271 -3589012 -1685678 66948 857435 1538388
42388A538388Q56779L60230k10343n1701K73139j1724n16222o06146m66256k64335
$$ 1538388 2395167 2755397 2545054 2493353 2766492 2754768 2238546 1632400 1166144 901809
42378I01809M16778J302291J027436p38111k153589j649699k27962L30497L21799
$$ 901809 1318587 2620878 3648314 2910203 756614 -893085 -1121047 -790550 -468751
42369d68751J107178K134125J476894p52751j968948o95243J381079J878566O96336
$$ -468751 638427 2772552 4249446 3496695 1527747 832504 2213583 4092149 4788485
42360D788485o11822j229810j474345j486466r48838k2099N46531M50385J57810
$$ 4788485 4176663 2946853 1472508 -13958 -962796 -984895 -438364 12021 169831
42351A69831k3131m32086j111546j096573L88973K324025K688379J098487n70456
$$ 169831 146700 -285386 -1396932 -2493505 -2104532 219493 2907872 4006359 3435903
42342C435903q18688m83110q83961j261722m3242K015416K427885Q22193l71757
$$ 3435903 2617215 2134105 1250144 -11578 -54820 1960596 4388481 5210674 4838917
42333D838917J81914P11844l61475j538477q10903Q15443J030130J26438K50163
$$ 4838917 5020831 5732675 5371200 3832723 3021820 3837263 4867393 4993831 5243994
42324E243994J427119J444609k42234j441610p53003M12337M15211k07468k80779
$$ 5243994 6671113 8115722 7873488 6431878 5678875 6091212 6506423 6298955 6018176
42315F018176j35806o56798j494381j768317j622673j647325j438741j73393J672507
$$ 6018176 5882370 5225572 3731191 1962874 340201 -1307124 -2745865 -2919258 -1246751
42306a246751K432167J222112r10247j999921j085617Q45127J812580R49146n41706
$$ -1246751 1185416 2407528 1497281 -502640 -1588257 -743130 1069450 2018596 1476890
42297A476890r46604j65549N26347M45456N5359k36649m48596k02739R24842K060843
$$ 1476890 530286 364737 891084 1336540 1391899 1155250 706654 503915 1428757 3489600
42287C489600J701331Q2814q60956m02252P0125k39533j59030Q65664J128735
$$ 3489600 5190931 5273745 4412789 4010537 4080662 3841129 3682099 4547763 5676498
42278E676498m54930j843428o98164J778995K514857J014726o31348j439085k200233
$$ 5676498 5221568 3378140 2679976 4458971 6973828 7988554 7357206 5918121 3717888
42269C717888k699760j456619J187631K554614J278715p91182j453681r05521
$$ 3717888 1018128 -438491 749140 3303754 4582469 3791287 2337606 1432085
42261A432085m20409j18458M81271J062776J072828P00345K79096k81066p04327
$$ 1432085 1011676 893218 1374489 2437265 3510093 4210438 4489534 4208468 3504141
42252C504141k70322O91422P77774n4708J15825J935604K948954J157982j361483
$$ 3504141 3233819 3925241 4703015 4648307 4764132 6699736 9648690 10806672 9445189
42243I445189j224490J063549J912458J80824j538524j450981r17952j197244
$$ 9445189 8220699 9284248 11196706 11377530 9839006 8388025 7470073 6272829
42235F272829j055958N27344J992126J795942J141361J558883J720045k98503
$$ 6272829 5216871 5744215 7736341 9532283 10673644 12232527 13952572 13654069
42227A3654069l003501l208415j080130J50633n18885o40239Q80127J613474N6290
$$ 13654069 10650568 7442153 6362023 6512656 5993771 5353532 6233659 7847133 7903423
42218G903423j206194M56704L141678L183140P94869n80634K72547J048259R2767
$$ 7903423 6697229 7153933 10295611 13478751 14273620 13692986 13965533 15013792 15106559
42209A5106559j328913j638991j172998p87258l80310R0780j11319j082491j591259
$$ 15106559 13777646 12138655 10965657 10178399 9798089 9888869 9777550 8695059 7103800
42200G103800q61782K14405N60884L70621J75009k85476j200979j774223j270153
$$ 7103800 6242018 6456423 7017307 7387928 7562937 7277461 6076482 4302259 3032106
42191C032106j91309M89429N38403K36827j91841l56919Q7561M97887k31461j629284
$$ 3032106 2840797 3330226 3868629 4105456 3913615 3556696 3644257 4142144 3910683 2281399
42181B281399j718059J8594J503747J143228J98601L90091R13700J30823j168829
$$ 2281399 563340 581934 2085681 3228909 3427510 3817601 4731301 4862124 3693295
42172C693295r15634O03784J093615P0193m10753P20078J728453P53560j457552
$$ 3693295 2777661 3381445 4475060 4545253 4134500 4854578 6583031 7336591 5879039
42163E879039k567757j373492J137092K715780J708007j194986l215116k487563
$$ 5879039 3311282 1937790 3074882 5790662 7498669 6303683 3088567 601004
42155F01004m00804L40041n84084j157002m45412K77293Q0958j63310L62506R80490
$$ 601004 200200 540241 -43843 -1200845 -1646257 -1368964 -1288006 -1451316 -1088810 -108320
42145a08320Q80328M19731J84638O8299J2457L45427P45169L03442p05347p06293
$$ -108320 772008 1191739 1376377 1444676 1457133 1802560 2547729 2851171 2145824 1439531
42135A439531O68915J607300P82022n76402o83195J07039K61529l30409n09787
$$ 1439531 2108446 3715746 4497768 3921366 3238171 3345210 3606739 3276330 2766543
42126B766543Q176L45662J13485o4575K86951Q49181J094129Q18096J60006l92938
$$ 2766543 2774719 3120381 3233866 3169291 3456242 4305423 5399552 6217648 6377654 5984716
42116E984716k36584O45629J455772J392685M01004r73000j916058j571457J19439
$$ 5984716 5748132 6393761 7849533 9242218 9643222 8670222 6754164 5182707 5302146
42107E302146J659647J254453p91833k156875j496039o7927L07922m28748j180030
$$ 5302146 6961793 8216246 7424413 5267538 3771499 3703572 4011494 3582746 2402716
42098B402716j313272o81315P20003K033350J770904j9156j145228k43329J007746
$$ 2402716 1089444 408129 1128132 3161482 4932386 4913230 3768002 3524673 4532419
42089D532419L93530j344272j660424m7330J536094J725021J079991L89198l49398
$$ 4532419 4925949 3581677 1921253 1873923 3410017 5135038 6215029 6604227 6254829
42080F254829r84210r76507n21084n05905j016010j111863l78911M28712N44786
$$ 6254829 5270619 4294112 3773028 3267123 2251113 1139250 760339 1189051 1733837
42071A733837K7927o63868j046228o53911L12143O06274o43425k339402k517577
$$ 1733837 1761764 1097896 51668 -602243 -290100 316174 -327251 -2666653 -5184230
42062e184230r42093P19749J265565J117474J057463J211574J513771J905203
$$ -5184230 -6126323 -5406574 -4141009 -3023535 -1966072 -754498 759273 2664476
42054B664476J855293Q79940l51017o79942k69414l14276q97099q52173q5711
$$ 2664476 4519769 5399709 5048692 4368750 4099336 3785060 2887961 2035788 1950077
42045A950077r3809j326015j867931j59901K293755K612462L31859j983358j872862
$$ 1950077 1856268 530253 -1337678 -1497579 796176 3408638 3740497 1757139 -115723
42036a15723L15487K112042J807037K59388l54488N55576J187793J6076j775276
$$ -115723 199764 2311806 4118843 4378231 4023743 4579319 5767112 5783188 4007912
42027D007912j917969m03298P15056O06052N15367J048578R90886k09215r90709
$$ 4007912 2089943 1686645 2401701 3007753 3523120 4571698 5562584 5353369 4362660
42018D362660j82532Q87885N23745o28069r17106m89850o07802j072015o63565
$$ 4362660 4180128 5068013 5591758 4963689 4046583 3556733 2948931 1876916 1213351
42009A213351K91804K08999q52133r34236N59305J507394J44465k168284k748716
$$ 1213351 1505155 1714154 862021 -72215 487090 1994484 2138949 -29335 -2778051
42000b778051j101242R36095J909565J990225J663474Q21517l61950r36060l97252
$$ -2778051 -3879293 -2943198 -1033633 956592 2620066 3441583 3079633 2143573 1746321
41991A746321M25455N86605M26676P02072R20168K2784j446938j601539m6707
$$ 1746321 2171776 2758381 3185057 3887129 4807297 4830081 3383143 1781604 1734897
41982A734897J233786P07073n68396q90071n32306o92931j010874l12981Q43319
$$ 1734897 2968683 3675756 3107360 2217289 1684983 992052 -18822 -331803 511516
41973E11516P71307l32581l94683J120470K075233Q38280j283099j964069q36298
$$ 511516 1282823 950242 555559 1676029 3751262 4589542 3306443 1342374 506076
41964E06076N99238J048765M79283k09402l7758Q77154J017097n68945k258209
$$ 506076 1105314 2154079 2633362 2423960 2386202 3263356 4280453 3711508 1453299
41955A453299j614842Q43710J958780N33888r68587n05446M29016k74130j585682
$$ 1453299 -161543 682167 2640947 3174835 2206248 1700802 2129818 1855688 270006
41946B70006j116151Q61987J869768Q73594r00776k212360k677929j909400N7798
$$ 270006 -846145 15842 1885610 2759204 1858428 -353932 -3031861 -4941261 -4883463
41937d883463J762774J730120O53723L44356Q65200P15760l82318j035014n72199
$$ -4883463 -3120689 -1390569 -736846 -392490 472710 1188470 806152 -228862 -801061
41928h01061J36070M94334R29064J495087J490083Q58557M09723L28177K823m44487
$$ -801061 -664991 -170657 758407 2253494 3743577 4602134 5011857 5340034 5342857 4898370
41918D898370j06220R40361J450287R33878J68820m35050j219716j800816j242166
$$ 4898370 4792150 5732511 7182798 8116676 8285496 7850446 6630730 4829914 3587748
41909C587748j43258l17773j654487j695512M79957K367040J714407j35378p15825
$$ 3587748 3444490 3126717 1472230 -223282 256675 2623715 4338122 4202744 3486919
41900C486919k92054o47424j495855j083979L81952R07420J67868l9334Q72497
$$ 3486919 3194865 2547441 1051586 -32393 349559 1256979 1424847 1385513 2258010
41891B258010J173947j33728j543086j526287q17281p58753r89050m32794O08890
$$ 2258010 3431957 3298229 1755143 228856 -588425 -1347178 -2336228 -2769022 -2160132
41882b160132J083548J053869J236212J300442M19246q24383r40943M7987N30702
$$ -2160132 -1076584 -22715 1213497 2513939 2933185 2108802 1167859 1215846 1746548
41873A746548q9700o00672l79928n70823j680875j930180J07122K637535K795612
$$ 1746548 1656848 1056176 676248 105425 -1575450 -3505630 -3398508 -760973 2034639
41864B034639R01164J1921J338531K705082K126230M83807m92189q23864j303311
$$ 2034639 2935803 2947724 4286255 6991337 9117567 9601374 9109185 8285321 6982010
41855F982010j527300p37013L98655N60023k77941j079769j333272j130172l64233
$$ 6982010 5454710 4717697 5116352 5676375 5398434 4318665 2985393 1855221 1490988
41846A490988P84683J257347M97352k23950M71953J598119J011234j157068k425614
$$ 1490988 2275671 3533018 4030370 3806420 4278373 5876492 6887726 5730658 3305044
41837C305044j561112j66356K4338m41295j77500O24324P19718J5351k20010O48537
$$ 3305044 1743932 1577576 1601914 1160619 983119 1607443 2327161 2342512 2122502 2771039
41827B771039J466557O94879j334483k313329o90862J909350K272208j69779k267405
$$ 2771039 4237596 4932475 3597992 1284663 593801 2503151 4775359 4605580 2338175
41818B338175j331733J173163J849053R7748j598651j531023m88812L35934Q68194
$$ 2338175 1006442 2179605 4028658 4126406 2527755 996732 507920 843854 1712048
41809A712048J175005R50855M96658N30002O86313n8797j250151j231507N0681
$$ 1712048 2887053 3837908 4334566 4864568 5550881 5492084 4241933 3010426 3061107
41800C061107O67017k49894j269050j275937j048452j158450o59499O71070J071585
$$ 3061107 3728124 3478230 2209180 933243 -115209 -1273659 -1933158 -1262088 -190503
41791a90503l37001j458725k17161K024552K466621J038923K9428L54997P32725
$$ -190503 -527504 -1986229 -2203390 -178838 2287783 3326706 3356134 3711131 4443856
41782D443856K72192m07941p49849j036948j325157j098147l13624L16870L09511
$$ 4443856 4716048 4308107 3558258 2521310 1196153 98006 -215618 101252 410763
41773D10763j20357n53797p14628n32223l25795m83468o57710j25389P35142O18531
$$ 410763 290406 -263391 -978019 -1510242 -1836037 -2319505 -2977215 -3102604 -2367462 -1748931
41763a748931n00770r52238m8599O68657J47075k52623O19761J216941p9677j625570
$$ -1748931 -2249701 -3201939 -3250538 -2581881 -2434806 -2687429 -2067668 -850727 -930404 -2555974
41753b555974q67465J207299J376423o58092j903338r01592M41739M44786k347
$$ -2555974 -3423439 -2216140 -839717 -1497809 -3401147 -4302739 -3861000 -3416214 -3418561
41744c418561K98340Q25004P76573M87503L72629K29994L08328J204370K092382
$$ -3418561 -3120221 -2295217 -1518644 -1031141 -658512 -428518 -120190 1084180 3176562
41735C176562J157136j396654k905190j860857O9301Q40052Q56564J489200K429204
$$ 3176562 4333698 2937044 31854 -1829003 -1759702 -919650 -63086 1426114 3855318
41726C855318K263888O61376j383521k722692k652983j316455p7976k73531j166342
$$ 3855318 6119206 6780582 5397061 2674369 21386 -1295069 -1373045 -1646576 -2812918
41717b812918p69352Q79614J446989J62506n82416Q98952K534506J589897j091894
$$ -2812918 -3582270 -2702656 -1255667 -1093161 -1675577 -776625 1757881 3347778 2255884
41708B255884k556532k042620j096946l98984O29900J495735Q17877r31237j411677
$$ 2255884 -300648 -2343268 -3440214 -3839198 -3209298 -1713563 -895686 -1826923 -3238600
41699c238600K02699J888021J666549J96485n30724Q1946Q45693N46341o68886
$$ -3238600 -3035901 -1147880 518669 715154 184430 266376 1112069 1658410 989524
41690I89524j554908j169609L7800Q06686P26537N49312N99172J03723j069374
$$ 989524 -565384 -1734993 -1697193 -890507 -163970 385342 984514 1088237 18863
41681A8863j378990J81946J916262J422047q09606j934337q14937O18842N12319
$$ 18863 -1360127 -1178181 738081 2160128 1350522 -583815 -1398752 -779910 -267591
41672b67591m21437n29165K32503P06432N64904N61649J027088J200646L14667
$$ -267591 -689028 -1218193 -985690 -279258 285646 847295 1874383 3075029 3389696
41663C389696j190428j959722j253088J32993Q35753N98467K77494K73978P0412
$$ 3389696 2199268 239546 -1013542 -880549 -44796 553671 831165 1105143 1175555
41654A175555m07611l55366K63434J27488j181454j810451k51673J941463K195738
$$ 1175555 767944 412578 676012 803500 -377954 -2188405 -2440078 -498615 1697123
41645A697123P01891l13518m03112j062851k224042j839441L07591J506911K67079
$$ 1697123 2399014 2085496 1682384 619533 -1604509 -3443950 -3136359 -1629448 -1362369
41636a362369j188722m74617J278510J610231O69185K82183M51002k70774j553710
$$ -1362369 -2551091 -3025708 -1747198 -136967 532218 814401 1265403 994629 -559081
41627e59081j429018K59115J262268M44945m94747N8359J014639M87812j070059
$$ -559081 -1988099 -1728984 -466716 -21771 -516518 -458159 556480 1044292 -25767
41618b5767j542611l39281R09250Q59235R3459k24148o9319o0254j06050K94178
$$ -25767 -1568378 -1907659 -998409 -139174 -45715 -269863 -339182 -399436 -505486 -211308
41608b11308P80242L95976p96881j508116r86844L3007O68252J075936J518117
$$ -211308 568934 964910 168029 -1340087 -2326931 -2293924 -1625672 -549736 968381
41599I68381J367713K48688q01708q08171o47562j505235k237237p27358K219094
$$ 968381 2336094 2584782 1783074 974903 327341 -1177894 -3415131 -4142489 -1923395
41590a923395L154844R36203j316776p06600J374383J770298K79277p47332m02939
$$ -1923395 1231449 2167652 850876 144276 1518659 3288957 3568234 2820902 2417963
41581B417963r5315p20822j377660j137779k64086O32617J200357R97471j00853
$$ 2417963 2322648 1601826 224166 -913613 -1177699 -545082 655275 1652746 1551893
41572A551893j140589j069444l46580j31649j68599O53900J750211J153381j133531
$$ 1551893 411304 -658140 -1004720 -1136369 -1304968 -651068 1099143 2252524 1118993
41563A118993k420872j026746J324340K119166J254084M6736j227033k717655
$$ 1118993 -1301879 -2328625 -1004285 1114881 2368965 2415701 1188668 -1528987
41555a528987l178868j270692J699165K681960Q23718j372009j370879M30512
$$ -1528987 -4707855 -5978547 -4279382 -1597422 -773704 -2145713 -3516592 -3086080
41547c086080J857797J887403J332917J133814J015288J06372j528284k528596
$$ -3086080 -1228283 659120 1992037 3125851 4141139 4247511 2719227 190631
41539A90631j785382o1094P78032K54256j24302O75492J458735P41192o70875
$$ 190631 -1594751 -1655845 -877813 -623557 -747859 -72367 1386368 2127560 1456685
41530A456685q57673P0379J59340j043852j569473j58720J633044J675284J49571
$$ 1456685 599012 669391 828731 -215121 -1784594 -1943314 -310270 1365014 1514585
41521A514585j146950j288297o29851M04252J463078J740040P70445m69701n71714
$$ 1514585 367635 -920662 -1550513 -1146261 316817 2056857 2827302 2357601 1785887
41512A785887K96548O36775r7326p45005l07041N54372N37974m95388j453381
$$ 1785887 2082435 2719210 2621884 1876879 1569838 2124210 2662184 2166796 713415
41503G13415j433447o76184j30087l13245p07339m11034N78745J135700M00683
$$ 713415 -720032 -1396216 -1526303 -1839548 -2546887 -2957921 -2379176 -1243476 -842793
41494h42793r57352j432668m36707J177092K162100J894529N49309j039271j736891
$$ -842793 -1800145 -3232813 -3669520 -2492428 -330328 1564201 2113510 1074239 -662652
41485f62652r95820N11488J550305J521782O54328n88923j647719j837459j053736
$$ -662652 -1658472 -1146984 403321 1925103 2579431 1990508 342789 -1494670 -2548406
41476b548406j86568M9917K44200J137210J933504J366275O1342j91175N01440
$$ -2548406 -2734974 -2685057 -2440857 -1303647 629857 1996132 2057474 1866299 2367739
41467B367739J84230j356563j725305J20726J673914O62552j267036j315468j21776
$$ 2367739 2551969 1195406 -529899 -409173 1264741 1927293 660257 -655211 -776987
41458g76987k91365j479827p87081J957247L162755Q91741j982402j992991M0989
$$ -776987 -1068352 -2548179 -3335260 -1378013 1784742 2676483 694081 -1298910 -1257921
41449a257921P95627n08148j493244n08469J230810J707541P13265l16231l10390
$$ -1257921 -462294 -970442 -2463686 -2972155 -1741345 -33804 679461 363230 52840
41440E2840K71962K60002n59620j077539m64207N05457O28828K15989M17428R42867
$$ 52840 324802 584804 25184 -1052355 -1516562 -1011105 -382277 -166288 251140 1194007
41430A194007M33964p23464l78265J644369K296149l21605l479489l324641l92495
$$ 1194007 1627971 904507 526242 2170611 4466760 4145155 665666 -2658975 -3051470
41421c051470J408422N67322n43724m3144Q47672N73383j39721o9628J94131l56547
$$ -3051470 -1643048 -1075726 -1619450 -1662594 -814922 -241539 -381260 -450888 -256757 -613304
41411f13304r08195L603J887555K702656J571399l62123j635546j813750j203949
$$ -613304 -1521499 -1517896 369659 3072315 4643714 4281591 2646045 832295 -371654
41402c71654l30628J76392j9975n32109p23500n28241k95430n3322M24463R76830
$$ -371654 -702282 -525890 -545865 -1077974 -1801474 -2329715 -2625145 -2678467 -2254004 -1277174
41392a277174J142602Q34285L86286N0602o0212K09372O68872N22326o53391j860692
$$ -1277174 -134572 699713 1085999 1136601 1076389 1285761 1954633 2476959 1823568 -37124
41382c7124j629745o1374J138550R40541K42851K98729Q83186R04095J40962o69667
$$ -37124 -1666869 -1728243 -589693 350848 593699 892428 1775614 2679709 2820671 2151004
41372B151004j112466j383057j396094p01008M42200Q63011l2519j196899j103565
$$ 2151004 1038538 -344519 -1740613 -2441621 -1999421 -1136410 -1168929 -2365828 -3469393
41363c469393L06965J544383J392869K10255p27476o82528J6099N79215N77807
$$ -3469393 -3162428 -1618045 -225176 -14921 -742397 -1424925 -1408826 -829611 -251804
41354b51804K56341J55893L37590J06562j047984k258800j840756M50446K470824
$$ -251804 4537 160430 498020 604582 -443402 -2702202 -4542958 -4092512 -1621688
41345a621688J987520m39075k053766j403784L0893J65905r20470j510438p68297
$$ -1621688 365832 -73243 -2127009 -3530793 -3499900 -3333995 -4254465 -5764903 -6533200
41336f533200M39967J017181R06652P81056J120838J739547J877785Q98710p42386
$$ -6533200 -6093233 -5076052 -4169400 -3388344 -2267506 -527959 1349826 2248536 1506150
41327A506150j558503o66876R09399J309843N6149j531244j997902j041093P14520
$$ 1506150 -52353 -719229 190170 1500013 1556162 24918 -1972984 -3014077 -2299557
41318b299557K225166K303443N47911j665162k192579o58213R66263R04357k70496
$$ -2299557 -74391 2229052 2776963 1111801 -1080778 -1738991 -772728 131629 -138867
41309a38867q25583k96449L96606O35354O12601L81721l26595j182960j252769
$$ -138867 -964450 -1260899 -864293 -228939 383662 765383 438788 -744172 -1996941
41300a996941l63058L42254j31556j078757p95558J135066K938405K580478L53492
$$ -1996941 -2359999 -2017745 -2149301 -3228058 -4023616 -2888550 49855 2630333 2983825
41291B983825j325730r98914o4708n93755k045754j953709J70615J748530Q33057
$$ 2983825 1658095 659181 594473 718 -2045036 -3998745 -3828130 -2079600 -1246543
41282a246543j031030j233400J09240Q79240N55513O48269J668074K048597P39563
$$ -1246543 -2277573 -3510973 -3401733 -2522493 -1966980 -1318711 349363 2397960 3137523
41273C137523j011790j478716p33442q3084j52707m88626n02622p3607M57216
$$ 3137523 2125733 647017 -86425 -169509 -322216 -810842 -1313464 -1387071 -929855
41264i29855N36172M4431k49404M04387J348822J076187n50715j793635j356635
$$ -929855 -393683 -349252 -598656 -194269 1154553 2230740 1680025 -113610 -1470245
41255a470245j29120K65968j93752j37187J103839K615573L033917J875586k21069
$$ -1470245 -1599365 -1333397 -1527149 -1664336 -560497 2055076 5088993 6964579 6743510
41246F743510k089334k840522k366948j172213J28273R74715R35803K08267k42799
$$ 6743510 4654176 1813654 -553294 -1725507 -1597234 -622519 313284 521551 278752
41237B78752K07717Q57563O76371m9709k55078R579k48449r39700q29957K02185
$$ 278752 486469 1344032 2020403 1970694 1715616 1725195 1476746 537046 -292911 -90726
41227i0726P41059K85021J59893R96707J251324k92535k193658k276965o82291
$$ -90726 650333 935354 1095247 2091954 3343278 3050743 857085 -1419880 -2102171
41218b102171P16010R99073P16256M78664M85844Q08313J019131L91052o31310
$$ -2102171 -1386161 -387088 329168 807832 1293676 2101989 3121120 3512172 2880862
41209B880862m94534Q45833J153904o50442k242839j289946P48746R59450m59556
$$ 2880862 2386328 3232161 4386065 3735623 1492784 202838 951584 1911034 1451478
41200A451478j159155r23392j340117j897209m22995K481515L418835J381348
$$ 1451478 292323 -631069 -1971186 -3868395 -4291390 -1809875 1608960 2990308
41192B990308o84833o38400J2043m32055q40847J89936J476171J295607K49006
$$ 2990308 2305475 1667075 1679118 1247063 406216 596152 2072323 3367930 3616936
41183C616936j60825j61536q40583j941263k348520j745981m54316J203399K327366
$$ 3616936 3456111 3294575 2453992 512729 -1835791 -3581772 -4036088 -2832689 -505323
41174e05323J761021O3872n86808L96507R53667j02678q90282K42295J552452
$$ -505323 1255698 1319570 732762 1129269 2082936 1980258 1089976 1332271 2884723
41165B884723O60550j415781j953466q84006l29843o11662P5395K099186L362685
$$ 2884723 3545273 2129492 176026 -707980 -1037823 -1649485 -1574090 525096 3887781
41156C887781K314651r1425j880565j997273p09909O06386L44532j417546k451733
$$ 3887781 6202432 6111007 4230442 2233169 1523260 2129646 2474178 1056632 -1395101
41147a395101j184104R33630J531555P44218L79605O06930R0224j066622j292795
$$ -1395101 -2579205 -1645575 -114020 630198 1009803 1616733 1706957 640335 -652460
41138f52460m38898l848k54865J93374J411256J479464k21290j517186o60971
$$ -652460 -1091358 -1095206 -1350071 -1156697 254559 1734023 1512733 -4453 -665424
41129f65424R70981J047077l63824j331693j013756m34954o53146j360585j442213
$$ -665424 305557 1352634 988810 -342883 -1356639 -1791593 -2444739 -3805324 -5247537
41120e247537l99824R70198J449676R94813Q24158J444917J587927K37923j248193
$$ -5247537 -5647361 -4677163 -3227487 -2232674 -1408516 36401 1624328 1862251 614058
41111F14058q23790R76043J503346k28384k193126k221855o13205P21532N44226
$$ 614058 -209732 766311 2269657 2041273 -151853 -2373708 -2986913 -2265381 -1721155
41102a721155p23659j476709l91697J821950K693094J067898j046208j281372
$$ -1721155 -2444814 -3921523 -4313220 -2491270 201824 1269722 223514 -1057858
41094a057858l40227l36163q67742R4953J977277J944388k51080j485366k35264
$$ -1057858 -1398085 -1734248 -2601990 -2507037 -529760 1414628 1163548 -321818 -557082
41085e57082J259797J148554P18098J129793Q61282j088609k497480j392711L00074
$$ -557082 702715 1851269 2569367 3699160 4560442 3471833 974353 -418358 -118284
41076a18284k04904j919274j885041p2931J012174O23439K47609L26251j99957
$$ -118284 -323188 -2242462 -4127503 -4200434 -3188260 -2564821 -2317212 -1990961 -2190918
41067b190918j161454j033929K01161Q03086K83180J22294R14558J243584K85762
$$ -2190918 -3352372 -4386301 -4185140 -3382054 -3098874 -2976580 -2062022 -818438 -532676
41058e32676o71860m67938N4301k36306o81204n0020J166493J331343J25727j028354
$$ -532676 -1204536 -1672474 -1618173 -1854479 -2535683 -2585703 -1419210 -87867 37860 -990494
41048i90494j047273m20485O1639O80242J842743K467937R95987j800052k883420
$$ -990494 -2037767 -2458252 -2396613 -1716371 126372 2594309 3590296 1790244 -1093176
41039a093176r55879J304302Q92499j056050j130653R11369J967483Q51956l8170
$$ -1093176 -2049055 -744753 147746 -908304 -2038957 -1127588 839895 1691851 1653681
41030A653681O93048R84527o11874j911574q79130N87877n0860j406094o35985
$$ 1653681 2346729 3331256 2719382 807808 -71322 516555 465695 -940399 -1576384
41021a576384J398007J546009k43443j134220m30796k08892r25769n80270J088169
$$ -1576384 -178377 1367632 1124189 -10031 -440827 -649719 -1575488 -2155758 -1067589
41012a067589J553829n0771j052327L93191K154592J552452n62529j573020j082698
$$ -1067589 486240 435469 -616858 -223667 1930925 3483377 2920848 1347828 265130
41003B65130o65343q13004m99923O65071J726639J791334R23976l11426j332608
$$ 265130 -400213 -1213217 -1713140 -1048069 678570 2469904 3393880 3082454 1749846
40994A749846j628552j007045K04814J401718K012795J684413O07462m18890p71241
$$ 1749846 121294 -885751 -680937 720781 2733576 4417989 5025451 4606561 3835320
40985C835320p30432r22795j324053j427201j034160k57516P33733J331081P00258
$$ 3835320 3104888 2182093 858040 -569161 -1603321 -1860837 -1127104 203977 904235
40976I04235p47503j177037J74219J520360J090237j28676j92985N12001K70727
$$ 904235 156732 -1020305 -846086 674274 1764511 1635835 1442850 1954851 2225578
40967B225578o86071p52550j44177m67359j411244j046532N77380J332790O82795
$$ 2225578 1539507 786957 642780 175421 -1235823 -2282355 -1704975 -372185 310610
40958C10610K00873K11790n24760j353560L7589K922398L321191K00035k295949
$$ 310610 511483 723273 198513 -1155047 -1117458 1804940 5126131 5326166 3030217
40949C030217j165251R17943L96770j580567k043419j458970j860661k173934
$$ 3030217 1864966 2782909 3179679 1599112 -444307 -1903277 -3763938 -5937872
40941e937872m2747L121929L456295M97347k206456k218663n62309R97546J873460
$$ -5937872 -5980619 -2858690 597605 1094952 -1111504 -3330167 -3892476 -2894930 -1021470
40932a021470J727120M19693q74919p99470M0257J77327m5395O36251J548901
$$ -1021470 705650 1125343 250424 -549046 -508789 -331462 -376857 259394 1808295
40923A808295J016167l19276k77668R21774Q63615p19045j298406K0950Q65508
$$ 1808295 2824462 2505186 2227518 3149292 4012907 3293862 1995456 2016406 2881914
40914B881914l31327j748891j374220p6987M21694L45458N91233O28219j76133
$$ 2881914 2550587 801696 -572524 -649511 -227817 117641 708874 1337093 1160960
40905A160960p19114J29435J179407N02024j438330k392487j650769o83918m64272
$$ 1160960 441846 571281 1750688 2252712 814382 -1578105 -3228874 -3912792 -4377064
40896d377064j30165J069408K084436J496780j67707r20000q8280O38556l43852
$$ -4377064 -4507229 -3437821 -1353385 143395 -24312 -944312 -1032592 -394036 -737888
40887g37888k027859k080512k39128J382638J575010J519955K115905K077462
$$ -737888 -2765747 -4846259 -5085387 -3702749 -2127739 -607784 1508121 3585583
40879C585583M56866r91819m57500N56845m37609k370600k006316N31290J570507
$$ 3585583 4042449 3050630 2593130 3149975 2712366 341766 -1664550 -1133260 437247
40870D37247k65562j932255j025134O52536O50575j64299J19380P31871j46833
$$ 437247 171685 -1760570 -2785704 -2133168 -1482593 -1646892 -1527512 -795641 -942474
40861i42474j719311j689427j44866O14865j68846p33021K31069J711733K015688
$$ -942474 -2661785 -4351212 -4496078 -3881213 -4050059 -4783080 -4552011 -2840278 -824590
40852h24590Q74468n47789r31170K2210J184096J119789J6796l85968N68234J207603
$$ -824590 49878 -497911 -1429081 -1406871 -222775 897014 913810 527842 1096076 2303679
40842B303679J21647j377049j203882J28141L27044r92177j805771r48022L20184
$$ 2303679 2425326 1048277 -155605 -27464 299580 -692597 -2498368 -3446390 -3126206
40833c126206N45263L2626j99984N9150N42093J133382J422208O91361q86305
$$ -3126206 -2580943 -2548317 -2748301 -2689151 -2147058 -1013676 408532 1099893 213588
40824B13588j956171j622066n86773K0023J66087N02290J087805J381625J113279
$$ 213588 -1742583 -3364649 -3951422 -3931399 -3765312 -3263022 -2175217 -793592 319687
40815C19687M68153k71335p10573l83841N53128J066295M35428n74390n93919
$$ 319687 787840 516505 -194068 -577909 -24781 1041514 1476942 902552 308633
40806C08633L94265R43432J99125q80390r52959j84165K38799R0487L75098J408125
$$ 308633 702898 1646330 1845455 965065 12106 -172059 66740 157227 532325 1940450
40796A940450J843729M97326j601724k188642o69302J071258J047594n34313j866945
$$ 1940450 3784179 4281505 2679781 491139 -178163 893095 1940689 1406376 -460569
40787d60569j753362n72598N91207J099293J047821Q38804O40174K90233k13644
$$ -460569 -2213931 -2786529 -2195322 -1096029 -48208 790596 1430770 1721003 1507359
40778A507359l85181J23895O96321L09361q98383j467240n46824P65132Q38261
$$ 1507359 1122178 1246073 1942394 2251755 1353372 -113868 -660692 104440 942701
40769I42701k40748q61462j99542P34235O64849j89208o03252j43384L61823K12627
$$ 942701 701953 -159509 -359051 375184 1040033 850825 247573 104189 466012 678639
40759F78639n8372M34106J314753J131412o05678k386492k390187p03169R84012
$$ 678639 620267 1054373 2369126 3500538 2894860 508368 -1881819 -2584988 -1600976
40750a600976J554910J317869P93065j07963j305542k020613j716430q67229j56909
$$ -1600976 -46066 1271803 2064868 1956905 651363 -1369250 -3085680 -3952909 -4109818
40741d109818M44610J115938J312348M00911j075328j656397o12675J176224K105975
$$ -4109818 -3665208 -2549270 -1236922 -836011 -1911339 -3567736 -4180411 -3004187 -898212
40732h98212J363466l86508j615264j327137J1893J064033J108795N83226J51875
$$ -898212 465254 78746 -1536518 -2863655 -2851762 -1787729 -678934 -95708 56167
40723E6167j29509m40483n81041k53384L32787N60742L1883r93925j601596q76172
$$ 56167 -73342 -513825 -1094866 -1348250 -1015463 -454721 -422838 -1416763 -3018359 -3894531
40713c894531R04819J994901J024769r76413j634117m36683O22245J30026p35621
$$ -3894531 -2989712 -994811 29958 -946455 -2580572 -3017255 -2395010 -2264984 -3000605
40704c000605m03560N00857M62404k38380j72698O42499R15364M52507K06027
$$ -3000605 -3404165 -2903308 -2440904 -2679284 -2851982 -2209483 -1294119 -841612 -635585
40695f35585J29088o50661j370949n7392K733886L383393K15121l355555l256649
$$ -635585 -506497 -1157158 -2528107 -2585499 148387 3531780 3746901 391346 -2865303
40686b865303n82268K62188j636598k553836k91840K249885J672033o40213q37988
$$ -2865303 -3447571 -3185383 -4821981 -7375817 -7667657 -5417772 -3745739 -4385952 -5223940
40677e223940J430979K780922J414135n80205q92738j54794p3692n84328o14305
$$ -5223940 -3792961 -1012039 402096 -178109 -1070847 -1225641 -1299333 -1883661 -2497966
40668b497966j80395M8377J90848N12418L28455p49532j381790k24499J602959
$$ -2497966 -2678361 -2629984 -2439136 -1926718 -1598263 -2347795 -3729585 -3954084 -2351125
40659b351125J834229M21080n38874n4572P51737R54730R62504J008153N61642
$$ -2351125 -516896 -95816 -634690 -689262 62475 1017205 1979709 2987862 3549504
40650C549504k71266o42431o28261j071007j529212o91256Q05164O91347j016934
$$ 3549504 3278238 2635807 2007546 936539 -592673 -1283929 -478765 212582 -804352
40641h04352j410427O66176K424589J545098j99884l13758J73974r17867k494543
$$ -804352 -2214779 -1548603 875986 2421084 2221200 1907442 2081416 1163549 -1330994
40632a330994j910802K44984R65390k02118p07928N19396J584430J055687r0476
$$ -1330994 -3241796 -2996812 -2031422 -2233540 -2941468 -2422072 -837642 218045 127569
40623A27569o11568n91074l10019K74188N39982j98982r66792k70620J011203
$$ 127569 -483999 -1075073 -1385092 -1110904 -570922 -769904 -1736696 -2007316 -996113
40614i96113N51704j390554j887536m0989J366290L25626j214018o66678J070971
$$ -996113 -444409 -1834963 -3722499 -3763488 -2397198 -2071572 -3285590 -3952268 -2881297
40605b881297J328205o5178p70939M55159K265009K732101J420782o26896k064098
$$ -2881297 -1553092 -1618270 -2389209 -1934050 330959 3063060 4483842 3856946 1792848
40596A792848k262599j514949l14326J166194K409147K173942O7547k105621k264939
$$ 1792848 -469751 -1984700 -2299026 -1132832 1276315 3450257 3517804 1412183 -852756
40587h52756r33088k54573n02996j5920J393207J794836N23881n93334l98923
$$ -852756 -1785844 -2040417 -2543413 -2559333 -1166126 628710 1152591 559257 160334
40578A60334r8292n41273n09327O68494J379628N36970k92281K70768P47408n24186
$$ 160334 62042 -479231 -988558 -320064 1059564 1596534 1304253 1575021 2322429 1798243
40568A798243k095986j625044K13196R55750L23355O7708O64603R40543N10552
$$ 1798243 -297743 -1922787 -1709591 -753841 -430486 -362778 301825 1242368 1752920
40559A752920P6199l23855j080118j496455p52052J49300k75641j215169o61186
$$ 1752920 1829119 1505264 425146 -1071309 -1823361 -1674061 -1949702 -3164871 -3826057
40550c826057J047444J458912j74290j888525k115940j402167o03000L31338J176507
$$ -3826057 -2778613 -1319701 -1493991 -3382516 -5498456 -6900623 -7503623 -7172285 -5995778
40541e995778J166395N95670P49722J572722J364558l68062j676717r37807P35795
$$ -5995778 -4829383 -4233713 -3483991 -1911269 -546711 -914773 -2591490 -3529297 -2793502
40532b793502J181191J57556o81052j72305J037547J401239K29437j405508j676179
$$ -2793502 -1612311 -1454755 -2135807 -2308112 -1270565 130674 360111 -1045397 -2721576
40523b721576j91622J390718J560935Q69309N44669K66566q95808k102572j571410
$$ -2721576 -2913198 -1522480 38455 907764 1452433 1718999 823191 -1279381 -2850791
40514b850791M26288J670782J216037L24993m4327l90895q16093l77469Q10732
$$ -2850791 -2424503 -753721 462316 787309 742982 352087 -464006 -841475 -30743
40505c0743J021227l56833j448907o06100J125735J654623O79054m43266o82936
$$ -30743 990484 633651 -815256 -1421356 -295621 1359002 2038056 1594790 911854
40496I11854j30565M13063K8387j226750j663076J14021K528873K451100j88014
$$ 911854 781289 1194352 1222739 -4011 -1667087 -1553066 975807 3426907 3238893
40487C238893j793777l27906J585053P70539j699348k485557r67965P00296J370689
$$ 3238893 1445116 1117210 2702263 3472802 1773454 -712103 -1680068 -979772 390917
40478C90917J721821J857543R57863o67221j598925j518823j309477r84387K45634
$$ 390917 2112738 3970281 4928144 4260923 2661998 1143175 -166302 -1150689 -905055
40469i05055J714417J509890m64906j851593j176057J29051K02857m70788k89261
$$ -905055 809362 2319252 1854346 2753 -1173304 -1044253 -841396 -1312184 -1601445
40460a601445O95567R39571j58076j414563j468691l24930Q35163R16455p4259
$$ -1601445 -905878 33693 -124383 -1538946 -3007637 -3332567 -2497404 -1580949 -1655208
40451a655208j105423j272570p70020l76181k00326L03002J072991J178389K31261
$$ -1655208 -2760631 -4033201 -4803221 -5179402 -5379728 -5076726 -4003735 -2825346 -2594085
40442b594085p73284o92653K64765R79870R54186O40615M33176J16398n12444
$$ -2594085 -3367369 -4060022 -3795257 -2815387 -1861201 -1220586 -787410 -671012 -1183456
40433a183456j033671q17091R9697Q55084O38146l32684r34251m19869O15436
$$ -1183456 -2217127 -3034218 -2934521 -2079437 -1441291 -1773975 -2708226 -3128095 -2512659
40424b512659R25872K16461m64186j31407Q38940J283583P95329O8011k28080
$$ -2512659 -1586787 -1370326 -1834512 -1965919 -1126979 156604 951933 1019944 791864
40415G91864k34314l52853n14122m67376l99336o60879j059261j035850n20489
$$ 791864 557550 204697 -309425 -776801 -1176137 -1837016 -2896277 -3932127 -4452616
40406d452616k9682J26236J47534J67471Q376k87041l02194J23399O85403J180820
$$ -4452616 -4482298 -4356062 -4208528 -4041057 -4032681 -4319722 -4621916 -4498517 -3813114 -2632294
40396b632294J554086J310742J0301j366832j039138Q15414J576350j83501k219058
$$ -2632294 -1078208 232534 242835 -1123997 -2163135 -1347721 228629 45128 -2173930
40387b173930j777048J80456O32049m99585l42265J841599L095323J481933p87693
$$ -2173930 -3950978 -3770522 -3138473 -3638058 -3980323 -2138724 956599 2438532 1650839
40378A650839r30829K37492K14160r75458j319929n22124k59465j012594j285553
$$ 1650839 720010 957502 1171662 196204 -1123725 -1645849 -1905314 -2917908 -4203461
$$ [...]
##END NTUPLES=NMR SPECTRUM
##END=
