##TITLE=31Pdec_SR2_OMe
 CDCl3, 24 sc
 21.10.2019
##JCAMPDX= 6.0         $$ Bruker NMR JCAMP-DX V2.0
##DATA TYPE= NMR SPECTRUM
##DATA CLASS= NTUPLES
##ORIGIN= UXNMR, Bruker Analytische Messtechnik GmbH
##OWNER= root
$$ XWIN-NMR		Version 3.5
$$ Mon Oct 21 14:00:27 2019 Russian Standard Time (UT+4h)  she@DPX200
##.OBSERVE FREQUENCY= 81.013821
##.OBSERVE NUCLEUS= ^31P
##.ACQUISITION MODE= SIMULTANEOUS
##.ACQUISITION SCHEME= undefined
##.AVERAGES= 31
##.DIGITISER RES= 17
##SPECTROMETER/DATA SYSTEM= spect
##.PULSE SEQUENCE= zgpg30
##.SOLVENT NAME= DMSO
##.SHIFT REFERENCE= (INTERNAL, DMSO, 0, 182.463)
##AUDIT TRAIL= $$ (NUMBER, WHEN, WHO, WHERE, WHAT)
$$ ##TITLE= Audit trail, XWIN-NMR		Version 3.5
$$ ##JCAMPDX= 5.01
$$ ##ORIGIN= Bruker BioSpin GmbH
$$ ##OWNER= she
$$ F:/spectra/data/she/nmr/P31/1/pdata/1/auditp.txt
$$ ##AUDIT TRAIL=  $$ (NUMBER, WHEN, WHO, WHERE, WHAT)
(   1,<2019-10-21 13:59:31.34 +0400>,<she>,<DPX200>,
      <created by zg, POWCHK disabled, PULCHK disabled
       terminated by command 'halt'
       configuration hash MD5:
       00 E9 B6 7A A2 85 ED C7 34 08 36 98 17 FE 4E 26
       data hash MD5: 32K
       21 4F DA 42 C7 F5 5E 19 EF F5 C6 38 17 B3 37 DB>)
(   2,<2019-10-21 13:59:34.92 +0400>,<she>,<DPX200>,
      <Start of raw data processing
       efp BC_mod = 2 LB = 1 FT_mod = 6 PKNL = 1 PHC0 = -790.2385 PHC1 = 145.4006 SI = 64K 
       data hash MD5: 64K
       10 7B 45 2D B4 82 EF 1C DD 5D B7 D6 B1 76 E4 62>)
(   3,<2019-10-21 13:59:59.60 +0400>,<she>,<DPX200>,
      <pk PHC0 = 12.8279 PHC1 = 57.79999 
       data hash MD5: 64K
       01 EC C0 E5 9B BF 86 A4 E7 BD 44 2D 5A F2 3A F5>)
(   4,<2019-10-21 14:00:03.03 +0400>,<she>,<DPX200>,
      <abs ABSG = 5 
       data hash MD5: 64K
       C4 50 5B 7F 48 8C F1 F0 C8 0C 6C C1 5C 55 C8 D4>)
$$ ##END=
$$ 
$$ hash MD5
$$ 4F 89 F9 5D D6 6E 69 11 5B 23 55 3D 9E 0B BB D4
##$RELAX= 
##$RELAX= 
##$RELAX= 
##$RELAX= 
##$RELAX= 
##$RELAX= 
##$RELAX= 
##$RELAX= 
$$ Bruker specific parameters
$$ --------------------------
##$DU= <F:/spectra>
##$EXPNO= 1
##$NAME= <P31>
##$PROCNO= 1
##$TYPE= <nmr>
##$USER= <she>
##$AMP= (0..31)
100 100 100 100 100 100 100 100 100 100 100 100 100 100 100 100 100 100 
100 100 100 100 100 100 100 100 100 100 100 100 100 100 
##$AQSEQ= 0
##$AQ_mod= 1
##$AUNM= <au_zg>
##$AUTOPOS= <>
##$BF1= 81.014009
##$BF2= 200.13
##$BF3= 200.13
##$BF4= 200.13
##$BF5= 200.13
##$BF6= 200.13
##$BF7= 200.13
##$BF8= 200.13
##$BYTORDA= 1
##$CFDGTYP= 0
##$CFRGTYP= 5
##$CHEMSTR= <none>
##$CNST= (0..31)
1 1 145 1 1 1 1 1 1 1 1 1 1 1 1 1 1 1 1 1 1 1 1 1 1 1 1 1 1 1 1 1 
##$CPDPRG= <waltz16>
##$CPDPRG1= <>
##$CPDPRG2= <waltz16>
##$CPDPRG3= <>
##$CPDPRG4= <mlev>
##$CPDPRG5= <mlev>
##$CPDPRG6= <mlev>
##$CPDPRG7= <mlev>
##$CPDPRG8= <mlev>
##$CPDPRGB= <>
##$CPDPRGT= <>
##$D= (0..31)
0 1 0 0 0 0 0 0 0 0 0 0.03 2e-05 3e-06 0 0 0 0 0 0 0 0 0 0 0 0 0 0 0 0 
0 0 
##$DATE= 1571651970
##$DBL= (0..7)
120 120 120 11 120 120 24 19 
##$DBP= (0..7)
150 150 150 150 150 150 150 150 
##$DBP07= 0
$$ [...]
##$SUBNAM3= <"">
##$SUBNAM4= <"">
##$SUBNAM5= <"">
##$SUBNAM6= <"">
##$SUBNAM7= <"">
##$SUBNAM8= <"">
##$SUBNAM9= <"">
##$SW= 369.568048894756
##$SWIBOX= (0..15)
0 1 3 0 0 0 0 0 0 0 0 0 0 0 0 0 
##$SW_h= 29940.119760479
##$TD= 32768
##$TD0= 1
##$TE= 0
##$TE2= 300
##$TE3= 300
##$TEG= 300
##$TL= (0..7)
0 120 53 12 22 120 120 120 
##$TP= (0..7)
150 150 150 150 150 150 150 150 
##$TP07= 0
##$TPNAME0= <>
##$TPNAME1= <>
##$TPNAME2= <>
##$TPNAME3= <>
##$TPNAME4= <>
##$TPNAME5= <>
##$TPNAME6= <>
##$TPNAME7= <>
##$TPOAL= (0..7)
0.5 0.5 0.5 0.5 0.5 0.5 0.5 0.5 
##$TPOFFS= (0..7)
0 0 0 0 0 0 0 0 
##$TUNHIN= 0
##$TUNHOUT= 0
##$TUNXOUT= 0
##$USERA1= <user>
##$USERA2= <user>
##$USERA3= <user>
##$USERA4= <user>
##$USERA5= <user>
##$V9= 5
##$VALIST= <valist>
##$VCLIST= <CCCCCCCCCCCCCCC>
##$VD= 0
##$VDLIST= <DDDDDDDDDDDDDDD>
##$VPLIST= <PPPPPPPPPPPPPPP>
##$VTLIST= <TTTTTTTTTTTTTTT>
##$WBST= 1024
##$WBSW= 4
##$XGAIN= (0..3)
0 0 0 0 
##$XL= 0
##$YL= 0
##$YMAX_a= 9628
##$YMIN_a= -20848
##$ZGOPTNS= <>
##$ZL1= 120
##$ZL2= 120
##$ZL3= 120
##$ZL4= 120
##$ABSF1= 182.463
##$ABSF2= -187.1042
##$ABSG= 5
##$ABSL= 3
##$ALPHA= 0
##$AQORDER= 0
##$ASSFAC= 0
##$ASSFACI= 0
##$ASSFACX= 0
##$ASSWID= 0
##$AUNMP= <proc_1d>
##$AZFE= 0.1
##$AZFW= 0.5
##$BCFW= 0
##$BC_mod= 2
##$BYTORDP= 0
##$COROFFS= 0
##$CY= -3
##$DATMOD= 1
##$DC= 0
##$DFILT= <>
##$DTYPP= 0
##$F1P= 0
##$F2P= 0
##$FCOR= 1
##$FTSIZE= 65536
##$FT_mod= 6
##$GAMMA= 0
##$GB= 0
##$INTBC= 1
##$INTSCL= 5.30512e-09
##$ISEN= 30
##$LB= 1
##$LEV0= 0
##$LPBIN= 0
##$MAXI= 10000
##$MC2= 0
##$MEAN= 0
##$ME_mod= 0
##$MI= 50
##$NCOEF= 0
##$NC_proc= -7
##$NLEV= 6
##$NOISF1= 182.463
##$NOISF2= 159.3651
##$NSP= 0
##$NTH_PI= 0
##$NZP= 0
##$OFFSET= 182.463
##$PC= 4
##$PHC0= -777.4106
##$PHC1= 203.2006
##$PH_mod= 1
##$PKNL= yes
##$PPARMOD= 0
##$PSCAL= 0
##$PSIGN= 0
##$REVERSE= no
##$SF= 81.0140089999434
##$SI= 65536
##$SIGF1= 159.3651
##$SIGF2= -187.1042
##$SINO= 113.3802
##$SIOLD= 16384
##$SREGLST= <1H.CDCl3>
##$SSB= 0
##$STSI= 65536
##$STSR= 0
##$SW_p= 29940.119760479
##$SYMM= 0
##$S_DEV= 0
##$TDeff= 32768
##$TDoff= 0
##$TI= <>
##$TILT= no
##$TM1= 0
##$TM2= 0
##$TOPLEV= 0
##$USERP1= <user>
##$USERP2= <user>
##$USERP3= <user>
##$USERP4= <user>
##$USERP5= <user>
##$WDW= 1
##$XDIM= 65536
##$YMAX_p= 317565063
##$YMIN_p= -47264511
$$ End of Bruker specific parameters
$$ ---------------------------------
##NTUPLES= NMR SPECTRUM
##VAR_NAME=  FREQUENCY,     SPECTRUM/REAL,   SPECTRUM/IMAG
##SYMBOL=    X,             R,               I
##VAR_TYPE=  INDEPENDENT,   DEPENDENT,       DEPENDENT
##VAR_FORM=  AFFN,          ASDF,            ASDF
##VAR_DIM=   65536,         65536,           65536
##UNITS=     HZ,            ARBITRARY UNITS, ARBITRARY UNITS
##FACTOR=    0.456856943014862, 1,           1
##FIRST=     14782.0589164792, 0,            0
##LAST=      -15158.0608439998, 0,           0
##MIN=       -15158.0608439998, -47264511,   0
##MAX=       14782.0589164792, 317565063,    0
$$ Real data points
##PAGE= N=1
##DATA TABLE= (X++(R..R)), XYDATA
$$ [...]
$$ plain form
45680 4279929 8959406 9008398 4285837 -270777 -1457507 -1680619 -3872919 -5812543 -3469562
45671 -3469562 1840044 4449494 2355477 -439327 -701768 -619220 -3212091 -6795776 -7606684
45662 -7606684 -5623408 -3929316 -3497625 -2380364 231146 2647452 3826457 4920353
45654 4920353 6823704 8543903 8927159 8061721 6272639 3691773 1497480 1424382 3067081
45645 3067081 3772358 2404995 1158697 2163244 4280350 5104673 4484395 4045984 4495239
45636 4495239 5270634 5753184 5174922 2717793 -542354 -1534619 698823 2617836 809348
45627 809348 -2713340 -3530591 -1877514 -2125544 -5417348 -7805038 -6840181 -5168099 -5217072
45618 -5217072 -4639608 -567238 4770312 6754525 4865335 2645675 2294194 2880875 3340461
$$ packed form
45680D279929M679477M8992m722561m556614j186730k23112k192300j939624K342981
45671c469562N309606K609450k094017k794804k62441Q2548k592871l583685q10908
45662g606684J983276J694092M31691J117261K611510K416306J179005J093896
45654D920353J903351J720199L83256q65438j789082k580866k194293p3098J642699
45645C067081P05277j367363j246298J004547K117106Q24323o20278m38411M49255
45636D495239P75395M82550n78262k457129l260147r92265K233442J919013j808488
45627H09348l522688q17251J653077k48030l291804k387690R64857J672082m8973
45618e217072N77464M072370N337550J984213j889190k219660l51481N86681M59586
$$ plain form
45609 3340461 3714226 3387714 1339097 -1379112 -2356738 -1774797 -2703319 -6049686 -7902582
45600 -7902582 -4288432 3045546 8257624 8338780 6054637 5650128 7622759 8977625 7593901
45591 7593901 4769567 3386572 4639010 7081028 8300028 6969165 3699885 623866
45583 623866 -27380 2243607 5515028 7035882 5741065 3078832 1526586 2529774
45575 2529774 5470542 8124420 8521580 6907000 5270477 4362004 2453469 -1455796
45567 -1455796 -4601141 -3381691 1111005 3771658 2324865 201758 978619 2982947
45559 2982947 2089413 -2221314 -6621737 -8580647 -8380599 -7093340 -5244447 -3499674
45551 -3499674 -2505657 -1860498 -842681 40692 -117775 -662321 -237794 562314 -400419
$$ packed form
45609C340461L73765l26512k048617k718209r77626N81941r28522l346367j852896
45600g902582L614150P333978N212078Q1156k284143m04509J972631J354866j383724
45591G593901k824334j382995J252438K442018J219000j330863l269280l076019
45583F23866o51246K270987L271421J520854j294817k662233j552246J003188
45575B529774K940768K653878L97160j614580j636523r08473j908535l909265
45567a455796l145345J219450M492696K660653j446793k123107P76861K004328
45559B982947q93534m310727m400423j958910K00048J287259J848893J744773
45551c499674R94017O45159J017817Q83373j58467n44546M24527Q00108r62733
$$ plain form
45542 -400419 -3482031 -6356120 -7020150 -5977016 -4764991 -3917425 -3285766 -3124427 -3771360
45533 -3771360 -4841419 -5374270 -4469223 -1822469 1589045 3421950 1688194 -2983905
45525 -2983905 -7395500 -8313683 -4813288 1197664 5879439 5635513 55144 -7169493
45517 -7169493 -11387911 -11136111 -8403226 -5420388 -2745087 -332213 1283263 1436616
45509 1436616 16391 -2461075 -4808843 -5756634 -5614986 -6385241 -8505544 -8588223 -3189556
45500 -3189556 5422904 10508851 8806447 4520597 3809500 7363851 10338842 8393119
45492 8393119 2067357 -4305956 -6948405 -6077596 -5193753 -6531061 -8090398 -6894363
45484 -6894363 -4274075 -4667962 -8710360 -11151885 -7698657 -1112594 2248661 114614
$$ packed form
45542d00419l081612k874089o64030J043134J212025Q47566O31659J61339o46933
45533c771360j070059n32851R05047K646754L411514J832905j733756m672099
45525b983905m411595r18183L500395O010952M681775k43926n580369p224637
45517g169493m218418K51800K732885K982838K675301K412874J615476J53353
45509A436616j420225k477466k347768r47791J41648p70255k120303q2679N398667
45500c189556Q612460N085947j702404m285850p11097L554351K974991j945723
45492H393119o325762o373313k642449Q70809Q83843j337308j559337J196035
45484f894363K620288l93887m042398k441525L453228O586063L361255k134047
$$ plain form
45476 114614 -4311911 -7348658 -8055808 -6766522 -3534604 719233 3230220 1283609
45468 1283609 -4751884 -10921263 -13055051 -11129740 -9440005 -11244465 -14167188 -13186585
45460 -13186585 -7816881 -3161232 -3011715 -5141579 -5344687 -3303748 -1659810 -1211239
45452 -1211239 -222649 2210523 4664220 5145931 2965282 -470649 -1807286 1662079
45444 1662079 8133137 12010495 10344294 6311114 3991723 2527411 -789784 -4041235
45436 -4041235 -2571573 3247477 7385659 6102488 2073641 -675858 -1714913 -2077708
45428 -2077708 -1018864 2072310 4947705 4713373 1579124 -1759528 -3530233 -3981158
45420 -3981158 -3959370 -3908866 -3765823 -2989672 -1399409 -346076 -1690575 -4958024 -7034849
$$ packed form
45476A14614m426525l036747p07150J289286L231918M253837K510987j946611
45468A283609o035493o169379k133788J925311J689735j804460k922723R80603
45460a3186585N369704M655649J49517k129864k03108K040939J643938M48571
45452a211239R88590K433172K453697M81711k180649l435931j336637L469365
45444A662079O471058L877358j666201m033180k319391j464312l317195l251451
45436d041235J469662N819050M138182j283171m028847k749499j039055l62795
45428b077708J058844L091174K875395k34332l134249l338652j770705m50925
45420c981158K1788N0504J43043P76151J590263J053333j344499l267449k076825
$$ plain form
45411 -7034849 -5716416 -2324083 129977 237368 -1101234 -2004143 -863970 2500140
45403 2500140 6256250 8287071 8753894 9251127 9300629 6430234 865493 -2784420 -847569
45394 -847569 4454475 7844514 7174425 4208227 672432 -3252355 -6805937 -7956195
45386 -7956195 -5595266 -912931 3677463 6034579 5307760 2836895 1403492 2134825
45378 2134825 2933595 1526568 -1107653 -2518772 -2787660 -3731282 -4711233 -2910366 1609927
45369 1609927 4638589 3216345 -441226 -2364770 -1901182 -1075852 -644752 492278 2661523
45360 2661523 4648899 5591302 5878866 6034699 6054209 5966572 5861579 5222459 3367577
45351 3367577 898528 -240592 1216693 4162587 5925946 4853747 2049334 389345
$$ packed form
45411g034849J318433L392333K454060J07391j338602r02909J140173L364110
45403B500140L756110K030821M66823M97233M9502k870395n564741l649913J936851
45394h47569N302044L390039o70089k966198l535795l924787l553582j150258
45386g956195K360929M682335M590394K357116p26819k470865j433403P31333
45378B134825P98770j407027k634221j411119k68888r43622r79951J800867M520293
45369A609927L028662j422244l657571j923544M63588Q25330M31100J137030K169245
45360B661523J987376R42403K87564J55833J9510q7637j04993o39120j854882
45351C367577k469049j139120J457285K945894J763359j072199k804413j659989
$$ plain form
45343 389345 1509154 3904061 4641090 2882441 697256 177671 1138004 2445611 4125010
45334 4125010 6583606 8791614 9155732 7719308 5682754 3229706 11190 -2508158
45326 -2508158 -2032634 649478 1664258 -575395 -2698711 -1278411 1967403 2894467
45318 2894467 1189268 260783 1520573 2631637 1914849 851382 821097 534351 -1187451
45309 -1187451 -2623813 -1776604 -49988 -481256 -3164705 -5077791 -4218143 -1656388 540020
45300 540020 1370068 634061 -1444098 -3591783 -3924963 -1976952 402591 770677 -1633259
45291 -1633259 -5400780 -8248617 -8842860 -7778135 -6560541 -5457053 -3297819 -21409
45283 -21409 2074740 1212857 -1019623 -1997722 -2318061 -4677912 -8566924 -9626950 -5642910
$$ packed form
45343C89345J119809K394907P37029j758649k185185n19585R60333J307607J679399
45334D125010K458596K208008L64118j436424k036554k453048l218516k519348
45326b508158M75524K682112J014780k239653k123316J420300L245814R27064
45318B894467j705199r28485J259790J111064p16788j063467l0285k86746j721802
45309a187451j436362Q47209J726616m31268k683449j913086Q59648K561755K196408
45300E40020Q30048p36007k078159k147685l33180J948011K379543L68086k403936
45291a633259l767521k847837n94243J064725J217594J103488K159234L276410
45283b1409K096149q61883k232480r78099l20339k359851l889012j060026L984040
$$ plain form
45274 -5642910 -128122 2298940 1854454 2187299 4503285 6220886 5285056 3051398 2078023
45265 2078023 2906676 4163183 4800641 5047311 5351504 5292729 4060337 1879990 266733
45256 266733 266486 941844 686328 -141641 660628 4112470 8656212 12346709 14744354
45247 14744354 15674328 14063090 9919562 6040251 5299746 6883247 7555931 6292579
45239 6292579 5056471 4910347 4316381 2420415 1373619 3298100 6633326 7867088
45231 7867088 6132054 3960688 3764678 5434243 7322949 7744510 5372748 210955
45223 210955 -5132624 -7035162 -4910954 -2134021 -1646699 -2368659 -1868760 -842095 -1800464
45214 -1800464 -4090563 -4069352 -949653 1211650 -741098 -4416078 -5632731 -4334540
$$ packed form
45274e642910N514788K427062m44486L32845K315986J717601r35830k233658r73375
45265B078023Q28653J256507O37458K46670L04193n8775j232392k180347j613257
45256B66733k47O75358k55516q27969Q02269L451842M543742L690497K397645
45247A4744354R29974j611238m143528l879311p40505J583501O72684j263352
45239F292579j236108j46124n93966j895966j046796J924481L335226J233762
45231G867088j735034k171366j96010J669565J888706M21561k371762n161793
45223B10955n343579j902538K124208K776933M87322p21960M99899J026665r58369
45214a800464k290099K1211L119699K161303j952748l674980j216653J298191
$$ plain form
45206 -4334540 -3375714 -3076382 -940666 3562152 7605593 8896001 7957671 5912529 2874129
45197 2874129 -408309 -1939081 -1027990 422546 438796 -817358 -2286410 -3691065 -4954325
45188 -4954325 -5602708 -5767068 -6289167 -7104499 -7153852 -6402754 -5951857 -5724405 -4594633
45179 -4594633 -3424707 -4753006 -8102708 -9021233 -4987966 785046 3898934 4094788
45171 4094788 3353983 2003504 258872 536981 3865672 6473690 4673378 1046807
45163 1046807 681868 3098804 3720200 2076744 1916299 3373589 2246251 -1632122 -2434480
45154 -2434480 2436195 7489829 7195500 3367408 417745 -1544692 -3937422 -4723828
45146 -4723828 -2187702 -151536 -2921440 -7415997 -7151672 -2754385 -1297934 -5045993
$$ packed form
45206d334540R58826K99332K135716M502818M043441J290408r38330k045142l038400
45197B874129l282438j530772R11091J450536J6250j256154j469052j404655j263260
45188d954325o48383j64360n22099q15332m9353P51098M50897K27452J129772
45179d594633J169926j328299l349702r18525M033267N773012L113888J95854
45171D094788p40805j350479j744632K78109L328691K608018j800312l626571
45163A046807l64939K416936O21396j643456j60445J457290j127338l878373q02358
45154b434480M870675N053634k94329l828092k949663j962437k392730p86406
45146d723828K536126K036166k769904m494557K64325M397287J456451l748059
$$ plain form
45138 -5045993 -8097223 -6066500 -2450264 -1972619 -3138560 -1984102 841325 2014217
45130 2014217 2035248 4185736 7774665 7835564 2585225 -3116813 -3774841 301051 4712192
45121 4712192 6692099 6572443 5363360 3927093 3758054 5550495 7041237 5164483
45113 5164483 769268 -1796388 -867431 -136316 -3107588 -7651688 -9119595 -6920370
45105 -6920370 -4397764 -3250845 -1986109 236553 2115600 3222587 4861587 6680280
45097 6680280 5883794 1761072 -1991648 -1872691 876224 2808829 3230763 3756809 4563165
45088 4563165 4321479 3149785 2655123 3126642 3099785 1743358 -360781 -2671214 -4763343
45079 -4763343 -5021359 -1791930 3410684 6098674 3757922 -648548 -1747414 2033693
$$ packed form
45138e045993l051230K030723L616236M77645j165941J154458K825427J172892
45130B014217K1031K150488L588929O0899n250339n702038o58028M075892M411141
45121D712192J979907j19656j209083j436267j69039J792441J490742j876754
45113E164483m395215k565656R28957P31115k971272m544100j467907K199225
45105f920370K522606J146919J264736K222662J879047J106987J639000J818693
45097F680280p96486m122722l752720J18957K748915J932605M21934N26046Q06356
45088D563165k41686j171694m94662M71519k6857j356427k104139k310433k092129
45079d763343k58016L229429N202614K687990k340752m406470j098866L781107
$$ plain form
45071 2033693 6658107 7245416 3780887 973467 2272833 5342211 4938924 -244932
45063 -244932 -5666126 -6344646 -2451075 1461282 1517816 -2048735 -5438336 -4717893 36717
45054 36717 3922600 2488135 -2132028 -3398856 647629 4637343 4112862 1943525 2555269
45045 2555269 3871800 936933 -4827472 -6809373 -3222064 669487 1167559 585792
45037 585792 1077290 238279 -3526471 -6413054 -4703482 -1206184 -1224954 -4444204 -5775230
45028 -5775230 -3047994 800913 2891705 3545292 3835987 3607827 2987811 3112560 4056533
45019 4056533 3997679 1672171 -1638628 -3530068 -3090606 -1608458 -1272857 -3246757 -6384314
45010 -6384314 -7986301 -6452084 -2882993 388784 1992234 1561151 -924838 -4251018
$$ packed form
45071B033693M624414N87309l464529k807420J299366L069378m03287n183856
45063b44932n421194o78520L893571L912357N6534l566551l389601P20443M754610
45054C6717L885883j434465m620163j266828M046485L989714n24481k169337O11744
45045B555269J316531k934867n764405j981901L587309L891551M98072n81767
45037E85792M91498q39011l764750k886583J709572L497298j8770l219250j331026
45028e775230K727236L848907K090792O53587K90695k28160o20016J24749R43973
45019D056533n8854k325508l310799j891440M39462J482148L35601j973900l137557
45010f384314j601987J534217L569091L271777J603450m31083k485989l326180
$$ plain form
45002 -4251018 -5703143 -3877014 -943632 187598 171152 1792712 4619550 4722534 610723
44993 610723 -3983107 -5065385 -3352813 -2079229 -2194454 -2405013 -2246288 -2224464 -2007940
44984 -2007940 -1278683 -1581910 -4439970 -8075328 -9019274 -7007569 -5333240 -5988219 -7411864
44975 -7411864 -7713855 -7034205 -5571213 -2471403 1473894 3031649 922843 -1518518
44967 -1518518 -891536 1355861 1791062 672806 737022 1673439 399380 -3358629 -6154057
44958 -6154057 -6001675 -4414168 -2513666 644220 4412558 5392030 2218227 -2012831
44950 -2012831 -4530036 -6667530 -9982573 -11912301 -9111769 -2892798 2381158 4719487
44942 4719487 5020398 3901785 1641776 -74084 -21173 6224 -1942718 -3768588 -2065982
$$ packed form
45002d251018j452125J826129K933382J131230j6446J621560K826838J02984m111811
44993F10723m593830j082278J712572J273584j15225k10559J58725K1824K16524
44984b007940P29257l03227k858060l635358r43946K011705J674329o54979j423645
44975g411864l01991O79650J462992L099810L945297J557755k108806k441361
44967a518518O26982K247397M35201j118256O4216R36417j274059l758009k795428
44958f154057J52382J587507J900502L157886L768338R79472l173803m231058
44950b012831k517205k137494l315043j929728K800532O218971N273956K338329
44942D719487L00911j118613k260009j715860N2911K7397j948942j825870J702606
$$ plain form
44933 -2065982 1759225 2726609 -255814 -2642831 -890326 3035387 5023889 3415719
44925 3415719 -885560 -5791888 -8358890 -6643085 -2483965 11596 -467498 -1424807
44917 -1424807 -941928 88467 671210 1118674 821992 -1673868 -5012587 -5164384 -959534
44908 -959534 4002373 6595405 7465821 7279132 4310993 -1102300 -4104966 -1609085 2302797
44899 2302797 1838989 -2241676 -4539304 -3155618 -958076 179059 1521608 3905750
44891 3905750 6020240 6640638 5715852 3415294 632411 -343602 1549066 3742853 3156938
44882 3156938 702272 -350270 719987 2212507 3770849 6039435 7495046 6014047
44874 6014047 3197078 2588107 3551940 1691977 -3920290 -8687788 -9183075 -7649338 -7760123
$$ packed form
44933b065982L825207R67384k982423k387017J752505L925713J988502j608170
44925C415719m301279m906328k567002J715805M159120K495561m79094r57309
44917a424807M82879J030395N82743M47464k96682k495860l338719j51797M204850
44908i59534M961907K593032Q70416j86689k968139n413293l002666K495881L911882
44899B302797m63808m080665k297628J383686K197542J137135J342549K384142
44891C905750K114490O20398r24786k300558k782883r76013J892668K193787n85915
44882C156938k454666j052542J070257J492520J558342K268586J455611j480999
44874F014047k816969o08971R63833j859963n612267m767498m95287J533737j10785
$$ plain form
44865 -7760123 -9440242 -10168281 -8682723 -5470696 -1906697 -293583 -2302427 -6143069
44857 -6143069 -7779632 -5973259 -3475619 -2547185 -2659440 -3568149 -6503233 -10311722 -10591023
44848 -10591023 -5755172 -505102 356901 -1176631 451729 6132359 11098746 11353599
44840 11353599 7754204 4014510 3179277 5713017 9043486 9518712 6414640 3041949
44832 3041949 2429736 3489117 3331090 1574125 -155411 -1470276 -3069226 -4294656
44824 -4294656 -3645991 -1233974 1561465 4143616 6170294 6037248 2676972 -1762614
44816 -1762614 -3888305 -3462634 -3177310 -4180582 -4582478 -2777282 94280 1642278 618608
44807 618608 -2359538 -5200560 -5815533 -4410955 -3293541 -3033874 -905681 4222578 7772923
$$ packed form
44865g760123j680119p28039J485558L212027L563999J613114k008844l840642
44857f143069j636563J806373K497640R28434j12255r08709k935084l808489k79301
44848a0591023M835851N250070Q62003j533532J628360N680630M966387K54853
44840A1353599l599395l739694q35233K533740L330469M75226l104072l372691
44832C041949o12213J059381j58027j756965j729536j314865j598950j225430
44824d294656O48665K412017K795439K582151K026678j33046l360276m439586
44816a762614k125691M25671K85324j003272m01896J805196K871562J547998j023670
44807F18608k978146k841022o14973J404578J117414K59667K128193N128259L550345
$$ plain form
44798 7772923 4593035 -3000409 -7445567 -6211993 -4385955 -5758390 -7057547 -4207570
44790 -4207570 426209 1578548 -1084064 -3306827 -2819974 -1238118 14830 1790349
44782 1790349 4861271 8326549 10855479 11522952 9470275 4878431 267456 -1394389
44774 -1394389 -137482 1467733 2389486 4369582 8264122 11444836 10577232 5718560
44766 5718560 -27862 -4298972 -7373954 -10373760 -12905796 -13320775 -11143417 -8537732
44758 -8537732 -8424724 -10780334 -11831365 -8290402 -1979949 1545745 -679214 -5809906
44750 -5809906 -9026814 -8751511 -6564993 -3648475 92990 3853084 5579924 4489893
44742 4489893 2070543 -115417 -1987645 -3688502 -4671733 -5087104 -6102375 -7315195
$$ packed form
44798G772923l179888p593444m445158J233574J826038j372435j299157K849977
44790d207570M633779J152339k662612k222763M86853J581856J252948J775519
44782A790349L070922L465278K528930O67473k052677m591844m610975j661845
44774a394389J256907J605215R21753J980096L894540L180714q67604m858672
44766E718560n746422m271110l074982k999806k532036m14979K177358K605685
44758h537732J13008k355610j051031L540963O310453L525694k224959n130692
44750e809906l216908K75303K186518K916518L741465L760094J726840j090031
44742D489893k419350k185960j872228j700857r83231m15371j015271j212820
$$ plain form
44734 -7315195 -5868047 -483611 5227091 6505484 3649956 1254891 1616014 2609968
44726 2609968 2645528 3556793 6415858 7912462 4324060 -2670277 -7390922 -6726165 -2880733
44717 -2880733 -121283 -890405 -4585538 -8112200 -8053702 -4179142 -316688 49780 -1794257
44708 -1794257 -2026277 -71539 917371 -675064 -2463378 -1860499 369927 1859119 1918256
44699 1918256 1511785 1394720 1678498 2214294 2359168 1291498 -716555 -2398761 -3405434
44690 -3405434 -4750904 -6637189 -7298634 -5061361 -443750 4587017 8247584 9224678
44682 9224678 7049028 3318280 959185 916789 1040334 -387404 -1860301 -1476386 -887300
44673 -887300 -3379490 -8517965 -11779738 -10156566 -5819025 -3204046 -4083196 -6536459
$$ packed form
44734g315195J447148N384436N710702J278393k855528k395065L61123R93954
44726B609968L5560R11265K859065J496604l588402o994337m720645O64757L845432
44717b880733K759450p69122l695133l526662N8498L874560L862454L66468j844037
44708a794257k32020J954738R88910j592435j788314O02879K230426J489192N9137
44699A918256m06471j17065K83778N35796J44874j067670k008053j682206j006673
44690c405434j345470j886285o61445K237273M617611N030767L660567R77094
44682I224678k175650l730748k359095m2396J23545j427738j472897L83915N89086
44673h87300k492190n138475l261773J623172M337541K614979q79150k453263
$$ plain form
44665 -6536459 -7651214 -6261081 -3677566 -2275288 -2776753 -2849237 456366 6462638 10496539
44656 10496539 8938049 3603026 -582336 -1817255 -3170121 -7401508 -12125249 -12341087
44648 -12341087 -7108481 -1112924 1086952 108226 -529135 192307 348654 -691628 -669802
44639 -669802 2215784 6663869 10098206 11444422 11015971 9252185 6914014 5227894
44631 5227894 4363186 2681930 -1178098 -6185600 -9930716 -11018198 -9670915 -7051697
44623 -7051697 -4865360 -4262035 -4024842 -1427752 3705193 7642255 7399562 4869569 3714513
44614 3714513 3966459 3196735 1683003 1901095 3038637 1031271 -4454804 -7696391 -4444468
44605 -4444468 1755445 4351198 2423953 599686 1774569 4144889 5395020 5937818
$$ packed form
44665f536459j114755J390133K583515J402278n01465p2484L305603O006272M033901
44656A0496539j558490n335023m185362j234919j352866m231387m723741k15838
44648a2341087N232606N995557K199876r78726o37361P21442J56347j040282K1826
44639f69802K885586M448085L434337J346216m28451j763786k338171j686120
44631E227894q64708j681256l860028n007502l745116j087482J347283K619218
44623g051697K186337O03325K37193K597090N132945L937062k42693k529993j155056
44614C714513K51946p69724j513732K18092J137542k007366n486075l241587L251923
44605d444468O199913K595753j927245j824267J174883K370320J250131N42798
$$ plain form
44597 5937818 6749422 6794919 4498883 411596 -3014250 -3656035 -1098518 3310008 7114208
44588 7114208 8336708 7216926 5861843 5687576 5897451 5043900 3244693 1874524 1626119
44579 1626119 2092855 3104953 5096020 7649706 8799647 6830644 2420879 -1830585
44571 -1830585 -3864183 -3576999 -2241795 -1535196 -2848278 -6042219 -8557906 -7346982
44563 -7346982 -2591616 1905433 3268439 3060504 4431059 7011282 7362697 4218558
44555 4218558 383042 -1201997 -674601 514930 2058463 3782862 4336151 3053254
44547 3053254 1601483 1620049 2081141 1262019 -46508 -77639 284033 -1239394 -3944124
44538 -3944124 -4757607 -3423588 -3039667 -4346637 -3781561 366933 3859529 2413456 -1175478
$$ packed form
44597E937818Q11604M5497k296036m087287l425846o41785K557517M408526L804200
44588G114208J222500j119782j355083j74267K09875q53551j799207j370169k48405
44579A626119M66736J012098J991067K553686J149941j969003m409765m251464
44571a830585k033598K87184J335204P06599j313082l193941k515687J210924
44563g346982M755366M497049J363006k07935J370555K580223L51415l144139
44555D218558l835516j585039N27396J189531J543533J724399N53289j282897
44547C053254j451771J8566M61092q19122j308527l1131L61672j523427k704730
44538c944124q13483J334019L83921j306970N65076M148494L492596j446073l588934
$$ plain form
44529 -1175478 -603532 4594563 8242660 6204489 1378225 -1096695 213975 3476043
44521 3476043 6463535 6774269 2219414 -6011442 -12549426 -13177496 -9753994 -7306667
44513 -7306667 -7524105 -7990538 -6880371 -5037593 -3438997 -1777547 -288865 -402778 -2563828
44504 -2563828 -5337896 -7423135 -8696040 -8740468 -6646973 -3387832 -2221845 -5015938
44496 -5015938 -9547678 -11943194 -10716425 -7294878 -3867676 -1984317 -2040310 -2774525 -2241251
44487 -2241251 -275508 1282538 1678738 2566213 4723714 5767985 3778825 1425742
44479 1425742 3000671 7959524 10933774 8636036 3857931 1579729 3235476 6001312
44471 6001312 6426336 3871903 998059 926095 3445654 5015122 3617518 1883415 3056467
$$ packed form
44529a175478N71946N198095L648097k038171m826264k474920J310670L262068
44521C476043K987492L10734m554855q230856o537984o28070L423502K447327
44513g306667k17438m66433J110167J842778J598596J661450J488682j13913k161050
44504b563828k774068k085239j272905m4428K093495L259141J165987k794093
44496e015938m531740k395516J226769L421547L427202J883359n5993p34215N33274
44487b241251J965743J558046L96200Q87475K157501J044271j989160k353083
44479A425742J574929M958853K974250k297738m778105k278202J655747K765836
44471F001312M25024k554433k873844p1964K519559J569468j397604j734103J173052
$$ plain form
44462 3056467 5552515 5154375 1762218 -398010 476372 1365796 11382 -1543335 -1136576
44453 -1136576 -175736 -364616 -353285 1088631 1796027 -119416 -2053980 -538396 3079114
44444 3079114 4947499 4927547 5715697 6997538 5777131 2348825 641877 1839157 2619095
44435 2619095 1178760 247540 1860356 3420117 2012356 -770522 -1740709 -1335586 -2402024
44426 -2402024 -5363821 -7900438 -8609173 -8192976 -7387497 -5956673 -3684574 -942542 1407274
44417 1407274 1923385 -374884 -3874902 -4986114 -2426499 781334 1329398 -207852
44409 -207852 -1299506 -1439950 -1306156 161366 3967311 7310204 5922940 470441 -3278570
44400 -3278570 -1766397 2072703 3190534 365360 -3691085 -5843222 -4662928 -986072
$$ packed form
44462C056467K496048l98140l392157k160228Q74382Q89424j354414j554717M06759
44453a136576R60840j88880J1331J441916P07396j915443j934564J515584L617510
44444C079114J868385j9952P88150J281841j220407l428306j706948J197280P79938
44435B619095j440335r31220J612816J559761j407761k782878r70187M05123j066438
44426b402024k961797k536617p08735M16197Q05479J430824K272099K742032K349816
44417A407274N16111k298269l500018j111212K559615L207833N48064j537250
44409b07852j091654j40444J33794J467522L805945L342893j387264n452499l749011
44400c278570J512173L839100J117831k825174m056445k152137J180294L676856
$$ plain form
44392 -986072 2323467 2744945 991237 -309737 -999863 -3376172 -6927694 -7075267 -1708798
44383 -1708798 4549785 6272215 4676786 4782049 7050896 7112648 3407965 -223797 -747016
44374 -747016 -56926 -715232 -1424121 158065 2769467 3212339 1329799 89385 1039901
44365 1039901 2368508 1816526 -487163 -2840703 -4364950 -5726937 -7817520 -10107003
44357 -10107003 -10528795 -7449138 -1787845 3562978 6581808 7389346 6620059 4442053
44349 4442053 2272664 3310937 8766947 14582102 15022771 9824923 4936361 5039295
44341 5039295 7856667 7930291 4225159 1014964 1538641 3757710 3675007 886030 -1268344
44332 -1268344 -389441 2311849 4409196 5405359 6138960 6312764 4690981 1640024 -536094
$$ packed form
44392i86072L309539M21478j753708j300974o90126k376309l551522j47573N366469
44383a708798O258583J722430j595429J05263K268847O1752l704683l631762n23219
44374g47016O90090o58306p08889J582186K611402M42872j882540j240414R50516
44365A039901J328607n51982k303689k353540j524247j361987k090583k289483
44357a0107003m21792L079657N661293N350823L018830Q07538p69287k178006
44349D442053k169389J038273N456010N815155M40669n197848m888562J02934
44341E039295K817372P3624l705132l210195N23677K219069q2703k788977k154374
44332a268344Q78903K701290K097347R96163P33601J73804j621783l050957k176118
$$ plain form
44323 -536094 -532734 214309 -205924 -1433787 -1826367 -1382280 -1938381 -4502642 -7731964
44314 -7731964 -9224698 -7446828 -2646689 2916102 5877457 4571750 1281809 171059
44306 171059 2379978 4650666 3659701 211593 -2187056 -1669769 762923 3436308 5300260
44297 5300260 5273146 2591182 -1418757 -3621757 -2322997 794636 3038366 4059234
44289 4059234 5477504 7793319 9446676 9190796 7889665 7111092 6886889 5944715 3779138
44280 3779138 1474777 370357 587000 1184847 1452252 1682222 2534481 3701480 3706941
44271 3706941 1652234 -1112157 -2155281 -978966 409981 395395 -437093 -1376477 -3308638
44262 -3308638 -6107207 -6291184 -1066332 6001911 7843429 3219010 -1255102 -423868
$$ packed form
44323e36094L360P47043m20233j227863l92580M44087n56101k564261l229322
44314g731964j492734J777870M800139N562791K961355j305707l289941j110750
44306A71059K208919K270688r90965l448108k398649N17287K432692K673385J863952
44297E300260k7114k681964m009939k203000J298760L117633K243730J020868
44289D059234J418270K315815J653357k55880j301131p78573k24203r42174k165577
44280C779138k304361j104420K16643N97847K67405K29970Q52259J166999N461
44271C706941k054707k764391j043124J176315J388947j4586q32488r39384j932161
44262c308638k798569j83977N224852P068243J841518m624419m474112Q31234
$$ plain form
44254 -423868 2417524 1286367 -3419135 -6399962 -5753241 -4453038 -4322513 -3840054 -2485401
44245 -2485401 -2418513 -4267852 -5262877 -3607838 -1524142 -1845054 -4187592 -6391619 -7334402
44236 -7334402 -6540546 -3510265 521632 2502126 1491455 652698 3037169 7140879
44228 7140879 8809196 5939690 -518306 -8130294 -13435127 -13266190 -8399360 -3820332
44220 -3820332 -2576871 -1739706 2209576 6742828 6842646 3346400 2017511 4659483 6914326
44211 6914326 5751912 3657681 3460545 3939289 3330182 2971826 4032054 3984600 322296
44202 322296 -4385427 -5136833 -1278085 2689842 2848481 -177934 -3023060 -3265952 -961427
44193 -961427 2146113 4337339 5014976 4051823 789458 -4758255 -9972156 -11242408 -8073464
$$ packed form
44254d23868K841392j131157m705502k980827O46721J300203J30525M82459J354653
44245b485401O6888j849339r95025J655039K083696l20912k342538k204027r42783
44236g334402P93856L030281M031897J980494j010671q38757K384471M103710
44228G140879J668317k869506o457996p611988n304833J68937M866830M579028
44220c820332J243461Q37165L949282M533252R9818l496246j328889K641972K254843
44211F914326j162414k094231j97136M78744o09107l58356J060228m7454l662304
44202C22296m707723p51406L858748L967927J58639l026415k845126k42892K304525
44193i61427L107540K191226O77637r63153l262365n547713n213901j270252L168944
$$ plain form
44184 -8073464 -3372237 780184 4720168 7781890 7276365 3317599 949649 3765427
44176 3765427 8274507 8864603 5964519 4207023 4150097 1964216 -2655934 -4704904 -1951088
44167 -1951088 809452 -1084901 -5210418 -6477138 -5237056 -6031664 -9814188 -12363898
44159 -12363898 -10582851 -6326465 -2947925 -1201057 -110974 484781 226555 -367921
44151 -367921 -696981 -1538043 -3949664 -6860835 -7409727 -4318667 101227 2307055 1550131
44142 1550131 566695 2055624 5368341 7523266 7062262 5643368 5453631 6247545 6151439
44133 6151439 4795436 3865567 4094842 3441420 -153223 -5128546 -7589334 -6273241 -3985720
44124 -3985720 -3211445 -2608833 129074 3741918 4764454 2788880 1110056 1741158 2930478
$$ packed form
44184h073464M701227M152421L939984L061722n05525l958766k367950K815778
44176C765427M509080N90096k900084j757496n6926k185881m620150k048970K753816
44167a951088K760540j894353m125517j266720J240082p94608l782524k549710
44159a2363898J781047M256386L378540J746868J090083N95755k58226n94476
44151c67921l29060q41062k411621k911171n48892L091060M419894K205828p56924
44142A550131r83436J488929L312717K154925m61004j418894j89737P93914r6106
44133F151439j356003r29869K29275o53422l594643m975323k460788J316093K287521
44124c985720P74275O02612K737907L612844J022536j975574j678824O31102J189320
$$ plain form
44115 2930478 2802579 2485212 3581895 4945720 4539387 2830757 1723092 1423732 1112251
44106 1112251 1627458 4339527 7798761 8701254 6321463 3030995 193348 -3134685
44098 -3134685 -6558514 -6991346 -3122196 1421813 2113919 -799778 -3139567 -2305111 335160
44089 335160 1962025 1098073 -1858572 -4968009 -5550784 -2365946 2518845 5146258 3450881
44080 3450881 -932433 -4644066 -5677358 -4476582 -2774563 -1749621 -1109590 150632
44072 150632 2134078 3478049 2614051 -527315 -4047964 -5204115 -2551876 2253469
44064 2253469 5270825 4110739 742819 -934766 -41982 830166 215428 24468 1905910
44055 1905910 3951991 3297308 205737 -2896886 -5128062 -7247677 -8942524 -8792641
$$ packed form
44115B930478j27899l17367J096683J363825m06333j708630j107665k99360l11481
44106A112251N15207K712069L459234R02493k379791l290468k837647l328033
44098c134685l423829m32832L869150M544009O92106k913697k339789Q34456K640271
44089C35160J626865q63952k956645l109437n82775L184838M884791K627413j695377
44080C450881m383314l711633j033292J200776J702019J024942O40031J260222
44072A50632J983446J343971q63998l141366l520649j156151K652239M805345
44064B253469L017356j160086l367920j677585Q92784Q72148o14738j90960J881442
44055A905910K046081o54683l091571l102623k231176k119615j694847J49883
$$ plain form
44047 -8792641 -6743924 -4269156 -2161909 -242683 1022729 858338 -27429 -228162 -60657
44038 -60657 -854835 -2041285 -1644462 313686 1829182 2533321 4052219 6213946 6480091
44029 6480091 4298630 2408190 2306362 2286404 1934652 4035991 8638643 9748262 3146172
44020 3146172 -5716323 -7808333 -2833723 965433 -1061001 -4642067 -4601948 -2052327
44012 -2052327 -836532 -1647953 -3040408 -4709832 -6517629 -7021884 -5823022 -4831595 -4719453
44003 -4719453 -3077851 948826 3354395 569537 -4362811 -5433484 -1998696 1126759
43995 1126759 1118395 -22364 -170278 -23294 -189616 875309 4268073 8555807 11528233
43986 11528233 11845024 8462892 1391602 -5958444 -8314812 -4339123 1362466 3677545
$$ packed form
44047h792641K048717K474768K107247J919226J265412j64391q85767k00733J67505
44038f0657p94178j186450L96823J958148J515496P04139J518898K161727K66145
44029F480091k181461j890440j01828j9958l51752K101339M602652J109619o602090
44020C146172q862495k092010M974610L799156k026434l581066M0119K549621
44012b052327J215795q11421j392455j669424j807797n04255J198862R91427J12142
44003d719453J641602M026677K405569k784858m932348j070673L434788L125455
43995A126759q364j140759j47914J46984j66322J064925L392764M287734K972426
43986A1528233L16791l382132p071290p350046k356368L975689N701589K315079
$$ plain form
43978 3677545 2313370 135199 -1365257 -2531583 -3135523 -2132260 635759 4014873
43970 4014873 6306687 5817018 2118382 -2290376 -3472374 -671485 2331091 2086980
43962 2086980 -197593 -1146210 2863 1670668 3284462 5234710 6536273 5796153
43954 5796153 4134785 4083716 5588888 6011218 4378005 2853701 3349943 5126605 6498076
43945 6498076 6688682 5279956 2118177 -1229177 -2100856 -106797 1995599 2078420 1409502
43936 1409502 1974322 2755659 1059153 -3189338 -6812636 -7233513 -5226113 -3316746 -2858735
43927 -2858735 -3638328 -5282817 -7315789 -7882350 -4582277 1901887 6559365 5174566
43919 5174566 356731 -825327 3883130 8476652 6741734 613981 -3010046 -1572571
$$ packed form
43978C677545j364175k178171j500456j166326o03940J003263K768019L379114
43970D014873K291814m89669l698636m408758j181998K800889L002576k44111
43962B086980k284573r48617J149073J667805J613794J950248J301563p40120
43954E796153j661368n1069J505172M22330j633213j524304M96242J776662J371471
43945F498076J90606j408726l161779l347354q71679J994059K102396Q2821o68918
43936A409502N64820P81337j696506m248491l623298m20877K007400J909367M58011
43927b858735p79593j644489k032972n66561L300073O484164M657478j384799
43919E174566m817835j182058M708457M593522j734918o127753l624027J437475
$$ plain form
43911 -1572571 1343518 2420395 2139143 1641533 362602 -1802615 -3081268 -1986249
43903 -1986249 1208206 5549641 9588339 10727693 7734354 3900404 3731464 6114502
43895 6114502 5438147 541144 -2829368 -795371 2831343 3035810 869588 -308458
43887 -308458 -1284950 -4018768 -5846530 -3157880 1465293 2434080 59851 -513496 1413267
43878 1413267 1212410 -2011994 -2927339 1059775 4985667 4153306 1317109 1700443 5172747
43869 5172747 8144848 9975133 12434048 14850407 14771242 12644049 11525131 12206507 12182337
43860 12182337 9635183 5455945 1146943 -2422243 -3853995 -1746408 2617167 5441715
43852 5441715 4582364 1898738 390142 477251 298697 -1532888 -4698314 -7720514 -8623675
$$ packed form
43911a572571K916089J076877k81252m97610j278931k165217j278653J095019
43903a986249L194455M341435M038698J139354k993339l833950j68940K383038
43895F114502o76355m897003l370512K033997L626714K04467k166222j178046
43887c08458r76492k733818j827762K688650M623173R68787k374229n73347J926763
43878A413267k00857l224404r15345L987114L925892q32361k836197L83334L472304
43869E172747K972101J830285K458915K416359p9165k127193j118918O81376k4170
43860A2182337k547154m179238m309002l569186j431752K107587M363575K824548
43852E441715q59351k683626j508596Q7109j78554j831585l165426l022200r03161
$$ plain form
43843 -8623675 -6116269 -1593538 988560 -688783 -3583364 -2245420 3972644 9268692
43835 9268692 8547920 3885316 1203459 2279859 3795759 3674260 3766826 5077955 4764757
43826 4764757 762516 -3912240 -5024488 -2923476 -774224 969337 3846309 6302060
43818 6302060 4427551 -1729855 -6972997 -7197365 -3232641 2335148 8047878 11803399
43810 11803399 10612816 5080030 840289 2192284 6534247 8149486 5550170 1959257
43802 1959257 105735 -166776 8206 -147876 -1246219 -3006885 -3947582 -3663860 -4200880
43793 -4200880 -6877659 -9189615 -7866171 -3931748 -1263062 -674709 692413 3854989
43785 3854989 5906363 4812197 2740367 2367400 2538175 346601 -4004032 -7035507
$$ packed form
43843h623675K507406M522731K582098j677343k894581J337944O218064N296048
43835I268692p20772m662604k681857J076400J515900j21499R2566J311129l13198
43826D764757m002241m674756j112248K101012K149252J743561K876972K455751
43818F302060j874509o157406n243142k24368L964724N567789N712730L755521
43810A1803399j190583n532786m239741J351995M341963J615239k599316l590913
43802A959257j853522k72511J74982j56082j098343j760666r40697K83722n37020
43793d200880k676779k311956J323444L934423K668686N88353J367122L162576
43785C854989K051374j094166k071830l72967J70775k191574m350633l031475
$$ plain form
43777 -7035507 -6108736 -1834352 3158049 6277653 6226988 3816913 1567673 1376031 2588038
43768 2588038 3195021 2525513 1567309 930120 96805 -1012285 -1337629 -459435 183255
43759 183255 -796062 -2387228 -2351589 -466691 1045565 478308 -1605816 -3980159 -6265408
43750 -6265408 -7864968 -7256998 -4091277 -683076 524491 15829 -240539 -241990 -1469652
43741 -1469652 -3647539 -4846348 -4680230 -4511086 -4361761 -2772816 -299963 136245 -2449066
43732 -2449066 -5489795 -6811060 -7017851 -6504159 -3794837 688635 2784470 -85703
43724 -85703 -4563753 -5957352 -4722224 -4357776 -5038257 -4091854 -1592424 -490103 -1287819
43715 -1287819 -1184258 828661 1994011 42808 -3656676 -6165599 -5762896 -2355661
$$ packed form
43777g035507R26771M274384M992401L119604n0665k410075k249240j91642J212007
43768B588038O06983o69508r58204o37189q33315j109090l25344Q78194O42690
43759A83255r79317j591166L5639J884898J512256n67257k084124k374343k285249
43750f265408j599560O07970L165721L408201J207567n08662k56368j451j227662
43741a469652k177887j198809J66118J69144J49325J588945K472853M36208k585311
43732b449066l040729j321265k06791N13692K709322M483472K095835k870173
43724h5703m478050j393599J235128L64448o80481R46403K499430J102321p97716
43715a287819J03561K012919J165350j951203l699484k508923M02703L407235
$$ plain form
43707 -2355661 2352017 5027584 3751381 909504 384570 2223783 3151216 1796670
43699 1796670 -293169 -2406959 -5109381 -6989912 -5726153 -2778678 -1928921 -2429468
43691 -2429468 604314 7480420 11960922 10668244 7962713 7593763 6148840 445646
43683 445646 -4553639 -2604899 3346085 5610991 3820844 4036722 7209395 7431503 2360602
43674 2360602 -2815708 -3909161 -3093276 -2954847 -1650569 2238630 5305764 4040733
43666 4040733 131936 -2697646 -3809848 -4132318 -2838037 505089 3058207 2037306
43658 2037306 -795453 -1530389 351240 1970503 1326825 -1234147 -4468454 -6463437
43650 -6463437 -5034211 -810631 1760882 -241018 -3589032 -3481940 -1207511 -2326946
$$ packed form
43707b355661M707678K675567j276203k841877n24934J839213R27433j354546
43699A796670k089839k113790k702422j880531J263759K947475Q49757n00547
43691b429468L033782O876106M480502j292678k705531l68950j444923n703194
43683D45646m999285J948740N950984K264906j790147K15878L172673K22108n070901
43674B360602n176310j093453Q15885J38429J304278L889199L067134j265031
43666D040733l908797k829582j112202l22470J294281L343126K553118j020901
43658B037306k832759p34936J881629J619263o43678k560972l234307j994983
43650f463437J429226M223580K571513k001900l348014J07092K274429j119435
$$ plain form
43642 -2326946 -7487309 -10293972 -5864520 2607433 8030502 7301687 3018080 -488721
43634 -488721 -927629 781586 1913795 1340926 1229037 3549178 5968536 4817872 1760101
43625 1760101 2532208 7904364 11412661 9028639 5744208 7767517 12568296 13024822
43617 13024822 8755744 6138291 7771752 9119848 6775969 3531944 2647096 2575369
43609 2575369 925520 -646084 485403 3070923 4223132 4205444 5086850 6297323 5483044
43600 5483044 2926510 1421420 1942070 2653758 2397988 2316475 3454386 4998982 5538625
43591 5538625 4451432 1831792 -1353644 -2986694 -1478340 1904105 3910321 2932873
43583 2932873 564962 -684683 -35623 1491374 2590052 2776035 2414747 1806184 453967
$$ packed form
43642b326946n160363k806663M429452Q471953N423069p28815m283607l506801
43634d88721m38908J709215J132209n72869j11889K320141K419358j150664l057771
43625A760101P72107N372156L508297k384022l284431K023309M800779M56526
43617A3024822m269078k617453J633461J348096k343879l244025q84848p1727
43609B575369j649849j571604J131487K585520J152209j7688Q81406J210473q14279
43600E483044k556534j505090N20650P11688k55770q1513J137911J544596N39643
43591E538625j087193k619640l185436j633050J508354L382445K006216r77448
43583B932873k367911j249645O49060J526997J098678J85983l61288o08563j352217
$$ plain form
43574 453967 -1867705 -3404439 -1720254 2479616 5138643 4208692 2949465 5300904
43566 5300904 9902338 11963664 9752023 5750780 2383025 378169 730768 3994852
43558 3994852 7421195 6919576 2612841 -1240435 -2365988 -2464094 -2465599 -659101 2718511
43549 2718511 3933019 1706700 444755 3856895 8785149 9374377 4809880 -975197
43541 -975197 -5126603 -7423025 -7669187 -5637648 -2944376 -1686510 -1672132 -1430851 -816993
43532 -816993 -104805 1841262 5358485 7470228 5211355 508240 -1908289 -866952
43524 -866952 549273 285238 -419624 -217946 309949 385961 28388 -1045063 -3006517
43515 -3006517 -4389393 -3560619 -1559314 -645697 -227648 2519449 7751465 11922529 12227376
$$ packed form
43574D53967k321672j536734J684185M199870K659027r29951j259227K351439
43566E300904M601434K061326k211641m001243l367755k004856L52599L264084
43558C994852L426343n01619m306735l853276j125553r8106j505J806498L377612
43549B718511J214508k226319j261945L412140M928254N89228m564497n785077
43541i75197m151406k296422k46162K031539K693272J257866J4378K41281O13858
43532h16993P12188J946067L517223K111743k258873m703115k416529J041337
43524h66952J416225k64035p04862K01678N27895P6012l57573j073451j961454
43515c006517j382876Q28774K001305R13617M18049K747097N232016M171064L04847
$$ plain form
43506 12227376 9176881 4432210 -645990 -3684247 -2139228 3020318 7268301 7557786
43498 7557786 5032904 1904529 -1368217 -4443296 -5667780 -4317079 -2140969 -1073818
43490 -1073818 -1299165 -2589728 -5060478 -7341751 -6837553 -3620282 -1431518 -2710583
43482 -2710583 -5097006 -5224662 -3636382 -3065250 -3616500 -2804958 428550 4344950 6663679
43473 6663679 6338860 3701521 463803 -1138152 -688090 -316795 -1878385 -4469454 -5955209
43464 -5955209 -5584865 -3692670 -393759 3559672 5947711 5116221 1971872 -1476654
43456 -1476654 -4175342 -5129095 -2596501 3126141 7699507 6835165 1804541 -2207151
43448 -2207151 -3009048 -3520607 -6577374 -10623021 -11901313 -8931520 -3470086 1580553
$$ packed form
43506A2227376l050495m744671n078200l038257J545019N159546M247983K89485
43498G557786k524882l128375l272746l075079j224484J350701K176110J067151
43490a073818k25347j290563k470750k281273N04198L217271K188764j279065
43482b710583k386423j27656J588280N71132n51250Q11542L233508L916400K318729
43473F663679l24819k637339l237718j601955M50062L71295j561590k591069j485755
43464e955209L70344J892195L298911L953431K388039q31490l144349l448526
43456a476654k698688r53753K532594N722642M573366q64342n030624m011692
43448b207151q01897n11559l056767m045647j278292K969793N461434N050639
$$ plain form
43440 1580553 4007096 3108805 131863 -2244109 -1760205 1594617 5519635 7331392
43432 7331392 6316009 4156798 2761115 2181926 1540265 1186692 1995765 2764120 922483
43423 922483 -3518836 -7359341 -8671513 -9128696 -10180190 -9826173 -5961324 -645904 2276732
43414 2276732 2436345 2638053 4272294 6052602 6688686 6050052 4267774 2219586 1991044
43405 1991044 4091191 5359745 2949459 -722715 -1007805 1708894 2471664 -416289
43397 -416289 -3167590 -3254631 -2999348 -3868452 -2286120 4567279 12419211 14527941 10850894
43388 10850894 7664389 8603545 10727120 10067579 6910750 3816989 1586111 -370161
43380 -370161 -1720355 -1984687 -2493094 -4724735 -6856098 -4914499 1532488 7325059 7472358
$$ packed form
43440A580553K426543q98291k976942k375972M83904L354822L925018J811757
43432G331392j015383k159211j395683n79189o41661l53573Q09073P68355j841637
43423I22483m441319l840505j312172m57183j051494L54017L864849N315420K922636
43414B276732J59613K01708J634241J780308O36084o38634j782278k048188k28542
43405A991044K100147J268554k410286l672174k85090K716699P62770k887953
43397d16289k751301q7041K55283q69104J582332O853399P851932K108730l677047
43388A0850894l186505R39156K123575o59541l156829l093761k230878j956272
43380c70161j350194k64332n08407k231641k131363J941599O446987N792571J47299
$$ plain form
43371 7472358 3326362 345642 726504 1633236 703163 -635207 -745081 -948921 -2464249
43362 -2464249 -3180422 -898752 2385228 3113737 1459316 177169 -384224 -1735890 -2711188
43353 -2711188 -601701 3168755 3920446 1271604 287306 3025404 4555980 1006660
43345 1006660 -3446367 -2742251 1496901 2546701 -1033610 -3629178 -1166331 3829843
43337 3829843 6917314 7115349 5807988 3786504 1711145 1056764 2175714 2904474 1143050
43328 1143050 -2177750 -4368380 -4293092 -2739682 -278259 3203536 6873717 8766916
43320 8766916 7930571 5611729 3649876 2595465 2062930 2015930 2705245 3860316 4831601
43311 4831601 5115633 4152333 1686518 -510740 1140127 7553159 13712699 13453530 7603538
$$ packed form
43371G472358m145996k980720L80862R06732r30073j338370j09874k03840j515328
43362b464249p16173K281670L283980P28509j654421j282147n61393j351666r75298
43353b711188K109487L770456P51691k648842r84298K738098J530576l549320
43345A006660m453027P04116M239152J049800l580311k595568K462847M996174
43337C829843L087471J98035j307361k021484k075359o54381J118950P28760j761424
43328A143050l320800k190630P5288J553410K461423L481795L670181J893199
43320H766916q36345k318842j961853j054411n32535m7000O89315J155071R71285
43311D831601K84032r63300k465815k197258J650867O413032O159540k59169n849992
$$ plain form
43302 7603538 3309905 4202927 5965884 4339231 2491992 5364409 10472187 11171233
43294 11171233 7406222 5790142 8631232 10286481 6801825 2518436 3016967 6704001
43286 6704001 8353243 7241750 6467946 6639253 5641380 3626233 3265614 4959758 5885709
43277 5885709 4513682 2907877 3621013 6564448 9640530 10789541 9184845 6013986
43269 6013986 4143803 5486313 8707402 10865461 10964900 10406824 10453071 11125354 12351582
43260 12351582 14100675 15075945 13154328 7991268 2107978 -1395590 -1796237 -1093525
43252 -1093525 -1511657 -2635128 -1430112 3931785 10569788 13142367 10180507 6060012
43244 6060012 5414924 7733860 9415939 9190696 8804810 9589067 11230426 13390374 15871402
$$ packed form
43302G603538m293633Q93022J762957j626653j847239K872417N107778O99046
43294A1171233l765011j616080K841090J655249l484656m283389M98531L687034
43286F704001J649242j111493p73804J71307r97873k015147l60619J694144R25951
43277E885709j372027j605805P13136K943435L076082J149011j604696l170859
43269F013986j870183J342510L221089K158059R9439n58076M6247O72283J226228
43260A2351582J749093R75270j921617n163060n883290l503568m00647P02712
43252a093525m18132j123471J205016N361897O638003K572579k961860m120495
43244F060012o45088K318936J682079k25243l85886P84257J641359K159948K481028
$$ plain form
43235 15871402 17376864 16550409 14252964 12580027 11610935 9488209 6094066 4289076
43227 4289076 6351948 10683563 13276138 11886989 8124411 5656630 6564816 9490686
43219 9490686 11639533 12208041 12639503 13731313 14583951 14804096 15156964 15057773 12548623
43210 12548623 8635648 8132398 12948681 17671809 16237263 10784253 8799178 12622091
43202 12622091 17131845 17701833 15165808 12131870 9359712 7328622 7020057 7275696
43194 7275696 5205700 1027081 -1243339 207034 2212189 2220836 2706494 6741501 12535515
43185 12535515 16252757 17817488 19943516 23106518 25392666 26229920 26531948 25880773
43177 25880773 23319107 20615812 20811652 23127272 23366028 20860639 21132851 28515017
$$ packed form
43235A5871402J505462q26455k297445j672937r69092k122726l394143j804990
43227D289076K062872M331615K592575j389149l762578k467781R08186K925870
43219I490686K148847N68508M31462J091810Q52638K20145L52868r9191k509150
43210A2548623l912975n03250M816283M723128j434546n453010j985075L822913
43202A2622091M509754N69988k536025l033938k772158k031090l08565K55639
43194G275696k069996m178619k270420J450373K005155Q647M85658M035007N794014
43185A2535515L717242J564731K126028L163002K286148Q37254L02028o51175
43177B5880773k561666k703295J95840K315620K38756k505389K72212P382166
$$ plain form
43169 28515017 38675460 42726064 38389453 33074582 34585624 42213065 49751718 54672482
43161 54672482 59843203 66891202 73167252 77166843 82511629 93037588 106975458 120059270
43153 120059270 132298727 147161054 165098234 182328816 195592677 203768004 205074670
43146 205074670 197764560 184607718 172038785 163095249 155125080 146070211 138713436 136270121
43138 136270121 137750418 140838896 146131855 155136277 166738967 179305491 194429450
43131 194429450 215048286 240763207 267659051 291649858 309487015 317565063 312688231
43124 312688231 294466035 266054268 233065957 201777854 176070091 154811514 134141078
43117 134141078 113301849 95854304 84230170 76417035 69775542 64516872 60802572
$$ packed form
43169B8515017J0160443M050604m336611n314871J511042P627441P538653M920764
43161E4672482N170721P047999O276050L999591N344786J0525959J3937870J3083812
43153A20059270J2239457J4862327J7937180J7230582J3263861Q175327J306666
43146B05074670p310110j3156842j2568933q943536p970169r054869p356775k443315
43138A36270121J480297L088478N292959R004422J1602690J2566524J5123959
43131A94429450K0618836K5714921K6895844K3990807J7837157Q078048m876832
43124C12688231j8222196k8411767l2988311l1288103k5707763k1258577k0670436
43117A34141078k0839229j7447545j1624134p813135o641493n258670l714300
$$ plain form
43110 60802572 56031741 48585705 41259987 37045364 34128643 29361972 24314276 22827656
43102 22827656 23964411 22686130 17389131 12025611 10156250 10885668 11623912 11586476 11365322
43093 11365322 11292862 11117975 10095842 7718239 5424606 5989968 9365257 11333265 9138978
43084 9138978 6224012 7668754 12814381 16645969 16976322 15579012 13356327 9628857
43076 9628857 5849767 4682642 5064292 3314977 -215969 -839510 2943377 6653784
43068 6653784 6329154 3235008 248573 -2005269 -3287977 -2292389 497049 2261434
43060 2261434 2370640 3589367 6599520 7681333 4767261 1490608 1506187 2716735 1571363
43051 1571363 -245375 1334355 5328016 6602518 3613079 364442 210446 1772217
$$ packed form
43110F0802572m770831p446036p325718m214623k916721m766671n047696j486620
43102B2827656J136755j278281n296999n363520j869361P29418P38244l7436k21154
43093A1365322p2460j74887j022133k377603k293633N65362L375289J968008k194287
43084I138978k914966J444742N145627L831588L30353j397310k222685l727470
43076I628857l779090j167125L81650j749315l530946o23541L782887L710407
43068F653784l24630l094146k986435k253842j282708R95588K789438J764385
43060B261434J09206J218727L010153J081813k914072l276653J5579J210548j145372
43051A571363j816738J579730L993661J274502k989439l248637j53996J561771
$$ plain form
43043 1772217 2238333 1620134 1871193 3398404 4207938 2400612 -1260750 -3873273 -3734508
43034 -3734508 -2321096 -1829191 -1748130 -17555 3155686 5677254 7560329 10781141 14512649
43025 14512649 14744630 10516134 6598195 7249001 10476842 11360933 8315066 3308466
43017 3308466 -1345834 -3471684 -1070532 4801007 9511663 10268009 9560516 10240042 10431650
43008 10431650 7426849 3552142 3057997 5341018 6577204 6444446 7640771 9864765
43000 9864765 10173742 8838881 8762281 8936856 4885681 -3233511 -9272365 -9973563 -9289814
42991 -9289814 -10905746 -12094875 -9161506 -4335522 -2290458 -3099315 -3705106 -4017808 -6197112
42982 -6197112 -8949794 -7837672 -1856977 4372913 6251215 4141799 1458546 148191
$$ packed form
43043A772217M66116o18199K51059J527211Q09534j807326l661362k612523J38765
43034c734508J413412M91905Q1061J730575L173241K521568J883075L220812L731508
43025A4512649K31981m228496l917939O50806L227841Q84091l045867n006600
43017C308466m654300k125850K401152N871539M710656P56346p07493O79526J91608
43008A0431650l004801l874707m94145K283021J236186j32758J196325K223994
43000I864765L08977j334861p6600J74575m051175q119192o038854p01198O83749
42991i289814j615932j189129K933369M825984K045064q08857o05791l12702k179304
42982f197112k752682J112122N980695O229890J878302k109416k683253j310355
$$ plain form
42974 148191 -348106 -1018999 -1712608 -1423761 325153 2263957 1988557 -1231846 -4550682
42965 -4550682 -3998685 658023 4932140 4702309 1435317 602760 4818393 10390238 11874673
42956 11874673 8691355 5162268 4513803 5476382 5490097 4638628 4499553 4958270 4645194
42947 4645194 3569783 2908699 2720815 2255034 2230672 4233336 7605475 9447331 8482306
42938 8482306 6756419 6448083 6871669 6036770 3861885 2384943 3356674 6480468 9623596
42929 9623596 10522811 9014599 7583426 8581259 10946867 11335079 8868568 6807906 8322791
42920 8322791 12173899 14335758 13199720 11483544 12845084 17642000 22565208 24256752
42912 24256752 22864179 21514202 22322644 24081973 24659146 24235595 24220802 23851130 20720761
$$ packed form
42974A48191m96297o70893o93609K88847J748914J938804k75400l220403l318836
42965d550682N51997M656708M274117k29831l266992q32557M215633N571845J484435
42956A1874673l183318l529087o48465R62579J3715q51469j39075M58717l13076
42947D645194j075411o61084j87884m65781k4362K002664L372139J841856r65025
42938H482306j725887l08336M23586q34899k174885j476942R71731L123794L143128
42929I623596Q99215j508212j431173R97833K365608L88212k466511k060662J514885
42920H322791L851108K161859j136038j716176J361540M796916M923208J691544
42912B4256752j392573j349977Q08442J759329N77173m23551j4793l69672l130369
$$ plain form
42903 20720761 15113606 11184391 12490494 18123361 24536724 29552253 33017422 34966713
42895 34966713 35249757 34450887 33294429 31066177 26107643 18413634 10880380 7214473
42887 7214473 8544673 12253956 14320587 12963307 9923951 8153838 8670384 9971386
42879 9971386 9983020 8020295 5269380 3849656 4860450 6938555 7611798 6487808 5641352
42870 5641352 6069017 5870395 3646684 1421692 1426813 1977102 253982 -2209953 -1392176
42861 -1392176 2236739 3538233 326523 -3619156 -4811210 -4715902 -5627044 -6044604 -3545911
42852 -3545911 941357 5163946 9080244 12867826 13991900 10361466 4683444 1642289
42844 1642289 1863227 2373099 1953423 2015897 2696988 2165162 92088 -1618533 -1919053
$$ packed form
42903B0720761n607155l929215J306103N632867O413363N015529L465169J949291
42895C4966713K83044p98870j156458k228252m958534p694009p533254l665907
42887G214473J330200L709283K066631j357280l039356j770113N16546J301002
42879I971386J1634j962725k750915j419724J010794K078105O73243j123990q46456
42870E641352M27665j98622k223711k224992N121N50289j723120k463935Q17777
42861a392176L628915J301494l211710l945679j192054R5308r11142m17560K498693
42852c545911M487268M222589L916298L787582J124074l630434n678022l041155
42844A642289K20938N09872m19676O2474O81091n31826k073074j710621l00520
$$ plain form
42835 -1919053 -1392224 134708 3411475 6836226 7195974 4254726 1382173 480522 -487321
42826 -487321 -3337234 -6190880 -6468213 -4849691 -3637701 -3042356 -1878687 -717735 -1468776
42817 -1468776 -4203299 -6778198 -7599991 -6850863 -5077549 -2625113 -769263 -1378614 -4509430
42808 -4509430 -7775787 -9116721 -9021704 -8957483 -8807331 -7519348 -5570028 -4727683 -5284035
42799 -5284035 -5473553 -4269030 -2944748 -2785655 -2909896 -1930953 -407908 299547 595455
42790 595455 1890055 3978895 5493442 6437208 7635363 7878544 4656447 -1756235 -7774283
42781 -7774283 -10794898 -11290659 -10002772 -6443189 -1584693 1488259 1876855 2654973 5680537
42772 5680537 7682422 4958220 -582834 -4099255 -4704787 -5267157 -6286778 -4686206
$$ packed form
42835a919053N26829J526932L276767L424751L59748k941248k872553r01651r67843
42826d87321k849913k853646k77333J618522J211990N95345J163669J160952p51041
42817a468776k734523k574899q21793P49128J773314K452436J855850o09351l130816
42808d509430l266357j340934R5017O4221J50152J287983J949320Q42345n56352
42799e284035j89518J204523J324282J59093j24241R78943J523045P07455K95908
42790E95455J294600K088840J514547R43766J198155K43181l222097o412682o018048
42781g774283l020615m95761J287887L559583M858496L072952L88596P78118L025564
42772E680537K001885k724202n541054l516421o05532n62370j019621J600572
$$ plain form
42764 -4686206 743083 6501577 8386635 6085526 2911738 2466482 5602314 9241334
42756 9241334 8724922 2976379 -3566465 -6008789 -4677666 -3492961 -4399531 -6608626
42748 -6608626 -9831159 -14112865 -17041899 -15384590 -9715858 -3736942 925477 5175293
42740 5175293 7823663 5647649 -574979 -4889310 -3453491 672889 2316437 373950
42732 373950 -3139484 -6891999 -10135880 -11332305 -9865962 -7596467 -6575216 -6657021 -6756272
42723 -6756272 -6522050 -5538996 -3227898 -801339 -606220 -2165820 -2030550 740274 2497595
42714 2497595 671474 -2201974 -3058848 -3111894 -4217600 -3983923 425092 5892545 6213730
42705 6213730 571751 -5503304 -7256640 -4665633 194161 5247395 7682050 5494938
$$ packed form
42764d686206N429289N758494J885058k301109l173788m45256L135832L639020
42756I241334n16412n748543o542844k442324J331123J184705r06570k209095
42748f608626l222533m281706k929034J657309N668732N978916M662419M249816
42740E175293K648370k176014o222628m314331J435819M126380J643548j942487
42732C73950l513434l752515l243881j196425J466343K269495J021251q1805r9251
42723f756272K34222R83054K311098K426559J95119j559600J35270K770824J757321
42714B497595j826121k873448q56874n3046j105706K33677M409015N467453L21185
42705F213730n641979o075055j753336K591007M859794N053234K434655k187112
$$ plain form
42697 5494938 971186 -688679 2595592 7659032 10627256 10908824 9898222 8291147
42689 8291147 5956684 2826715 -890405 -4237728 -5325167 -3105016 973440 4668317
42681 4668317 7604020 10273414 11398870 9121805 4474400 802610 -375325 -483634
42673 -483634 -1016645 -2107248 -3687218 -5254421 -4757172 -932815 3234336 2888519 -2387873
42664 -2387873 -7996111 -10505163 -10706209 -9795966 -6905314 -2349827 707022 633144 121451
42655 121451 1599975 2692685 -228250 -5942291 -9454725 -8233606 -4398895 -1262437
42647 -1262437 -167067 -402667 -316958 1118294 2580939 1360730 -2576122 -5305168 -3967647
42638 -3967647 -1307654 -2021492 -5608495 -6619154 -2279836 3607653 5638520 2960694
$$ packed form
42697E494938m523752j659865L284271N063440K968224K81568j010602j607075
42689H291147k334463l129969l717120l347323j087439K220151M078456L694877
42681D668317K935703K669394J125456k277065m647405l671790j177935j08309
42673d83634n33011j090603j579970j567203M97249L824357M167151l45817n276392
42664b387873n608238k509052k01046R10243K890652M555487L056849p3878n11693
42655A21451J478524J092710k920935n714041l512434J221119L834711L136458
42647a262437J095370k35600Q5709J435252J462645j220209l936852k729046J337521
42638c967647K659993p13838l587003j010659M339318N887489K030867k677826
$$ plain form
42630 2960694 -1243485 -4250513 -5432816 -4672339 -2014791 746710 504930 -3538652
42622 -3538652 -7863089 -8244189 -5134231 -3225834 -5051783 -7445036 -6188487 -2134873
42614 -2134873 223147 -813494 -2536139 -2493936 -1320359 -283273 638198 964062 -879691
42605 -879691 -4514987 -6579218 -4788942 -910414 2145375 3976217 5536599 6674933
42597 6674933 7028095 7176755 6742749 3879715 -810473 -2855496 15869 3119327 659427
42588 659427 -5695082 -9184143 -7611642 -5003474 -3999720 -2701900 -164257 875318
42580 875318 -810934 -1969428 -159857 2056976 1550209 -242216 -216139 1189461 1457439
42571 1457439 510694 84602 281930 285519 971279 3133878 4421286 2080995 -1993429
$$ packed form
42630B960694m204179l007028j182303P60477K657548K761501k41780m043582
42622c538652m324437l81100L109958J908397j825949k393253J256549M053614
42614b134873K358020j036641j722645M2203J173577J037086R21471L25864j843753
42605h79691l635296k064231J790276L878528L055789J830842J560382J138334
42597F674933L53162J48660m34006k863034m690188k045023K871365L103458k459900
42588F59427o354509l489061J572501K608168J003754J297820K537643J039575
42580H75318j686252j158494J809571K216833n06767j792425K6077J405600K67978
42571A457439r46745m26092J97328L589O85760K162599J287408k340291m074424
$$ plain form
42562 -1993429 -3188008 -987469 489264 -680378 -1372456 927163 3730941 3565928
42554 3565928 1260456 24524 502494 1126596 1800355 3499653 4922674 3467655 -32457
42545 -32457 -1220990 1701559 4871196 3911399 -164778 -2912238 -2669996 -1593697 -1174387
42536 -1174387 -304694 1573253 2671462 1927419 1373121 3128077 5748674 6179323 4305016
42527 4305016 2797486 2829927 2801407 1633240 591609 817508 1333961 845346 -414066
42518 -414066 -2059238 -4800609 -8325949 -9674005 -6476952 -1022912 1808775 735593
42510 735593 -468555 1603920 5530578 7455318 6192331 4030256 3216585 3405048 2637963
42501 2637963 -280469 -4680748 -8697766 -10776346 -10618575 -8640663 -4866735 709979
$$ packed form
42562a993429j194579K200539J476733j169642o92078K299619K803778j65013
42554C565928k305472j235932M77970O24102O73759J699298J423021j455019l500112
42545c2457j188533K922549L169637r59797m076177k747460K42242J076299M19310
42536a174387Q69693J877947J098209p44043n54298J754956K620597M30649j874307
42527D305016j507530L2441k8520j168167j041631K25899N16453m88615j259412
42518d14066j645172k741371l525340j348056L197053N454040K831687j073182
42510G35593j204148K072475L926658J924740j262987k162075q13671J88463p67085
42501B637963k918432m400279m017018k078580J57771J977912L773928N576714
$$ plain form
42493 709979 6530154 9656872 8814970 6507633 6550816 9538977 12081841 10735790 5484343
42484 5484343 -917556 -5552396 -6545262 -3301121 2680809 7943323 9933036 9719247
42476 9719247 10193128 11468323 10237689 4771523 -1499619 -3678088 -1761274 -687949
42468 -687949 -3784266 -8565688 -10243010 -7552180 -3280210 -146461 1579719 2569620
42460 2569620 2839123 2491255 2429569 3061525 3202766 1480434 -1744126 -4939210 -7302741
42451 -7302741 -8770052 -8611071 -5966034 -2169264 -618623 -2985623 -6676251 -7577372
42443 -7577372 -4796384 -1256698 198017 -125594 161889 2431428 5389612 6002883 2177983
42434 2177983 -4665420 -9822298 -9214284 -3391477 3054999 6015633 4955764 1931393
$$ packed form
42493G09979N820175L126718q41902k307337M3183K988161K542864j346051n251447
42484E484343o401899m634840r92866L244141N981930N262514J989713k13789
42476I719247M73881J275195j230634n466166o271142k178469J916814J073325
42468f87949l096317m781422j677322K690830M271970L133749J726180R89901
42460B569620K69503l47868o1686O31956J41241j722332l224560l195084k363531
42451g302741j467311J58981K645037L796770J550641k367000l690628r01121
42443g577372K780988L539686J454715l23611K87483K269539K958184O13271l824900
42434B177983o843403n156878O08014N822807O446476K960634j059869l024371
$$ plain form
42426 1931393 -765174 -1712361 -886209 104304 -347246 -1411365 -706167 1707933 2510705
42417 2510705 -175330 -3594820 -4254278 -2955791 -2753279 -3466454 -2389243 -16331 -373178
42408 -373178 -4510256 -7983190 -7147105 -4393212 -3975119 -5402337 -4920724 -2048529 -430761
42399 -430761 -2201330 -5076826 -5980816 -4897726 -3853251 -3888427 -4343204 -4160878 -3126369
42390 -3126369 -2377620 -3592830 -6655170 -8622729 -6847854 -2902144 -966445 -1933571
42382 -1933571 -1967477 1706353 6349389 7414060 4554597 959641 -1818723 -4764667
42374 -4764667 -7594297 -7919450 -5107968 -1753449 234862 2300033 6023996 9550272
42366 9550272 9827230 7077345 4467403 3970812 4712271 4939024 3681169 935990 -1927011
$$ packed form
42426A931393k696567r47187Q26152R90513m51550j064119P05198K414100Q02772
42417B510705k686035l419490o59458J298487K02512p13175J077211K372912l56847
42408c73178m137078l472934Q36085K753893M18093j427218M81613K872195J617768
42399d30761j770569k875496r03990J083090J044475l5176m54777J82326J034509
42390c126369P48749j215210l062340j967559J774875L945710J935699r67126
42382a933571l3906L673830M643036J064671k859463l594956k778364k945944
42374d764667k829630l25153K811482L354519J988311K065171L723963L526276
42366I550272K76958k749885k609942m96591P41459K26753j257855k745179k863001
$$ plain form
42357 -1927011 -2622672 -910713 -227884 -3617202 -8669104 -9935802 -6321746 -2161165
42349 -2161165 -337220 1150844 3950413 5408176 3244257 180159 -474171 -601957
42341 -601957 -3434261 -6449203 -4488005 970196 2504974 -2310984 -7021075 -5638568
42333 -5638568 -357678 3215648 3665455 2693460 578701 -2605045 -4204098 -2333458
42325 -2333458 -92455 -1696024 -5751617 -7244817 -5503983 -4991805 -7654494 -9498147
42317 -9498147 -6796027 -1890166 802 -2409128 -5391987 -4989961 -1179062 2392336
42309 2392336 2040712 -2308301 -7098833 -9152932 -8810864 -7949888 -6385635 -2888327 1016101
42300 1016101 1812976 -820549 -2808923 -1040140 2678696 4665735 4117273 2947217
$$ packed form
42357a927011o95661J711959O82829l389318n051902j266698L614056M160581
42349b161165J823945J488064K799569J457763k163919l064098o54330j27786
42341f01957k832304l014942J961198N458201J534778m815958m710091J382507
42333e638568N280890L573326M49807r71995k114759l183746j599053J870640
42325b333458K241003j603569m055593j493200J740834N12178k662689j843653
42317i498147K702120M905861J890968k409930k982859M02026L810899L571398
42309B392336l51624m349013m790532k054099L42068Q60976J564253L497308L904428
42300A016101P96875k633525j988374J768783L718836J987039n48462j170056
$$ plain form
42292 2947217 2726068 3793014 6000991 8326767 8800710 6824012 4852267 5823728 9194414
42283 9194414 11334124 10083464 7436636 6858054 8642004 9258688 6035110 1506106
42275 1506106 795385 4167683 5397514 256218 -6300101 -6323585 -779658 1267600 -3739828
42266 -3739828 -8162815 -4769267 2186280 3494567 -1619607 -5783563 -5064235 -2847062
42258 -2847062 -2252887 -1862532 -824666 -2038211 -6951875 -11777558 -12667342 -11411144 -12134536
42249 -12134536 -14630095 -15059860 -12299140 -9716494 -10192076 -12167141 -11893388 -8164187
42241 -8164187 -3564932 -1455963 -2674075 -5472399 -7927563 -9235320 -8840600 -6327911
42233 -6327911 -3155935 -2296681 -4103976 -4659993 -1356769 1741311 -1286791 -8616129
$$ packed form
42292B947217k21149J066946K207977K325776M73943j976698j971745R71461L370686
42283I194414K139710j250660k646828n78582J783950O16684l223578m529004
42275A506106p10721L372298J229831n141296o556319k3484N543927K047258n007428
42266c739828m422987L393548O955547J308287n114174m163956P19328K217173
42258b847062N94175L90355J037866j213545m913664m825683q89784J256198p23392
42249a2134536k495559m29765K760720K582646m75582j975065K73753L729201
42241h164187M599255K108969j218112k798324k455164j307757L94720K512689
42233f327911L171976Q59254j807295n56017L303224L098080l028102p329338
$$ plain form
42225 -8616129 -11371911 -5308431 3304654 6229116 3341324 411027 221704 594262
42217 594262 -446834 -2037018 -2779055 -2466295 -1492552 -699910 -1269636 -2989738 -3875017
42208 -3875017 -3388125 -4022864 -7016491 -8835009 -5806985 -396914 1927010 1018623 1714849
42199 1714849 5051852 5864629 1201890 -4170454 -4156055 537437 4397086 4659792 3241964
42190 3241964 2796844 4129769 6545572 8126122 6614026 2385424 -536902 1037916
42182 1037916 4879336 5909311 2802943 -811899 -1732010 -904096 -941356 -2209029 -2887567
42173 -2887567 -1779046 258834 1323825 232809 -2501030 -5041141 -5651316 -3996201
42165 -3996201 -1249251 939662 1846825 2402408 4040149 6148993 5597034 545676 -5750569
$$ packed form
42225h616129k755782O063480Q613085K924462k887792k930297j89323L72558
42217E94262j041096j590184p42037L12760R73743P92642n69726j720102q85279
42208c875017M86892o34739k993627j818518L028024N410071K323924r08387O96226
42199A714849L337003Q12777m662739n372344J4399M693492L859649K62706j417828
42190C241964m45120J332925K415803J580550j512096m228602k922326J574818
42182A037916L841420J029975l106368l614842r20111Q27914l7260j267673o78538
42173b887567J108521K037880J064991j091016k733839k540111o10175J655115
42165c996201K746950K188913R07163N55583J637741K108844n51959n051358o296245
$$ plain form
42156 -5750569 -7513469 -3344921 1926218 3357167 1356135 -534573 -802447 -538686
42148 -538686 -754710 -1721419 -3634183 -5612032 -5488271 -2975783 -1288337 -2740106 -4624599
42139 -4624599 -3171554 35404 241516 -2713129 -4119850 -2232043 -841797 -2398542
42131 -2398542 -3824826 -2056481 771796 1356069 790624 1922458 3892203 3857526 2471615
42122 2471615 3117483 6346707 9122087 9476471 8300268 6326917 2878990 -1531704
42114 -1531704 -4332797 -3926368 -1567826 695505 2130341 2648030 2003694 786862 664197
42105 664197 2366064 4378016 4607968 2698546 79810 -1587913 -1535101 -178941 1061239
42096 1061239 626614 -1928370 -5358841 -7350725 -6101009 -2197785 1054293 650803
$$ packed form
42156e750569j762900M168548N271139J430949k001032j890708k67874K63761
42148e38686k16024r66709j912764j977849J23761K512488J687446j451769j884493
42139d624599J453045L206958K06112k954645j406721J887807J390246j556745
42131b398542j426284J768345K828277N84273n65445J131834J969745l4677j385911
42122B471615O45868L229224K775380L54384j176203j973351l447927m410694
42114a531704k801093M06429K358542K263331J434836N17689o44336j216832j22665
42105F64197J701867K011952K29952j909422k618736j667723N2812J356160J240180
42096A061239m34625k554984l430471j991884J249716L903224L252078m03490
$$ plain form
42088 650803 -2183474 -2893676 324206 3426838 1832712 -2902744 -5007602 -2295381
42080 -2295381 1628726 3158043 2973678 3304117 4159011 4436549 4522647 5390754 6334684
42071 6334684 5644763 3051643 187350 -1108508 -414386 772405 163061 -2583828 -4504342
42062 -4504342 -2532284 2068422 4973768 4795678 4697740 6915941 9094859 8360616 6014117
42053 6014117 5014938 5058490 3758622 1263992 -59716 168946 146640 -242193 1029382
42044 1029382 4097611 5968128 4606898 1824633 637672 1508015 2488437 1822380 -569782
42035 -569782 -3129167 -3541472 -699425 3662443 6382170 6382523 5665862 6385490 8139073
42026 8139073 8841346 7338883 4450246 1930514 745299 30576 -2036753 -5783423
$$ packed form
42088F50803k834277p10202L217882L102632j594126m735456k104858K712221
42080b295381L924107J529317j84365L30439Q54894K77538Q6098Q68107R43930
42071F334684o89921k593120k864293j295858O94122J186791o09344k746889j920514
42062d504342J972058M600706K905346j78090r7938K218201K178918p34243k346499
42053F014117r99179M3552j299868k494630j323708K28662k2306l88833J271575
42044A029382L068229J870517j361230k782265j186961Q70343R80422o66057k392162
42035e69782k559385m12305K842047M361868K719727L53p16661P19628J753583
42026H139073P02273j502463k888637k519732j185215p14723k067329l746670
$$ plain form
42018 -5783423 -9017022 -9372762 -6957359 -3439744 427511 4351741 6443032 4529402
42010 4529402 -321135 -4394509 -6074015 -7246853 -9001910 -8936061 -4806937 1430789
42002 1430789 5818019 7297769 8020896 9485673 10619086 9691661 6609919 3127574
41994 3127574 1486606 2500179 4434104 4531310 2275027 151127 368885 1985321 2461157
41985 2461157 1103351 -425588 -500729 681265 1380374 -232620 -4276959 -8449360 -10153315
41976 -10153315 -9647439 -9461479 -10118476 -8700977 -3192396 3811801 7858311 7594840 4899323
41967 4899323 1629301 -1207601 -2287573 -956483 1019101 1145427 -744808 -3242927
41959 -3242927 -6116949 -9435214 -10889944 -7859093 -2310552 245722 -2194210 -5608111
$$ packed form
42018e783423l233599l55740K415403L517615L867255L924230K091291j913630
42010D529402m850537m073374j679506j172838j755057O5849M129124O237726
42002A430789M387230J479750P23127J464777J133413r27425l081742l482345
41994C127574j640968J013573J933925R7206k256283k123900K17758J616436M75836
41985B461157j357806j528939p5141J181994O99109j612994m044339m172401j703955
41976a0153315N05876J85960o56997J417499N508581P004197M046510k63471k695517
41967D899323l270022k836902j079972J331090J975584J26326j890235k498119
41959c242927k874022l318265j454730L030851N548541K556274k439932l413901
$$ plain form
41951 -5608111 -6035424 -4810454 -5243792 -6780020 -5804378 -1164627 4044310 6159822 4432116
41942 4432116 663845 -3161277 -6320663 -8938786 -10614115 -10110240 -7114482 -3613019
41934 -3613019 -1872120 -1227035 1006849 5014457 7263737 5069680 315190 -3171876
41926 -3171876 -4352038 -4936891 -5650430 -5026628 -2142903 1216268 2048374 -595894 -4230675
41917 -4230675 -5142408 -2326611 1273402 2336231 1232464 818996 1838207 2336483 1851549
41908 1851549 2676609 5449972 6903078 4700081 1742421 2165565 4995083 5753656 3368464
41899 3368464 1281351 1596307 2106029 333221 -2609075 -3947377 -2984688 -1306821 -544642
41890 -544642 -1056110 -1885560 -1409257 1022000 3802261 4557204 3047560 1307569 860925
$$ packed form
41951e608111m27313J224970m33338j536228R75642M639751N208937K115512j727706
41942D432116l768271l825122l159386k618123j675329N03875K995758L501463
41934c613019J740899O45085K233884M007608K249280k194057m754490l487066
41926c171876j180162n84853p13539O23802K883725L359171Q32106k644268l634781
41917d230675r11733K815797L600013J062829j103767m13468J019211M98276m84934
41908A851549Q25060K773363J453106k202997k957660M23144K829518P58573k385192
41899C368464k087113L14956N09722j772808k942296j338302R62689J677867P62179
41890e44642n11468q29450M76303K431257K780261P54943j509644j739991m46644
$$ plain form
41881 860925 1361411 2133961 3228094 4361205 4432624 2855329 213852 -2725878 -5366316
41872 -5366316 -6620380 -5697766 -3759116 -2743174 -2167579 495306 5428867 9090356
41864 9090356 8767395 6183683 4601273 4370529 3682298 2060542 432520 -1181819 -3320972
41855 -3320972 -4974915 -4424395 -2133706 -562881 -863603 -1564896 -805663 1542355 4055063
41846 4055063 4926500 3311963 654481 -160344 1525374 2584229 523462 -1864989
41838 -1864989 214975 6060138 9405899 6730437 1604626 -1018982 -1024698 -913063 -774404
41829 -774404 696159 2391768 2139807 740627 851409 2519390 3539590 3761115 4948510
41820 4948510 6326636 4809172 725139 -1244412 987969 3205451 1241685 -2534583
$$ packed form
41881H60925N00486P72550J094133J133111P1419j577295k641477k939730k640438
41872e366316j254064R22614J938650J015942N75595K662885M933561L661489
41864I090356l22961k583712j582410k30744o88231j621756j628022j614339k139153
41855c320972j653943N50520K290689J570825l00722p01293P59233K348018K512708
41846D055063Q71437j614537k657482q14825J685718J058855k060767k388451
41838a864989K079964N845163L345761k675462n125811k623608n716J11635J38659
41829g74404J470563J695609k51961j399180J10782J667981J020200K21525J187395
41820D948510J378126j517464m084033j969551K232381K217482j963766l776268
$$ plain form
41812 -2534583 -3139330 -753180 148113 -1889146 -3731535 -3381665 -2733867 -3558214 -4526315
41803 -4526315 -3971832 -2747661 -2465800 -3016916 -3505961 -3914356 -4396131 -4519624 -4488183
41794 -4488183 -5487361 -7489405 -8290088 -6167680 -2184617 1302457 2912593 2031326 -1487537
41785 -1487537 -5683386 -6716585 -3238941 978412 1413084 -1367670 -3002607 -1638666
41777 -1638666 164765 -174731 -1862469 -2561480 -1693157 -963626 -2457666 -6282983 -9489679
41768 -9489679 -8282907 -2645064 2406400 2118057 -2425433 -6175277 -6420538 -4414978
41760 -4414978 -1649396 1817453 5066546 5830898 3435771 -197281 -3200797 -5195917
41752 -5195917 -5861148 -4762755 -3012096 -2341124 -2262162 -1232232 -656179 -3504486 -8138532
$$ packed form
41812b534583o04747K386150R01293k037259j842389L49870O47798q24347r68101
41803d526315N54483J224171K81861n51116m89045m08395m81775j23493L1441
41794d488183r99178k002044q00683K122408L983063L487074J610136q81267l518863
41785a487537m195849j033199L477644M217353M34672k780754j634937J363941
41777a638666J803431l39496j687738o99011Q68323P29531j494040l825317l206696
41768i489679J206772N637843N051464k88343m543490l749844k45261K005560
41760d414978K765582L466849L249093P64352k395127l633052l003516j995120
41752e195917o65231J098393J750659O70972P8962J029930N76053k848307m634046
$$ plain form
41743 -8138532 -8560724 -3187685 1460869 -479977 -5842247 -7384208 -4026647 -916112
41735 -916112 -1128987 -2711184 -3429476 -3412799 -2532986 459935 4782826 6852477 4357384
41726 4357384 -848905 -4939816 -5733991 -3770050 -1358483 -890862 -2811758 -5204743
41718 -5204743 -6246645 -6222216 -5828735 -3976839 341327 4988235 6275530 3373016 -1175910
41709 -1175910 -4892217 -6920761 -6716300 -4014188 -162435 2922658 5082482 7057035
41701 7057035 7899392 5898296 1594953 -2901517 -6977981 -10803686 -12507548 -10213013
41693 -10213013 -6538799 -6253563 -8863495 -8561823 -2994104 3062082 5189092 5482197
41685 5482197 7569562 9785246 8091733 3069969 -830906 -1516134 -451048 1276218
$$ packed form
41743h138532m22192N373039M648554j940846n362270j541961L357561L110535
41735i16112k12875j582197p18292J6677Q79813K992921M322891K069651k495093
41726D357384n206289m090911p94175J963941K411567M67621j920896k392985
41718e204743j041902K4429L93481J851896M318166M646908J287295k902514m548926
41709a175910l716307k028544K04461K702112L851753L085093K159824J974553
41701G057035Q42357k001096m303343m496470m076464l825705j703862K294535
41693a0213013L674214K85236k609932L01672N567719O056186K127010K93105
41685E482197K087365K215684j693513n021764l900875o85228J065086J727266
$$ plain form
41677 1276218 3859131 6030544 5379416 2082817 -630690 -587394 940685 1604247 826798
41668 826798 -569846 -2185531 -4326963 -6731396 -7641926 -4866196 1531092 8086614
41660 8086614 10909301 9619275 6653835 3180683 -1357217 -5507895 -5708056 -1791571
41652 -1791571 1102393 -943978 -5153565 -6357390 -4098152 -1670703 -377639 774503
41644 774503 1052651 -1516935 -5813859 -7996014 -6607848 -3853552 -1560308 688299
41636 688299 3041042 4446212 4947442 5840431 6860462 6233912 4282021 3871573 6120776
41627 6120776 8433833 8122607 5592406 2735563 420299 -1231238 -2110847 -2748463 -3881334
41618 -3881334 -4786294 -4024532 -2126686 -1024845 -513144 1593923 5050274 6525244 4847007
$$ packed form
41677A276218K582913K171413o51128l296599k713507M3296J528079O63562p77449
41668H26798j396644j615685k141432k404433r10530K775730O397288O555522
41660H086614K822687j290026k965440l473152m537900m150678k00161L916485
41652a791571K893964k046371m209587j203825K259238K427449J293064J152142
41644G74503K78148k569586m296924k182155J388166K754296K293244K248607
41636F88299K352743J405170N01230Q92989J020031o26550j951891m10448K249203
41627F120776K313057l11226k530201k856843k315264j651537q79609o37616j132871
41618c881334r04960P61762J897846J101841N11701K107067L456351J474970j678237
$$ plain form
41609 4847007 3220179 3900192 4133686 632786 -4644020 -6965879 -5411242 -3296411
41601 -3296411 -2897035 -3102762 -2136489 110065 2516390 3554852 2031698 -1202975 -3030342
41592 -3030342 -1583178 812846 506602 -2444242 -4801571 -5243221 -5770482 -7622424 -8859477
41583 -8859477 -7401917 -4252483 -2032302 -1713067 -2280030 -2692876 -2845918 -3044027 -3438432
41574 -3438432 -3676433 -2647039 768773 5955796 10045077 10113973 6132555 1289467 -925176
41565 -925176 79942 1871380 1995781 559577 -693495 -1255280 -2377924 -4515413 -5870106
41556 -5870106 -4671994 -1883872 -198358 -850344 -2764012 -4490903 -5489293 -5500306 -4235356
41547 -4235356 -2257164 -1027331 -1318330 -2309222 -2934590 -3471903 -4864846 -6783710 -7525482
$$ packed form
41609D847007j626828O80013K33494l500900n276806k321859J554637K114831
41601c296411L99376k05727R66273K246554K406325J038462j523154l234673j827367
41592c030342J447164K396024l06244k950844k357329m41650n27261j851942j237053
41583h859477J457560L149434K220181L19235n66963m12846j53042j98109l94405
41574c438432k38001J029394L415812N187023M089281O8896l981418m843088k214643
41565i25176J005118J791438J24401j436204j253072n61785j122644k137489j354693
41556e870106J198112K788122J685514o51986j913668j726891r98390j1013J264950
41547d235356J978192J229833k90999r90892o25368n37313j392943j918864p41772
$$ plain form
41538 -7525482 -6282250 -4623175 -4634686 -5808528 -5214450 -1501922 2466926 2541692 -1520239
41529 -1520239 -5457115 -5429747 -2135721 679243 662816 -1228642 -2651592 -2615470 -2083037
41520 -2083037 -2191694 -2387316 -1087741 1675790 3641468 3371353 2461809 2851272 3349328
41511 3349328 1703685 -849408 -911324 1253385 1597085 -967781 -2370805 -202505 1875700
41502 1875700 165596 -2630559 -1743363 1934247 3870888 3551735 4099422 5232403 3123615
41493 3123615 -2073333 -4828985 -2510605 245874 -1608501 -6596905 -9936423 -10181878
41485 -10181878 -9060070 -7374030 -4818587 -2146668 -202629 1880916 4586128 5512122
41477 5512122 2227630 -3263270 -6239612 -5258888 -3426224 -3468591 -4387492 -3895691 -1940912
$$ packed form
41538g525482J243232J659075j1511j173842N94078L712528L968848P4766m061931
41529a520239l936876K7368L294026K814964j6427j891458j422950L6122N32433
41520b083037j08657j95622J299575K763531J965678k70115r09544L89463M98056
41511C349328j645643k553093o1916K164709L43700k564866j403024K168300K078205
41502A875700j710104k796155Q87196L677610J936641l19153N47687J132981k108788
41493C123615n196948k755652K318380K756479j854375m988404l339518k45455
41485a0181878J121808J686040K555443K671919J944039K083545K705212R25994
41477E512122l284492n490900k976342R80724J832664m2367r18901M91801J954779
$$ plain form
41468 -1940912 -433332 -617327 -1699981 -1545682 1592908 7416083 13435363 16876998
41460 16876998 16601762 12973223 6889445 94596 -4440782 -4443756 -952474 2335492 2824372
41451 2824372 1273139 1770 -230748 -870317 -3396429 -7083009 -9312616 -8297792
41443 -8297792 -5070264 -2065961 -186877 1282511 2001649 259543 -3531404 -5445725
41435 -5445725 -2516797 2953582 6242129 6251249 5596962 5294411 3245322 -1193624 -4815110
41426 -4815110 -4805060 -2802512 -2386510 -4338266 -6705102 -8102561 -8474229 -7587785 -5396390
41417 -5396390 -3498352 -3815760 -5820921 -7170565 -7091432 -6974245 -7471145 -7386771 -6024807
41408 -6024807 -4249737 -2272682 1153805 5812744 8666687 7649941 4928499 3777431
$$ packed form
41468a940912J507580j83995j082654J54299L138590N823175O019280L441635
41460A6876998k75236l628539o083778o794849m535378k974L491282L287966M88880
41451B824372j551233j271369k32518o39569k526112l686580k229607J014824
41443h297792L227528L004303J879084J469388P19138j742106l790947j914321
41435e445725K928928N470379L288547R120o54287l02551k049089m438946l621486
41426d815110J0050K002548M16002j951756k366836j397459l71668Q86444K191395
41417e396390J898038l17408k005161j349644P9133J17187m96900Q4374J361964
41408f024807J775070J977055L426487M658939K853943j016746k721442j151068
$$ plain form
41400 3777431 3821097 2617138 891275 2121816 6652890 10294966 10272553 8989948 9547942
41391 9547942 10572569 8726577 4278873 526792 -1244019 -2519931 -3580457 -2580321
41383 -2580321 548761 2634618 1468705 -966566 -1534433 -433180 -314223 -1909834
41375 -1909834 -3003307 -1775345 854024 2913113 3931379 4624296 4878588 3742444
41367 3742444 1625817 762901 2092094 2917564 85669 -4785131 -6293775 -2476115
41359 -2476115 2048493 2276423 -717014 -2688425 -2982332 -3774154 -4140928 -744336 5127852
41350 5127852 7076921 2433981 -3307589 -4020386 -747055 1725026 2390433 3423103
41342 3423103 4593721 3545989 719529 -722908 117283 851630 -68005 -1658516 -3025763
$$ packed form
41400C777431M3666j203959j725863J230541M531074L642076k2413j282605N57994
41391I547942J024627j845992m447704l752081j770811j275912j060526J000136
41383b580321L129082K085857j165913k435271n67867J101253J18957j595611
41375a909834j093473J227962K629369K059089J018266O92917K54292j136144
41367C742444k116627q62916J329193Q25470k831895m870800j508644L817660
41359b476115M524608K27930k993437j971411k93907p91822l66774L396592N872188
41350E127852J949069m642940n741570p12797L273331K472081O65407J032670
41342C423103J170618j047732k826460j442437Q40191P34347r19635j590511j367247
$$ plain form
41333 -3025763 -4363412 -5031058 -3821224 -1542644 -248365 465429 3054783 7267599
41325 7267599 9273913 6827477 2259882 -973032 -1863500 -870832 1319410 2511186
41317 2511186 -33912 -5141355 -7507470 -4520486 -141494 968724 -123233 74503
41309 74503 841859 -972400 -4454450 -5648661 -4535446 -5165909 -8074413 -8231400 -2842622
41300 -2842622 3534945 4942933 1724943 -1133984 -981096 600742 1408194 1081815 641844
41291 641844 1652512 4869681 8052406 6950545 866517 -4778022 -4828785 -1770316 -2303845
41282 -2303845 -7105954 -9275261 -4413701 2718008 4924039 2306342 769621 2600798
41274 2600798 3526837 -292863 -6357484 -9072463 -6786291 -3171432 -2093966 -3058154
$$ packed form
41333c025763j337649o67646J209834K278580J294279P13794K589354M212816
41325G267599K006314k446436m567595l232914q90468R92668K190242J191776
41317B511186k545098n107443k366115K986984M378992J110218j091957J97736
41309G4503P67356j814259l482050j194211J113215o30463k908504j56987N388778
41300b842622O377567J407988l217990k858927J52888J581838Q07452l26379m39971
41291F41844J010668L217169L182725j101861o084028n644539n0763L058469n33529
41282b303845m802109k169307M861560P131709K206031k617697j536721J831177
41274B600798R26039l819700o064621k714979K286172L614859J077466r64188
$$ plain form
41266 -3058154 -2510381 1206424 5592276 7214877 6068476 5011990 5091880 3807417 -801351
41257 -801351 -6367781 -8612306 -6419948 -2354684 1120196 3563081 5026698 5128080
41249 5128080 3994402 2141189 -744393 -4743312 -7377799 -5285319 752915 5321396
41241 5321396 4782365 1832863 1348847 3647332 4834260 2770370 -495198 -2223299
41233 -2223299 -2099424 -1098832 524205 2680945 4065295 2858287 -1139077 -5732736
41225 -5732736 -8054092 -7134211 -4573569 -2404602 -837712 887109 1957162 390746
41217 390746 -3464190 -6015542 -4522024 -528730 2412762 3006800 2374492 1489995 981830
41208 981830 2494841 7247693 13169990 16019273 13947806 9258989 5469118 4310225
$$ packed form
41266c058154N47773L716805M385852J622601j146401j056486P9890j284463m608768
41257h01351n566430k244525K192358M065264L474880K442885J463617J01382
41249E128080j133678j853213k885582l998919k634487K092480O038234M568481
41241E321396n39031k949502m84016K298485J186928k063890l265568j728101
41233b223299J23875J000592J623037K156740J384350j207008l997364m593659
41225e732736k321356R19881K560642K168967J566890J724821J070053j566416
41217C90746l854936k551352J493518L993294K941492N94038o32308q84497n08165
41208I81830J513011M752852N922297K849283k071467m688817l789871j158893
$$ plain form
41200 4310225 5536951 7596740 8176814 6018692 2643024 655760 284839 -420527 -1915883
41191 -1915883 -2299425 -878146 33623 -1539891 -4066071 -4504419 -2183453 930090 2845882
41182 2845882 2969974 1657077 -284070 -1932813 -2932140 -3576503 -4017915 -4136566 -4342938
41173 -4342938 -5372102 -6945396 -7855852 -7759415 -7513264 -7285844 -5956476 -3243039 -911899
41164 -911899 -695193 -2059848 -3061047 -2617515 -1297615 -664911 -2074291 -4970441 -6436944
41155 -6436944 -4198942 -102419 1754636 691740 250341 2287838 3726365 1493816
41147 1493816 -2400712 -4047722 -3622077 -4268109 -6192580 -5992489 -2067095 2675428 4444742
41138 4444742 2591307 -854704 -3948611 -6269762 -8506316 -10992796 -12441489 -10957374
$$ packed form
41200D310225J226726K059789N80074k158122l375668j987264l70921p05366j495356
41191a915883l83542J421279R11769j573514k526180m38348K320966L113543J915792
41182B845882J24092j312897j941147j648743r99327o44363m41412j18651k06372
41173d342938j029164j573294r10456R6437K46151K27420J329368K713437K331140
41164i11899K16706j364655j001199M43532J319900O32704j409380k896150j466503
41155f436944K238002M096523J857055j062896m41399K037497J438527k232549
41147A493816l894528j647010M25645o46032j924471K00091L925394M742523J769314
41138D444742j853435l446011l093907k321151k236554k486480j448693J484115
$$ plain form
41130 -10957374 -6991426 -3849388 -3875930 -5579723 -6269615 -5886107 -5879791 -5926669 -4886591
41121 -4886591 -3931443 -5138020 -7329379 -6934487 -3221155 732987 2729539 3618442 4013473
41112 4013473 2601611 -599439 -2677888 -1830910 -192192 -141799 -214757 2240277 6018353
41103 6018353 7196581 4904547 2780156 3956876 6853561 7287029 3727471 -815058
41095 -815058 -2096730 907511 5286571 7519128 6474004 2928565 -2158329 -7330393
41087 -7330393 -9963052 -8526452 -5241397 -3861242 -4607312 -4061439 -764245 2106028
41079 2106028 1272948 -2008533 -4106572 -3905340 -3113146 -2980556 -3186339 -3360728 -3594542
41070 -3594542 -3714451 -3657073 -4106726 -5245834 -5475878 -3126164 892137 3781998 4032994
$$ packed form
41130a0957374L965948L142038k6542j703793o89892L83508O316m6878J040078
41121d886591R55148j206577k191359L94892L713332L954142J996552Q88903L95031
41112D013473j411862l201050k078449Q46978J638718N0393p2958K455034L778076
41103F018353J178228k292034k124391J176720K896685M33468l559558m542529
41095h15058j281672L004241M379060K232557j045124l545439n086894n172064
41087g330393k632659J436600L285055J380155p46070N45873L297194K870273
41079B106028q33080l281481k098039K01232P92194J32590k05783j74389k33814
41070c594542j19909N7378m49653j139108k30044K349714M018301K889861K50996
$$ plain form
41061 4032994 2498105 750209 116216 2030097 7028005 12722423 14736338 11056485
41053 11056485 4446343 -683934 -3018505 -4501617 -6198093 -6141436 -2508071 2507722
41045 2507722 4353808 1729013 -1831957 -3042198 -3129726 -4725445 -6480851 -4518708
41037 -4518708 1203972 5944956 6393486 4261833 2311125 440562 -1959019 -3129849
41029 -3129849 -1749200 -118795 -869892 -2293262 -889600 2650621 4225251 2550023
41021 2550023 325856 -854094 -2200613 -3405056 -1344287 4528278 9422179 9091174
41013 9091174 5616762 3798587 4006966 2800233 -421253 -1939494 442288 3867396
41005 3867396 4542280 2846608 2192214 4276615 7502697 9315509 8335012 4693079 88186
$$ packed form
41061D032994j534889j747896o33993J913881M997908N694418K013915l679853
41053A1056485o610142n130277k334571j483112j696476N6657L633365N015793
41045B507722J846086k624795l560970j210241q7528j595719j755406J962143
41037d518708N722680M740984M48530k131653j950708j870563k399581j170830
41029c129849J380649J630405p51097j423370J403662L540221J574630j675228
41021B550023k224167j179950j346519j204443K060769N872565M893901l31005
41013I091174l474412j818175K08379j206733l221486j518241K381782L425108
41005C867396O74884j695672o54394K084401L226082J812812r80497l641933m604893
$$ plain form
40996 88186 -2584130 -1543915 1371356 2080332 -940714 -4511149 -4633613 -1487417 1126735
40987 1126735 784995 -1093854 -1998463 -1655658 -1605554 -2689156 -4248527 -5310107 -5467320
40978 -5467320 -4678518 -3035882 -1064036 76452 -735139 -3122044 -4612909 -2821898
40970 -2821898 1039126 2373845 -1269115 -6135767 -6516549 -2501983 105972 -1739308
40962 -1739308 -3931110 -1513746 4019039 7248100 6524623 5158751 5741083 7147276
40954 7147276 7555776 7236737 7209534 7284777 6616071 4935179 2560882 89754 -1720801
40945 -1720801 -2577067 -2958948 -3019398 -1933821 448987 2299900 1859231 -81014 -1621148
40936 -1621148 -2647127 -3953951 -4577762 -3131973 -1264192 -2203190 -5659024 -7795194
$$ packed form
40996H8186k672316J040215K915271P08976l021046l570435j22464L146196K614152
40987A126735l41740j878849r04609L42805N0104j083602j559371j061580j57213
40978e467320P88802J642636J971846J140488q11591k386905j490865J791011
40970b821898L861024J334719l642960m866652l80782M014566K607955j845280
40962a739308k191802K417364N532785L229061p23477j365872N82332J406193
40954G147276M08500l19039k7203P5243o68706j680892k374297k471128j810555
40945a720801q56266l81881o0450J085577K382808J850913m40669j940245j540134
40936a621148j025979j306824o23811J445789J867781r38998l455834k136170
$$ plain form
40928 -7795194 -7017629 -6079781 -7028049 -7729813 -5701465 -2283417 -269255 94806 -228408
40919 -228408 -2251648 -7249516 -12907661 -14635641 -10871047 -4800068 -763612 -651423
40911 -651423 -3433545 -6336918 -6679169 -4300383 -2101637 -2731937 -5096422 -5707111 -3085157
40902 -3085157 891828 3619999 3775208 980356 -4026056 -8297571 -8083829 -2805469
40894 -2805469 3666490 6900112 5994953 2759231 -1651515 -7015511 -11482446 -11635716
40886 -11635716 -6596289 -382144 1923653 -235246 -3113987 -4108298 -4278635 -4862400
40878 -4862400 -4483309 -2135384 -410169 -2255805 -5834277 -6491195 -3581296 -1407683
40870 -1407683 -2768312 -5352710 -5902424 -4502791 -2867683 -1421466 -307173 -661174
$$ packed form
40928g795194P77565R37848r48268p01764K028348L418048K014162L64061l23214
40919b28408k023240m997868n658145j727980L764594O070979M036456J12189
40911f51423k782122k903373l42251K378786K198746o30300k364485o10689K621954
40902c085157L976985K728171J55209k794852n006412m271515K13742N278360
40894b805469O471959L233622r05159l235722m410746n363996m466935j53270
40886a1635716N039427O214145K305797k158899k878741r94311j70337n83765
40878d862400L79091K347925J725215j845636l578472o56918K909899K173613
40870a407683j360629k584398n49714J399633J635108J446217J114293l54001
$$ plain form
40862 -661174 -2584863 -4222661 -5012373 -7161918 -11326071 -13740062 -11161920 -6245202
40854 -6245202 -3914374 -4193615 -3134130 172386 2284389 1139315 -1262683 -2616426
40846 -2616426 -3046284 -3168651 -2690905 -2015086 -2492432 -4151495 -5506705 -6037589 -6371910
40837 -6371910 -5924447 -3331345 547731 3300000 4919022 7454113 10203776 9553094
40829 9553094 4993664 943764 351313 622861 -1183987 -3028079 -1574470 1790170
40821 1790170 2884853 838391 -1552508 -2223264 -1229330 955098 3266289 3444907 829479
40812 829479 -1549603 -1005866 162976 -1977485 -6230286 -7525200 -4620861 -1658542
40804 -1658542 -1414845 -1832890 -845534 -137059 -1491314 -3032965 -2317048 -593084 -682630
$$ packed form
40862f61174j923689j637798p89712k149545m164153k413991K578142M916718
40854f245202K330828k79241J059485L306516K112003j145074k401998j353743
40846b616426m29858j22367M77746O75819m77346j659063j355210n30884l34321
40837f371910M47463K593102L879076K752269J619022K535091K749663o50682
40829I553094m559430m049900n92451K71548j806848j844092J453609L364640
40821A790170J094683k046462k390899o70756R93934K184428K311191J78618k615428
40812H29479k379082N43737J168842k140461m252801j294914K904339K962319
40804a658542K43697m18045R87356P08475j354255j541651P15917J723964q9546
$$ plain form
40795 -682630 -2289429 -2667239 -1151142 -95418 -1294668 -3705489 -5161119 -4912106 -4007489
40786 -4007489 -3938589 -5139344 -6498475 -6467921 -4753621 -2472269 -688354 360232 598053
40777 598053 -97249 -1183422 -1837023 -2355590 -3606711 -4605327 -2685528 2630900 7709745
40768 7709745 8506173 5003915 432155 -2569557 -3148132 -1113204 2554201 4598694
40760 4598694 1867961 -4644576 -10301413 -11962615 -10744952 -9167890 -7793083 -5943693
40752 -5943693 -3858403 -2221332 -554698 1997971 4512736 4515372 827831 -4591287 -8118934
40743 -8118934 -7697876 -4626941 -2141735 -2039513 -2992022 -2807561 -1867722 -2722250 -5974362
40734 -5974362 -8554287 -7547651 -4278372 -2473934 -3148230 -3792829 -2690784 -1442674
$$ packed form
40795f82630j606799l77810J516097J055724j199250k410821j455630K49013R04617
40786d007489O8900j200755j359131L0554J714300K281352J783915J048586K37821
40777E98053o95302j086173o53601n18567j251121r98616J919799N316428N078845
40768G709745P96428l502258m571760l001712n78575K034928L667405K044493
40760D598694k730733o512537n656837j661202J217663J577062J374807J849390
40752e943693K085290J637071J666634K552669K514765K636l687541n419118l527647
40743h118934M21058L070935K485206J02222r52509J84461R39839q54528l252112
40734e974362k579925J006636L269279J804438o74296o44599J102045J248110
$$ plain form
40726 -1442674 -2197484 -4503824 -6480148 -7490667 -7767030 -6628520 -3475478 -48339
40718 -48339 865923 -684227 -1512070 317146 2910815 3678834 3065755 3049967 3256891
40709 3256891 1326915 -3008883 -6891574 -8189360 -8219130 -9144024 -10282811 -9197340 -5891175
40700 -5891175 -3517351 -4136568 -5591833 -4351970 -685812 1268526 -820510 -3868689
40692 -3868689 -3402297 114140 2009801 557182 -184080 3337116 8124528 8668872 5411855
40683 5411855 4361402 7785792 10093082 5609050 -3025584 -7989645 -5984070 -889236
40675 -889236 2691514 4568500 6663328 8763795 8885439 6545753 3595138 1808566
40667 1808566 861659 -769384 -3263419 -4659773 -3433272 -1439076 -2383101 -6497296
$$ packed form
40726a442674p54810k306340j976324j010519k76363J138510L153042L427139
40718d8339R14262j550150q27843J829216K593669P68019o13079j5788K06924
40709C256891j929976m335798l882691j297786k9770r24894j138787J085471L306165
40700e891175K373824o19217j455265J239863L666158J954338k089036l048179
40692c868689M66392L516437J895661j452619p41262L521196M787412N44344l257017
40683E411855j050453L424390K307290m484032q634634m964061K005575N094834
40675h89236L580750J876986K094828K100467J21644k339686k950615j786572
40667A808566r46907j631043k494035j396354J226501J994196r44025m114195
$$ plain form
40659 -6497296 -8822515 -5048116 2269424 6301553 4310543 58440 -2573536 -4556657
40651 -4556657 -8203932 -11852867 -11685312 -7632522 -3883088 -3223061 -3688731 -1973287 1836210
40642 1836210 4700849 5033926 4815500 6657346 9753772 10304685 6407703 1059578 -1374740
40633 -1374740 -870496 -1358613 -4314198 -5740651 -1607303 5793853 9878918 7455772
40625 7455772 1647315 -2804912 -4405353 -4219945 -2765808 344200 4493943 7667247
40617 7667247 8322679 6849297 4722694 2594225 -122849 -3557720 -6028455 -5496865
40609 -5496865 -2331762 656311 1413230 725278 498599 1268630 2447461 3830529 5447628
40600 5447628 6719833 7046329 6521973 5087350 2181900 -1456189 -3232679 -1968392
$$ packed form
40659f497296k325219L774399P317540M032129j991010m252103k631976j983121
40651d556657l647275l648935J67555M052790L749434O60027m65670J715444L809497
40642A836210K864639L33077k18426J841846L096426N50913l896982n348125k434318
40633a374740N04244m88117k955585j426453M133348P401156M085065k423146
40625G455772n808457m452227j600441J85408J454137L110008M149743L173304
40617G667247O55432j473382k126603k128469k717074l434871k470735N31590
40609e496865L165103K988073P56919o87952k26679P70031J178831J383068J617099
40600E447628J272205L26496n24356j434623k905450l638089j776490J264287
$$ plain form
40592 -1968392 -299879 -1231544 -3455426 -3312970 -879488 -423109 -4199575 -8990665 -10060355
40583 -10060355 -6241671 -179886 4323487 4532461 658895 -3692761 -5034474 -4221039
40575 -4221039 -4686043 -6651123 -6897896 -4849454 -4118975 -6001735 -6309909 -2227579 1980179
40566 1980179 935507 -3302652 -4209559 -550728 2615748 2307121 1393857 2983256 5741249
40557 5741249 6797990 5927271 4767798 4261487 4589967 5822676 7220951 7388503 6223558
40548 6223558 5412039 6036973 6821361 5672283 2395731 -598464 -214930 4144745 8946274
$$ packed form
40592a968392J668513r31665k223882J42456K433482M56379l776466m791090j069690
40583a0060355L818684O061785M503373K08974l873566m351656j341713Q13435
40575d221039m65004j965080k46773K048442P30479j882760l08174M082330M207758
40566A980179j044672m238159r06907L658831L166476l08627r13264J589399K757993
40557E741249J056741q70719j159473n06311L28480J232709J398275J67552j164945
40548F223558q11519O24934P84388j149078l276552k994195L83534M359675M801529
$$ [...]
##END NTUPLES=NMR SPECTRUM
##END=
