##TITLE=31Pdec_SR29H_1_1
 , 24 sc
 5.04.2021
##JCAMPDX= 6.0         $$ Bruker NMR JCAMP-DX V2.0
##DATA TYPE= NMR SPECTRUM
##DATA CLASS= NTUPLES
##ORIGIN= UXNMR, Bruker Analytische Messtechnik GmbH
##OWNER= root
$$ XWIN-NMR		Version 3.5
$$ Mon Apr  5 11:02:28 2021 Russian Standard Time (UT+4h)  she@DPX200
##.OBSERVE FREQUENCY= 81.013821
##.OBSERVE NUCLEUS= ^31P
##.ACQUISITION MODE= SIMULTANEOUS
##.ACQUISITION SCHEME= undefined
##.AVERAGES= 124
##.DIGITISER RES= 16
##SPECTROMETER/DATA SYSTEM= spect
##.PULSE SEQUENCE= zgpg30
##.SOLVENT NAME= CDCl3
##.SHIFT REFERENCE= (INTERNAL, CDCl3, 0, 248.564)
##AUDIT TRAIL= $$ (NUMBER, WHEN, WHO, WHERE, WHAT)
$$ ##TITLE= Audit trail, XWIN-NMR		Version 3.5
$$ ##JCAMPDX= 5.01
$$ ##ORIGIN= Bruker BioSpin GmbH
$$ ##OWNER= she
$$ F:/spectra/data/she/nmr/P31/1/pdata/1/auditp.txt
$$ ##AUDIT TRAIL=  $$ (NUMBER, WHEN, WHO, WHERE, WHAT)
(   1,<2021-04-05 11:00:29.12 +0400>,<she>,<DPX200>,
      <continue with go, POWCHK disabled, PULCHK disabled
       configuration hash MD5:
       00 E9 B6 7A A2 85 ED C7 34 08 36 98 17 FE 4E 26
       data hash MD5: 32K
       12 1E 29 6D 5B 57 9E 0F 21 4B 3E CC 9D 38 8B F7>)
(   2,<2021-04-05 11:00:30.95 +0400>,<she>,<DPX200>,
      <Start of raw data processing
       efp BC_mod = 2 LB = 1 FT_mod = 6 PKNL = 1 PHC0 = -4403.154 PHC1 = 167.0011 SI = 64K 
       data hash MD5: 64K
       EC 6F A2 CF C3 21 2A 12 58 6D 05 62 54 A6 8D 0F>)
(   3,<2021-04-05 11:01:18.45 +0400>,<she>,<DPX200>,
      <pk PHC0 = 110.4883 PHC1 = 0 
       data hash MD5: 64K
       BC FA F4 13 C6 B6 3D 05 3C 36 0E B0 57 56 F5 FE>)
$$ ##END=
$$ 
$$ hash MD5
$$ F3 DC 1A 85 C6 17 17 AD 97 E8 C6 ED 5C C7 4E 0A
##$RELAX= 
##$RELAX= 
##$RELAX= 
##$RELAX= 
##$RELAX= 
##$RELAX= 
##$RELAX= 
##$RELAX= 
$$ Bruker specific parameters
$$ --------------------------
##$DU= <F:/spectra>
##$EXPNO= 1
##$NAME= <P31>
##$PROCNO= 1
##$TYPE= <nmr>
##$USER= <she>
##$AMP= (0..31)
100 100 100 100 100 100 100 100 100 100 100 100 100 100 100 100 100 100 
100 100 100 100 100 100 100 100 100 100 100 100 100 100 
##$AQSEQ= 0
##$AQ_mod= 1
##$AUNM= <au_zg>
##$AUTOPOS= <>
##$BF1= 81.014009
##$BF2= 200.13
##$BF3= 200.13
##$BF4= 200.13
##$BF5= 200.13
##$BF6= 200.13
##$BF7= 200.13
##$BF8= 200.13
##$BYTORDA= 1
##$CFDGTYP= 0
##$CFRGTYP= 5
##$CHEMSTR= <none>
##$CNST= (0..31)
1 1 145 1 1 1 1 1 1 1 1 1 1 1 1 1 1 1 1 1 1 1 1 1 1 1 1 1 1 1 1 1 
##$CPDPRG= <waltz16>
##$CPDPRG1= <>
##$CPDPRG2= <waltz16>
##$CPDPRG3= <>
##$CPDPRG4= <mlev>
##$CPDPRG5= <mlev>
##$CPDPRG6= <mlev>
##$CPDPRG7= <mlev>
##$CPDPRG8= <mlev>
##$CPDPRGB= <>
##$CPDPRGT= <>
##$D= (0..31)
0 1 0 0 0 0 0 0 0 0 0 0.03 2e-05 3e-06 0 0 0 0 0 0 0 0 0 0 0 0 0 0 0 0 
0 0 
##$DATE= 1617605805
##$DBL= (0..7)
120 120 120 11 120 120 24 19 
##$DBP= (0..7)
150 150 150 150 150 150 150 150 
##$DBP07= 0
##$DBPNAM0= <>
##$DBPNAM1= <>
##$DBPNAM2= <>
##$DBPNAM3= <>
##$DBPNAM4= <>
##$DBPNAM5= <>
##$DBPNAM6= <>
##$DBPNAM7= <>
##$DBPOAL= (0..7)
0.5 0.5 0.5 0.5 0.5 0.5 0.5 0.5 
##$DBPOFFS= (0..7)
0 0 0 0 0 0 0 0 
$$ [...]
##$SUBNAM2= <"">
##$SUBNAM3= <"">
##$SUBNAM4= <"">
##$SUBNAM5= <"">
##$SUBNAM6= <"">
##$SUBNAM7= <"">
##$SUBNAM8= <"">
##$SUBNAM9= <"">
##$SW= 501.771253377433
##$SWIBOX= (0..15)
0 1 3 0 0 0 0 0 0 0 0 0 0 0 0 0 
##$SW_h= 40650.406504065
##$TD= 32768
##$TD0= 1
##$TE= 0
##$TE2= 300
##$TE3= 300
##$TEG= 300
##$TL= (0..7)
0 120 53 12 22 120 120 120 
##$TP= (0..7)
150 150 150 150 150 150 150 150 
##$TP07= 0
##$TPNAME0= <>
##$TPNAME1= <>
##$TPNAME2= <>
##$TPNAME3= <>
##$TPNAME4= <>
##$TPNAME5= <>
##$TPNAME6= <>
##$TPNAME7= <>
##$TPOAL= (0..7)
0.5 0.5 0.5 0.5 0.5 0.5 0.5 0.5 
##$TPOFFS= (0..7)
0 0 0 0 0 0 0 0 
##$TUNHIN= 0
##$TUNHOUT= 0
##$TUNXOUT= 0
##$USERA1= <user>
##$USERA2= <user>
##$USERA3= <user>
##$USERA4= <user>
##$USERA5= <user>
##$V9= 5
##$VALIST= <valist>
##$VCLIST= <CCCCCCCCCCCCCCC>
##$VD= 0
##$VDLIST= <DDDDDDDDDDDDDDD>
##$VPLIST= <PPPPPPPPPPPPPPP>
##$VTLIST= <TTTTTTTTTTTTTTT>
##$WBST= 1024
##$WBSW= 4
##$XGAIN= (0..3)
0 0 0 0 
##$XL= 0
##$YL= 0
##$YMAX_a= 5901
##$YMIN_a= -18773
##$ZGOPTNS= <>
##$ZL1= 120
##$ZL2= 120
##$ZL3= 120
##$ZL4= 120
##$ABSF1= 0
##$ABSF2= 0
##$ABSG= 0
##$ABSL= 0
##$ALPHA= 0
##$AQORDER= 0
##$ASSFAC= 0
##$ASSFACI= 0
##$ASSFACX= 0
##$ASSWID= 0
##$AUNMP= <proc_1d>
##$AZFE= 0.1
##$AZFW= 0.5
##$BCFW= 0
##$BC_mod= 2
##$BYTORDP= 0
##$COROFFS= 0
##$CY= -3
##$DATMOD= 1
##$DC= 0
##$DFILT= <>
##$DTYPP= 0
##$F1P= 0
##$F2P= 0
##$FCOR= 1
##$FTSIZE= 65536
##$FT_mod= 6
##$GAMMA= 0
##$GB= 0
##$INTBC= 1
##$INTSCL= 5.30512e-09
##$ISEN= 30
##$LB= 1
##$LEV0= 0
##$LPBIN= 0
##$MAXI= 10000
##$MC2= 0
##$MEAN= 0
##$ME_mod= 0
##$MI= 50
##$NCOEF= 0
##$NC_proc= -7
##$NLEV= 6
##$NOISF1= 182.463
##$NOISF2= 159.3651
##$NSP= 0
##$NTH_PI= 0
##$NZP= 0
##$OFFSET= 248.5645
##$PC= 4
##$PHC0= -4292.666
##$PHC1= 167.0011
##$PH_mod= 1
##$PKNL= yes
##$PPARMOD= 0
##$PSCAL= 0
##$PSIGN= 0
##$REVERSE= no
##$SF= 81.014009
##$SI= 65536
##$SIGF1= 159.3651
##$SIGF2= -187.1042
##$SINO= 113.3802
##$SIOLD= 16384
##$SREGLST= <1H.CDCl3>
##$SSB= 0
##$STSI= 65536
##$STSR= 0
##$SW_p= 40650.406504065
##$SYMM= 0
##$S_DEV= 0
##$TDeff= 32768
##$TDoff= 0
##$TI= <>
##$TILT= no
##$TM1= 0
##$TM2= 0
##$TOPLEV= 0
##$USERP1= <user>
##$USERP2= <user>
##$USERP3= <user>
##$USERP4= <user>
##$USERP5= <user>
##$WDW= 1
##$XDIM= 65536
##$YMAX_p= 379057207
##$YMIN_p= -59737034
$$ End of Bruker specific parameters
$$ ---------------------------------
##NTUPLES= NMR SPECTRUM
##VAR_NAME=  FREQUENCY,     SPECTRUM/REAL,   SPECTRUM/IMAG
##SYMBOL=    X,             R,               I
##VAR_TYPE=  INDEPENDENT,   DEPENDENT,       DEPENDENT
##VAR_FORM=  AFFN,          ASDF,            ASDF
##VAR_DIM=   65536,         65536,           65536
##UNITS=     HZ,            ARBITRARY UNITS, ARBITRARY UNITS
##FACTOR=    0.620285442955139, 1,           1
##FIRST=     20137.2065510759, 0,            0
##LAST=      -20513.1999529892, 0,           0
##MIN=       -20513.1999529892, -59737034,   0
##MAX=       20137.2065510759, 379057207,    0
$$ Real data points
##PAGE= N=1
##DATA TABLE= (X++(R..R)), XYDATA
$$ [...]
##PAGE= N=2
##DATA TABLE= (X++(I..I)), XYDATA
12280a2735903l812699L614084R239849R503721O207108J811611l819633r519756
$$ -12735903 -16548602 -12934518 -3694669 5809052 12016160 13827771 10008138 488382
12272D88382r645680j414917O917144M436167n814521r168116o93591P303047
$$ 488382 -9157298 -10572215 -3655071 781096 -5033425 -14201541 -14895132 -7592085
12264g592085M534236j933209m15264O731689Q378649K363385l621025n510828
$$ -7592085 -3057849 -4991058 -5406322 1325367 9704016 12067401 8446376 2935548
12256B935548o415562p959509p540554m350448o59924K933032P277155J0285350
$$ 2935548 -3480014 -11439523 -18980077 -23330525 -23990449 -21057417 -13780262 -3494912
12248c494912Q875791M787620K741914L169981J960512k819485q293404j0322177
$$ -3494912 5380879 10168499 12910413 16080394 18040906 15221421 6928017 -3394160
12240c394160o619252J552900P912715N381733m254387r958392n803674M70600
$$ -3394160 -10013412 -8460512 -547797 4833936 579549 -9378843 -15182517 -14711917
12232a4711917J21418k674725L71101N697103M249139o48108K172122J0448528
$$ -14711917 -14590499 -17265224 -16894123 -11197020 -6947881 -7595989 -5423867 5024661
12224E024661R366972l220278j0053731m94211J2315755J1255621l51080p056730
$$ 5024661 14391633 11171355 1117624 623413 12939168 24194789 23843709 16786979
12216A6786979m774036j972728l046805m041359k648155j112238j80407R03969
$$ 16786979 12012943 10040215 6993410 2952051 303896 -808342 -988749 -84780
12208h4780K29443k807376k713162L718629Q396059K678172o657493o223507J462860
$$ -84780 144663 -2662713 -5375875 -1657246 6738813 9416985 2759492 -3464015 -2001155
12199b001155J296343p550401p693984O818125J6597646N697667j2233651j4207779
$$ -2001155 -704812 -8255213 -15949197 -9131072 7466574 13164241 930590 -13277189
12191a3277189k114803L938055q93148k093159O174000J1240179M524737n207917
$$ -13277189 -15391992 -11453937 -12347085 -14440244 -8266244 2973935 7498672 2290755
12183B290755q423634q317000r118192n589834N247615J3936644J1248317J620305
$$ 2290755 -6132879 -14449879 -23568071 -29157905 -23910290 -9973646 1274671 2894976
12175B894976n544530q319393p098536J295295J3241376J4357776j83765j3130268
$$ 2894976 -2649554 -10968947 -18067483 -16772188 -3530812 10826964 10643199 -2487069
12167b487069r086464Q63400j704224r962358l772246J2781700J5341191K05335
$$ -2487069 -11573533 -10710133 -12414357 -22376715 -26148961 -13367261 1973930 2179265
12159B179265r276151k378692L545517k187132l734813R351839J8217357N897227
$$ 2179265 -7096886 -9475578 -5930061 -8117193 -11852006 -2500167 15717190 21614417
12151B1614417j0671085p241058O890504N058555j1441460j6344945k114530J0407017
$$ 21614417 10943332 3702274 10592778 15651333 4209873 -12135072 -14249602 -3842585
12143c842585P511503j27704j163366m1195j736230j018655L666200L373391m777329
$$ -3842585 3668918 3541214 2377848 2336653 600423 -418232 3247968 6621359 1844030
12134A844030r722556m403870K481071J805418k046849j887210j29549q64613
$$ 1844030 -7878526 -12282396 -9801325 -7995907 -10042756 -11929966 -12059515 -12924128
12126a2924128p28752K636725L340259k069827o581741m595173j537310j989603
$$ -12924128 -13652880 -11016155 -7675896 -9745723 -16327464 -20922637 -22459947 -24449550
12118b4449550N58418J0327658J6584158Q891761l764801n246719K664734M566078
$$ -24449550 -23891132 -13563474 3020684 11912445 8147644 2900925 5565659 10131737
12110A0131737k891682p467075l223874J286732k37679k418321q48391o90730
$$ 10131737 7240055 -227020 -3450894 -2164162 -2401841 -4820162 -5668553 -6359283
12102f359283n413699q128412k860174L940131K523127m902466p130375J83324
$$ -6359283 -11772982 -19901394 -22761568 -18821437 -16298310 -21200776 -28331151 -28147827
12094b8147827R170419J0188482K693057m911834m050506M961633J2014112P772221
$$ -28147827 -18977408 -8788926 -6095869 -11007703 -15058209 -10096576 1917536 9689757
12086I689757m289377j0780335n204545L777451N156242O61100o48123J484835
$$ 9689757 5400380 -5379955 -10584500 -6807049 -1650807 -989707 -1637830 -152995
12078a52995r73931p815412p486631L924924J2430772N636737o327389m482287
$$ -152995 -1126926 -8942338 -16428969 -12504045 -73273 5563464 -763925 -5246212
12070e246212Q845759J2193033j036414j1190123m133905N343823j057441j2456977
$$ -5246212 3599547 15792580 14756166 3566043 -567862 4775961 3718520 -8738457
12062h738457n982571J2456891J4091674n686295j6926467j851804J6321566J0117598
$$ -8738457 -14721028 -2264137 11827537 6141242 -10785225 -12637029 3684537 13802135
12054A3802135r638172j3591123p06428M489124m993654r128350K630355J3418548
$$ 13802135 4163963 -9427160 -10133588 -5644464 -10638118 -19766468 -17136113 -3717565
12046c717565P974760l104934l201620L171068R29117q765781j1229877l060810
$$ -3717565 4257195 1152261 -2049359 1121709 2050826 -6714955 -17944832 -21005642
12038b1005642L700353K457675J170052O207244J0525052O119559j456473j729546
$$ -21005642 -17305289 -14847614 -13677562 -7470318 3054734 9174293 7717820 5988274
12030E988274L276188K604259m201928m857460M785504J1063071L165507p798103
$$ 5988274 9264462 11868721 7666793 2809333 7594837 18657908 21823415 14025312
12022A4025312n226927M968480K564056j2216220j5299093K957079J8982237J0672663
$$ 14025312 8798385 13766865 16330921 4114701 -11184392 -8227313 10754924 21427587
12014B1427587q492184j1582204k06456K307305p758873j0022863J970545Q060406
$$ 21427587 12935403 1353199 1146743 3454048 -4304825 -14327688 -12357143 -4296737
12006d296737l427207j3989421m696589J2568969J3899042P1586o953199K170933
$$ -4296737 -7723944 -21713365 -26409954 -13840985 58057 129643 -6823556 -4652623
11998d652623J3577951J2524727P34676j0413145j2810471n749150M619838Q465533
$$ -4652623 8925328 21450055 22184731 11771586 -1038885 -6788035 -2168197 6297336
11990F297336J018814j0949738j5300200o805399Q548015J8664301J3992992k845488
$$ 6297336 7316150 -3633588 -18933788 -25739187 -17191172 1473129 15466121 12620633
11982A2620633j5000177q056890R193005J3292583l90129r834595j630771O125606
$$ 12620633 -2379544 -10436434 -1243429 12049154 11659025 1824430 193659 6319265
11974F319265n351494k0386115j1899260J2294328J9000701J985102r634923J33520
$$ 6319265 967771 -19418344 -31317604 -19023276 -22575 1962527 -7672396 -7538876
11966g538876J1327999O030553k244455L276505J1330694M111356r561795r249092
$$ -7538876 3789123 9819676 7575221 10851726 22182420 26293776 16731981 7482889
11958G482889K362816O316770J84402k020898K281646J812169m486749m910398
$$ 7482889 9845705 16162475 16346877 14325979 16607625 18419794 13933045 9022647
11950I022647J891577L495730l016352n318511J129317M193672l028262r583347
$$ 9022647 10914224 14409954 11393602 6075091 7204408 11398080 8369818 -1213529
11942a213529n657310J634811K115285j511861k369775j575422q16102N013748
$$ -1213529 -6870839 -5236028 -3120743 -4632604 -7002379 -8577801 -9393903 -4380155
11934d380155J5703342J7981937M002290j2299633j2739623q78360N795942L208867
$$ -4380155 11323187 29305124 33307414 21007781 8268158 7389798 13185740 16394607
11926A6394607J947735M647854K028067p074387j0599785l704471K075908j875734
$$ 16394607 18342342 22990196 25018263 17943876 7344091 3639620 5715528 3839794
11918C839794o895090k298928O371251O747255l57770l455043P55744L481917
$$ 3839794 -3055296 -5354224 1017027 7764282 7406512 3951469 4707213 8189130
11910H189130j140741p383750o886529O87658Q832586J1470512P005422j279888
$$ 8189130 7048389 -335361 -7221890 -6534232 2298354 13768866 20774288 19494400
11902A9494400p228562o952288k911842n47640j057216q98348J547137L193486
$$ 19494400 12265838 5313550 2401708 1854068 796852 -101496 1445641 4639127
11894D639127J465534j711581l238876k812672j413739Q29913K782272J811743
$$ 4639127 6104661 4393080 1154204 -1658468 -3072207 -2242294 539978 2351721
11886B351721j611795k300923K522801P581219N929525j645373q885718j2566385
$$ 2351721 739926 -1560997 961804 8543023 14472548 12827175 3941457 -8624928
11878h624928j1976014l732036J2252120K3177406J3776988j0201345k3227661
$$ -8624928 -20600942 -24332978 -12080858 11096548 24873536 14672191 -8555470
11871h555470j2489732M365202N570421l611458l323226O706456Q036279l545082
$$ -8555470 -21045202 -16680000 -11109579 -14721037 -18044263 -11337807 -3301528 -6846610
11863f846610j0125999k397502M106664m154111j3948184n021486J6961201K6768597
$$ -6846610 -16972609 -19370111 -15263447 -19417558 -33365742 -38387228 -21426027 5342570
11855E342570J4378469m196701j0785151m850644L290734O773037M742203p66791
$$ 5342570 19721039 15524338 4739187 -111457 3179277 9952314 14694517 13927726
11847A3927726n276318m554737m80921J72539m483871p374101j738485Q567376
$$ 13927726 8651408 4096671 3615750 3788289 -695582 -8069683 -9808168 -1240792
11839a240792J2395600M863935n540441o221559L241961Q630663m98806j3796054
$$ -1240792 11154808 16018743 10478302 4256743 7498704 16129367 15630561 1834507
11831A834507j1261197Q191582K1607479J1569325j0363978k0130148j2102021
$$ 1834507 -9426690 -1235108 20372371 31941696 21577718 1447570 -10654451
11824a0654451l24878M827912N383495L450669l060250j0100375p992507K741796
$$ -10654451 -10979329 -6151417 -767922 2682747 -377503 -10477878 -18470385 -15728589
11816a5728589R263623O118882M003189J0448655J4540735L807727j2925819j5785357
$$ -15728589 -6464966 -346084 3657105 14105760 28646495 32454222 19528403 3743046
11808C743046l397063M551591l383837j3799901r203029O031598J3088852O652201
$$ 3743046 345983 4897574 1513737 -12286164 -21489193 -15457595 -2368743 4283458
11800D283458N04698L725057O112323l504712j5514974j1299790P419626J8178750
$$ 4283458 4788156 8513213 14625536 11120824 -4394150 -15693940 -8274314 9904436
11792I904436R165033n199897p262796k4102L322375J424154J337678J469846
$$ 9904436 19069469 13869572 6606776 6582674 9905049 11329203 12666881 14136727
11784A4136727n166117j4556877j4823919m982882L751177N431901M764140M943225
$$ 14136727 8970610 -5586267 -20410186 -25393068 -21641891 -16209990 -11445850 -6502625
11776f502625L781273K775978O181970R514369L235597r586178j3946475n133394
$$ -6502625 -2721352 54626 6236596 15750965 18986562 9400384 -4546091 -9679485
11768i679485M107020L633449r06122r33952K442987N254521P487943O969970
$$ -9679485 -5572465 -1939016 -2845138 -3779090 -1336103 3918418 11406361 18376331
11760A8376331o08350r770718p802780M169256Q680866r51820q246579Q1881J2353135
$$ 18376331 17767981 7997263 194483 4363739 13044605 12092785 3846206 3928087 16281222
11751A6281222J1316991J96580p216028r122246j0643294q093510K693150J2077841
$$ 16281222 27598213 27794793 20578765 11456519 813225 -7280285 -4587135 7490706
11743G490706R534594K139850J649989K657010n707544j5382249j0566226K944206
$$ 7490706 17025300 19165150 20815139 23472149 17764605 2382356 -8183870 -5239664
11735e239664N161837m356547o580091K861325O590390k699177r107589j350297
$$ -5239664 -77827 -4434374 -11014465 -8153140 -1562750 -4261927 -13369516 -14719813
11727a4719813Q743591P347474j81075j972486J036162R28143k744616m943304
$$ -14719813 -5976222 1371252 1190177 -782309 253853 1181996 -1562620 -6505924
11719f505924l935068r96542K128023K260920j289599k097006M122505Q453055
$$ -6505924 -10440992 -11437534 -9309511 -7048591 -8338190 -10435196 -6312691 2140364
11711B140364J152954q468814l711329R906243J0404343l674663r281429J485719
$$ 2140364 3293318 -5175496 -8886825 1019418 11423761 7749098 -1532331 -46612
11703d6612P077583n100770j5019480m382489J1417649J0316831N10669K107191
$$ -46612 7030971 1930201 -13089279 -17471768 -6054119 4262712 4773381 6880572
11695F880572R480884L325739j1644700j3753524k962425o8159q352763p590864
$$ 6880572 16361456 19687195 8042495 -5711029 -8673454 -8741613 -17094376 -24685240
11687b4685240R060025K1200227J3918672N0818k816838K050899K023956k839025
$$ -24685240 -15625215 5575012 19493684 19544502 16727664 18778563 20802519 17963494
11679A7963494m122034j681351k186434o062083o848911k013724K838164J042111
$$ 17963494 13841460 12160109 9973675 3911592 -2937319 -4951043 -2112879 -1070768
11671a070768o645155j1441964n988449M991787Q631068J646368l862092Q56876
$$ -1070768 -7715923 -19157887 -25146336 -20154549 -11523481 -9877113 -13739205 -12882329
11663a2882329O395292Q67476q700161p200660K594267M703611k035672k530365
$$ -12882329 -6487037 -5619561 -14319722 -21520382 -18926115 -14222504 -16258176 -18788541
11655a8788541O324470Q978957n20079o048712L043620J1979389M497111r261564
$$ -18788541 -12464071 -3485114 -4005193 -10053905 -7010285 4969104 9466215 204651
11647B04651q579258M561229R316009q83319r355896k784706R641331J0921293
$$ 204651 -8374607 -3813378 5502631 4619312 -4736584 -7521290 2120041 13041334
11639A3041334k49340r581468o898077K053028N062218J25531k960849K012539
$$ 13041334 12791994 3210526 -3687551 -1634523 3427695 3553226 592377 2604916
11631B604916P829300M924269l780617q324265p623674p928371p886886j70834
$$ 2604916 10434216 15358485 11577868 3253603 -4370071 -12298442 -20185328 -20356162
11623b0356162J1227238J2166780J498225m191573K879841P864914j488570j2198169
$$ -20356162 -9128924 3037856 4536081 344508 3224349 11089263 9600693 -2597476
11615b597476o191594R507086J3577018L778474k570409J149268K349198o044592
$$ -2597476 -8789070 718016 14295034 18073508 15503099 16652367 19001565 12956973
11607A2956973j2328268n451412P163044J0969724L793990m677666o524417j800916
$$ 12956973 628705 -4822707 2340337 13310061 17104051 12426385 5901968 4101052
11599D101052M610518P354458M518267m58386l282657m668660p342139r009397
$$ 4101052 8711570 16066028 20584295 20125909 16843252 12174592 4832453 -4176944
11591d176944n216474J768057N014584L843339M101456O947864O604645R83050
$$ -4176944 -9393418 -7625361 -2610777 1232562 5334018 12281882 18886527 19869577
11583A9869577m685815p049904q036958o728212J293095J2369049J4054344K597087
$$ 19869577 15183762 8133858 96900 -6631312 -5338217 7030832 21085176 23682263
11575B3682263r382269j0505198n672278m115041k915112M541705J1828716P233930
$$ 23682263 14299994 3794796 -1877482 -5992523 -8907635 -4365930 7462786 14696716
11567A4696716n363677r689302j573987M970005j14173q256486o603409L235096
$$ 14696716 9333039 -356263 -1930250 3039755 2925582 -5330904 -11934313 -8699217
11559h699217R262263N621422k661665p813254o177557N32222O363376N742862
$$ -8699217 563046 6184468 3522803 -4290451 -10468008 -9935786 -3572410 2170452
11551B170452O3141l389925j634478l70399m043447o817716m71525J1696501J6960982
$$ 2170452 2233593 -1156332 -2790810 -3161209 -7204656 -14022372 -14493897 -2797396 14163586
11542A4163586R255083l624333j0270829p511493j35732O006792P590373M335478
$$ 14163586 23418669 19794336 9523507 2012014 1876282 7883074 15473447 19808925
11534A9808925o36268l131950k690778k641305l935938k947957J618027M086527
$$ 19808925 19172657 16040707 13349929 10708624 6772686 3824729 5442756 9529283
11526I529283n02229p052321n824195L255807R009884L930183n504186p547899
$$ 9529283 9027054 1974733 -3849462 -593655 8416229 12346412 6842226 -705673
11518g05673n2034Q167684Q692766J933915n112629o412491k279870J242152p97127
$$ -705673 -757707 7409977 16102743 18036658 12924029 6511538 4231668 5473820 4676693
11509D676693n627458n799414P2722M352663J557984k734904m60581N529486N492294
$$ 4676693 -950765 -6750179 -6677457 -2324794 -766810 -3501714 -3962295 1567191 7059485
11500G059485j234958m546498K51503M763918J267824m668281l540359K337976
$$ 7059485 5824527 1278029 1529532 6293450 7561274 2892993 -647366 1690610
11492A690610K740104l377358n565936J728949R820073P715575k735104r746880
$$ 1690610 4430714 1053356 -4512580 -2783631 7036442 14752017 12016913 2270033
11484B270033o660832J694720O904478O003180J424867l877309q041967q871242
$$ 2270033 -4390799 -2696079 4208399 10211579 11636446 7759137 -282830 -9154072
11476i154072m628853K813451P940840O551013J12583n783390o574878j827734
$$ -9154072 -13782925 -10969474 -3028634 3522379 3634962 -2148428 -8723306 -10551040
11468a0551040M920270P872150K924976o793962j1035818k829429J1283781J6590405
$$ -10551040 -5630770 2241380 5166356 -1627606 -12663424 -15492853 -4209072 12381333
11460A2381333P294287o660469j2369999q492501k757999M04417K991590O006788
$$ 12381333 19675620 13015151 645152 -7847349 -10605348 -10200931 -7209341 -1202553
11452a202553O255096K148201k450174k916207M82890L719587L692204J40192
$$ -1202553 5052543 7200744 4750570 1834363 2317253 6036840 9729044 9869236
11444I869236n146134r028274q259960k454948M052884N198626n38456p371850
$$ 9869236 4723102 -4305172 -12565132 -15020080 -10967196 -5768570 -6307026 -13678876
11436a3678876p627727p68072N011636K529834m688227o490405L70847P817529
$$ -13678876 -21306603 -22074675 -17063039 -14533205 -19221432 -25711837 -25340990 -17523461
11428a7523461P355912O76009l966144k176291L698635R030391R987259M804382
$$ -17523461 -10167549 -9491540 -13457684 -15633975 -11935340 -2904949 7082310 11886692
11420A1886692l353075o918479k212558M531516M559523j548569n253137k405019
$$ 11886692 8533617 1615138 -597420 3934096 8493619 6945050 1691913 -713106
11412g13106K338497L931470L099641J912358r04093o393515j0851575r026983
$$ -713106 1625391 5556861 8656502 10568860 9664767 3271252 -7580323 -16607306
11404a6607306q39354P322363Q264287J532118m279813K95322J2655326J7803031
$$ -16607306 -17446660 -10124297 -1860010 -327892 -4607705 -4312383 8342943 26145974
11396B6145974O612870r888782j3673955m691935k46312p925127j3678106m654089
$$ 26145974 32758844 22870062 9196107 4504172 4257860 -3667267 -17345373 -21999462
11388b1999462R076630R375299j353818l657195P992365J5521160M915527j1298870
$$ -21999462 -12922832 -3547533 -4901351 -8558546 -566181 14954979 19870506 8571636
11380H571636j1941134J468089P692445j762234j0946335o151474K183099j773321
$$ 8571636 -3369498 -1901409 5791036 4028802 -6917533 -13069007 -10885908 -12659229
11372a2659229j0492190l979194J4568819J8604115o34461j7024199q119897J0133489
$$ -12659229 -23151419 -27130613 -12561794 6042321 5407860 -11616339 -19736236 -9602747
11364i602747R333072o307757r106536N572281J3463073L302465o449673j766713
$$ -9602747 -269675 -6577432 -15683968 -10111687 3351386 6653851 204178 -1562535
11356a562535M338568j715945r385376m978048K666382n80692p089470j541503
$$ -1562535 2776033 1060088 -8325288 -13303336 -10636954 -11217646 -18307116 -19848619
11348a9848619R835961R409274k69655j177206P449311P727884m206938j0076379
$$ -19848619 -10012658 -603384 -873039 -2050245 5399066 13126950 8920012 -1156367
11340a156367o13717Q341519K056630r492563q283718M442707J1941411N852685
$$ -1156367 -1770084 6571435 8628065 -864498 -9148216 -4705509 7235902 13088587
11332A3088587n554176r776091k897588Q105902J2044286M892728m953771p157376
$$ 13088587 7534411 -2241680 -5139268 2966634 15010920 19903648 14949877 7792501
11324G792501l368544k894542o440292n525172J636700O589142N486645M160456
$$ 7792501 4423957 1529415 -4910877 -10436049 -8799349 -2210207 3276438 7436894
11316G436894M233246j476522j2731452j5410880j936812J3642258J3639791J119713
$$ 7436894 11670140 10193618 -2537834 -17948714 -19885526 -6243268 7396523 8516236
11308H516236o707090l280729K229658J469136l286054n429973j805302N425604
$$ 8516236 1809146 -1471583 758075 2227211 -1058843 -6488816 -8294118 -2868514
11300b868514R510043M525359n525995q459829l18024P048595K705925o351147
$$ -2868514 6641529 11166888 5640893 -2818936 -3136960 3911635 6617560 266413
11292B66413n582042N203318J2475645Q591889j010125q795032j2034476r196293
$$ 266413 -5315629 -112311 12363334 20955223 19945098 11150066 -884410 -10080703
11284a0080703n54656O632077L795800o097398j0193152k258938J0169194J6444517
$$ -10080703 -10635359 -4003282 -207482 -6304880 -16498032 -18756970 -8587776 7856741
11276G856741J3061527K741853q251739j1178845k632210P164942M010341r724946
$$ 7856741 20918268 23660121 15408382 4229537 1597327 8762269 12772610 3047664
11268C047664j5344707l468829J1878368J2605791J29147j0405374j1611623p673012
$$ 3047664 -12297043 -15765872 -3887504 8718287 8847434 -1557940 -13169563 -20842575
11260b0842575j874083O185097J2091030Q437024k311844p759715k749886L037881
$$ -20842575 -22716658 -16531561 -4440531 3996493 1684649 -6075066 -8824952 -5787071
11252e787071Q03150k861877L286038J5462796J7944162N570687q154850r585338
$$ -5787071 -4983921 -7845798 -4559760 10903036 28847198 34417885 26263035 16677697
11244A6677697k619490q48498p903743j4490204j2906756n785800N48494L860996
$$ 16677697 14058207 13209709 5305966 -9184238 -22090994 -27876794 -27328300 -23467304
11236b3467304M305653J241825l848698n724556j608750L867178M811855K980999
$$ -23467304 -19161651 -17919826 -21768524 -27493080 -29101830 -25234652 -20422797 -17441798
11228a7441798N005455J1386439J4122204P128600n215095j2832293j0910709
$$ -17441798 -12436343 -1049904 13072300 20200900 14985805 2153512 -8757197
11221h757197l421306K765807M253221J926848j498213l354641k300078N37948
$$ -8757197 -12178503 -9412696 -5159475 -3232627 -4730840 -8085481 -10385559 -9847611
11213i847611K648455L461622M751442O060660L055996n139121j0145665l744555
$$ -9847611 -7199156 -3737534 1013908 7074568 10130564 4991443 -5154222 -8898777
11205h898777P738941Q933405j934008p935029J460472J2159057N713265j0898387
$$ -8898777 -1159836 7773569 5839561 -2095468 -634996 11524061 17237326 6338939
11197F338939j3759770K461273J6635159J1952067k948297j0925668r462779o557468
$$ 6338939 -7420831 -4959558 11675601 23627668 20679371 9753703 290924 -6266544
11189f266544n047656k886927j530878k985364l350323J471598P591556Q444377
$$ -6266544 -11314200 -14201127 -15732005 -18717369 -22067692 -20596094 -13004538 -4560161
11181d560161M418432M25385j806487k587968l51284M326164N662453N67217n139293
$$ -4560161 -141729 283656 -1522831 -4110799 -4462083 -135919 5526534 6093751 954458
11172I54458n088417j812501j098740k669947l748301n537497p969338m854764
$$ 954458 -4133959 -5946460 -7045200 -9715147 -13463448 -19000945 -26970283 -31825047
11164c1825047N975942J4208478R847620j062033n264608j735792M76698o28820
$$ -31825047 -25849105 -11640627 -1793007 -2855040 -8119648 -9855440 -9378742 -10007562
11156a0007562N88076L447727J359408m062722l515269M111117R246560O629283
$$ -10007562 -9419486 -5971759 -4612351 -8675073 -12190342 -8079225 1167335 7796618
11148G796618R14114l749815p782285q983964l806509L066688L203807o27430
$$ 7796618 8710732 4960917 -2821368 -11805332 -15611841 -12545153 -9341346 -9968776
11140i968776J931774R033807O736812p304433j7168476j2232380j334158M637574
$$ -9968776 -8037002 996805 7733617 429184 -16739292 -28971672 -30305830 -25668256
11132b5668256Q209093J3005992J1648895j22209r846419m482976Q717802J2505824
$$ -25668256 -17459163 -4453171 7195724 7073515 -2772904 -7255880 1461922 13967746
11124A3967746M179141m367008n971041l839569j391358P68679J140m998759q156818
$$ 13967746 18146887 13779879 7808838 3969269 2577911 3346590 3347730 -1651029 -9807847
11115i807847l674296K905410J913232m480094m846928L541200J0147662O065428
$$ -9807847 -13482143 -10576733 -8663501 -13143595 -17990523 -14449323 -4301661 1763767
11107A763767m791300j1283118o699366N165090J2390455O582201n005651o115207
$$ 1763767 -3027533 -14310651 -21010017 -15844927 -3454472 3127729 -1877922 -7993129
11099g993129N054084J0012406k869951j7803597j3950149K125939P545741L26652
$$ -7993129 -2939045 7073361 4203410 -13600187 -27550336 -25424397 -17878656 -17552004
11091a7552004J30692J1833284J5614000J225001j3067800r698015J243015K018703
$$ -17552004 -17421312 -5588028 10025972 11250973 -1816827 -11514842 -10271827 -8253124
11083h253124k971663J368671J1443863J0125188l883676j3380767r042202j97840
$$ -8253124 -11224787 -9856116 1587747 11712935 7829259 -5551508 -14593710 -14791550
11075a4791550K637511M22949k053594k924953N71472J0052578J7304246J0624780
$$ -14791550 -12154039 -11731090 -13784684 -16709637 -16138165 -6085587 11218659 21843439
11067B1843439o198312j4518380o301820M035977J552372p498836p263513L308633
$$ 21843439 15645127 1126747 -5175073 -1139096 413276 -7085560 -14349073 -11040440
11059a1040440J0805660P627522j89428m254695l369058j303350j320102l020414
$$ -11040440 -234780 7392742 7203314 2948619 -420439 -1723789 -3043891 -6064305
11051f064305j631042O430862J4917705J1898078k502317j2007568o467772K173210
$$ -6064305 -7695347 -1264485 13653220 25551298 23048981 11041413 4573641 6746851
11043F746851p99930p710823j451457J3021073J3796229j639106j0544401j750619
$$ 6746851 5946921 -1763902 -3215359 9805714 23601943 21962837 11418436 9667817
11035I667817O658556q77547j1012007n841320N101669J249562j2821029j4010785
$$ 9667817 16326373 15448826 4436819 -1404501 3697168 4946730 -7874299 -21885084
11027b1885084J553602J3094408Q393953p62146j401264K518964K784255J053945
$$ -21885084 -20331482 -7237074 1156879 394733 -1006531 1512433 4296688 5350633
11019E350633Q87395r03127n266758m609934M596906J2387140Q647208j628169
$$ 5350633 6238028 5334901 68143 -4541791 55115 12442255 21089463 19461294
11011A9461294o302679l221498K59380M3669j845700l835631n521212m094307
$$ 19461294 13158615 9937117 10196497 10240166 8394466 4558835 -962377 -5056684
11003e056684K177947Q625418R119836M501934j07241l535266o810745o257970
$$ -5056684 -2878737 5746681 14866517 19368451 19261210 15725944 8915199 2657229
10995B657229K053054J1830643J1120343n94031r750446p297961o46538o11112
$$ 2657229 4710283 16540926 27661269 27067238 17316792 10018831 9372293 8761181
10987H761181m788510l567633K767274M626644o82761n026582l463509j301652
$$ 8761181 3972671 405038 3172312 7798956 7116195 2089613 -1373896 -2675548
10979b675548l000682m267570j770942j340556p298136j1381231l854656R447444
$$ -2675548 -5676230 -9943800 -11714742 -13055298 -20353434 -31734665 -35589321 -26141877
10971b6141877J3634495N479967m561944q783271p673761j062960J0785942J7657943
$$ -26141877 -12507382 -7027415 -11589359 -20372630 -28046391 -29109351 -18323409 -665466
10963f65466Q612904p099031p735692P245693J2607458l971330k0953782j6140396
$$ -665466 7947438 848407 -6887285 358408 12965866 8994536 -11959246 -28099642
10955b8099642m8214M653200k96213K252696J1703494J2740558M602712O23808
$$ -28099642 -28147856 -23494656 -23790869 -21538173 -9834679 2905879 7508591 8132399
10947H132399J679126m000820j4736424j4326204l3147J1289255R550188L236883
$$ 8132399 9811525 5810705 -8925719 -23251923 -23285070 -11995815 -2445627 791256
10939G91256N55347j207499k892614K80987M830127P96065q004342n929573P057945
$$ 791256 1346603 139104 -2753510 -2472523 2357604 3153669 -4850673 -10780246 -3722301
10930c722301J1680156K87124j0538433p597488K79870K007705J592581L517767
$$ -3722301 7957855 8244979 -2293454 -9890942 -9611072 -7603367 -6010786 -2493019
10922b493019J186644o717123p991023J163956N730771k106940p282815J092898
$$ -2493019 -1306375 -8023498 -16014521 -14850565 -9119794 -11226734 -18509549 -17416651
10914a7416651Q153785j065885j3942094j1026565K344275Q799183Q052647Q865326
$$ -17416651 -9262866 -10328751 -24270845 -35297410 -32953135 -24153952 -16101305 -7235979
10906g235979O190810p273811j8730410j1933857L434154O571560R49984N529317
$$ -7235979 -1045169 -8318980 -27049390 -38983247 -35549093 -28977533 -28027549 -22498232
10898b2498232J7379110J5205870j573769r474579P9208Q313715K364748o211593
$$ -22498232 -5119122 10086748 8512979 -961600 -882392 7431323 9796071 3584478
10890C584478n610087k472698m928658o823734j001896P021982R144217O306323
$$ 3584478 -2025609 -4498307 -9426965 -16250699 -17252595 -10230613 -1086396 5219927
10882E219927K529113j649306m513938k512982K334878M204133L064810K097256
$$ 5219927 7749040 6099734 1585796 -927186 1407692 5611825 8676635 10773891
10874A0773891j414029r183051j1090572R38196J3221669O501750j1410439j4674937
$$ 10773891 9359862 176811 -10913761 -9975565 3246104 9747854 -1662585 -16337522
10866a6337522l80492Q306607K722105M50510Q252947P076025j0318546j9240188
$$ -16337522 -16718014 -8411407 -5689302 -5238792 3014155 10090180 -228366 -19468554
10858a9468554k954627J6038083J1865308k325854K00993J1790742M980056j6563080
$$ -19468554 -22423181 -6385098 5480210 3154356 3355349 15146091 20126147 3563067
10850C563067k1325689k605003J0073273m69226j2854473m524432J2126459J2163546
$$ 3563067 -17762622 -20367625 -10294352 -10763578 -23618051 -28142483 -16016024 -3852478
10842c852478j936183o797407M135536J2456540M575287q980161j0505970Q91763
$$ -3852478 -5788661 -12586068 -8450532 4006008 8581295 -398866 -10904836 -10013073
10834a0013073J1323032J1590316N296163k53536k566788k379406o18824M58327
$$ -10013073 1309959 12900275 18196438 17942902 15376114 12996708 12377884 12836211
10826A2836211j396474l686861j745558J786219j751674j2029431j5841923n982916
$$ 12836211 11439737 7752876 6007318 7793537 6041863 -5987568 -21829491 -27812407
10818b7812407N661312M820747l879137n795138O67963N603310P014469J0923247
$$ -27812407 -22151095 -17330348 -21209485 -27004623 -26336660 -20733350 -13718881 -2795634
10810b795634J4600138Q544106m249346r354491l602253R42584j314653j976672
$$ -2795634 11804504 20348610 16099264 6744773 3142520 4085104 2770451 793779
10802G93779K745228M439517j2120j139414N045964Q366559K240425n672620q562191
$$ 793779 3539007 7978524 7966404 6826990 11872954 20239513 22479938 16807318 8245127
10793H245127j0140420j1527182n911087M986558P539727p59450m184181M262728
$$ 8245127 -1895293 -13422475 -19333562 -14347004 -6807277 -7566727 -11750908 -7488180
10785g488180R698927K514331l827811J008162L568355o449643j1587648M061361
$$ -7488180 2210747 4725078 897267 1905429 5473784 -975859 -12563507 -8502146
10777h502146K1096247J2195334j1975985j8659427m474848M776247M5640k016957
$$ -8502146 12594101 24789435 12813450 -5845977 -10320825 -5544578 -5498938 -7515895
10769g515895M364096M869950k952234k829200P026593O515745r196097j6371316
$$ -7515895 -3151799 1718151 -1234083 -4063283 2963310 9479055 282958 -16088358
10761a6088358j751746J3822475R576376k762070k252807O811769P341595p7030
$$ -16088358 -17840104 -4017629 5558747 2796677 543870 7355639 14697234 14620204
10753A4620204k961492j191853k832507m670601J547116R880260P412203l684906
$$ 14620204 11658712 10466859 7634352 2963751 4510867 14391127 21803330 18118424
10745A8118424r749691p652793n541100m702457J082684R104271Q513433r73445
$$ 18118424 8368733 715940 -4825160 -9527617 -8444933 659338 9172771 8199326
10737H199326p090208m110580N97759J658556K966480O138587N502231r2598k876017
$$ 8199326 1109118 -3001462 -2403703 -745147 2221333 8359920 13862151 13769553 10893536
10728A0893536M13834K015587l367472q943273o887030J80055N860875R172179
$$ 10893536 11307370 13322957 9955485 1012212 -5874818 -5694763 166112 9338291
10720I338291R605272K310894j2329997k2173875j6945647k793464O499232P376758
$$ 9338291 18943563 21254457 8924460 -13249415 -30195062 -32988526 -26489294 -19112536
10712a9112536N702243L951203R72983J72994N295765J0660021P945344N43567
$$ -19112536 -13410293 -9459090 -8486107 -8313113 -3017348 7642673 15588017 16131584
10704A6131584j535967J200018j1126m427923k886730K993336J209286p743303
$$ 16131584 14595617 15795635 15784509 11356586 8469856 11463192 12672478 4929175
10696D929175q192344L674722J0326880J184741r210488n827680K364592Q31803
$$ 4929175 -3263169 411553 10738433 11923174 2712686 -3114994 -750402 81401
10688H1401l716876K898397J3838016J1007404l757654j1440392o307169o31227
$$ 81401 -3635475 -737078 13100938 24108342 20350688 8910296 2603127 1971900
10680A971900l87753J251681N353507L797030k860012m075571R04867J090425
$$ 1971900 1584147 2835828 8189335 11986365 9126353 5050782 5955649 7046074
10672G046074n311391p387629k442579k28239j920287L534116J5526647J6751273
$$ 7046074 1734683 -5652946 -8095525 -8323764 -10244051 -6709935 8816712 25567985
10664B5567985K003207r552271l753067O568517L912331o894076j0594714o250267
$$ 25567985 27571192 18018921 14265854 20834371 24746702 17852626 7257912 1007645
10656A007645l219382l143720j326296K062994M395558O361086O514461K57982
$$ 1007645 -2211737 -5355457 -6681753 -4618759 -223201 6137885 12652346 12910328
10648A2910328q345179p237844L091152O047234m109548j0358764j088339R687331
$$ 12910328 4565149 -2672695 418457 6465691 2356143 -8002621 -9090960 596371
10640E96371P251853J447618N781161R821295j725720j7244076j4309903K404872
$$ 596371 7848224 9295842 15077003 24898298 23172578 5928502 -8381401 -5976529
10632e976529Q669669K06760m489750J391281M252868k234949o781221k703841
$$ -5976529 2693140 2899900 -1589850 -198569 4054299 1819350 -4961871 -7665712
10624g665712J889007J825434L206883Q312505R389507K846164n086327j0094139
$$ -7665712 -5776705 -3951271 -744388 7568117 16957624 19803788 14717461 4623322
10616D623322j3100574j0975061L29563J2622401J2526385L198202J210298R377910
$$ 4623322 -8477252 -19452313 -19122750 -6500349 6026036 9224238 10434536 19812446
10608A9812446J1704885K85893j1502957j0423868j638353L355335L255351K312238
$$ 19812446 31517331 31803224 20300267 9876399 8238046 11593381 14848732 17160970
10600A7160970M23495l554841p030164q207975q002628m709517L955404J1712941
$$ 17160970 17584465 14029624 6999460 -1208515 -9211143 -13920660 -9965256 1747685
10592A747685Q063321n002039j2078840m480942Q922544J5020291J1005789K123881
$$ 1747685 9811006 4808967 -7269873 -11750815 -2828271 12192020 23197809 25321690
10584B5321690n618779o982013n25783O852047O248905j042551n898244n600856
$$ 25321690 19702911 12720898 12195115 19047162 25296067 24253516 18355272 12754416
10576A2754416n439643o125234j747958P431117J1784719O093040k707437n578479
$$ 12754416 7314773 1189539 -558419 6872698 18657417 24750457 22043020 16464541
10568A6464541k114792J545372N6888o840404j3137801j1331480k210317M693385
$$ 16464541 14349749 15895121 15952009 9111605 -4026196 -15357676 -17567993 -12874608
10560a2874608M466373K626024K359502j936735r632308p370494Q561011J8690436
$$ -12874608 -8408235 -5782211 -3422709 -5359444 -14991752 -22362246 -13801235 4889201
10552D889201P519046j0065632j1123940n8256L140812k026271j390985L682736
$$ 4889201 12408247 2342615 -8781325 -8839581 -5698769 -7725040 -9116025 -5433289
10544e433289J302391l153243L958130J3771926O940601q386609p250642O431990
$$ -5433289 -4130898 -7284141 -3326011 10445915 17386516 8999907 1749265 8181255
10536H181255N222514j0369262r942994J0991316J9320801J626930j2189983k095905
$$ 8181255 13403769 3034507 -6908487 4082829 23403630 25030560 12840577 10744672
10528A0744672Q420457k766155j7026531j0451027M737116O195363Q24860N852818
$$ 10744672 19165129 16398974 -627557 -11078584 -6341468 -146105 678755 6531573
10520F531573J3879388Q495118l715599n805368K24119J975737K23755J859316
$$ 6531573 20410961 28906079 25190480 19385112 19609231 21584968 21808723 23668039
10512B3668039L219849p32281m778443n483477q035156j0352509k149725J1165150
$$ 23668039 26887888 26155607 21377164 15893687 7858531 -2493978 -4643703 6521447
10504F521447J1052092O77064L252260J6530961J1270169j1883527j4480133J0974912
$$ 6521447 17573539 18250603 21502863 38033824 49303993 37420466 22940333 33915245
10496C3915245K1458852J36040j1370929N984182R069329j4088771L712532Q2238966
$$ 33915245 55374097 55510137 44139208 50123390 59192719 45103948 48816480 131055446
10488A31055446J04040182k7546034j99609718k07352303m1656323R4891096P4785869
$$ 131055446 235095628 207549594 7939876 -199412427 -241068750 -146177654 -71391785
10481g1391785n059124j1890401K9727372K6282174j4553395j9368734J2089488
$$ -71391785 -76450909 -88341310 -58613938 -32331764 -46885159 -66253893 -54164405
10474e4164405J8128922q346437j5571746Q526337K0502982L125585j0548808
$$ -54164405 -36035483 -44381920 -59953666 -51427329 -30924347 -27798762 -38347570
10467c8347570j626732P283411L90805n785919J680071J0842184J1468651J0265431
$$ -38347570 -39974302 -32690891 -32300086 -38086005 -36405934 -25563750 -14095099 -3829668
10459c829668J0002186J697939j3813172k0426784j0463388M835884J2571162
$$ -3829668 6172518 7870457 -5942715 -26369499 -36832887 -31997003 -19425841
10452a9425841J0242106N44513j0415415j1756482J98479J2140965J0305388O68932
$$ -19425841 -9183735 -8639222 -19054637 -30811119 -30612640 -18471675 -8166287 -7497355
10444g497355k497433l1360k071759o675243m044371L265530L717400l132207
$$ -7497355 -9994788 -10026148 -12097907 -18773150 -22817521 -19551991 -15834591 -18966798
10436a8966798p093176m361946R12579O879289J1812068R314873J5549k257323
$$ -18966798 -26059974 -30421920 -29509341 -22630052 -10817984 -1503111 -1487562 -3744885
10428c744885P778031J1698971n524924k6055159k2224226N99693J2520402M818757
$$ -3744885 4033146 15732117 10207193 -15847966 -38072192 -37472499 -24952097 -20133340
10420b0133340k610274J806056O960668N265209N196563J0098184Q912399k281356
$$ -20133340 -22743614 -20937558 -13976890 -8711681 -3515118 6583066 15495465 13214109
10412A3214109j0146985n514018K505560K982212j605101m692442o022496n511027
$$ 13214109 3067124 -2446894 58666 3040878 1435777 -3256665 -9279161 -14790188
10404a4790188p7518P023328O603817j250940n414614j801162J035145o43825
$$ -14790188 -14867706 -7844378 -1240561 -2491501 -7906115 -9707277 -8672132 -9315957
10396i315957J391314R738916J2720007L618768n908604m178077J024872m066098
$$ -9315957 -7924643 1814273 14534280 18153048 12244444 8066367 9091239 5025141
10388E025141j4964935j4259149K134617J8275875J8810299O014528o437615r671350
$$ 5025141 -9939794 -24198943 -22064326 -3788451 15021848 21036376 14598761 4927411
10380D927411n759642j472055m53789k157794n342736q634675q110176k02301
$$ 4927411 -832231 -2304286 -2758075 -4915869 -10258605 -18893280 -27003456 -27205757
10372b7205757J0591837J3408155N250817l000815j681410L153999j39754r503884
$$ -27205757 -16613920 -3205765 2045052 -955763 -2637173 516826 377072 -9126812
10364i126812j2014356l831743M687467M423379j938971o178499l705575L977185
$$ -9126812 -21141168 -24972911 -20285444 -15862065 -17801036 -23979535 -27685110 -23707925
10356b3707925R919579O718913l137893o588429K568026J2241326Q937026j315884
$$ -23707925 -13788346 -7069433 -10207326 -16795755 -14227729 -1986403 6950623 5634739
10348E634739l508988J442233P17503n450648m115528N024745O890563k263887
$$ 5634739 2125751 3567984 4285487 -1165161 -5280689 -255944 6634619 4370732
10340D370732p216788j83894O057640J608161l808972o11653K327973m615817
$$ 4370732 -2846056 -3029950 3027690 4635851 826879 215226 2543199 -2072618
10332b072618j1029928k248088J4576437J9259339P453882o238576j0406825p164138
$$ -2072618 -13102546 -15350634 -774197 18485142 25939024 19700448 9293623 2129485
10324B129485k608689p8218j750560o293555o669448O16670P512161N048701k513740
$$ 2129485 -479204 -557422 -2307982 -8601537 -15270985 -14654315 -7142154 -2093453 -4607193
10315d607193m796951j856101j232168k332838J821195Q634117P056040l410525
$$ -4607193 -9404144 -11260245 -12492413 -14825251 -13004056 -4369939 2686101 -724424
10307g24424r311198l439093M443326L623833j984530k697201J387193L527681
$$ -724424 -10035622 -13474715 -9031389 -5407556 -7392086 -10089287 -8702094 -5174413
10299e174413K954663L738811M141308j963203j2441631j5627636n871630O927128
$$ -5174413 -2219750 1519061 5660369 3697166 -8744465 -24372101 -30243731 -23316603
10291b3316603R597104K883871j295673K233718N898491L143552r01590J404908
$$ -23316603 -13719499 -10835628 -12131301 -9897583 -3999092 -855540 -1757130 -352222
10283c52222P169186P656108K135816k334613l198735m618286p261752n967144
$$ -352222 6816964 14473072 16608888 14274275 11075540 6457254 -804498 -6771642
10275f771642J55826M698941M455948M062059N946409M678755k816940r714168
$$ -6771642 -6615816 -1916875 2539073 6601132 12547541 17226296 14409356 4695188
10267D695188r185823m941024m140158n692589l856376J143352M366497M682485
$$ 4695188 -4490635 -9431659 -13571817 -19264406 -23120782 -21977430 -17610933 -12928448
10259a2928448M664822M947088N117255O580941Q219652M034445p223431j5098888
$$ -12928448 -8263626 -3316538 1800717 8381658 16601310 20635755 13412324 -1686564
10251a686564r528574L977286J1348732R004511M871682K756204j462398p687322
$$ -1686564 -11215138 -7237852 4110880 13115391 17987073 20743277 19280879 11593557
10243A1593557q691489k637739K748230K739358J972491L447767J865384m951556
$$ 11593557 2902068 264329 3012559 5751917 7724408 11172175 13037559 8086003
10235H086003p959251l73992Q034163K622954j3047110j8741252m318265J5702070
$$ 8086003 126752 -247240 7786923 10409877 -2637233 -21378485 -25696750 -9994680
10227i994680K0207873P042639p286743r775844l507816K566724O698542J0887992
$$ -9994680 10213193 17255832 9969089 193245 -3314571 -747847 5950695 16838687
10219A6838687J1281452K569204r700698j2478718l532056L762276q26435j0148024
$$ 16838687 28120139 30689343 20988645 8509927 4977871 8740147 7913712 -2234312
10211b234312j1817517o323838k717385k304565R61099O510325O381842p45679
$$ -2234312 -14051829 -20375667 -23093052 -25397617 -24436518 -17926193 -11544351 -12290030
10203a2290030n880473k935466L236394N305847K828472O577k59207K313206N600485
$$ -12290030 -18170503 -21105969 -17869575 -12563728 -9735256 -9728679 -9987886 -7674680 -2074195
10194b074195N797699J987539j194627j83403J520157O34329K271341J0397691
$$ -2074195 3723504 5711043 4516416 4333013 5853170 6487499 8758840 19156531
10186A9156531J5120212M383608j3749586j8163993n670658M028818k85486n003743
$$ 19156531 34276743 38660351 24910765 6746772 1076114 5104932 4819446 -184297
10178a84297K726026J1899315O289043q006359j2396971m419191J779249j145478
$$ -184297 2541729 14441044 20730087 12723728 326757 -4092434 -2313185 -3458663
10170c458663o286985o408341j697806M928661R215898N122178o564658j3464822
$$ -3458663 -9745648 -16153989 -17851795 -12923134 -3707236 1414942 -5149716 -18614538
10162a8614538o629550M735619N953867j115146k991360L153411P962160P462747
$$ -18614538 -25244088 -20508469 -14554602 -15669748 -18661108 -15507697 -7545537 -82790
10154h2790N701563K068666o611445j2731230n637714O985483N959301q470637
$$ -82790 5618773 7687439 1075994 -11655236 -17292950 -10307467 -4348166 -12818803
10146a2818803j4315672k393483R309472O115438l78973M759178J2645712O268106
$$ -12818803 -27134475 -29527958 -20218486 -14103048 -14482021 -9722843 2922869 9190975
10138I190975r431632j4300334l495363P532023O524673k167609p609508m599119
$$ 9190975 -240657 -14540991 -18036354 -10504331 -3979658 -6147267 -13756775 -18355894
10130a8355894M086830J0245986O728347l393308q519594l888420K174122K600632
$$ -18355894 -14269064 -4023078 2705269 -688039 -9207633 -13096053 -10921931 -8321299
10122h321299J755810L444951J072103q392226j2607459j601783J2652504J2386414
$$ -8321299 -6565489 -3120538 -2048435 -10440661 -23048120 -24649903 -11997399 389015
10114C89015J886817r77725M396202J961867j0320111j4506120k634729R096170
$$ 389015 2275832 1298107 5694309 7656176 -2663935 -17170055 -19804784 -10708614
10106a0708614N992871l093873k023062P544423J1172677L873342n249057p062327
$$ -10708614 -4715743 -7809616 -9832678 -2288255 8884422 12757764 7508707 446380
10098D46380j945018L326209K755927l522170q620473n975936K434451Q702597
$$ 446380 -1498638 1827571 4583498 1061328 -7559145 -13535081 -11100630 -2398033
10090b398033R011938N691618R71170l769028m085158K604034Q764644M400735
$$ -2398033 6613905 12305523 13276693 9507665 5422507 8026541 16791185 21191920
10082B1191920o544318r779178k627275J429545n148015j1555979o478651M282999
$$ 21191920 14647602 4868424 2241149 3670694 -1477321 -13033300 -19511951 -15228952
10074a5228952Q456103N463219K750826K142213J370877K462774O546922N723277
$$ -15228952 -6772849 -1309630 1441196 3583409 4954286 7417060 13963982 19687259
10066A9687259o762570k1249008k0343707l405711J0427712P525092k770811l237727
$$ 19687259 12924689 -8324319 -28668026 -32073737 -21646025 -14120933 -16891744 -20129471
10058b0129471O037904Q365656m043553j5979229q461807J3138736K2914915Q956439
$$ -20129471 -14091567 -5725911 -9769464 -25748693 -34210500 -21071764 1843151 10799590
10050A0799590r405185q989767M106599N941322o989591j3021304p45624J3238699
$$ 10799590 1394405 -7595362 -3488763 2452559 -4537032 -17558336 -18303960 -5065261
10042e065261J1328534O11528k409455J834655J222826o285776j2217429j2624524
$$ -5065261 6263273 6874801 4465346 6300001 7522827 1237051 -10980378 -23604902
10034b3604902r264846j060597J1802203J9689921J3477805Q7445m920852J429479
$$ -23604902 -32869748 -33930345 -22128142 -2438221 11039584 11127029 6206177 7635656
10026G635656P636832N408611k305437r573842j2604955p969682L276606J1124856
$$ 7635656 15272488 20681099 18375662 8801820 -3803135 -11772817 -8496211 2628645
10018B628645P342257j051917q05950O908785Q324467p39422q895987p595386
$$ 2628645 9970902 8918985 8113035 15021820 23346287 22606865 13710878 6115492
10010F115492k008753L24074k21928q45061j720121j944076N89900K668893j078367
$$ 6115492 4106739 4430813 4208885 3363824 1643703 -300373 289527 2958420 1880053
10001A880053o926499n486842J780235K960244m103639p060154l67155M420694
$$ 1880053 -5046446 -10533288 -8753053 -5792809 -9896448 -16956602 -17323757 -12903063
9993a2903063j154690p003950j584147Q379187R640926L717559J113417K131106
$$ -12903063 -14057753 -21061703 -22645850 -14266663 -4625737 -908178 205239 2336345
9985B336345o38157n939003n541121P41570N687518P532678Q971449O984002j754281
$$ 2336345 1698188 -4240815 -9781936 -9040366 -3352848 4179830 13151279 20135281 18381000
9976A8381000q824307m025449M998655J945382r765654r513439O017904J4556252
$$ 18381000 9556693 5531244 10529899 12475281 2709627 -6803812 -785908 13770344
9968A3770344L990637o975141J69741J2710580Q412403p308689j1658385k629098
$$ 13770344 17760981 10785840 10955581 23666161 32078564 24769875 13111490 10482392
9960A0482392P68642o331206p307831L909417R581585k280690j6496805j3738684
$$ 10482392 11251034 4919828 -2388003 1521414 11102999 8822309 -7674496 -21413180
9952b1413180O62755P251290J439191m110404n99911P392614J1681677R486948
$$ -21413180 -20750425 -13499135 -12059944 -16170348 -16770259 -9377645 2304032 11790980
9944A1790980L236726k124002k815031o06190k28945j177168J082330M667189
$$ 11790980 15027706 12903704 10088673 9482483 9253538 8076370 9158700 13825889
9936A3825889K499244l491648k702800M820767N272456m761236r033579J052268
$$ 13825889 16325133 12833485 10130685 14951452 20223908 15462672 6429093 7481361
9928G481361Q658440j304366j4842324j1179041K572227N096053k513010k522007
$$ 7481361 16139801 14835435 -6889 -11185930 -8613703 -3517650 -6030660 -8552667
9920h552667N374114O155300N14419K349622P904369L02938j5167441j4848980
$$ -8552667 -3178553 2976747 3491166 5840788 13745157 14048095 -1119346 -15968326
9912a5968326J269913P224004l251202o315121O806823J3297248K301785m118694
$$ -15968326 -14698413 -7474409 -10725611 -17040732 -10233909 3063339 5365124 1246430
9904A246430O506374J1796282l607049j7151100p817672P348793O936346K706036
$$ 1246430 7752804 19549086 15942037 -1209063 -9026735 -1677942 5258404 7964440
9896G964440J0018812J3110883k564634j4418351q56447J4058059O5605k2485468
$$ 7964440 17983252 31094135 28529501 14111150 13254703 27312762 27378367 4892899
9888D892899j5886211R345492J6730917R392698J3956914J9946856K767880j0862420
$$ 4892899 -10993312 -1647820 15083097 24475795 38432709 58379565 61147445 50285025
9880E0285025J9571940N4173342R647757r7557042j43245416o7101449L7580696
$$ 50285025 69856965 124030307 133678064 36121022 -107124394 -174225843 -136645147
9873a36645147N9756680J6773226m670591J2065913J7804998j65763o960430N756794
$$ -136645147 -76888467 -60115241 -64785832 -52719919 -34914921 -35080684 -42041114 -36284320
9865c6284320R983033P93837J933810J3192778Q833576j0176570j4279477J138457
$$ -36284320 -26301287 -25507450 -23573640 -10380862 -1547286 -11723856 -26003333 -24864876
9857b4864876Q568583o41154m139644N924079R365564p29955m796142L544478
$$ -24864876 -16296293 -16937447 -21077091 -15153012 -5787448 -6517403 -11313545 -7769067
9849g769067L834774j1415778j9977104q853099L663106K050384j594971M526514
$$ -7769067 -3934293 -15350071 -35327175 -44180274 -40517168 -38466784 -40061755 -35535241
9841c5535241Q145481j760734j0812278k952313J1409639J2587687J614457o061133
$$ -35535241 -27389760 -29150494 -39962772 -42915085 -31505446 -18917759 -17303302 -23364435
9833b3364435m439368J479758P086145Q386033J730311p041795n635620M979782
$$ -23364435 -27803803 -26324045 -19237900 -10851867 -9121556 -16163351 -21798971 -16819189
9825a6819189R185072K168711j956462L696325O227646r72648k797818R393004
$$ -16819189 -7634117 -5465406 -7421868 -3725543 2502103 1529455 -1268363 8124641
9817H124641J6532082J455686j9320021j9704257n000277j08461p222608o138255
$$ 8124641 24656723 26112409 6792388 -12911869 -17912146 -18020607 -25243215 -31381470
9809c1381470P338272J3984089M865640m578169j240021P176883R199995O570188
$$ -31381470 -24043198 -10059109 -5193469 -9771638 -11011659 -3834776 5365219 11935407
9801A1935407M592100R98882n493625q142636l508439N65499k494417o611175
$$ 11935407 16527507 17526389 12032764 3890128 381689 947188 -1547229 -8158404
9793h158404l543642L018763L638420k190261o920330o727820l776848P57910
$$ -8158404 -11702046 -8683283 -5044863 -7235124 -14155454 -20883274 -24660122 -23902212
9785b3902212P514404J3272880J1793105K084945q471473j0989541l366003P991907
$$ -23902212 -16387808 -3114928 8678177 10763122 2291649 -8697892 -12063895 -4071988
9777d071988J3298359P848277k649344p161271j943285M705846L440900l758861
$$ -4071988 9226371 17074648 14425304 7264033 5320748 10026594 13467494 9708633
9769I708633p426926m453401j225921k968930o778680p227782l317602K516043
$$ 9708633 2281707 -2171694 -3397615 -6366545 -13145225 -20373007 -23690609 -21174566
9761b1174566P443517Q243441L477017k421005l399371k021662o797846j5597372
$$ -21174566 -13731049 -5487608 -2010591 -4431596 -7830967 -9852629 -16650475 -32247847
9753c2247847j3316555N092091K0781933J4535830m262044j0161206J319990R766363
$$ -32247847 -45564402 -40472311 -19690378 -5154548 -9416592 -19577798 -18257808 -8491445
9745h491445L290940n937599n524092j519453k613222l629420J441909M894143
$$ -8491445 -5200505 -11138104 -16662196 -18181649 -20794871 -24424291 -22982382 -18088239
9737a8088239n96395n538548J761881J3648325J3981673L880818j556804J511937
$$ -18088239 -18684634 -24223182 -22461301 -8812976 5168697 9049515 7492711 9004648
9729I004648J721122o524151j4198480j2332224l413151M386845N737631P01303
$$ 9004648 10725770 4201619 -9996861 -22329085 -25742236 -21355391 -15617760 -14916457
9721a4916457m115680K94504J2519954J7384091N025661j2976121j8198129r650888
$$ -14916457 -19032137 -18737633 -6217679 11166412 16192073 3215952 -14982177 -24633065
9713b4633065k41721M191486O708189O325444R39376j684882N439346J1547771
$$ -24633065 -24874786 -20683300 -13975111 -7649667 -6710291 -8395173 -2955827 8591944
9705H591944K575791j1747960r556313O485287J1747563N85907n300699L818117
$$ 8591944 11167735 -580225 -10136538 -3651251 8096312 8682219 3381520 7199637
9697G199637R142092j258310j0484235m247724L228492k949779r231161J178355
$$ 7199637 16341729 15083419 4599184 351460 3579952 630173 -8600988 -7422633
9689g422633J4679399Q986041o924972o882088Q053716J2282834p74901j0048797
$$ -7422633 7256766 16242807 9317835 2435747 10489463 22772297 21997396 11948599
9681A1948599m045937K893915j349246q062438p317823m729437o749871o659424
$$ 11948599 7902662 10796577 9447331 1384893 -5932930 -10662367 -17412238 -24071662
9673b4071662K233470J2759782J4694774Q831595J093007o895660j2715837r784024
$$ -24071662 -21838192 -9078410 5616364 14447959 15540966 8645306 -4070531 -13854555
9665a3854555P95925N279365m231161j5077295j0664335N075879J3996053J0219314
$$ -13854555 -13058630 -7779265 -12010426 -27087721 -37752056 -32676177 -18680124 -8460810
9657h460810N082207O299565P501702K364929l805855l593198O50993J909558
$$ -8460810 -3378603 2920962 10422664 12787593 8981738 5388540 6039533 7949091
9649G949091j057515n018775q095438p892847n54144J0264121J0744902n196247
$$ 7949091 6891576 1872801 -6222637 -14115484 -14669628 -4405507 6339395 1143148
9641A143148k1044333j5581775O827842K0730979J5003316M757417L136731K407312
$$ 1143148 -19901185 -35482960 -28655118 -7924139 7079177 11836594 14973325 17380637
9633A7380637n487446r918366j084340P932227P12066j2923238j1299874L277826
$$ 17380637 11893191 1974825 890485 8822712 9534778 -3388460 -14688334 -11410508
9625a1410508R333436K611450l3074O714343Q182752j428265q573624o268553
$$ -11410508 -2077072 534378 501304 7215647 15398399 13970134 5396510 -872043
9617h72043m801400p491042k132575J1402646J2429051n052613j5038388K96608
$$ -872043 -5673443 -13164485 -15297060 -3894414 8534637 3482024 -11556364 -11259756
9609a1259756J7974530R544337j1545917j1073511J0554311J9633791K004453
$$ -11259756 6714774 16259111 4713194 -6360317 4193994 23827785 25832238
9602B5832238j8819192j9864015o932484K947426M915764K908948l71091j605067
$$ 25832238 7013046 -12850969 -19783453 -16836027 -11920263 -9011315 -9382406 -10987473
9594a0987473L010258J0082910J1123445M927722j291177l372192l137915j120307
$$ -10987473 -7977215 2105695 13229140 18156862 16865685 13493493 10355578 9235271
9586I235271L117111N172827J011404m617785n484720n004313q362311j0099802
$$ 9235271 12352382 17525209 18536613 13918828 8434108 3429795 -4932516 -15032318
9578a5032318l885800K709070M11578k541397N830845J5618238Q671031o838846
$$ -15032318 -18918118 -16209048 -15797470 -18338867 -12508022 3110216 11781247 4942401
9570D942401n600069J0867441J2733693q565747k3372222j1221149O649219M042463
$$ 4942401 -657668 10209773 22943466 14377719 -8994503 -20215652 -13566433 -9523970
9562i523970q109415l978117J2786945J7338958M827508n836051m692965j555875
$$ -9523970 -17633385 -21611502 -8824557 8514401 13341909 7505858 2812893 1257018
9554A257018m322213p750425o253819j614979M119905J0527285J3044805O919245
$$ 1257018 -3065195 -10815620 -17069439 -18684418 -14564513 -4037228 9007577 15926822
9546A5926822l157618p512120m440954L51178M128860P174875O506644L71844
$$ 15926822 12769204 5257084 816130 1167308 5296168 12471043 18977687 19349531
9538A9349531m977602m069447k822980p987493j1895710l447012J0234412J1747105
$$ 19349531 14371929 10302482 7479502 -507991 -12403701 -15850713 -5616301 6130804
9530F130804J513839k384476N351184Q241971l474851j5522567j2590058j822977
$$ 6130804 7644643 5260167 10611351 18853322 15378471 -144096 -12734154 -14557131
9522a4557131J513347j269369J230663Q258644Q900419K116761j726002J472325
$$ -14557131 -13043784 -14313153 -13082490 -4823846 4076573 6193334 4467332 5939657
9514E939657M712097L464393J099271q90588n479398r922492n614289O554173
$$ 5939657 10651754 14116147 15215418 14324830 8845432 -1077060 -6691349 -137176
9506a37176J2547911M511518o777548q226712l543806l722988o335433n78551
$$ -137176 12410735 16922253 10144705 1917993 -1625813 -5348801 -11684234 -12262785
9498a2262785J0187724R305574o508682j8195562j0479631O370081J2215297M609399
$$ -12262785 -2075061 7230513 721831 -17473731 -27953362 -21583281 -9367984 -4758585
9490d758585k539082j653202J527241J854847K099277M169703L803542j657164
$$ -4758585 -7297667 -8950869 -7423628 -5568781 -3469504 700199 4503741 2846577
9482B846577p459946p556378j959047M375755O325646J761277n709160p559990
$$ 2846577 -4613369 -12169747 -14128794 -9753039 -3427393 -1666116 -7375276 -14935266
9474a4935266N82056J1170576J2670051N120290k52803J840308L306292l510606
$$ -14935266 -14353210 -3182634 9487417 14607707 14354904 16195212 19501504 15990898
9466A5990898j2917078j3624887m307699N375006O805231L43887p162900r152454
$$ 15990898 3073820 -10551067 -14858766 -9483760 -2678529 -2334642 -9497542 -18649996
9458a8649996m861565l6846j73332k552558N87564R507125J3744221N819741o962212
$$ -18649996 -23511561 -23548407 -23721739 -26274297 -25686733 -16179608 -2435387 3384354 -3577858
9449c577858j0874223l301643N004479N188646J217252K245060Q316733R948091
$$ -3577858 -14452081 -17753724 -12749245 -7560599 -6343347 -4098287 4218446 14166537
9441A4166537K647628m601556j472721O841369N357226o958228j2121886M34123
$$ 14166537 16814165 12212609 10739888 17581257 22938483 15980255 3858369 4292492
9433D292492J4584581Q867146j1146567k0184847r923351J937627J453284l326035
$$ 4292492 18877073 27744219 16597652 -3587195 -13510546 -11572919 -10119635 -13445670
9425a3445670j533001K203660J053660J733545J1264064J9687370J3117483l514361
$$ -13445670 -14978671 -12775011 -11721351 -9987806 1276258 20963628 34081111 30566750
9417C0566750j3259205j1447669p163542m406053J149534P626695O230589k536968
$$ 30566750 17307545 5859876 -1303666 -5709719 -4560185 3066510 9297099 6760131
9409F760131o889025j945974L267282J554796k301416k830662l218768n816625
$$ 6760131 -128894 -2074868 1192414 2747210 445794 -2384868 -5603636 -11420261
9401a1420261m271960N207266J3411692R787111j527109q089489p008999n105532
$$ -11420261 -15692221 -10484955 2926737 12713848 11186739 3097250 -3911749 -9017281
9393i017281m363510m1889O612567O867218n29138m778534m1310L752446k884434
$$ -9017281 -13380791 -13422680 -6810113 57105 -472033 -5250567 -5291877 -1539431 -4423865
9384d423865j0762627m294422J1895711J5348479k347719k1321366j9314878r0055
$$ -4423865 -15186492 -19480914 -7585203 7763276 5415557 -15905809 -35220687 -35310742
9376c5310742J5181655J6398404J0889417N942861J76950o547498p978038j780193
$$ -35310742 -20129087 -3730683 7158734 13101595 13278545 6731047 -1246991 -3027184
9368c027184L833927K61983r365909j3328010m900476R420787J5107279M898397
$$ -3027184 806743 1068726 -8297183 -21625193 -26525669 -17104882 -1997603 2900794
9360B900794r937680r594586Q285085K1079370R888796j2466386j8253019m427188
$$ 2900794 -7036886 -16631472 -8346387 12732983 22621779 10155393 -8097626 -12524814
9352a2524814N581955j46341o359856m91069N587531j345126j0622477n283684
$$ -12524814 -6942859 -7089200 -13449056 -13940125 -8352594 -9697720 -20320197 -25603881
9344b5603881Q859845J2644742L042328o674424r502942p973491n15612J4610567
$$ -25603881 -16744036 -4099294 -1056966 -7731390 -17234332 -25207823 -25723435 -11112868
9336a1112868K4838434J4504071q706893j8979045p261678P814491Q245576k189385
$$ -11112868 13725566 28229637 19522744 543699 -6717979 1096512 9342088 7152703
9328G152703j0812504j2690866p183581N612163J6569323J1695686n722886j3002838
$$ 7152703 -3659801 -16350667 -23534248 -17922085 -1352762 10342924 4620038 -8382800
9320h382800K70846J4230994P383338j0922847j5559594k976160P677669N809908
$$ -8382800 -8111954 6119040 13502378 2579531 -12980063 -15956223 -8278554 -2468646
9312b468646M99979K17160Q38625j692216k512011J917429O422495N893133K164675
$$ -2468646 -1968667 -1751507 -912882 -2605098 -5117109 -3199680 3222815 9115948 11280623
9303A1280623k166400p518993j0969343o139950N260467J1261957N282756m503177
$$ 11280623 9114223 1595230 -9374113 -15514063 -10253596 1008361 6291117 1787940
9295A787940p616083m278030P99335P631798J4623021J2939744j73806j0726131
$$ 1787940 -5828143 -10106173 -9306838 -1675040 12947981 25887725 25713919 14987788
9287A4987788n839897M065171p05958j6054232j6868246L928768K1495253J4588340
$$ 14987788 9147891 13213062 12507104 -3547128 -20415374 -16486606 5008647 19596987
9279A9596987m348294j0169318j284219M224267m15683m274387o41589L569219
$$ 19596987 15248693 5079375 3795156 8019423 7603740 3329353 2687764 6256983
9271F256983K343866p67669k294139m825669q997100r570545m032019K712151
$$ 6256983 8600849 7833180 5539041 713372 -8283728 -17854273 -21886292 -19174141
9263a9174141N676237N304413L797084K475727L586381P748987R643680M026867
$$ -19174141 -13497904 -8193491 -4396407 -1920680 1665701 9414688 19058368 23085235
9255B3085235m489853o466937j630083K072636K215875K821519K355797m710779
$$ 23085235 18595382 12128445 10498362 12570998 14786873 17608392 19964189 15253410
9247A5253410j3045983r309160N786434J4373276P106665l616970m593016o76749
$$ 15253410 2207427 -7101733 -1315299 13057977 20164642 16547672 11954656 11277907
9239A1277907j885169n581295m410256p42661l34087r84880P77115R84706k708235
$$ 11277907 9392738 3811443 -598813 -1341474 -1675561 -2660441 -1883326 -898620 -3606855
9230c606855l190301L556644Q616770M722509o84665K18207R41327m606430o292059
$$ -3606855 -6797156 -3240512 5376258 10098767 9414102 9632309 10573636 5967206 -324853
9221c24853M465535J3526234L335606j5663907j7602973r1370J4015639J1602525
$$ -324853 4140682 17666916 21002522 5338615 -12264358 -12355728 1659911 13262436
9213A3262436K217573l854014p331136q079208l219825P99707m887129j1418457
$$ 13262436 15480009 11625995 4294859 -3784349 -7004174 -6204467 -11091596 -22510053
9205b2510053j577412J8743557K3544270O301195r284332o549590J914860J184305
$$ -22510053 -24087465 -5343908 18200362 24501557 15217225 8667635 10582495 11766800
9197A1766800k155577P38126P45678j0289223j9145149j1257011L572128P136683
$$ 11766800 9611223 10349349 11095027 805804 -18339345 -29596356 -26024228 -18887545
9189a8887545K347303M323073J1273388Q209894m563230r894323j510216O882073
$$ -18887545 -16540242 -12217169 -943781 7266113 2702883 -7191440 -8701656 -1819583
9181a819583M399831j918325j709416J957184j91807o920166o910954M633732
$$ -1819583 2580248 661923 -1047493 909691 717884 -6202282 -13113236 -8479504
9173h479504J6821643J5123090O51943r663762n179748M378036M862261p16955
$$ -8479504 8342139 23465229 24117172 14453410 9273662 13651698 18513959 17797004
9165A7797004k93768M126859O09539p883828n757545N424496M636262j2558144
$$ 17797004 17503236 21630095 22239634 14355806 8598261 14022757 18659019 6100875
9157F100875k1489876o748652J1309729Q910906l659878k348053R752607J0904223
$$ 6100875 -15389001 -22137653 -10827924 -1917018 -5576896 -7924949 1827658 12731881
9149A2731881n88862o413841k135910j905485r483785j1525391k908900N261487
$$ 12731881 12143019 5729178 3593268 1687783 -7796002 -19321393 -22230293 -16968806
9141a6968806P170114R444237J2273709N925602p503210j1204224j168518N146547
$$ -16968806 -9798692 -354455 11919254 17844856 10341646 -862578 -2031096 3115451
9133C115451j609010o331320K677932J0373267m36229j7548257j6230643K459296
$$ 3115451 1506441 -4824879 -2146947 8226320 7790091 -9758166 -25988809 -23529513
9125b3529513J4797296J1188485N330040O036578M028460o266543j3047906p440944
$$ -23529513 -8732217 2456268 7786308 13822886 17851346 11584803 -1463103 -8904047
9117h904047l99777l754469p931828J710320J5313512R828185j1147895j5772976
$$ -8904047 -9303824 -13058293 -20990121 -19279801 -3966289 5861896 -5285999 -21058975
9109b1058975Q685325L1834512K1873913q226566k1317220r742428J773525J335291
$$ -21058975 -12373650 19460862 41334775 33108209 11790989 2048561 3822086 5157377
9101E157377L611667J3738949J2184539q784792k3365102r890386J2923045J4044346
$$ 5157377 8769044 22507993 34692532 25907740 2542638 -7347748 5575297 19619643
9093A9619643l108761j1212427m030401P59739k227947M79954J0364582J0014606
$$ 19619643 16510882 5298455 1268054 2027793 -200154 279800 10644382 20658988
9085B0658988n394202j5681993n917965J1454528J6532767P558689m241890j1237992
$$ 20658988 15264786 -417207 -6335172 5119356 21652123 29210812 24968922 13730930
9077A3730930j0684001j983540P853052P013192m766707j3172483r207119m95319
$$ 13730930 3046929 1063389 8916441 15929633 11162926 -2009557 -11216676 -11711995
9069a1711995L791742O228243J0942885J2796794O975785r23449l889300l328170
$$ -11711995 -7920253 -1692010 9250875 22047669 29023454 28100005 24210705 20882535
9061B0882535k178081J247422M946906J006000r481829j2601860l288054L508085
$$ 20882535 18704454 19951876 24898782 25904782 16422953 3821093 533039 4041124
9053D041124l482512j1840068o348901L796459M23637j0944900q922166P514693
$$ 4041124 558612 -11281456 -17630357 -13833898 -13410261 -24355161 -33277327 -25762634
9045b5762634J6350353P527583l443052k696194K685323J880305j381818M78355
$$ -25762634 -9412281 -1884698 -5327750 -8023944 -5338621 -3458316 -4840134 -4361779
9037d361779M054661L257504J787639N300526R284338O229722j141889m302893
$$ -4361779 -307118 2950386 4738025 10038551 19322889 25552611 24410722 20107829
9029B0107829j975815N50291J063095N93810k170810p665170j0062190m652854
$$ 20107829 18132014 18682305 19745400 20339210 18168400 10503230 441040 -4211814
9021d211814K024484j57130q381530r425975J79933Q342208N849703o29618j425066
$$ -4211814 -2187330 -2344460 -10725990 -20151965 -19972032 -11629824 -5780121 -6409739 -7834805
9012g834805j07906n762622j4737852j3361953J243256J4911651J4699270M372099
$$ -7834805 -7942711 -13705333 -28443185 -41805138 -40561882 -25650231 -10950961 -6578862
9004f578862l593817m353684k324836j209774J36445L304696P348954R900858
$$ -6578862 -10172679 -14526363 -16851199 -18060973 -17924528 -14619832 -7270878 2629980
8996B629980Q305387J721101n239652n099263J972698N350087j821772j0913117
$$ 2629980 10935367 12656468 7416816 2317553 4290251 9640338 7818566 -3094551
8988c094551r638003j025342J969316j621788j01974P942020Q121314m430996
$$ -3094551 -12732554 -13757896 -11788580 -13410368 -13512342 -5570322 2550992 -1880004
8980a880004j1836426n7557J5394901J0217990j0463686j7761101k008317J3488572
$$ -1880004 -13716430 -13773987 1620914 11838904 1375218 -16385883 -18394200 -4905628
8972d905628Q465618n648755o810823L740159P330573p56674o113188j090909
$$ -4905628 3559990 -2088765 -8899588 -5159429 2171144 1414470 -4698718 -5789627
8964e789627K763599n192345j5984604j3361056K546655J5327950J3778570L422105
$$ -5789627 -3026028 -8218373 -24202977 -37564033 -35017378 -19689428 -5910858 -2488753
8956b488753m002924l831521J776227R702951J5580037J2906432L90931j1881346
$$ -2488753 -6491677 -10323198 -8546971 1155980 16736017 29642449 30033380 18152034
8948A8152034j1962258k236678K302993n191384j3164263q477557M273378J0447343
$$ 18152034 6189776 3953098 6256091 1064707 -12099556 -20577113 -16303735 -5856392
8940e856392P502229O155217R669482O954876p527586k0063613j5305892Q78754
$$ -5856392 1645837 7801054 17470536 24425412 16897826 -3165787 -18471679 -17592925
8932a7592925R657633N680452N10778O50532j528285j0164375j4224390l760488
$$ -17592925 -7935292 -2254840 -1744062 -1093530 -2621815 -12786190 -27010580 -30771068
8924c0771068J2274942J6673499O893733m125292o801035l353198J184832N126844
$$ -30771068 -18496126 -1822627 5071106 945814 -5855221 -9208419 -8023587 -2896743
8916b896743O189093J551220n239495n991583j5060L266076j677046o973291k214680
$$ -2896743 3292350 4843570 -395925 -6387508 -6402568 -3136492 -4813538 -11786829 -14001509
8907a4001509R709844J4572924L856547j4408803k2732283j1695983R034969J9072298
$$ -14001509 -4291665 10281259 14137806 -270997 -23003280 -34699263 -25664294 -6591996
8899f591996R535798n959108q062862L684674J2074945O944610l196026p077946
$$ -6591996 2943802 -3015306 -11078168 -7393494 4681451 11626061 8430035 1352089
8891A352089o020793o515344p580161m698129O11954M040042N845713O943410
$$ 1352089 -4668704 -11184048 -18764209 -23462338 -22850384 -18810342 -12964629 -6021219
8883f021219L375884o256436j2809095o315104Q876186J8081448J4119807L196250
$$ -6021219 -2645335 -8901771 -21710866 -28025970 -19149784 -1068336 13051471 16247721
8875A6247721n563112q513201o085890l70040N012597P065009N416994O43215
$$ 16247721 10684609 2171408 -3914482 -4284522 728075 7793084 13210078 13853293
8867A3853293n639035p674572l90516R187210O085577j0018228j8740296o977866
$$ 13853293 8214258 539686 149170 9336380 15421957 5403729 -13336567 -20314433
8859b0314433R558763R139317k597996l511399P639292J0067090l004887j3111227
$$ -20314433 -10755670 -1616353 -4214349 -7725748 -86456 9980634 6975747 -6135480
8851f135480p562883J796017J396426k946851j443780L19462o076344j2627265
$$ -6135480 -13698363 -11902346 -10505920 -13452771 -14896551 -14577089 -20653433 -33280698
8843c3280698n950712R731479J7122905J0228524M89949p65787M864786Q595754
$$ -33280698 -39231410 -29499931 -12377026 -2148502 -1658553 -2424340 2440446 11036200
8835A1036200N425377k224113p922903p670506l778277q95199L57415J266264
$$ 11036200 16461577 14237464 6314561 -1355945 -5134222 -6029421 -5672006 -4405742
8827d405742q62317q202679j3759491q346815L813290R324216O563815P164115
$$ -4405742 -5268059 -13470738 -27230229 -35577044 -31763754 -22439538 -15875723 -8711608
8819h711608J3435508J2354720n29444r953936n439926R79243l175323q041287
$$ -8711608 4723900 17078620 16549176 6595240 1155314 2134557 -1040766 -9082053
8811i082053k87503R907487M737102q589294p943051N760619Q958418m803542
$$ -9082053 -9369556 537931 5275033 -3314261 -11257312 -5496693 3461725 -1341817
8803a341817j3415339k593063J1234988Q346778l685345m665611N874214J0164381
$$ -1341817 -14757156 -17350219 -6115231 2231547 -1453798 -6119409 -245195 9919186
8795I919186P06879r649979p121220N129571J2350394N921445p380314j2837983
$$ 9919186 10626065 976086 -6145134 -1015563 11334831 17256276 9875962 -2962021
8787b962021m282695Q034505R301708j130631r080478m673040N371436Q635231
$$ -2962021 -7244716 789789 10091497 8960866 -119612 -4792652 578784 9214015
8779I214015L416245k256594l506245k796191k715796j833386Q62240K540861
$$ 9214015 12630260 10373666 6867421 4071230 1355434 -477952 384288 2925149
8771B925149M02913l587896m636147j222107K747153K684449p82500k438810M89539
$$ 2925149 3328062 -259834 -4895981 -6118088 -3370935 -686486 -1468986 -3907796 -3418257
8762c418257L983136K344349l205512m778279J750348R776074R344137M56924
$$ -3418257 564879 2909228 -296284 -5074563 -3324215 6451859 15795996 16252920
8754A6252920o031604k696935M098922L124272n423949r954254m104720M579840
$$ 16252920 10221316 7524381 11623303 14747575 9323626 -630628 -4735348 -155508
8746a55508N969260M81993m235557m123768l36359N002588Q438516N403707k679257
$$ -155508 5813752 6295745 2060188 -2063580 -2399939 2602649 11041165 16444872 13765615
8737A3765615o865639l308613m82850m736381p230365J326812J0998920N887418
$$ 13765615 6899976 3591363 3108513 -1627868 -8858233 -7531421 3467499 9354917
8729I354917p851237q830724N265009J3440906N521780l085749M14810N758443
$$ 9354917 1503680 -7327044 -2062035 11378871 16900651 13814902 14229712 19988155
8721A9988155O69386p149953n285938J565552J526598m953592j0261916j2674897
$$ 19988155 20657541 13507588 8221650 9787202 11313800 6360208 -3901708 -16576605
8713a6576605j1025634L21163J7007538K0065433K580190j3813081q348355P455533
$$ -16576605 -27602239 -27281076 -10273538 9791895 12372085 -1440996 -9789351 -2333818
8705b333818J0017343J537341J024971P948690N016612p379537j0126872L52862
$$ -2333818 7683525 9220866 10245837 18194527 23211139 15831602 5704730 6057592
8697F057592N536916k732890r328411l127522N435608L596486n287248j1226169
$$ 6057592 11594508 8861618 -466793 -3594315 1841293 5437779 150531 -11075638
8689a1075638j0606882l637731P405502J3916472Q971935N61525J231391N983072
$$ -11075638 -21682520 -25320251 -17914749 -3998277 4973658 5535183 6766574 12749646
8681A2749646Q7633j2505652j2821849m35402L837112n497716q026267O119964
$$ 12749646 12837279 331627 -12490222 -12925624 -9088512 -14586228 -22612495 -16492531
8673a6492531J7585426J0621145j766531l671444k725597r421175j2476855J74715
$$ -16492531 1092895 11714040 9947509 6276065 3550468 -5870707 -18347562 -18172847
8665a8172847J4123614R200739o095002p908496M844543J1973037N526727k942118
$$ -18172847 -4049233 5151506 -943496 -8851992 -4007449 7965588 13492315 10550197
8657A0550197n325826m732098k096003M829130J0397787P124645P99422K308488
$$ 10550197 5224371 492273 -1603730 3225400 13623187 20747832 21547254 23855742
8649B3855742P707759M760966m215421o272803k354458n995593j6926044j8294336
$$ 23855742 31563501 36324467 32109046 25836243 23481785 17486192 560148 -17734188
8641a7734188m361666R621515J1217671N770990J015546m987009j2177712j1841836
$$ -17734188 -22095854 -12474339 -1256668 4514322 5529868 542859 -11634853 -23476689
8633b3476689j814105O177765M383843P79590L120417N144151K92798m072287
$$ -23476689 -25290794 -19113029 -14729186 -13949596 -10829179 -5685028 -5392230 -9464517
8625i464517L7237N374418K430251j682026M792259J4533910R789775p553880
$$ -9464517 -9427280 -4052862 -1622611 -3304637 1487622 16021532 25811307 18257427
8617A8257427j5505249m725209P744427N379102m183948m667262K632533L829288
$$ 18257427 2752178 -1973031 5771396 11150498 6966550 2299288 4931821 8761109
8609H761109l590291q224179m349402Q96457J676432J669958M005339M519449
$$ 8761109 5170818 -3053361 -7402763 -6506306 -4829874 -3159916 845423 5364872
8601E364872J086270l18636L762045O375366J398081n326011o006528m589937
$$ 5364872 6451142 6132506 9894551 16269917 17667998 12341987 6335459 1745522
8593A745522q179132j1011837k479163J1489686J2340347l334830j5965402r364426
$$ 1745522 -6433610 -17445447 -19924610 -8434924 3905423 570593 -15394809 -24759235
8585b4759235Q062441J6586523R558486l857959j2451083j1193024j530432R192194
$$ -24759235 -16696794 -110271 9448215 5590256 -6860827 -18053851 -19584283 -10392089
8577a0392089J2449114P393459R58523k947563p362142j2915584j3722751p375170
$$ -10392089 2057025 9450484 10409007 7461444 99302 -12816282 -26539033 -33914203
8569c3914203l21939K232237L511327O873970R157019Q137313P480899Q137731
$$ -33914203 -34236142 -32003905 -28492578 -21618608 -12461589 -4324276 3156623 11294354
8561A1294354M729400k838945n381587j80813J421348p495131j5746992j1639356
$$ 11294354 16023754 13184809 7803222 7622409 9043757 1548626 -14198366 -25837722
8553b5837722k260244J68275R8009Q212905J7843687J3363006j855500p793837
$$ -25837722 -28097966 -27929691 -27831682 -19618777 -1775090 11587916 9732416 1938579
8545A938579J396249R253941L483952p388858j0135337m843136P39949L799648
$$ 1938579 3334828 12588769 16072721 8683863 -1451474 -6294610 -5554661 -1755013
8537a755013N983464P552151P202722L480571m371331j2450914j2306358k339491
$$ -1755013 4228451 11780602 18983324 22463895 18092564 5641650 -6664708 -9004199
8529i004199N706756J783833o342613n001910K731444K941513l989469l770713
$$ -9004199 -3297443 -1513610 -7856223 -12858133 -10126689 -7185176 -11174645 -14945358
8521a4945358O093515J1624722O905323K617869L817772K25021j1228724j4524454
$$ -14945358 -8851843 2772879 9678202 12296071 16113843 16338864 5110140 -9414314
8513i414314j0188J5174865J0059521q692907j6706532n794107R345213J4053037
$$ -9414314 -9424502 5750363 15809884 7116977 -9589555 -15383662 -6038449 8014588
8505H014588P750941k996253j1722131j2354303l440941P002130R030283K869870
$$ 8014588 15765529 12769276 1047145 -11307158 -14748099 -7745969 1284314 4154184
8497D154184l359590n897499p188278p100165j715809P806654J3172363R381703
$$ 4154184 794594 -5102905 -12291183 -19391348 -21107157 -13300503 -128140 9253563
8489I253563K295011J383743O622477P243128l646814j6088686j2832631N544566
$$ 9253563 11548574 12932317 19554794 26797922 23151108 7062422 -5770209 -225643
8481b25643J5681934J779022j8505111j6071943O393831J6500967M32448j6548136
$$ -225643 15456291 17235313 -1269798 -17341741 -10947910 5553057 5985505 -10562631
8473a0562631r963015P459598R644826j152824k789140P577070J1193656J634517
$$ -10562631 -20525646 -13066048 -3421222 -4574046 -7363186 213884 11407540 13042057
8465A3042057o119900l514175r39277n284541o562388K229836R803659M571361
$$ 13042057 6922157 3407982 2468705 -2815836 -9378224 -7148388 2655271 7226632
8457G226632n512779n457058L651644Q080178K608964m264839m017141K675951
$$ 7226632 1713853 -3743205 -91561 7988617 10597581 6332742 2315601 4991552
8449D991552R393254R913433K290848q001592j1757472p058617k301053l823735
$$ 4991552 14384806 24298239 26589087 18587495 6830023 -228594 -2529647 -6353382
8441f353382o667623m013832R12234J372309j72116K925251P495107M326309n006573
$$ -6353382 -13021005 -17034837 -16122603 -14750294 -14922410 -11997159 -4502052 -175743 -5182316
8432e182316q254026j288159N686741M571527K99572k02512J032823L71828R32107
$$ -5182316 -13436342 -14724501 -9037760 -4466233 -4166661 -4369173 -3336350 -2964522 -2032415
8423b032415M881209O209011R72153l304090M33664M892658k97217r457441q405379
$$ -2032415 2848794 9057805 10029958 6725868 7159532 12052190 11754973 2297532 -6107847
8414f107847K333671Q523076N573291L381656N998223M755477l079840o874921
$$ -6107847 -3774176 4748900 10322191 13703847 19702070 24457547 21377707 14502786
8406A4502786k286794j119312j0095781j5886351o208990P687935P124102n376411
$$ 14502786 12215992 11096680 1000899 -14885452 -21094442 -13406507 -6282405 -11658816
8398a1658816j1679865n248141M994908J2436614J6459352J2773628j074727j3101866
$$ -11658816 -23338681 -28586822 -23591914 -11155300 5304052 18077680 17002953 3901087
8390C901087q970402M387338O694659m335804j0624675m401667J625211m2330
$$ 3901087 -5069315 -681977 6012682 1676878 -8947797 -13349464 -11724253 -11766583
8382a1766583M00319P069565O784498n560372j1738181J394478J6837741J2449967
$$ -11766583 -11366264 -4296699 2487799 -3072573 -14810754 -13416276 3421465 15871432
8374A5871432l868895q245598O09352L447001m117751n684474M943908J2138850
$$ 15871432 12002537 3756939 4366291 7813292 3695541 -1988933 2954975 15093825
8366A5093825M906086n908715o855950j795338j355477n146909n922984k418582
$$ 15093825 19999911 14091196 7235246 5439908 4084431 -1062478 -6985462 -9404044
8358i404044J990160O181024Q465012M330165m714189q090564j615200K382300
$$ -9404044 -7413884 -1232860 7232152 11562317 6848128 -1242436 -2857636 -475336
8350d75336o801043j7185421q636520J3818367K1679892L543944j5614880r265336
$$ -475336 -7276379 -24461800 -33098320 -19279953 2399939 5943883 -9670997 -18936333
8342a8936333J1640232J4534152p004474k4374493j5076815Q325612J9792378
$$ -18936333 -7296101 7238051 233577 -24140916 -39217731 -30892119 -11099741
8335a1099741J3789779L978505m74809j213746M78049N421989R084380N661550
$$ -11099741 2690038 6668543 6193734 4979988 5458037 10880026 19964406 25625956
8327B5625956j189278l356678k386487n945462j1585324q864557J312298N262208
$$ 25625956 24436678 21080000 18693513 12748051 1162727 -7701830 -6389532 -1127324
8319a127324j575543o676057r29103P144107O281169r61619o117359p907554p159895
$$ -1127324 -2702867 -9378924 -10308027 -3163920 3117249 2155630 -3961729 -11869283 -19029178
8310a9029178L68650J3918978K0001266Q788538q329141j1828110p52814P279135
$$ -19029178 -18660528 -4741550 15259716 24048254 15719113 3891003 3138189 10417324
8302A0417324J118374j1269825j5784625q111620M594358J1374313O891972k381051
$$ 10417324 11535698 265873 -15518752 -23630372 -19036014 -7661701 -769729 -3150780
8294c150780m131097L736359Q908913K228869q423146j0532801n385062k581168
$$ -3150780 -7281877 -3545518 5363395 7592264 -830882 -11363683 -16748745 -19329913
8286a9329913k672803R91989P057893P270215J655316q00264K821200N376276
$$ -19329913 -22002716 -21010727 -13952834 -6682619 -5027303 -5827567 -3006367 2369909
8278B369909J698456n380383j1297559j3112052q117469J493606N655864r90365
$$ 2369909 4068365 -1312018 -12609577 -25721629 -33839098 -32345492 -26689628 -27679993
8270b7679993p725066k185639Q589020Q488388J27443J088646J2021151J2749117
$$ -27679993 -35405059 -37590698 -29001678 -20513290 -20385847 -19297201 -7276050 5473067
8262E473067l169303j4232945m314385J1032188R325843m424546q760409M6489
$$ 5473067 2303764 -11929181 -16243566 -5211378 4114465 -310081 -9070490 -9024001
8254i024001O556555L146624k073145k933618k724627k612443J889258R365356
$$ -9024001 -2467446 679178 -1393967 -4327585 -7052212 -9664655 -7775397 1589959
8246A589959J0219074P92509r692340j0732819k105796Q905625J5198850J2671454
$$ 1589959 11809033 12601542 2909202 -7823617 -9929413 -1023788 14175062 26846516
8238B6846516K261752q063314r440751l014281Q66010l074901p716310m590175
$$ 26846516 29108268 21044954 11604203 8589922 9455932 6381031 -1335279 -5925454
8230e925454L367113O297816J489515l962227m183704j610675p12577k14374L180246
$$ -5925454 -2558341 3739475 5228990 1266763 -2916941 -4527616 -5240193 -5454567 -2274321
8221b274321O428645K824760o462889j1011305n033068L791339N230077P42750
$$ -2274321 4154324 6979084 516195 -10495110 -15528178 -11736839 -6506762 -5764012
8213e764012j093655R49269J022150j190949K54258N012405M903578k211177q219244
$$ -5764012 -6857667 -5908398 -4886248 -6077197 -5822939 -810534 4093044 1881867 -6337377
8204f337377q351359p389155p080873l30698J3529598K0489657J1156852k492766
$$ -6337377 -14688736 -22077891 -29158764 -29489462 -15959864 4529793 15686645 13193879
8196A3193879m383845P04832k742319j2127821r436113P297534J6969824O253106
$$ 13193879 8810034 9514866 6772547 -5355274 -14791387 -7493853 9475971 15729077
8188A5729077j1110813j5909200q972845k438045K049257J0541026J9366399J7152090
$$ 15729077 4618264 -11290936 -20263781 -22701826 -20652569 -10111543 9254856 26406946
8180B6406946L149236r966082j2989505r113315m192432J389310P053025P389614
$$ 26406946 29556182 19590100 6600595 -2512720 -6705152 -5315842 1737183 9126797
8172I126797p1443q168729q231140j885586J696808j050766m095958j727836L204418
$$ 9126797 9055354 886625 -7344515 -9230101 -7533293 -8584059 -12680017 -14407853 -11203435
8163a1203435M187428P70045j046333K288918O469456M937174j852659n905130
$$ -11203435 -7016007 -6245962 -7292295 -5003377 1466079 6403253 4550594 -1354536
8155a354536j435725P045310R391000K560419m958417m254127J239660j75533
$$ -1354536 -2790261 4255049 13646049 16206468 11248051 6993924 8233584 8058051
8147H058051j0899542j7129021n120744J8838980L2244569K1319992l780336k1564410
$$ 8058051 -2841491 -19970512 -25091256 -6252276 25992293 47312285 43531949 21967539
8139B1967539k1876630j1353748n17311O652658J0067195Q393180J636816m921656
$$ 21967539 90909 -11262839 -11780150 -5127492 4939703 13332883 14969699 10048043
8131A0048043n138469J93839M291964L235770k94718k783127m427637n561390
$$ 10048043 4909574 5103413 9395377 12631147 12336429 9553302 5125665 -435725
8123d35725l669107J390327L573128j211144o247938k100992P562114R057038
$$ -435725 -4104832 -2714505 858623 -352521 -6600459 -8701451 -1139337 7917701
8115G917701l28608o504859r5017P941947L304295q214576r292828J623564Q359491
$$ 7917701 7589093 1084234 989217 8931164 12235459 4020883 -5271945 -3648381 4711110
8106D711110K514094n525297n345006j258792o93948o23399M212810R178036O947890
$$ 4711110 7225204 1699907 -3645099 -4903891 -5597839 -6221238 -2008428 7169608 14117498
8097A4117498J39568l760954m691301o945595q551464m716766J304428J901201
$$ 14117498 14257066 10496112 5804811 -1140784 -9692248 -14409014 -13104586 -11203385
8089a1203385k099848l093502j76732L7442l627978m245460R10135N589407N105692
$$ -11203385 -13303233 -16396735 -16573467 -16536025 -20164003 -24409463 -23499328 -17909921 -12804229
8080a2804229K410129M32066k492449n621614l407507M611800R754835O076720
$$ -12804229 -10394100 -9962034 -12454483 -18076097 -21483604 -16871804 -7116969 -1040249
8072a040249q88081l320878k037950j674672j935788j191003k187600n557171
$$ -1040249 -1928330 -5249208 -7287158 -8961830 -10897618 -12088621 -14276221 -19833392
8064a9833392l916828P121837J7130861J2500197k424196r081258n37239R103922
$$ -19833392 -23750220 -16628383 502478 13002675 10578479 1497221 959982 10063904
8056A0063904N334033p372502j3519520o889741M166942Q387941L456570k746710
$$ 10063904 15397937 8025435 -5494085 -12383826 -8216884 171057 3627627 880917
8048H80917j227520O536110Q299180l025442j6503717j5212171K25616J1696156
$$ 880917 -346603 6189507 14488687 11463245 -5040472 -20252643 -20027027 -8330871
8040h330871Q628307M4222k729956j519651j543939J30649M775514L018795r440154
$$ -8330871 297436 341658 -2388298 -3907949 -5451888 -5321239 -545725 2473070 -6967084
8031f967084j7723764p534254R075731R236404l850150m514467J3306811K4184302
$$ -6967084 -24690848 -32225102 -23149371 -13912967 -17763117 -22277584 -8970773 15213529
8023A5213529J0804377q932072j0587019O46952L173539n290474q555074j781328
$$ 15213529 26017906 17085834 6498815 7145767 10319306 5028832 -3526242 -5307570
8015e307570K597175j487030m239801J675012Q968849P988659M4231p059862q850406
$$ -5307570 -2710395 -4197425 -8437226 -6762214 2206635 10195294 10239525 3179663 -5670743
8006e670743n707529q75880J149402l05693L78822N824921P530920k163540j3233990
$$ -5670743 -11378272 -12254152 -11104750 -11410443 -11031621 -5206700 2324220 160680 -13073310
7997a3073310q339072R557161J7446336N411139q067270m138685Q738587R913613
$$ -13073310 -21412382 -11855221 5591115 11002254 2934984 -1203701 7534886 17448499
7989A7448499k129795j0888940p969316o78867M510679R626287J4356589J1869794
$$ 17448499 15318704 4429764 -3539552 -4218419 292260 9918547 24275136 36144930
7981C6144930Q03676q977050q861387k722050o9017l137220o298058n350581k434952
$$ 36144930 36948606 27971556 19110169 16388119 16319102 13181882 6883824 1533243 -901709
7972i01709k049447m882215o595749l088476L389757N967388K365343j257669
$$ -901709 -2951156 -7833371 -14429120 -17517596 -14127839 -8160451 -5795108 -7052777
7964g052777R11014N233702L565084m884578j2460571j3014662p684737j179023
$$ -7052777 -6141763 -908061 2657023 -2227555 -14688126 -27702788 -35387525 -36566548
7956c6566548L014653M264798N534561J0487464J5841422J1459012m406486j5561734
$$ -36566548 -33551895 -29287097 -23752536 -13265072 2576350 14035362 9628876 -5932858
7948e932858o386810J2600002J4447263n833627k0818174q807794J3954592J6397173
$$ -5932858 -12319668 280334 14727597 8893970 -11924204 -20731998 -6777406 9619767
7940I619767k704983j4879930m439159J1353141J0811090j906213p794922k425257
$$ 9619767 6914784 -7965146 -12404305 -1051164 9759926 7853713 58791 -2366466
7932b366466J555245k818697o876152j759168P659649J0853697O709766K452958
$$ -2366466 -811221 -3629918 -10506070 -12265238 -4605589 6248108 12957874 15410832
7924A5410832O04034l892715j2030742j4742220n003160Q936792J1447468J78862
$$ 15410832 16014866 12122151 91409 -14650811 -19653971 -10717179 730289 909151
7916I09151j0292289q396795n12764M09834n652031p127405J172231J1085913
$$ 909151 -9383138 -17779933 -18292697 -17882863 -23534894 -30662299 -29490068 -18404155
7908a8404155J2716684N480738l784068p725277k852005O900781J0809255K528234
$$ -18404155 -5687471 -206733 -3990801 -11716078 -14568083 -7667302 3141953 5670187
7900E670187r240988r746259J259060Q426556L332957l886723k046371L787749
$$ 5670187 -3570801 -13317060 -12058000 -3631444 -298487 -4185210 -6231581 -2443832
7892b443832L000056k316526l064217l41396k276592p400064o273832J175965
$$ -2443832 556224 -1760302 -4824519 -5165915 -7442507 -14842571 -21116403 -19940438
7884a9940438M587881N98395k517476j27731K375364K294040N285928J2663575
$$ -19940438 -15352557 -14754162 -17271638 -17399369 -15024005 -12729965 -7444037 5219538
7876E219538J5668619R490870J498991j980265n460210j2173031j4099587n444118
$$ 5219538 20888157 30379027 31878018 29897753 24437543 12264512 -1835075 -7279193
7868g279193M396888M262821j325918k013849l85662m457712q201834N85419J5169030
$$ -7279193 -2882305 1380516 54598 -1959251 -2344913 -6802625 -15004459 -14419040 749990
7859G49990J3923354o576809k1738164j1143082J3910052K5703698J3097031j0484127
$$ 749990 14673344 8096535 -13641629 -24784711 -10874659 14829039 27926070 17441943
7851A7441943k4701513j9293837N67914J7711868J6281692j206196j4074235p163400
$$ 17441943 -7259570 -26553407 -25985493 -8273625 8008067 6801871 -7272364 -14435764
7843a4435764J0128555J6131714M815559q069922p106391L512812P782708P0431
$$ -14435764 -4307209 11824505 16640064 8570142 1463751 4976563 12759271 12829702
7835A2829702p953555l886889P804398J1259805J031638j0100255q944016K31464
$$ 12829702 4876147 989258 8793656 20053461 21085099 10984844 2040828 2272292
7827B272292L425605k854944r147670q407565l234582K228908P416101J0698552
$$ 2272292 5697897 2842953 -6304717 -14712282 -17946864 -15717956 -8301855 2396697
7819B396697Q791620L039745j700273n507826j1704113j6148424r888371M601882
$$ 2396697 11188317 14228062 12527789 7019963 -4684150 -20832574 -30720945 -26119063
7811b6119063J2274801O110787k687867j872782N431523R193891O906873J323268
$$ -26119063 -13844262 -7733475 -10421342 -12294124 -6862601 2331290 9238163 10561431
7803A0561431n689700q402038J634664J8856792K1428417Q09486j8941221j1253769
$$ 10561431 4871731 -3530307 -1895643 16961149 38389566 39199052 20257831 9004062
7795I004062J3057976J9861138J029630j6890364j5036883n873081n369207o787620
$$ 9004062 22062038 41923176 42952806 26062442 11025559 5152478 -216729 -7004349
7787g004349J375231J0673761O517939n437867p594407J404353O519370J874610
$$ -7004349 -5629118 5044643 11562582 6124715 -1469692 -65339 6454031 8328641
7779H328641k186596R33090L791643l82147o112378n692678p69311K986192M738334
$$ 8328641 6142045 7075135 10866778 10484631 4372253 -1320425 -2089736 896456 5634790
7770E634790N246233J874104n665555j0385956o943665j005475j098625m566203
$$ 5634790 10881023 12755127 7089572 -3296384 -10240049 -11245524 -12344149 -16910352
7762a6910352j605643P963688J2842662P155560p99942j388495K990334L831764
$$ -16910352 -18515995 -10552307 2290355 9445915 8645973 7257478 10247812 14079576
7754A4079576j96596l314800k430036J06224J683497J485497j226088n594138
$$ 14079576 13882980 10568180 8138144 8244368 9927865 11413362 10187274 4593136
7746D593136p318445l552876J510678J141576m687437r417610q360763k506857
$$ 4593136 -2725309 -6278185 -4767507 -3625931 -8313368 -17730978 -26091741 -28598598
7738b8598598M517610Q348713N045049l463372p306632M56158J2352420J4188396
$$ -28598598 -24080988 -15732275 -10687226 -14150598 -21457230 -21001072 -8648652 5539744
7730E539744L607408p885104j1359023q974126m912112J115369P492035Q136134
$$ 5539744 9147152 1262048 -10096975 -19071101 -23983213 -22867844 -15375809 -7239675
7722g239675K073570k704726o35182L582254L860899J847911J285136O71604j713457
$$ -7239675 -5166105 -7870831 -8506013 -4923759 -1062860 785051 2070187 2741791 1028334
7713A028334k051357K633423P786123P580026K886512k562553q053475j2068480
$$ 1028334 -1023023 1610400 9396523 16976549 19863061 17300508 9247033 -2821447
7705b821447r316122J023459R821288Q475460K27479n762721o621360n355640
$$ -2821447 -12137569 -11114110 -1292822 7182638 7410117 1647396 -4973964 -10329604
7697a0329604l644150k046413k271154k834719J498070R590751J0972886R30103
$$ -10329604 -13973754 -16020167 -18291321 -21126040 -19627970 -10037219 935667 1865770
7689A865770r656337r095430j407826K695479K972159M824844M917401k955438
$$ 1865770 -7790567 -16885997 -18293823 -15598344 -12626185 -7801341 -2883940 -5839378
7681e839378j2461220j1015851P78962J0190339J0742855O104552j197183j0015939
$$ -5839378 -18300598 -29316449 -28537487 -18347148 -7604293 -1499741 -2696924 -12712863
7673a2712863j2405635j805491J1780428J1813557L21355m635576K579471Q181305
$$ -12712863 -25118498 -26923989 -15143561 -3330004 -3008649 -7644225 -5064754 3116551
7665C116551L440982l235884m231902l862216m323229Q71877J0137249Q926494
$$ 3116551 6557533 3321649 -910253 -4772469 -9095698 -8223821 1913428 10839922
7657A0839922o335466j6605113p245122Q355011R126510k146957o572988M20868
$$ 10839922 4504456 -12100657 -19345779 -10990768 -1864258 -4011215 -10584203 -10163335
7649a0163335O421216N349069M013351N594646L906028k834917o697833l246558
$$ -10163335 -3742119 1606950 5620301 11214947 15120975 12286058 5588225 2341667
7641B341667R85686n37061m581918m922867k288925j419991k243587k89698M994661
$$ 2341667 3327353 2790292 -1791626 -6714493 -9003418 -10423409 -12666996 -12956694 -7962033
7632g962033P624885K846108n351304q180728l196138K683056K735391j602981
$$ -7962033 -337148 2508960 -2842344 -11023072 -14219210 -11536154 -8800763 -10403744
7624a0403744n325744o978071o186917j68220R553095J2853287M046619n734844
$$ -10403744 -15729488 -22707559 -28894476 -29062696 -19509601 -6656314 -2609695 -8344539
7616h344539k456909Q107966P862230m405401j0332892j880836O153399J849673
$$ -8344539 -10801448 -2693482 5168748 763347 -9569545 -11450381 -5296982 -3447309
7608c447309m694095q52733O218021L171892n729913o309672J597362N256810
$$ -3447309 -8141404 -8994137 -2776116 395776 -5334137 -11643809 -10046447 -4789637
7600d789637L60377m094934j298840N035818P762949L476718n640874j1305333
$$ -4789637 -4429260 -8524194 -9823034 -4787216 2975733 6452451 811577 -10493756
7592a0493756n533975O705571R718158n11389p617699r9452P761675j943965j8335491
$$ -10493756 -16027731 -9322160 395998 -115391 -7733090 -7832542 -70867 -2014832 -20350323
7583b0350323j5160304P550511K0985024R882520o810684o905126M033157O990732
$$ -20350323 -35510627 -27960116 -6975092 2907428 -3903256 -10808382 -6775225 215507
7575B15507r7088l619644J431137N167384M35848o008293m271695L905656P365525
$$ 215507 118419 -3501225 -2070088 3097296 3533144 -2475149 -6746844 -2841188 4524337
7566D524337J016123o852587o360203r56241k125285r553782q640283O493423
$$ 4524337 5540460 -1312127 -7672330 -8628571 -10753856 -20307638 -28947921 -22454498
7558b2454498J9976536J5800232K215370j574268L944225J486361j1275194j5674823
$$ -22454498 -2477962 13322270 15537640 13963372 17907597 19393958 8118764 -7556059
7550g556059l522666O934355p07097j3784172r398649R919601J9434698Q450763
$$ -7556059 -11078725 -4144370 -4851467 -18635639 -28034288 -18114687 1320011 9770774
7542I770774n546637l474542R275675J2951924J388177j1664068j2656927m492830
$$ 9770774 4224137 749595 10025270 22977194 24365371 12701303 44376 -4448454
7534d448454J080053J27225j660994o87103k96684k808042m364327j404693L441913
$$ -4448454 -3368401 -3241176 -4902170 -5589273 -5885957 -8693999 -13058326 -14463019 -11021106
7525a1021106N840045N119803J793402m087091p883407j643219J2298205J6852120
$$ -11021106 -5181061 -61258 1732144 -2354947 -10238354 -11881573 416632 17268752
7517A7268752M16921k3282786k8464978r382839J3054769J8300796Q454008p95735
$$ 17268752 17685673 -5597113 -34062091 -43444930 -30390161 -12089365 -3635357 -4431092
7509d431092k001823j049334m485476r152970o434072N356116J6474753J6690067
$$ -4431092 -6432915 -7482249 -11967725 -21120695 -27554767 -22198651 -5723898 10966169
7501A0966169Q220211J151163k787776j0818889k0944131j7643521M546706K5658268
$$ 10966169 19186380 20337543 17549767 6730878 -14213253 -31856774 -27310068 -1651800
7493a651800K3050661J538064j4450947j3165914m245137J074846J971602R36663
$$ -1651800 21398861 22936925 8485978 -4679936 -8925073 -7850227 -5878625 -4941962
7485d941962p21610J72502M492173N672077M62382o97586J0344268J9388624O823181
$$ -4941962 -5663572 -5491070 -998897 4673180 5135562 4437976 14782244 34170868 40994049
7476D0994049j8358949k5785112o979192J3056203J3306775J872282n247817p234062
$$ 40994049 22635100 -3150012 -10129204 2926999 16233774 18106056 12858239 5624177
7468E624177p960254l594508M583478L538852r714200j6676218m472244J1252349
$$ 5624177 -2336077 -5930585 -1347107 2191745 -7522455 -24198673 -28670917 -17418568
7460a7418568Q971374o485364j3807317o937037K437404O530547P453255O895831
$$ -17418568 -8447194 -14932558 -28739875 -35676912 -33239508 -26708961 -19255706 -12359875
7452a2359875N279982O100114Q611050M246257p247769j0013037L306658J2480625
$$ -12359875 -7079893 -979779 7631271 11877528 4629759 -5383278 -2076620 10404005
7444A0404005k461969k4882834k0650995J0306741L0671059J7614550q520603
$$ 10404005 7942036 -16940798 -37591793 -27285052 3386007 21000557 12479954
7437A2479954j6917965n714182M917595L735158k607051m143166N61963N360791
$$ 12479954 -4438011 -10152193 -5234598 -1499440 -4106491 -8249657 -7687694 -2326903
$$ [...]
##END NTUPLES=NMR SPECTRUM
##END=
