##TITLE=31Pdec_SR28_4
 CDCl3, 24 sc
 24.12.2020
##JCAMPDX= 6.0         $$ Bruker NMR JCAMP-DX V2.0
##DATA TYPE= NMR SPECTRUM
##DATA CLASS= NTUPLES
##ORIGIN= UXNMR, Bruker Analytische Messtechnik GmbH
##OWNER= root
$$ XWIN-NMR		Version 3.5
$$ Thu Dec 24 12:23:15 2020 Russian Standard Time (UT+4h)  she@DPX200
##.OBSERVE FREQUENCY= 81.013821
##.OBSERVE NUCLEUS= ^31P
##.ACQUISITION MODE= SIMULTANEOUS
##.ACQUISITION SCHEME= undefined
##.AVERAGES= 24
##.DIGITISER RES= 17
##SPECTROMETER/DATA SYSTEM= spect
##.PULSE SEQUENCE= zgpg30
##.SOLVENT NAME= CDCl3
##.SHIFT REFERENCE= (INTERNAL, CDCl3, 0, 182.463)
##AUDIT TRAIL= $$ (NUMBER, WHEN, WHO, WHERE, WHAT)
$$ ##TITLE= Audit trail, XWIN-NMR		Version 3.5
$$ ##JCAMPDX= 5.01
$$ ##ORIGIN= Bruker BioSpin GmbH
$$ ##OWNER= she
$$ F:/spectra/data/she/nmr/P31/1/pdata/1/auditp.txt
$$ ##AUDIT TRAIL=  $$ (NUMBER, WHEN, WHO, WHERE, WHAT)
(   1,<2020-12-24 12:21:14.04 +0400>,<she>,<DPX200>,
      <created by zg, POWCHK disabled, PULCHK disabled
       configuration hash MD5:
       00 E9 B6 7A A2 85 ED C7 34 08 36 98 17 FE 4E 26
       data hash MD5: 32K
       4A 7E F9 91 AB 50 AC 7C 45 A4 6E 40 D0 FA 55 6F>)
(   2,<2020-12-24 12:21:17.87 +0400>,<she>,<DPX200>,
      <Start of raw data processing
       efp BC_mod = 2 LB = 1 FT_mod = 6 PKNL = 1 PHC0 = -2461.565 PHC1 = 63.20083 SI = 64K 
       data hash MD5: 64K
       43 13 84 9A 95 95 4D 2E 90 2A BE CC C9 9D 30 6D>)
(   3,<2020-12-24 12:21:35.50 +0400>,<she>,<DPX200>,
      <pk PHC0 = -188.5493 PHC1 = 515.1997 
       data hash MD5: 64K
       55 89 44 3F 9F 0B C7 F4 C6 C1 32 D6 80 E4 C7 2B>)
(   4,<2020-12-24 12:21:38.96 +0400>,<she>,<DPX200>,
      <abs ABSG = 5 
       data hash MD5: 64K
       B6 F5 30 24 08 16 13 59 6A 79 A5 1C AB 1E 01 A4>)
(   5,<2020-12-24 12:22:18.81 +0400>,<she>,<DPX200>,
      <pk PHC0 = 7.021641 PHC1 = -17.79998 
       data hash MD5: 64K
       FA 18 C1 11 9D D7 5B D5 63 F2 E8 A8 1B 73 9E B3>)
(   6,<2020-12-24 12:22:24.37 +0400>,<she>,<DPX200>,
      <abs ABSG = 5 
       data hash MD5: 64K
       ED 39 03 DD 18 94 23 57 5F 6D 7A 93 7D 96 C8 47>)
$$ ##END=
$$ 
$$ hash MD5
$$ DA F4 6F 85 28 DB E5 78 CF D9 EA 01 D1 DA D0 CE
##$RELAX= 
##$RELAX= 
##$RELAX= 
##$RELAX= 
##$RELAX= 
##$RELAX= 
##$RELAX= 
##$RELAX= 
$$ Bruker specific parameters
$$ --------------------------
##$DU= <F:/spectra>
##$EXPNO= 1
##$NAME= <P31>
##$PROCNO= 1
##$TYPE= <nmr>
##$USER= <she>
##$AMP= (0..31)
100 100 100 100 100 100 100 100 100 100 100 100 100 100 100 100 100 100 
100 100 100 100 100 100 100 100 100 100 100 100 100 100 
##$AQSEQ= 0
##$AQ_mod= 1
##$AUNM= <au_zg>
##$AUTOPOS= <>
##$BF1= 81.014009
##$BF2= 200.13
##$BF3= 200.13
##$BF4= 200.13
##$BF5= 200.13
##$BF6= 200.13
##$BF7= 200.13
##$BF8= 200.13
##$BYTORDA= 1
##$CFDGTYP= 0
##$CFRGTYP= 5
##$CHEMSTR= <none>
##$CNST= (0..31)
1 1 145 1 1 1 1 1 1 1 1 1 1 1 1 1 1 1 1 1 1 1 1 1 1 1 1 1 1 1 1 1 
##$CPDPRG= <waltz16>
##$CPDPRG1= <>
##$CPDPRG2= <waltz16>
##$CPDPRG3= <>
##$CPDPRG4= <mlev>
##$CPDPRG5= <mlev>
$$ [...]
##$SUBNAM3= <"">
##$SUBNAM4= <"">
##$SUBNAM5= <"">
##$SUBNAM6= <"">
##$SUBNAM7= <"">
##$SUBNAM8= <"">
##$SUBNAM9= <"">
##$SW= 369.568048894756
##$SWIBOX= (0..15)
0 1 3 0 0 0 0 0 0 0 0 0 0 0 0 0 
##$SW_h= 29940.119760479
##$TD= 32768
##$TD0= 1
##$TE= 0
##$TE2= 300
##$TE3= 300
##$TEG= 300
##$TL= (0..7)
0 120 53 12 22 120 120 120 
##$TP= (0..7)
150 150 150 150 150 150 150 150 
##$TP07= 0
##$TPNAME0= <>
##$TPNAME1= <>
##$TPNAME2= <>
##$TPNAME3= <>
##$TPNAME4= <>
##$TPNAME5= <>
##$TPNAME6= <>
##$TPNAME7= <>
##$TPOAL= (0..7)
0.5 0.5 0.5 0.5 0.5 0.5 0.5 0.5 
##$TPOFFS= (0..7)
0 0 0 0 0 0 0 0 
##$TUNHIN= 0
##$TUNHOUT= 0
##$TUNXOUT= 0
##$USERA1= <user>
##$USERA2= <user>
##$USERA3= <user>
##$USERA4= <user>
##$USERA5= <user>
##$V9= 5
##$VALIST= <valist>
##$VCLIST= <CCCCCCCCCCCCCCC>
##$VD= 0
##$VDLIST= <DDDDDDDDDDDDDDD>
##$VPLIST= <PPPPPPPPPPPPPPP>
##$VTLIST= <TTTTTTTTTTTTTTT>
##$WBST= 1024
##$WBSW= 4
##$XGAIN= (0..3)
0 0 0 0 
##$XL= 0
##$YL= 0
##$YMAX_a= 16785
##$YMIN_a= -18023
##$ZGOPTNS= <>
##$ZL1= 120
##$ZL2= 120
##$ZL3= 120
##$ZL4= 120
##$ABSF1= 182.463
##$ABSF2= -187.1042
##$ABSG= 5
##$ABSL= 3
##$ALPHA= 0
##$AQORDER= 0
##$ASSFAC= 0
##$ASSFACI= 0
##$ASSFACX= 0
##$ASSWID= 0
##$AUNMP= <proc_1d>
##$AZFE= 0.1
##$AZFW= 0.5
##$BCFW= 0
##$BC_mod= 2
##$BYTORDP= 0
##$COROFFS= 0
##$CY= -3
##$DATMOD= 1
##$DC= 0
##$DFILT= <>
##$DTYPP= 0
##$F1P= 0
##$F2P= 0
##$FCOR= 1
##$FTSIZE= 65536
##$FT_mod= 6
##$GAMMA= 0
##$GB= 0
##$INTBC= 1
##$INTSCL= 5.30512e-09
##$ISEN= 30
##$LB= 1
##$LEV0= 0
##$LPBIN= 0
##$MAXI= 10000
##$MC2= 0
##$MEAN= 0
##$ME_mod= 0
##$MI= 50
##$NCOEF= 0
##$NC_proc= -5
##$NLEV= 6
##$NOISF1= 182.463
##$NOISF2= 159.3651
##$NSP= 0
##$NTH_PI= 0
##$NZP= 0
##$OFFSET= 182.463
##$PC= 4
##$PHC0= -2643.092
##$PHC1= 560.6005
##$PH_mod= 1
##$PKNL= yes
##$PPARMOD= 0
##$PSCAL= 0
##$PSIGN= 0
##$REVERSE= no
##$SF= 81.014009
##$SI= 65536
##$SIGF1= 159.3651
##$SIGF2= -187.1042
##$SINO= 113.3802
##$SIOLD= 16384
##$SREGLST= <1H.CDCl3>
##$SSB= 0
##$STSI= 65536
##$STSR= 0
##$SW_p= 29940.119760479
##$SYMM= 0
##$S_DEV= 0
##$TDeff= 32768
##$TDoff= 0
##$TI= <>
##$TILT= no
##$TM1= 0
##$TM2= 0
##$TOPLEV= 0
##$USERP1= <user>
##$USERP2= <user>
##$USERP3= <user>
##$USERP4= <user>
##$USERP5= <user>
##$WDW= 1
##$XDIM= 65536
##$YMAX_p= 553528533
##$YMIN_p= -7998336
$$ End of Bruker specific parameters
$$ ---------------------------------
##NTUPLES= NMR SPECTRUM
##VAR_NAME=  FREQUENCY,     SPECTRUM/REAL,   SPECTRUM/IMAG
##SYMBOL=    X,             R,               I
##VAR_TYPE=  INDEPENDENT,   DEPENDENT,       DEPENDENT
##VAR_FORM=  AFFN,          ASDF,            ASDF
##VAR_DIM=   65536,         65536,           65536
##UNITS=     HZ,            ARBITRARY UNITS, ARBITRARY UNITS
##FACTOR=    0.456856943014862, 1,           1
##FIRST=     14782.0589164895, 0,            0
##LAST=      -15158.0608439895, 0,           0
##MIN=       -15158.0608439895, -7998336,    0
##MAX=       14782.0589164895, 553528533,    0
$$ Real data points
##PAGE= N=1
##DATA TABLE= (X++(R..R)), XYDATA
$$ [...]
44771 923196 569183 -53877 -637420 -763051 -99310 1099850 1938761 1818477 1259539
44762 1259539 1203268 1626241 1608371 811570 -67 -217076 -261430 -610837 -744231 24399
44752 24399 1152774 1383414 541863 -192562 9182 552613 480495 -105953 -332835 143609
44742 143609 825454 1258292 1559013 1880360 1885876 1202927 150879 -503233 -518445 -399958
44732 -399958 -465295 -235753 760941 1989297 2416254 1865976 1109298 630641 198142 -145098
44722 -145098 312923 1741757 3007944 2996714 2125506 1620530 1717570 1608225 928769 197670
44712 197670 -227798 -569368 -826513 -547944 274902 967986 1206461 1444602 1875547 1843382
44702 1843382 946980 -41312 -182900 285748 506182 433589 699837 1260362 1265515 417590
44692 417590 -462424 -563556 -91829 233025 132930 -204142 -614362 -981128 -1048966 -712340
44682 -712340 -361757 -484709 -937970 -1035009 -452639 305988 548978 228651 -137361 -221339
44672 -221339 -225933 -457240 -844715 -1026782 -775864 -242522 131584 -62552 -781195 -1398353
44662 -1398353 -1253844 -457953 98945 -280855 -1341285 -2245092 -2418263 -1818201 -761329
44653 -761329 121107 127988 -741134 -1487639 -1177090 -124006 604826 655742 551664 518160
44643 518160 172801 -461136 -713486 -477077 -634477 -1599543 -2355617 -1861889 -690423
44634 -690423 -187423 -507461 -661605 -261774 35143 -117021 -132303 427210 1120030 1464151
44624 1464151 1723616 2262163 2685425 2277030 992065 -477613 -1410362 -1468345 -700582
44615 -700582 424017 1176950 1193643 859133 769911 962020 1016933 775115 492979 324565
44605 324565 118130 -161111 -215493 170315 814111 1455100 2066240 2532290 2339965 1139851
44595 1139851 -470910 -1337585 -1078413 -511021 -502967 -928635 -1187630 -1235702 -1409012 -1552660
44585 -1552660 -1185732 -477287 -166685 -338780 -165842 703212 1296343 551052 -1142784
44576 -1142784 -2398378 -2523749 -2008922 -1475202 -920876 -155639 605146 910377 616823
44567 616823 81120 -151790 99757 361081 -42911 -1107734 -1996018 -1977377 -1231599 -466718
44557 -466718 -99956 -175543 -696701 -1487293 -1968975 -1660285 -809837 -93272 166127 67200
44547 67200 -282362 -674571 -558877 388735 1554655 1945464 1434278 800976 579915 589113
44537 589113 605583 696530 715658 250479 -615621 -1117578 -715540 273552 1118577 1260919
44527 1260919 442066 -1039240 -2080941 -1637364 -141242 750680 248978 -558104 -341421
44518 -341421 644872 1176214 870069 449313 515554 915113 1204553 1058288 294039 -902191
44508 -902191 -1807013 -1725990 -744140 430819 1269856 1732196 1942390 1955392 1769251 1310648
44498 1310648 565277 -94065 -65926 676493 1349230 1373927 1221271 1630777 2307730 2171843
44488 2171843 868086 -653753 -1209394 -555926 619934 1491427 1710559 1493512 1248738
44479 1248738 1110074 928780 703279 655963 728342 441864 -419168 -1401382 -2039518 -2475698
44469 -2475698 -2941782 -3089412 -2494875 -1496201 -819533 -599681 -456605 -317872 -390914 -440633
44459 -440633 94365 1227193 2351665 3074835 3470221 3497320 2880812 1702315 535750
44450 535750 -113604 -79405 586344 1388034 1306735 -130598 -1784149 -1942842 -536891
44441 -536891 750202 788926 257413 160936 326782 180550 -2662 311383 744934 515855
44431 515855 -251336 -688891 -455183 -1374 300771 527053 724185 720734 462713 68602
44421 68602 -420242 -946285 -1215661 -998138 -529538 -216397 -86719 82764 310852 536810
44411 536810 974689 1792282 2566376 2623267 1909432 1056046 580399 413530 179738 -399928
44401 -399928 -1277657 -1928792 -1650415 -405497 907703 1496927 1623695 1896625 2075081
44392 2075081 1545619 717504 694461 1436177 1527030 261365 -1207044 -1567853 -1211565
44383 -1211565 -1351809 -2007442 -2094262 -1243468 -348333 -233556 -731069 -1273221 -1612733 -1685419
44373 -1685419 -1427000 -1051688 -979181 -1190014 -1153897 -689677 -352510 -558071 -848271 -609943
44363 -609943 -126855 -193475 -860479 -1334386 -1188696 -954164 -1220613 -1743853 -1901941 -1640942
44353 -1640942 -1414079 -1342781 -980154 17118 1355817 2381899 2646054 2091375 941850
44344 941850 -362879 -1254723 -1354494 -801719 -151148 152989 142253 90657 25530 -293318
44334 -293318 -875797 -1294658 -1225544 -960967 -996848 -1244228 -1176182 -772789 -680153 -1168154
44324 -1168154 -1569750 -1276372 -757350 -837636 -1288045 -1060382 70496 1013351 811845
44315 811845 -158213 -905681 -1141837 -1280916 -1520922 -1618353 -1473563 -1335596 -1330703 -1230228
44305 -1230228 -875156 -540481 -636333 -1162525 -1673353 -1808049 -1708738 -1781296 -2103603 -2291677
44295 -2291677 -2014519 -1385342 -676368 43042 648626 659155 -220253 -1366242 -1719716
44286 -1719716 -1090923 -354208 -181180 -278102 -222612 -339708 -1109025 -2172634 -2643406 -2175770
44276 -2175770 -1143423 32555 1109354 1721716 1558116 931142 621193 970872 1517891
44267 1517891 1665367 1378147 1049036 922391 831735 432282 -348622 -1087362 -1243870 -846014
44257 -846014 -516297 -611041 -684496 -194332 586857 932846 758390 698850 1073292 1384704
44247 1384704 1055232 210743 -496143 -550878 64012 893839 1302874 999886 334568 -127077
44237 -127077 -233598 -179047 -18439 254533 311782 -157802 -726297 -620561 31209 173478
44227 173478 -633834 -1480546 -1448754 -910318 -722254 -775185 -342684 490577 863299 575006
44217 575006 437464 947239 1536217 1598325 1476010 1761859 2176153 1950557 1091703 465250
44207 465250 574470 918419 790789 215130 -239113 -238634 48141 254114 101226 -418522
44197 -418522 -875711 -655328 241417 853762 248787 -1202112 -2115915 -1768409 -893997
44188 -893997 -587581 -987611 -1456874 -1577819 -1421712 -1168748 -1034871 -1329136 -1988911 -2248970
44178 -2248970 -1439322 -41664 739431 509893 101721 279860 709406 570685 -330589
44169 -330589 -1503269 -2423603 -2789932 -2411722 -1348418 -85475 797142 1140016 1188333
44160 1188333 1151581 1022901 801013 646174 714291 911284 899812 427008 -321560 -813984
44150 -813984 -759283 -503064 -625733 -1201937 -1700601 -1614298 -966729 -196984 251948 238532
44140 238532 11900 -22187 240394 497734 526067 484500 480016 228644 -369330 -706726
44130 -706726 -220413 606878 822612 423018 259424 575372 722587 501018 614608 1349147
44120 1349147 1912785 1758838 1547517 1942149 2352197 1924297 1091811 950924 1491569
44111 1491569 1628790 876291 -52880 -376238 -125171 240016 453316 532561 649500 905424
44101 905424 997527 433519 -574147 -973642 -237718 700950 684389 -30712 -363667 -183139
44091 -183139 -266647 -728168 -839503 -474169 -407812 -893785 -1153813 -730265 -264218 -388550
44081 -388550 -780996 -868141 -625569 -146792 736487 1801713 2201662 1568454 688222 429913
44071 429913 633704 697084 602477 625444 606195 306289 20500 63131 69875 -410668 -1006013
44060 -1006013 -993279 -377368 270208 756600 1257223 1622488 1560916 1378808 1682718 2363301
44050 2363301 2655977 2243930 1583416 1094580 735801 462592 430969 610191 771198 915679
44040 915679 1122745 1000920 63021 -1277973 -1955751 -1734796 -1555975 -1989207 -2265570
44031 -2265570 -1566222 -506606 -342035 -1098609 -1540126 -949986 -23282 218407 -331052
44022 -331052 -1045078 -1441625 -1448631 -1130042 -589725 -37075 352295 595509 764477 832458
44012 832458 849672 1076789 1620380 2051950 1800042 942554 195116 -8581 -976 -219054
44002 -219054 -499219 -444291 -156664 -73362 -265799 -473661 -728125 -1294902 -1954201 -2012556
43992 -2012556 -1281184 -497150 -447700 -1083825 -1772642 -2027760 -1724428 -1009433 -314687 -104092
43982 -104092 -338207 -543881 -564553 -683478 -784435 -173513 1237946 2329181 2123563
43973 2123563 1151434 591140 567900 332431 -238876 -491917 -227869 52626 192504 572828
43963 572828 1095147 1044862 289948 -377867 -495786 -566183 -956286 -1118921 -593715 34513
43953 34513 7120 -373645 -235040 516402 1117681 1021876 427053 -128493 -244770 87564
43943 87564 373867 33326 -777772 -1169922 -682675 60040 274654 33354 -164990 -229081
43933 -229081 -225665 74959 575032 372690 -1036298 -2534695 -2600446 -1527571 -1090339 -1939242
43923 -1939242 -2720479 -2193784 -956846 -334829 -523811 -703727 -357034 347920 1080897
43914 1080897 1560671 1529167 1077343 747974 864988 1049757 805764 217362 -374066 -959384
43904 -959384 -1554706 -1701740 -1000796 73357 615892 455563 179895 59873 -258244
43895 -258244 -851213 -1090354 -502006 509209 1230963 1502610 1550608 1340298 680190 -177128
43885 -177128 -622111 -453419 -122438 -61087 -108537 165130 802883 1407904 1644578 1546363
43875 1546363 1356563 1281938 1414576 1684127 1816267 1514149 785130 -25248 -569893 -722107
43865 -722107 -466588 113534 593671 324356 -833959 -2112053 -2585536 -2202424 -1657423
43856 -1657423 -1399930 -1309114 -1289185 -1508295 -1875814 -1904525 -1398411 -757192 -287185 233072
43846 233072 900954 1218436 891651 574708 990584 1637406 1331738 8177 -958242
43837 -958242 -464115 1034978 2267804 2543419 2017156 1114247 215958 -365774 -540527
43828 -540527 -466918 -264849 60964 319248 187085 -210789 -264396 216147 540906 110093
43818 110093 -564893 -499844 321458 892985 564621 -228624 -756429 -867475 -790307 -607656
43808 -607656 -345793 -213461 -298062 -242116 339725 1209093 1655076 1313218 545208 -29297
43798 -29297 -112355 237119 877608 1664459 2353776 2674497 2585091 2346135 2218478 2121556
43788 2121556 1716852 859464 -145568 -802756 -854548 -407960 204787 567210 374946
43779 374946 -233587 -632680 -316200 442995 844327 502943 -193872 -732626 -1033417 -1155656
43769 -1155656 -933408 -353961 61120 -147299 -575117 -397989 406543 947546 653420
43760 653420 -62770 -644582 -1197128 -1926466 -2360764 -1890108 -788593 51408 262360
43751 262360 155855 -159181 -940755 -1962630 -2381401 -1860207 -1115123 -862014 -874462 -673159
43741 -673159 -504354 -806816 -1172813 -841541 -44417 173586 -446334 -933876 -549523 174721
43731 174721 335416 -101703 -549506 -750147 -815806 -672386 -152367 480980 676351 271722
43721 271722 -351500 -750097 -737776 -329947 266700 664906 629124 369952 246350 266441
43711 266441 174983 -65042 -207858 -81323 290861 840773 1416608 1686952 1441704 933301
43701 933301 576052 376924 35676 -464811 -798329 -803214 -624079 -361005 -30609 131371
43691 131371 -148027 -634396 -778947 -590582 -737669 -1545809 -2448867 -2750727 -2420958 -1783342
43681 -1783342 -942109 10216 666902 744781 535662 428899 315834 -2101 -185705 158050
43671 158050 612290 385499 -430267 -843090 -336635 477566 829782 717516 486290 136380
43661 136380 -376074 -624021 -223481 330892 69426 -1133910 -2233648 -2244625 -1370849
43652 -1370849 -574929 -330899 -255182 119896 696208 1096734 1232944 1258540 1157501 785585
43642 785585 306753 184780 581048 1052947 1068924 625204 141456 -84041 -85133 -31642
43632 -31642 -68265 -266379 -524179 -591140 -373816 -99776 17890 98113 284421 314737
43622 314737 -156134 -878811 -1184200 -936386 -789313 -1225719 -1795979 -1747589 -1113377 -635583
43612 -635583 -683065 -775060 -333023 491917 1029742 923310 458159 132857 148023 319500
43602 319500 286493 -214906 -1060108 -1660177 -1452321 -624668 -64501 -306474 -817470 -779798
43592 -779798 -369809 -564728 -1604090 -2406638 -1964124 -744910 -52141 -283103 -554988
43583 -554988 -62266 836198 1147021 496871 -439369 -674143 66152 1065568 1403453 973735
43573 973735 497046 491226 654989 537588 343086 509310 807192 601118 -53298 -320542
43563 -320542 241441 1053139 1328528 986338 426125 -116718 -539399 -534404 159660 1197642
43553 1197642 1715452 1145533 -132844 -1037944 -777103 330557 1156247 1029939 473741
43544 473741 366707 679912 645097 55794 -386995 -205145 132973 30211 -306951 -296894
43534 -296894 87777 394045 411496 276002 29433 -411272 -916165 -1186878 -1105388 -748596
43524 -748596 -182682 444903 773920 585108 197671 132536 420977 608947 443762 215106
43514 215106 363563 1016744 1945665 2731518 2936569 2360634 1256147 183445 -415377
43505 -415377 -490845 -330645 -331939 -724912 -1352592 -1738674 -1474667 -543618 724578 1901517
43495 1901517 2651706 2844370 2552460 1871132 817852 -408767 -1241935 -1223348 -623372
43486 -623372 -135809 32697 227674 488985 364476 -183278 -458404 -73053 399657 397646
43476 397646 323628 766902 1324348 1108542 96643 -935077 -1617170 -2225588 -2812853
43467 -2812853 -3011332 -2773954 -2506349 -2317748 -1849041 -1030147 -406020 -520677 -1411095
43458 -1411095 -2689225 -3614611 -3263202 -1424800 664678 1344212 438859 -646131 -887863
43449 -887863 -765757 -1074076 -1586998 -1586994 -1035195 -462824 -111522 168384 432786 572521
43439 572521 521735 188842 -538312 -1421965 -1877634 -1678107 -1266621 -1035541 -764700 -238085
43429 -238085 36597 -638598 -2123470 -3512113 -4133807 -4047593 -3650501 -3208900 -2751786
43420 -2751786 -2143769 -1292413 -408642 109941 152608 -30994 -323415 -878114 -1584835 -1924896
43410 -1924896 -1703693 -1416512 -1432484 -1303060 -473574 688463 1239686 843459 25717
43401 25717 -623002 -986002 -1245225 -1589215 -2009796 -2108745 -1368887 52753 1182575 1340045
43391 1340045 994879 964089 1188683 1055849 603972 507456 967542 1463728 1600156 1410505
43381 1410505 829509 -277239 -1443288 -1817440 -1287729 -630657 -325036 -43479 382218
43372 382218 429442 -118218 -493538 -60725 537968 279101 -620998 -1006259 -563399 -268977
43362 -268977 -859286 -1741916 -1899421 -1256747 -565425 -295227 -259687 -202280 -154943 -148381
43352 -148381 -76140 -27414 -298452 -797680 -895640 -305963 304671 231695 -65553 416029
43342 416029 1460414 1589557 171501 -1432089 -1561903 -368285 630173 542477 -272617
43333 -272617 -1172722 -1777156 -1714622 -859157 117084 289292 -333525 -938008 -1214845 -1612574
43323 -1612574 -2171225 -2153656 -1277772 -436147 -579471 -1484003 -2160676 -2007071 -1129122 -23668
43313 -23668 619564 275852 -785494 -1585588 -1484956 -763668 52372 839985 1517299 1724341
43303 1724341 1405409 1121380 1189156 1068811 281381 -582054 -567685 283078 1066963 1234583
43293 1234583 911755 272229 -556002 -1085363 -838101 -166157 45911 -424131 -925885
43284 -925885 -1001811 -948805 -1122605 -1339613 -1275803 -950976 -512675 52585 709409 1197959
43274 1197959 1313134 1130514 825917 515349 342382 430656 659682 748463 624078 485341
43264 485341 520375 789992 1264455 1671807 1538435 857893 489582 1223884 2567896 3236868
43254 3236868 2845294 2234447 2006687 1756557 1138989 657486 697521 672360 27128 -626195
43244 -626195 -418685 260612 319058 -273784 -510791 -101884 37664 -677199 -1576599 -1824711
43234 -1824711 -1543234 -1308712 -1297323 -1513551 -2150376 -3010561 -3182434 -2148084 -813130
43225 -813130 -536913 -1332158 -1888221 -1341216 -207797 532899 534373 35534 -643863 -1229875
43215 -1229875 -1536442 -1617512 -1559050 -1098015 32309 1314743 1701492 943138 8288
43206 8288 -228290 -65033 -181360 -393697 -42142 712479 879411 -59687 -1507216 -2492931
43196 -2492931 -2577394 -2000376 -1373262 -1222976 -1469443 -1452795 -848417 -299482 -580788 -1374687
43186 -1374687 -1615806 -951056 -63097 454660 688422 749191 427283 -187159 -545331 -492723
43176 -492723 -554414 -970968 -1195341 -830437 -328461 -176999 -100711 231207 358789 -260908
43166 -260908 -1172003 -1414088 -800929 61064 748252 1248726 1468235 1310140 1114585 1291283
43156 1291283 1620564 1572541 1155717 772195 442475 -40642 -348457 106104 1122022
43147 1122022 1766774 1564938 912264 280394 -234861 -539716 -520111 -478217 -796628 -1099724
43137 -1099724 -633749 396020 863175 370392 -164984 -20499 256545 -54391 -575861
43128 -575861 -506691 78910 457981 334933 -55970 -527123 -917079 -875404 -377801 -115280
43118 -115280 -640902 -1416243 -1462226 -746076 -148110 -169910 -452933 -573165 -556050 -469297
43108 -469297 -180410 216312 250452 -312549 -1013038 -1130211 -448760 523756 1016806 677024
43098 677024 -102768 -589847 -530622 -401371 -711483 -1298187 -1546037 -1089122 -55223 1120830
43088 1120830 1818850 1468791 123147 -1352345 -2063335 -1956630 -1601591 -1352381 -1175381
43079 -1175381 -1093845 -1228419 -1434371 -1402412 -1137546 -920641 -819184 -650450 -374649 -80953
43069 -80953 332721 937551 1296997 869008 -32713 -373835 241883 980517 933800 301869
43059 301869 -121991 -214966 -557887 -1339022 -1943283 -1838961 -1371243 -1287761 -1697287 -1905936
43049 -1905936 -1306451 -113673 936358 1387121 1323410 1012855 651090 427439 441118
43040 441118 451674 71491 -644730 -1141876 -1059493 -630114 -206755 187111 587850 838620
43030 838620 957429 1294841 1898857 2201309 1859366 1417687 1477418 1680090 1345070 738706
43020 738706 714374 1263017 1469220 953575 381725 373326 789755 1292093 1728908 1749143
43010 1749143 954867 -219021 -678418 -165135 269109 -207840 -1031660 -1214514 -746041
43001 -746041 -306090 -196499 -296564 -575154 -931872 -965610 -568076 -307198 -557955 -740453
42991 -740453 -194282 633857 768875 178365 -252698 -74772 280333 384078 318549 199156
42981 199156 -106100 -595398 -974021 -997439 -625560 81593 812935 936359 127145 -1047559
42971 -1047559 -1705851 -1686565 -1474477 -1287519 -907476 -326303 115981 242304 146655 -95993
42961 -95993 -289942 29984 893353 1369498 677499 -460142 -715171 -231697 -414976 -1551612
42951 -1551612 -2209121 -1523039 -579957 -657790 -1381337 -1682252 -1477851 -1195303 -597030 527544
42941 527544 1233819 515406 -890149 -1306852 -560525 -125533 -774975 -1548752 -1442192
42932 -1442192 -846676 -674119 -981962 -1153665 -850600 -259026 186875 29234 -823572
42923 -823572 -1770828 -2102092 -1976895 -2169506 -2790452 -3116680 -2857979 -2580070 -2492163 -1915126
42913 -1915126 -632583 268559 -141736 -1185655 -1669416 -1685633 -2033753 -2410299 -1763866
42904 -1763866 -328469 339445 -300088 -855581 -94038 1278520 1822729 1386796 856083
42895 856083 563951 149980 -313795 -262266 224594 254506 -546774 -1294990 -949151 284197
42885 284197 1140503 702468 -740037 -2134349 -2675457 -2372743 -1822242 -1539102 -1524334
42876 -1524334 -1449806 -1145991 -783713 -629622 -772056 -1076103 -1271692 -1095114 -496617 254890
42866 254890 769016 849809 572822 146654 -172059 -144818 233071 620522 663766 421192
42856 421192 216720 109815 -137713 -491466 -437849 364309 1449036 1899705 1328259 299700
42846 299700 -256241 22832 610212 715871 237923 -81023 369555 1153661 1290684 598857
42836 598857 -64540 -56623 225842 196113 126425 614744 1371634 1418463 456311 -761905
42826 -761905 -1543398 -1981539 -2310990 -2287062 -1728425 -1133703 -1108187 -1464045 -1500462 -1024334
42816 -1024334 -496862 -202398 115713 632930 991272 817553 359818 186719 386596
42807 386596 486484 219756 -2229 354718 1116548 1484934 994240 92435 -411678 -296637
42797 -296637 -96902 -415537 -1285851 -2173574 -2426901 -1791759 -704624 -11856 -132694
42788 -132694 -556281 -495259 16196 152777 -480819 -1209906 -1205944 -592254 -136889 -117452
42778 -117452 -60840 448956 1210442 1729397 1731291 1254313 533140 -99452 -424001 -544457
42768 -544457 -732443 -1047035 -1279457 -1242122 -898260 -267201 493585 927517 585519 -372956
42758 -372956 -1193948 -1314530 -884204 -350441 170433 807663 1407340 1484142 803472 -166960
42748 -166960 -558510 63949 1170266 1694806 1104802 -83444 -984229 -1289833 -1220069
42739 -1220069 -820427 21982 881382 924122 89311 -546926 -141274 732319 961447 525600
42729 525600 362992 787249 1022869 506555 -198023 -226480 424736 1048277 1167475 891915
42719 891915 575450 485637 655676 810630 609684 134322 -121651 65212 307889 213393
42709 213393 -35137 -68980 31563 -36805 -202842 -182651 -61027 -141265 -311860 -163569
42699 -163569 264306 459451 242907 11885 28572 58349 -50556 -15384 312485 564005
42689 564005 455407 291288 385260 430319 34621 -476874 -469437 20783 399913 474443
42679 474443 579081 770232 630059 15695 -646060 -1016861 -1219931 -1355594 -1263309 -1053952
42669 -1053952 -1233502 -1846481 -2075934 -1297385 -94952 459265 268320 240731 962803
42660 962803 2025681 2725461 2828202 2483511 1891739 1299606 954858 827720 636070
42651 636070 301792 118348 330606 825317 1369299 1831851 1994089 1534725 576109 -59465
42641 -59465 322882 1265567 1492405 422854 -1081071 -1780552 -1537549 -1263593 -1544376
42632 -1544376 -1922036 -1724871 -1056590 -483898 -93384 479635 1171061 1365495 856790
42623 856790 295885 289261 551353 439208 -67933 -485248 -629191 -701180 -737138 -570587
42613 -570587 -244351 108096 672088 1596598 2314573 1993995 754039 -345866 -731016
42604 -731016 -940862 -1520347 -2100506 -2125055 -1799943 -1635049 -1553838 -1180027 -637085 -332605
42594 -332605 -185126 243250 977302 1599097 1884866 1932945 1784945 1456886 1208820 1219845
42584 1219845 1121738 451839 -528150 -1084664 -1012349 -746161 -547263 -297305 -91885 -222938
42574 -222938 -437497 -52067 908964 1490746 1131934 461999 250844 264527 -125539 -735283
42564 -735283 -821410 -285987 184819 160322 -43795 -38004 27194 -212953 -713823 -1025838
42554 -1025838 -879467 -587561 -714604 -1311307 -1710562 -1359151 -648928 -431536 -805227
42545 -805227 -1051242 -836260 -653270 -754176 -544559 308063 957565 499736 -549120
42536 -549120 -957045 -615854 -514580 -984139 -1205408 -684828 -67169 6750 -126460 28765
42526 28765 147681 -263129 -801425 -644195 194994 897266 1015988 870618 727514 308921
42516 308921 -594811 -1530195 -1808848 -1311646 -540051 32480 367291 613859 741711 612140
42506 612140 283708 -15615 -220071 -450254 -622539 -374312 379246 1131812 1388708 1284554
42496 1284554 1124725 648110 -476086 -1561126 -1341958 220574 1549824 1453109 673209
42487 673209 620093 1236842 1232978 121448 -1159672 -1717448 -1749992 -1841335 -2087267 -2323198
42477 -2323198 -2499315 -2404570 -1692108 -660969 -330670 -1086659 -1846241 -1389638 -71922
42468 -71922 756527 770923 965295 1829531 2415940 1803473 603244 147001 645679 1027730
42458 1027730 482141 -580069 -1203527 -999909 -402571 -122190 -472249 -1060294 -1151758
42449 -1151758 -483847 426842 996297 1316886 1777522 2200111 1998164 1140837 251982
42440 251982 -370667 -1101716 -2045383 -2470284 -1773772 -530422 84869 -322836 -1136644
42431 -1136644 -1686160 -1836274 -1665849 -1149894 -362780 316259 410629 -254882 -1295902
42422 -1295902 -1907293 -1550318 -649986 -266719 -839658 -1636294 -1750359 -1189914 -542198
42413 -542198 -58745 290180 272930 -294498 -944300 -1067821 -872099 -1022985 -1479947 -1581600
42403 -1581600 -1224577 -970063 -908759 -458639 468512 1112653 1054508 823081 874668 873855
42393 873855 520711 231315 382187 656056 753531 975738 1442988 1538522 888810 125393
42383 125393 -143098 -307615 -761923 -789470 293611 1536870 1360534 -151922 -1393431
42374 -1393431 -1544241 -1332656 -1425042 -1469138 -1100527 -696714 -622131 -649986 -561073 -495824
42364 -495824 -387725 88597 678976 600228 -121365 -299071 793890 2230787 2557972
42355 2557972 1517042 6071 -1116523 -1519976 -1179351 -403010 180393 243481 157805
42346 157805 342761 541222 236631 -496060 -1086642 -1240019 -1153198 -1092257 -1133016 -1212037
42336 -1212037 -1138837 -694601 36683 608579 703407 495584 349327 390790 551270 765118
42326 765118 930984 907500 678040 304154 -252118 -885922 -1036324 -244140 955614 1460571
42316 1460571 1093443 846699 1336565 1907012 1774406 1199485 856271 817043 918909 1398930
42306 1398930 2290321 2843495 2507833 1918156 1893794 2014540 1368800 272933 -116936
42297 -116936 275679 328813 -378961 -905366 -555632 14976 -115432 -833061 -1371718 -1375612
42287 -1375612 -1069429 -798881 -735405 -707147 -251017 729809 1458287 1109269 82864 -383890
42277 -383890 78092 578549 429677 -1823 -198360 -222089 -101413 494709 1365321 1510525
42267 1510525 503189 -677289 -944951 -489795 -83223 202828 631845 873926 564695
42258 564695 272023 721141 1404573 1186367 125034 -530582 -196850 344243 285806 -204283
42248 -204283 -613249 -789097 -678030 -186727 335397 254773 -322567 -437784 375453 1353867
42238 1353867 1611601 1294459 1039204 920226 659063 394782 452855 634889 468344 -15025
42228 -15025 -388050 -536119 -627117 -562353 -170799 155249 -188772 -969101 -1187726 -432975
42218 -432975 520120 767849 341034 -150278 -386067 -393803 -177119 208360 510805 656470
42208 656470 978480 1635095 2118450 1876776 1166823 683372 530643 253748 -175499 -183301
42198 -183301 426417 1008339 929375 373370 -57122 -121875 31448 264367 490585 585789
42188 585789 590815 777955 1224289 1571570 1525086 1336074 1412026 1642674 1534117 949220
42178 949220 358968 319765 888279 1553795 1696719 1238762 824615 1060290 1575122 1360691
42168 1360691 213332 -798540 -718044 68677 590581 712076 960284 1331988 1290504
42159 1290504 865388 765632 1237580 1649330 1470503 941268 457982 -52791 -752694 -1398203
42149 -1398203 -1639420 -1464171 -1046137 -469642 150364 566181 610235 278361 -416013 -1294067
42139 -1294067 -1741908 -1171243 83342 881012 558856 -346286 -875830 -670560 14159
42130 14159 775789 1195528 959953 247522 -337145 -499221 -552888 -745569 -782187 -415109
42120 -415109 -53349 -255470 -871633 -1173347 -745431 53096 439429 -114284 -1379226
42111 -1379226 -2486033 -2772220 -2469203 -2211772 -2057237 -1618084 -1023849 -841961 -972850
42102 -972850 -680832 -24332 -95756 -1233542 -2136878 -1685683 -673530 -576729 -1324508 -1590743
42092 -1590743 -895938 -133032 -102985 -618952 -1101826 -1193162 -760520 -38602 283121 -199122
42082 -199122 -888443 -878367 -175806 455116 628754 560696 415670 269299 485257 1231794
42072 1231794 1817819 1451670 491575 -54160 -114688 -521957 -1428639 -1971776 -1700502 -1211983
42062 -1211983 -1051533 -982471 -703936 -396653 -207120 5190 139240 -123069 -559400 -531676
42052 -531676 -57123 158659 -62769 -138339 76424 -3333 -414059 -278032 705017 1521213
42042 1521213 1308393 566145 161937 64016 -137288 -297082 -143201 83655 165532 374111
42032 374111 737050 657744 -7460 -378754 100661 633033 322216 -413382 -745771 -917618
42022 -917618 -1606447 -2523316 -2941774 -3043740 -3414315 -3701191 -3179375 -2266439 -2008434 -2284040
42012 -2284040 -2011090 -1073856 -542767 -837615 -1108115 -782151 -451942 -738081 -1309997
42003 -1309997 -1514164 -1156722 -341139 694344 1379033 1269994 848499 985633 1544007
41994 1544007 1545084 855102 494886 919715 1216372 592128 -440985 -1042923 -1176950 -1010578
41984 -1010578 -199444 1258626 2278212 1910407 799118 375360 932508 1453583 1136641
41975 1136641 208893 -688200 -1157675 -1084840 -604031 -29087 566465 1479404 2652066
41966 2652066 3215402 2485555 1176499 744007 1497568 2211839 1860853 972636 758137
41957 758137 1415798 1966068 1621151 718426 142465 237298 631481 930902 1097551 1070668
41947 1070668 550056 -422744 -1048326 -598835 442408 803617 123894 -491394 20746
41938 20746 1249242 1954250 1699620 1148935 919334 834303 424986 -310484 -888681 -885791
41928 -885791 -370826 134140 126933 -381712 -905425 -1035911 -807092 -472146 -182839 -42110
41918 -42110 -203753 -651086 -1041945 -1031320 -642872 -130421 367751 800914 1002043 848204
41908 848204 583128 654407 1135910 1522323 1244857 324482 -593296 -873661 -516077 -90188
41898 -90188 -91090 -511400 -1070865 -1589096 -1921877 -1801776 -1142572 -387619 -134181 -416499
41888 -416499 -719409 -678077 -385299 -41823 247303 303540 -31449 -548099 -828620 -798261
41878 -798261 -692064 -505505 -40848 494475 620069 427016 552487 1090041 1294206 710396
41868 710396 -155017 -698903 -974780 -1083477 -646359 398017 1202251 1064649 506869
41859 506869 453742 873536 1145597 1264896 1598286 1798038 1157290 -47938 -726295 -578878
41849 -578878 -488060 -1066055 -1761018 -1787390 -1199248 -619835 -424812 -506275 -463222 102306
41839 102306 1086140 1696973 1263262 153253 -686602 -972491 -1114453 -1131919 -542474 518050
41829 518050 1103815 813459 456838 835502 1607162 1963952 1813917 1639339 1648142 1685033
41819 1685033 1657751 1543045 1247301 850186 666066 731784 629904 168312 -216641 -143187
41809 -143187 95435 77906 -15438 205370 544603 415970 -329393 -1222684 -1670300 -1315049
41799 -1315049 -204168 1044702 1588311 1272318 855969 937924 1122168 778835 149147
41790 149147 -22416 389793 896287 1255207 1538966 1541820 1004956 385756 501350 1278892
41780 1278892 1692604 1185284 399781 175468 505334 906023 1224241 1551641 1772637
41771 1772637 1756927 1749985 2049311 2382842 2047605 731381 -1047597 -2391483 -2806484
41762 -2806484 -2514988 -2053481 -1644125 -1086368 -278286 422060 585786 271127 -105782
41753 -105782 -305807 -336459 -141006 348899 913277 1225747 1297611 1314149 1115132 405642
41743 405642 -498966 -782951 -180845 642807 1015754 1047376 1209684 1614484 2046642 2297599
41733 2297599 2137129 1370692 281455 -392779 -326770 -89869 -351436 -954544 -1235310
41724 -1235310 -965556 -495820 -169154 -18796 115175 474954 1139840 1654310 1358319
41715 1358319 445455 75390 798898 1465222 615949 -1422536 -2893182 -2884942 -2155970
41706 -2155970 -1657763 -1385206 -1012676 -653902 -460476 -227980 88092 94255 -363633 -846377
41696 -846377 -1029916 -1113937 -1134666 -651968 312562 813953 236309 -643528 -716401 -130175
41686 -130175 126346 -203517 -531215 -612682 -754598 -911828 -662693 -174640 -158371 -625757
41676 -625757 -680683 49476 656477 205596 -894404 -1395605 -706377 599932 1512599
41667 1512599 1485014 820454 339342 455755 635783 185730 -578802 -696505 -91924 218036
41657 218036 -271648 -757512 -490898 17311 -54963 -516158 -754938 -982999 -1735996 -2555369
41647 -2555369 -2392782 -1220183 -152871 35295 -455485 -1269952 -2250001 -2823377 -2197333
41638 -2197333 -628145 454425 190426 -579046 -527609 433355 1296207 1344425 742460
41629 742460 49640 -275469 -81368 315945 355284 -66432 -388276 -189401 189344 243315
41619 243315 105793 179991 311511 47258 -426522 -360964 451157 1277088 1365907 814347
41609 814347 310194 385764 1106072 2132971 2859187 2776244 1998906 1260836 1163402 1541316
41599 1541316 1732106 1340181 568887 -69151 -163924 379182 1286277 2031103 2168987 1658792
41589 1658792 842516 132323 -230663 -200899 77318 242000 -120020 -1069092 -2107471
41580 -2107471 -2541275 -2074783 -967527 321435 1444367 2156907 2327783 2122235 1939248
41571 1939248 1947158 1856422 1372822 682085 185286 -89172 -429850 -865985 -1057821 -812439
41561 -812439 -356165 -4292 139544 91082 -75699 -107832 243849 753937 776731 7747
41551 7747 -1074458 -1750615 -1793157 -1433022 -883869 -246792 285124 520508 578378 830087
41541 830087 1444536 2114100 2313857 1845308 1111969 749126 901301 1055616 793765 434736
41531 434736 493994 736419 459561 -298962 -648676 -170168 447885 503133 230312 86936
41521 86936 -129387 -627845 -761245 102174 1239793 1285253 152396 -909065 -1209292
41512 -1209292 -1336034 -1693667 -1616211 -671189 192299 -151560 -1259186 -1664238 -919619
41503 -919619 -85025 -155379 -887933 -1442086 -1472514 -1152386 -591454 205962 951607 1140542
41493 1140542 643617 -22198 -215806 93231 256087 -352147 -1621157 -2727326 -2834288
41484 -2834288 -1789142 -235606 897017 1105226 636907 138046 -62 132632 319148
41475 319148 522985 725083 727814 405545 13958 -53077 219643 451804 367211 79884
41465 79884 -154176 -270647 -385029 -540273 -572891 -316511 20044 -127973 -974497 -1809155
41455 -1809155 -1663170 -640607 47475 -320824 -1031366 -1110256 -741914 -665020 -718834 -142024
41445 -142024 913061 1413911 1081458 773433 900469 630305 -697054 -2318514 -2992200
41436 -2992200 -2488215 -1407474 -185751 883218 1201524 446150 -666715 -1091286 -809401
41427 -809401 -708917 -1213572 -1829597 -2081809 -2143812 -2344129 -2633082 -2794899 -2801944 -2756176
41417 -2756176 -2697036 -2513824 -1919434 -722462 624650 1140026 495834 -272418 24971
41408 24971 1066221 1479899 889875 394098 746373 1185534 729454 -266827 -740538 -512572
41398 -512572 -281090 -345238 -292192 119889 623358 1042784 1463517 1667297 1171006 118018
41388 118018 -577313 -412005 -18963 -179302 -657971 -727613 -431378 -411112 -627167 -280874
41378 -280874 762310 1442471 969461 64635 -65310 491510 566373 -234925 -893240 -466403
41368 -466403 557815 917935 158044 -955836 -1407473 -917051 -13511 592875 655862
41359 655862 489745 445229 425605 138936 -291727 -382207 2838 420937 485204 326382
41349 326382 217239 132483 -41296 -215699 -335626 -580961 -996932 -1224369 -961797 -426045
41339 -426045 11357 362272 778084 1024590 682727 -255519 -1354201 -2106398 -2044934 -896904
41329 -896904 836497 1863455 1431342 425032 276091 928928 951276 -211387 -1264687
41320 -1264687 -908912 313585 869103 291789 -567050 -1003095 -1161240 -1274564 -1128355
41311 -1128355 -627741 -259591 -490481 -1024629 -1127993 -585601 48106 179043 -162126
41302 -162126 -528994 -700020 -835215 -1047660 -1120352 -793192 -158590 422668 738437 894433
41292 894433 1071440 1232786 1118881 530899 -359125 -1043584 -1160382 -892306 -674329 -562184
41282 -562184 -265893 148276 113839 -595524 -1368327 -1548313 -1321960 -1254583 -1284223 -903093
41272 -903093 -181810 187584 -51241 -337127 -184722 147081 177407 -90679 -308139 -261266
41262 -261266 55628 533425 878519 738328 116449 -565278 -947436 -1017706 -849043 -413680
41252 -413680 191788 651601 721679 404832 -144977 -579035 -351823 675499 1665496 1541880
41242 1541880 414248 -482133 -484357 -287859 -622675 -1046868 -794457 -112566 158942 -111400
41232 -111400 -379745 -474060 -709250 -1097361 -1301153 -1351123 -1598691 -1883181 -1528293 -395898
41222 -395898 709474 1010821 670610 443909 771742 1472180 2069074 2205615 1881787
41213 1881787 1401636 1010633 645937 198770 -130693 -36524 422434 858312 1005642 881637
41203 881637 610413 372633 389128 639379 756275 531122 294850 375708 440563 -46483
41193 -46483 -881731 -1290650 -972363 -317246 388378 1229246 2027809 2215877 1639016 853699
41183 853699 287885 -309685 -1186479 -1893161 -1811719 -1070314 -447549 -480076 -953159 -1186583
41173 -1186583 -706034 217650 706553 232829 -629626 -842346 -222333 471002 753514
41164 753514 920150 1134108 906232 -11381 -959493 -1237434 -1051918 -973236 -997703 -836028
41154 -836028 -618795 -549955 -304659 401971 1021266 826828 72215 -411891 -521299 -790042
41144 -790042 -1197888 -1210246 -998647 -1379413 -2270609 -2430370 -1284175 43109 248165
41135 248165 -455612 -963641 -872707 -533463 -58205 696321 1390032 1388524 700593 9513
41125 9513 -272444 -396319 -706343 -1205210 -1696318 -1878338 -1346061 -40383 1314190 1815546
41115 1815546 1512430 1351699 1852279 2414546 2208867 1223741 90443 -672922 -841588
41106 -841588 -330078 606625 1256114 1077732 385417 -40075 17890 28481 -379171 -801671
41096 -801671 -629633 71628 616921 548359 92234 -292730 -527136 -823959 -1133195 -1043111
41086 -1043111 -364967 441037 669303 97023 -861795 -1581427 -1597884 -796308 358741
41077 358741 915186 321069 -704633 -757821 554471 2023535 2301776 1482546 735043
41068 735043 762191 1261953 1709418 1953354 1971861 1642084 1018832 507991 520573 1048852
41058 1048852 1601761 1495250 427794 -994470 -1593699 -890202 218149 546783 115104
41049 115104 -125944 205017 643936 1069639 2009522 3382854 4036897 3266938 1958044
41040 1958044 1358876 1394008 1166373 610922 489629 934172 1149570 701670 122990 -61110
41030 -61110 -93622 -355336 -611580 -404895 168543 514430 199720 -678248 -1593985 -1921570
41020 -1921570 -1401741 -444245 223990 300707 89502 -83567 -299632 -735665 -1195815 -1202204
41010 -1202204 -502268 584580 1307601 1100554 218846 -405150 -188677 430360 692082
41001 692082 601643 733301 1111901 1060105 278677 -631944 -996579 -808990 -375280 149691
40991 149691 480609 102010 -949215 -1677893 -1200840 50324 861054 798464 550074
40982 550074 702055 881480 409704 -652070 -1542711 -1753814 -1585115 -1637050 -1943940 -1898000
40972 -1898000 -1097274 35238 756484 890059 791603 621556 264104 -62826 137246
40963 137246 766450 1041285 647725 297459 611151 1091883 903097 149099 -422457 -609376
40953 -609376 -755286 -788316 -228830 803444 1460391 1258818 622105 118133 -216338 -529784
40943 -529784 -703992 -594557 -317812 -2903 419602 957216 1389496 1555707 1534502 1406124
40933 1406124 1131478 768804 486925 283102 50534 -26032 373422 1023012 1189600 641252
40923 641252 83106 171776 567750 512733 2258 -257525 79431 571223 631089 92542
40913 92542 -908633 -2108390 -3008735 -3060228 -2269924 -1346129 -915318 -794261 -396591 283213
40903 283213 593567 219924 -273093 -280012 -144568 -670992 -1759773 -2304968 -1701092 -745334
40893 -745334 -500804 -805827 -671138 147243 862616 937541 771754 836059 865453 408053
40883 408053 -330213 -747331 -672155 -440330 -313944 -280198 -363401 -708732 -1255104 -1605896
40873 -1605896 -1418747 -858891 -510810 -732901 -1158289 -1089212 -488130 -209394 -874057 -1840663
40863 -1840663 -1928532 -1026561 -196024 -80496 -85152 474816 1244884 1551317 1626332 2192187
40853 2192187 3103623 3362959 2570350 1580173 1406619 1975712 2310774 1698354 400958
40844 400958 -683531 -913575 -458473 24265 210943 402487 923103 1541727 1755124
40835 1755124 1408013 720100 -91328 -850689 -1265536 -1161374 -807451 -629350 -649803 -565907
40825 -565907 -296415 -47969 115782 340441 600601 657123 442789 134998 -171094 -489426
40815 -489426 -656596 -478972 -226838 -481784 -1304079 -1986299 -1888202 -1182939 -546937 -407705
40805 -407705 -704012 -1095210 -1198504 -899897 -625232 -1001936 -2039694 -2964326 -3110408
40796 -3110408 -2645403 -2110033 -1610180 -932656 -218977 49996 -254749 -689033 -806736
40787 -806736 -617961 -357470 -85105 277098 658792 808127 558521 27173 -499142 -820900
40777 -820900 -874575 -558184 256205 1379352 2211160 2333322 2075738 2081548 2374644 2394627
40767 2394627 2012981 1844986 2225930 2498181 1879703 615805 -361018 -623036 -438413
40758 -438413 8287 803939 1698536 2047507 1590917 771647 100401 -311989 -451128 -206184
40748 -206184 240567 362361 7242 -263752 41896 624177 891701 813681 732770 627152
40738 627152 210078 -361654 -546951 -244373 16853 -147934 -494491 -597873 -332431 268303
40728 268303 1140825 1902130 1917479 1104226 315238 391867 1034051 1149183 238821 -1090638
40718 -1090638 -1987438 -2152453 -1656641 -571582 818374 1834666 1938546 1320490 614964
40709 614964 167112 -85295 -183657 -89255 -28377 -386352 -1107046 -1618499 -1570355 -1269642
40699 -1269642 -1113874 -960605 -457463 278296 788820 922842 854682 564793 -95092 -778841
40689 -778841 -770358 -19286 554293 257633 -373991 -395420 108822 212966 -345916 -756247
40679 -756247 -444424 8349 -236270 -1034416 -1548566 -1432968 -1069799 -770786 -406460 98704
40669 98704 454593 403156 65904 -287621 -522799 -551835 -302249 1975 -157901 -967828
40659 -967828 -1831728 -1926088 -1189637 -459526 -547546 -1388802 -2216439 -2440519 -2191223 -1999364
40649 -1999364 -2085532 -2124116 -1738415 -1053822 -556108 -452966 -437807 -178575 169230 118686
40639 118686 -557335 -1514419 -2090638 -1862143 -1058745 -434984 -543503 -1084070 -1196474 -497853
40629 -497853 436229 803929 509715 71822 -167325 -319546 -521995 -665200 -633673 -501104
40619 -501104 -374626 -290445 -362424 -787491 -1532399 -2164168 -2171325 -1446414 -412539 310325
40609 310325 416172 163486 41196 126035 -20304 -630843 -1190487 -1022071 -253108 325064
40599 325064 343954 230749 372954 506928 251479 -246949 -611029 -785497 -867008 -734095
40589 -734095 -339835 -90959 -387393 -970766 -1276801 -1277438 -1366779 -1514401 -1255204 -605161
40579 -605161 -262697 -622031 -1200322 -1406129 -1330272 -1324411 -1272134 -845717 -169450 345959
40569 345959 614984 765370 599105 -188799 -1285756 -1905192 -1780423 -1456216 -1415864 -1473075
40559 -1473075 -1319657 -1164148 -1386558 -1903356 -2332738 -2571025 -2774748 -2912729 -2746219
40550 -2746219 -2206320 -1486610 -827473 -443100 -489512 -808653 -920957 -649995 -505585 -936506
40540 -936506 -1446519 -1174164 -270827 152033 -392091 -1095847 -1143050 -838194 -867374 -1137903
40530 -1137903 -1110373 -764733 -423016 -2990 705644 1334866 1418098 1333913 1743285 2204672
40520 2204672 1549982 -186170 -1445970 -1256277 -551195 -651165 -1375796 -1650317 -1295463
40511 -1295463 -1066744 -1236125 -1253296 -836930 -492555 -730153 -1376888 -1849748 -1704736 -898787
40501 -898787 90081 475049 -51923 -833432 -1018771 -664322 -476942 -629997 -624521 -338473
40491 -338473 -341141 -908686 -1506050 -1626496 -1463636 -1311387 -946057 -173652 531541 572029
40481 572029 53843 -503668 -948576 -1384626 -1579683 -1191755 -462083 -6185 96570 399023
40471 399023 1164498 1863477 1795699 898656 -188592 -651981 -119166 971936 1680351
40462 1680351 1535952 1077978 1041933 1213320 714819 -599406 -1773352 -1992496 -1544500
40453 -1544500 -1181539 -1090436 -969917 -692227 -356889 7044 281441 71602 -746940 -1458341
40443 -1458341 -1115799 232061 1432747 1470564 438565 -800180 -1512239 -1500826 -988374
40434 -988374 -379095 6212 124696 93793 -56295 -287608 -292918 257659 1120222 1566392
40424 1566392 1321045 1036518 1449146 2304305 2577967 1735878 408478 -265004 246887
40415 246887 1445649 2326353 2277983 1557814 891501 631518 493373 173250 -113740 341
40405 341 410450 716249 864945 1095586 1287714 985530 247011 -124037 404467 1250804
40395 1250804 1365109 486485 -661744 -1245964 -971074 -25923 1099752 1752521 1564546
40386 1564546 904372 535365 731585 1069481 1159455 1133284 1190628 1105093 582312 -171834
40376 -171834 -692596 -925617 -1198950 -1544715 -1512500 -839100 12546 256943 -373500 -1365215
40366 -1365215 -1951722 -1791333 -1161387 -603715 -430169 -557040 -760075 -967761 -1211598
40357 -1211598 -1374432 -1190178 -569750 183329 588523 401558 -226077 -962484 -1608771
40348 -1608771 -2180754 -2699429 -2965044 -2654171 -1710232 -564718 156189 169484 -262102
40339 -262102 -636136 -657110 -417415 -223388 -239693 -276199 -3113 570747 990828 890769
40329 890769 489166 305639 497439 811784 1117827 1513328 1838046 1650992 1004824 724044
40319 724044 1367867 2258676 2221730 1171810 250899 296861 859970 1026922 615491 80974
40309 80974 -304680 -570660 -597425 -213837 271498 240506 -369579 -850500 -611418 107106
40299 107106 686649 928814 1008715 942549 660181 486508 905441 1717727 2035823 1433967
40289 1433967 578310 247793 207202 -246094 -926292 -878509 111646 1074085 1260086 1131109
40279 1131109 1374886 1714957 1545005 1174939 1385664 1997266 1980597 1012797 -122690
40270 -122690 -860098 -1507767 -2186477 -2180693 -1103223 103768 266317 -422412 -832508 -620952
40260 -620952 -556760 -1149265 -1821572 -1703993 -706867 438713 900938 424073 -452147 -847501
40250 -847501 -423867 300338 703273 818213 997897 1204333 1183309 1049227 1057344 1028896
40240 1028896 702569 442713 772969 1336431 1266983 608138 324154 688607 735384 -216851
40230 -216851 -1446870 -1859490 -1343722 -462044 462974 1200686 1232683 430144 -344513 -203424
40220 -203424 513398 779464 391079 47453 83871 48296 -400620 -957692 -1183608 -943234
40210 -943234 -252096 708617 1337137 1014188 -19822 -724200 -460765 275416 579709
40201 579709 252057 -91993 157908 887006 1343022 955917 82149 -286583 318511 1301841
40191 1301841 1843237 1831506 1560082 1021271 188995 -416842 -334438 -99286 -622588 -1707375
40181 -1707375 -2187291 -1613358 -775156 -345258 -78570 259092 247053 -286492 -667501 -445220
40171 -445220 -252722 -759410 -1468477 -1500298 -999460 -729374 -687812 -242639 559665 944273
40161 944273 689606 448420 641938 947455 1103777 1344782 1701933 1709740 1273225 1086703
40151 1086703 1591366 2135473 1904217 1250606 1256802 2120838 2803579 2424504 1362960 658219
40141 658219 744586 1155145 1241372 812023 131256 -387593 -420198 89771 806237 1143961
40131 1143961 735254 -170613 -851416 -748971 27734 864751 1268052 1225475 946411 449301
40121 449301 -362484 -1281745 -1790438 -1627806 -1116279 -692039 -351001 83276 344168 -72732
40111 -72732 -1071382 -1880265 -1971452 -1528924 -826317 176387 1204459 1371084 267354
40102 267354 -1163781 -1729502 -1595527 -1780542 -2289630 -2024114 -708283 382742 197752
40093 197752 -634422 -907617 -577973 -461481 -736186 -767488 -251298 336698 486028 236240
40083 236240 -66111 -176378 -74212 49239 -26015 -216212 -206144 -25507 -152651 -726505
40073 -726505 -1121507 -800328 -169637 22520 -206747 -262652 3851 229841 346792 642810
40063 642810 1021946 982072 455165 -19265 -119511 -102016 -158732 -51293 348041 707599
40053 707599 721622 475474 93850 -463916 -984168 -921627 -157403 592492 577931 -77496
40043 -77496 -665064 -808078 -677605 -502910 -285586 77479 663395 1410167 1951622 1799956
40033 1799956 947480 16946 -528725 -1049622 -2114761 -3397860 -3812048 -2849399 -1258382
40024 -1258382 -134234 258969 422541 702380 918547 838488 564519 332824 244726 344614
40014 344614 684650 1121142 1314413 1179486 1057179 1088171 729669 -505292 -1968350
40005 -1968350 -2313412 -1197575 168908 551382 125545 -173148 -172459 -510514 -1386787 -2122669
39995 -2122669 -2108020 -1581386 -1223711 -1348355 -1695465 -1790472 -1372196 -612941 44811 361535
39985 361535 520625 762460 1010545 1089900 1084805 1148779 1145933 860178 435453 234013 342113
39974 342113 548863 715183 841247 881419 806219 730178 722266 700307 762989 1258514 2131558
39963 2131558 2626890 2212379 1430414 1155489 1312637 1123113 440334 -12439 250797
39954 250797 865794 1175508 818234 -189706 -1368488 -1896321 -1444677 -709450 -457977
39945 -457977 -400424 113333 689195 420202 -371109 -361141 680298 1474168 1277515 930045
39935 930045 1265374 1804526 1842862 1694032 1906667 2147754 1812836 1060002 429843 61626
39925 61626 -45497 302962 906111 991741 324378 -277658 -232782 -150112 -677811 -1286663
39915 -1286663 -1214530 -843229 -983513 -1380342 -1116482 -119055 823920 1257645 1290532 924194
39905 924194 137741 -543535 -460568 277772 971282 1223483 1114642 823206 630681 898020
39895 898020 1518900 1883994 1814898 1824768 2014548 1710862 834288 437064 991796 1438214
39885 1438214 1060668 892057 1761541 2409315 1495580 181993 360974 1357992 1101741
39876 1101741 -122572 -132878 1126399 1259002 -405127 -1443580 -234557 1578740 1963252
39867 1963252 1388675 1155060 964999 114886 -575456 -52562 967472 1147493 714072
39858 714072 780868 1320705 1477375 1264314 1387236 1810650 1866160 1452633 1009601 690850
39848 690850 520626 819215 1511412 1661589 740897 -283725 -197870 761260 1536350 1890403
39838 1890403 2218753 2375707 2010787 1572141 1670647 1888855 1511146 963815 1112339 1526339
39828 1526339 1016646 -276627 -932074 -436207 200326 251619 272292 856465 1638834 2083686
39818 2083686 2296537 2542001 2740989 2834059 2923523 2779765 1975165 794013 215977 609746
39808 609746 1136397 875357 -17352 -677849 -638627 -238732 -201919 -924975 -1933789 -2154259
39798 -2154259 -1109699 381961 1253678 1607823 2265583 3153552 3285311 2478866 1942760
39789 1942760 2663658 4082958 4915454 4581582 3344944 1762667 623079 775592 2205450
39780 2205450 3630281 3776188 2884029 2287018 2606576 3088236 2845694 2087280 1665994
39771 1665994 1791605 1781784 1099720 141004 -273168 134507 988936 1886954 2642249 2997247
39761 2997247 2672545 1842960 1099834 775965 719459 827939 1268801 1993152 2617697 3054697
39751 3054697 3668666 4498952 4967437 4769240 4423084 4457728 4682089 4827108 5306555 6668280
39741 6668280 8748156 10954808 12917514 14298461 14531573 13440738 11693107 10057374
39733 10057374 8655306 7399510 6515434 6063258 5647540 5214061 5357554 6172496 6687122
39724 6687122 6254584 5618327 5707000 6283446 6728035 7164189 7753505 7937300 7572379 7725189
39714 7725189 9011688 10269530 10337126 10011622 10669348 12127343 13551756 15189460 17343299
39705 17343299 19059455 19941516 21733463 25719203 30241031 33567903 37363184 43957687
39697 43957687 52089677 59385449 67290500 78901173 93695948 109970122 130856086
39690 130856086 161414444 201698560 251369552 318808611 410332924 504693853 553528533
39683 553528533 522556756 428032984 321165634 239909912 186540401 147323303 116263623
39676 116263623 94368205 79234747 66173629 54728973 46853766 41498035 36068152
39669 36068152 30701166 26864775 23901807 20533352 17681481 16501534 15582323 13230878
39661 13230878 10684703 9962001 10202586 9267014 7538401 6963670 7396975 7046977 5885267
39652 5885267 5582709 6312081 6384590 5163589 3934990 3562544 3304280 2429049 1422810
39643 1422810 1093254 1556253 2351801 2805059 2404802 1495585 1129909 1534996 1532379 404721
39633 404721 -683015 -419672 480041 437675 -445202 -769545 -191385 444224 929138 1747253
39623 1747253 2480434 2091326 885331 358212 847258 1105891 589747 363887 1054265
39614 1054265 1572923 915277 -72080 102143 1448081 2654279 2855985 2353158 1847163
39605 1847163 1627539 1442013 912309 209240 177708 1259821 2461893 2302551 882799
39596 882799 -28326 651947 1899186 2124381 1197172 74091 -809839 -1640679 -2131788
39587 -2131788 -1599478 -243157 704136 550304 127586 601569 1783169 2387711 1838950
39578 1838950 1008992 906436 1311450 1302269 705143 218322 197148 158416 -311888 -893660
39568 -893660 -1125193 -1043631 -840823 -471234 -70041 -179199 -949102 -1573930 -1172136 89171
39558 89171 1288389 1805076 1584284 853500 223145 545567 1864334 2943377 2712790
39549 2712790 1750837 1337520 1477525 1140257 247186 -59414 681599 1474866 1467718 1105733
39539 1105733 1057019 1065339 689000 312753 491362 881428 748708 171793 -108049 150755
39529 150755 420222 254476 -178925 -464362 -407625 -74284 348751 659367 759523 708479
39519 708479 656464 788155 1220075 1726847 1717843 911629 -31047 -111924 683470 1291018
39509 1291018 1040021 586718 916476 1919567 2586811 2378705 1791977 1579599 1873480
39500 1873480 2206621 2146204 1749689 1431870 1429505 1490712 1209394 572245 -36451 -300287
39490 -300287 -195590 142103 452239 364973 -203748 -772419 -904277 -995675 -1795620 -3117115
39480 -3117115 -3797658 -3178462 -1912293 -982789 -623619 -617117 -938178 -1499685 -1835306 -1680381
39470 -1680381 -1412801 -1345522 -1118444 -469365 -29752 -446061 -1155303 -1112347 -495235 -497085
39460 -497085 -1404916 -2125531 -1948261 -1587704 -1817372 -2089243 -1485240 -353503 151973
39451 151973 -117035 -98477 772949 1662501 1552983 619749 -172155 -335749 -103796 268319
39441 268319 738489 1086089 931123 288938 -346706 -604455 -529131 -217219 328032 817293
39431 817293 738778 150098 -124850 442856 1292936 1580893 1330028 1107904 938758 389365
39421 389365 -437494 -884168 -736338 -446836 -289595 -62572 254674 345505 249551 421617
39411 421617 853228 942414 547892 319057 548100 576373 -47632 -648309 -447334 175281
39401 175281 334915 41420 10515 424276 802032 911885 958127 967822 769572 515603
39391 515603 503293 551571 290599 16936 446170 1512936 2196935 1817872 902735 460171
39381 460171 837068 1557900 1956331 1749090 1206588 843708 784543 567075 -133920 -838456
39371 -838456 -830719 -236096 109030 -149138 -474744 -350286 11472 91730 -257788 -759065
39361 -759065 -972590 -573157 201565 402223 -719132 -2558889 -3596941 -3178724 -2171131
39352 -2171131 -1565214 -1217014 -511958 434119 1024113 1179337 1258302 1217037 680821 -198255
39342 -198255 -752654 -797894 -901845 -1375809 -1644624 -1117252 -230519 26587 -533650 -1084102
39332 -1084102 -1026026 -839688 -1311193 -2322384 -2974919 -2778052 -2125884 -1534320 -998518
39323 -998518 -401180 -56545 -331897 -956217 -1200443 -708075 189115 916393 1104983 684128
39313 684128 -109361 -794142 -992983 -750459 -344437 110569 640661 1125757 1351366 1314299
39303 1314299 1234535 1288045 1464682 1562296 1233414 346949 -526921 -451950 687308 1783868
39293 1783868 1771567 843508 -135085 -868953 -1481421 -1644231 -980333 -109365 -104314 -890431
39283 -890431 -1315187 -916145 -454830 -472286 -542171 -374552 -436588 -847843 -801641 104318
39273 104318 954289 826769 153668 -165046 -181921 -375854 -417353 327378 1509552 2188843
39263 2188843 2225570 2193452 2134301 1513189 346723 -645261 -1045223 -1039037 -770782 -270967
39253 -270967 53074 -189590 -499099 3033 1102862 1550059 798575 -278160 -704320
39244 -704320 -479077 56628 964038 2176166 2978000 2787269 2039875 1674812 1989933
39235 1989933 2436973 2319100 1417130 212002 -356147 222807 1234761 1402526 543688
39226 543688 -144692 183614 838879 799744 330156 401000 990780 1152325 677588 508545
39216 508545 1197029 1971927 1930226 1403672 1345698 1784268 1789730 962711 130410 222957
39206 222957 1026019 1560666 1366034 799973 206316 -492271 -1197562 -1327022 -609497 250621
39196 250621 335169 -252943 -531368 6367 741997 769051 -51320 -1049671 -1472838 -1108389
39186 -1108389 -377411 129855 300796 539804 1013867 1226674 774084 159459 175672 696882
39176 696882 894395 552159 229538 74633 -423466 -1180201 -1173376 -35204 1032508 890868
39166 890868 227178 554193 1955362 3046217 2970753 2231953 1488273 681187 -284617
39157 -284617 -930441 -821758 -205480 422056 914536 1263045 1249903 778676 226418 17259
39147 17259 59542 11821 -62109 248000 988471 1556828 1275363 112586 -1234876 -1918775
39137 -1918775 -1620889 -771042 -116154 -25483 -215546 -169584 240903 643988 657254 359387
39127 359387 169364 306329 529903 477333 112868 -295147 -527476 -540701 -309845 195019
39117 195019 840422 1347322 1526189 1342156 795847 -7511 -711002 -971068 -888976 -798084
39107 -798084 -596574 179195 1427046 2210882 1857247 888477 346854 501697 779587
39098 779587 751339 567543 473275 482095 628846 1062285 1681310 1990246 1545057 455031
39088 455031 -632396 -1041918 -678455 -179589 -256672 -806706 -1004549 -430893 337976 581707
39078 581707 400830 346384 514313 623840 653452 713862 589351 182474 143386 1095964
39068 1095964 2339775 2403963 1047486 -347081 -702377 -522865 -704297 -1068642 -938705
39059 -938705 -448190 -277851 -466294 -424763 15086 404647 528265 715637 1161426 1510712
39049 1510712 1345379 687478 -167453 -990628 -1594217 -1730174 -1291141 -548467 2058
39040 2058 89162 -91968 -142341 48022 183551 19611 -210748 -56143 511865 988175
39030 988175 936610 503530 233781 497092 1163547 1788581 2106270 2303175 2650446 2931183
39020 2931183 2660208 1973882 1670355 1974127 1976574 1048205 146028 595066 1963476 2490127
39010 2490127 1562210 379654 -21274 35001 76965 434343 1191239 1487869 892559 425029
39000 425029 1100191 2292736 2676417 2103444 1453039 1204674 1220020 1397567 1533294 1094809
38990 1094809 119139 -331551 330736 1057364 771756 300696 1091555 2681460 3326127
38981 3326127 2766440 2371777 2648053 2682228 2244474 2348698 3205214 3557444 2783560 1931085
38971 1931085 1925115 2421782 3167686 4693627 6746443 7907246 7952899 8782444 11675020
38962 11675020 15603752 19990182 26896050 37546874 47933022 51314534 45410798 34707200
38954 34707200 25276497 19435262 15956087 13259263 10935749 9220962 8232463 7583893
38946 7583893 6553828 5017005 3910333 3949288 4280173 3620514 2419772 2297783 3334168
38937 3334168 3714655 2540858 1253279 1371460 2290761 2470618 1677200 797443 237223
38928 237223 -242274 -591808 -516937 -213024 -165265 -379033 -494781 -462921 -504667 -619829
38918 -619829 -649141 -567928 -275492 527326 1731909 2495225 2146030 1132866 477092 524300
38908 524300 792369 808008 517543 77927 -189732 182958 1276259 2393986 2731770
38899 2731770 2318340 1822706 1598409 1450217 1212835 987523 834203 724532 779499 1109973
38889 1109973 1473054 1528719 1369696 1338065 1398870 1220983 850703 726978 935588 1002148
38879 1002148 644982 285616 511141 1304440 2072051 2291042 1959057 1485072 1217087
38870 1217087 1062378 659887 -1205 -361366 54858 937610 1485516 1315426 754064
38861 754064 306631 213048 514867 1153674 1869564 2268860 2147607 1666097 1213728 1156889
38851 1156889 1536528 1857193 1448048 333097 -533065 -320598 612308 1217415 1128107
38842 1128107 906890 1001953 1190100 1203405 1224122 1434293 1616272 1580447 1552010 1725403
38832 1725403 1808343 1497867 1176461 1593031 2840140 4055693 4295864 3509392 2518459
38823 2518459 2143700 2499523 3139972 3670772 3975268 3954935 3501959 2876950 2646321 2899223
38813 2899223 2955891 2348853 1681556 1792705 2342719 2149870 932506 -238528 -484733
38804 -484733 -229777 -293022 -628052 -620283 -126111 478404 988985 1488907 1930063 2126820
38794 2126820 2107528 2065472 1986550 1628916 873839 -55925 -677620 -561453 185560 766250
38784 766250 448794 -458557 -900893 -450062 271784 738145 1212965 1796828 1718591 508407
38774 508407 -823749 -944902 -133349 179358 -375446 -687335 -118940 478094 272372
38765 272372 -147483 228803 1173283 1562495 1062482 553758 837558 1587912 1831067 1121652
38755 1121652 763 -619653 -375628 322589 950027 1503923 2236536 2960117 3112781
38746 3112781 2571514 1935183 1785411 1995443 1986984 1417126 440911 -465979 -816367 -508679
38736 -508679 -27790 31319 -303824 -509675 -463871 -609646 -967473 -690433 761993 2496028
38726 2496028 3047409 2184994 1053142 532719 304618 -197593 -696944 -560296 59630
38717 59630 306334 -198113 -858485 -984591 -725036 -776203 -1388469 -2067116 -2239013 -1859166
38707 -1859166 -1269923 -791804 -637212 -909897 -1372054 -1444269 -829774 3210 376718 318114
38697 318114 406220 755283 818346 381896 72553 431570 1026668 1091420 699410 606657
38687 606657 1038009 1301181 721780 -543570 -1803752 -2543054 -2621853 -2103353 -1210309
38678 -1210309 -350414 69578 -76532 -559776 -968726 -971830 -513492 179979 795866 1156987
38668 1156987 1297207 1390058 1580693 1790154 1734125 1296042 795637 587131 442645 -189104
38658 -189104 -1206800 -1739851 -1372877 -899042 -1209054 -1875063 -1729057 -688600 6877
38649 6877 -403241 -1088030 -843556 259745 1150539 1262214 989131 768216 469877 -92840
38639 -92840 -602270 -595585 -172469 35018 -360947 -983288 -1111294 -575656 -38495 -246213
38629 -246213 -1110156 -1758829 -1518014 -603265 258510 653673 711789 690830 671113 674196
38619 674196 775314 925845 852040 369269 -259200 -516818 -242484 143585 129847 -317106
38609 -317106 -788105 -873212 -419012 431799 1174915 1130519 146907 -961189 -1189840 -573671
38599 -573671 -65579 -118664 -128638 405505 976879 952381 674154 839056 1286150 1372182
38589 1372182 1196680 1348764 1610187 1146097 75942 -425655 33824 365680 -231250
38580 -231250 -957029 -774051 -104571 -1753 -323963 -86051 679436 797581 -186560 -1197819
38570 -1197819 -1097934 -101163 773069 1030322 926575 745045 415675 -183735 -878647 -1273936
38560 -1273936 -1171506 -874083 -908158 -1359716 -1730205 -1639990 -1363180 -1334903 -1441769 -1278255
38550 -1278255 -877640 -638402 -659840 -703282 -705706 -745479 -589273 50724 808580 933698
38540 933698 370764 -150034 -258988 -390007 -786733 -926744 -497844 -192247 -731918 -1621711
38530 -1621711 -1779019 -1141236 -705624 -956695 -1155346 -529115 515163 937049 487224
38521 487224 -19201 147165 716173 917168 552460 103449 -129367 -376967 -690519 -543208
38511 -543208 266383 811342 39398 -1576281 -2375787 -1654350 -521945 -253976 -689944
38502 -689944 -900782 -684473 -530199 -545678 -315095 323138 1060974 1608120 1846565 1632138
38492 1632138 980954 322638 48993 -38463 -315793 -595684 -431913 31886 285658 452799
38482 452799 1195835 2459040 3135675 2402569 800875 -445181 -764624 -515683 -296347
38473 -296347 -408807 -819226 -1288122 -1552006 -1504341 -1178045 -635359 -58895 198559 4162
38463 4162 -221519 7647 494849 607612 245457 -30022 109316 369865 493249 629944
38453 629944 787053 568984 -120028 -679048 -573047 -20572 503126 955326 1439919 1719949
38443 1719949 1592571 1370993 1427063 1588948 1533082 1402125 1428298 1322555 766224 208329
38433 208329 338642 914921 980472 269142 -430052 -466082 -139703 -52373 -253343 -382125
38423 -382125 -247916 13894 93535 -292590 -1067085 -1666262 -1608109 -1115602 -736843 -479062
38413 -479062 80446 919813 1559151 1936967 2461041 3039865 2970544 2103836 1214423 781684
38403 781684 352650 -279624 -280171 886087 2133012 1985230 676880 -178982 211828 1103297
38393 1103297 1588372 1550589 1153956 479863 -61974 91576 749850 1054819 728181 371815
38383 371815 276856 -38994 -651682 -681557 308304 1320695 1324791 884606 1219795 2173130
38373 2173130 2448006 1702074 1067514 1374825 2003924 1963192 1230241 448841 -81412 -522972
38363 -522972 -988903 -1406297 -1688014 -1738801 -1477693 -1025488 -642190 -399235 -219576 -238634
38353 -238634 -621350 -933832 -355241 1147826 2436866 2454036 1415781 329673 -181508
38344 -181508 -41468 748887 1926760 2618378 2099150 909641 399441 992006 1612019
38335 1612019 1126377 -238748 -1306197 -1334782 -566449 345416 1013055 1447207 1781304
38326 1781304 1961540 1735693 1008661 115932 -446323 -514792 -291295 17609 319992 489684
38316 489684 446765 360727 444386 602475 658795 827753 1430028 2158359 2273619 1686158
38306 1686158 1191782 1335336 1657921 1505894 1045510 918123 1276207 1736466 2031714
38297 2031714 2189578 2274227 2417206 2862381 3482532 3523842 2463321 953536 204712
38288 204712 435083 650633 115719 -649394 -702267 14570 702517 791605 525962 485428
38278 485428 843094 1209039 1094829 430760 -400563 -993746 -1266880 -1352393 -1307474 -1070968
38268 -1070968 -622143 -74972 328619 332724 -26413 -240822 186519 990496 1328171 923515
38258 923515 488978 617893 843523 451258 -261053 -413771 28024 237987 -83529 -287437
38248 -287437 59013 495606 533153 409749 503903 653733 607695 606298 915150 1198620
38238 1198620 978970 430336 116432 125793 54778 -211941 -250942 264663 1048398 1480292
38228 1480292 1237490 557782 -62319 -393315 -627688 -920131 -946753 -278337 842398
38219 842398 1563704 1414048 815550 404263 249279 52704 -218013 -290690 -25910 392319
38209 392319 650288 611468 548464 968868 1899320 2524967 2126098 1260975 1170173 1918128
38199 1918128 2186251 1345678 617541 1310991 2813282 3458219 2791470 1768008 1074147
38190 1074147 531725 72138 45104 353086 326121 -210773 -580629 -279167 363867 822091
38180 822091 983117 850260 324593 -367227 -641189 -332748 10330 -48511 -226351 -106757
38170 -106757 136260 48553 -372437 -645457 -357683 432108 1170193 1170196 304170 -692822 -1009765
38159 -1009765 -784145 -802027 -1246300 -1491751 -1238843 -994062 -1098731 -1099116 -575325 124369
38149 124369 555136 924420 1495578 1822840 1388447 609364 368163 738360 956465 599857
38139 599857 87003 -56992 149418 375093 444952 418986 423766 470665 374335 -1953 -352905
38128 -352905 -143347 550832 841266 104419 -1074771 -1570417 -1108724 -430043 -169175
38119 -169175 -163816 30426 389249 419706 -228502 -1255956 -1874286 -1625673 -973940 -718742
38109 -718742 -849047 -575633 346821 1087529 956560 415280 235984 337126 278537 308019
38099 308019 859105 1395179 948899 -254145 -838230 -111760 1085873 1624751 1381275
38090 1381275 1014392 1077604 1584247 1986041 1577953 442329 -219294 522653 1812516
38081 1812516 1927669 655846 -459217 -409635 74208 78609 -69794 240256 630486 434868
38071 434868 -125316 -460686 -653339 -1008384 -1157868 -652386 3908 -14477 -468563 -359018
38061 -359018 490624 1138206 873416 53694 -539047 -550962 -165411 155651 15168 -470548
38051 -470548 -704594 -430576 -181776 -440172 -799334 -641521 -208330 -130047 -238151 118201
38041 118201 739834 683003 -233961 -1086405 -1216915 -978450 -816949 -558064 -37828 377257
38031 377257 397145 274097 237798 109678 -112083 30726 643018 996262 444379 -666493
38021 -666493 -1554846 -2035230 -2433398 -2827236 -2942957 -2624716 -2015056 -1436392 -1284498 -1691331
38011 -1691331 -2113939 -1756578 -669566 129389 -21734 -572405 -654415 -236760 136545
38002 136545 210357 57440 -235182 -381426 40870 791703 911676 135544 -406086 218364
37992 218364 1222801 1306245 668032 439896 657269 440145 -71859 199266 1129206 1194554
37982 1194554 -58359 -1090573 -752978 -8798 -158770 -725597 -515267 244334 395678
37973 395678 -122750 -265816 350766 1009332 1176778 1101763 1076471 1070128 1190648 1680131
37963 1680131 2345896 2679323 2561759 2250149 1810531 1269162 1090467 1594757 2059440
37954 2059440 1477750 224268 -216285 583496 1309621 877859 -78644 -460858 -425156
37945 -425156 -805645 -1504629 -1626053 -943515 -241125 -257378 -1050362 -2301952 -3496075
37936 -3496075 -3865598 -2959393 -1353484 -125586 456421 1045036 1937108 2512564 2268761
37927 2268761 1629993 1174713 703358 -187169 -1051399 -1017230 -143575 492002 183898 -653376
37917 -653376 -1359040 -1927708 -2579186 -3022226 -2829200 -2242222 -1915358 -1946092 -1787124 -1140948
37907 -1140948 -361787 142670 379338 474218 405804 245345 195997 161055 -240645 -946610
37897 -946610 -1258598 -768835 7845 374564 336856 231865 14850 -378269 -442875 210087
37887 210087 896125 607821 -399442 -858746 -397815 -51366 -525856 -1044902 -582921
37878 -582921 579180 1317368 1149586 526998 -1568 -248708 -211451 14363 207957 229415
37868 229415 147348 30954 -127998 -235965 -269286 -640502 -1714882 -2820013 -2629225 -968810
37858 -968810 642306 895801 286581 1071 82172 -164363 -591751 -429053 182038 233694
37848 233694 -503071 -1070766 -769882 19338 699683 1162510 1308193 796833 -227753
37839 -227753 -881474 -513594 547006 1525540 1972004 1772274 992927 47556 -474007
37830 -474007 -432595 -197900 19908 359359 756940 890956 836991 1056962 1536765 1735974
37820 1735974 1656936 2032805 2995217 3523637 2932435 2039265 1926992 2215384 1656508 99200
37810 99200 -1217225 -1305326 -524272 74215 -90407 -718415 -1023868 -549397 235542 424041
37800 424041 -60193 -235482 496798 1353377 1305371 611807 286769 460985 363338 -235789
37790 -235789 -684128 -635471 -558256 -798367 -1002898 -824912 -495174 -355501 -426733 -704579
37780 -704579 -1245698 -1665941 -1244564 18248 1042637 925077 122929 -178276 429684
37771 429684 1263463 1542143 1139642 388261 -362293 -841711 -837249 -327799 397920 884433
37761 884433 855578 438765 -17284 -365780 -757859 -1244189 -1530685 -1374070 -1012847 -865286
37751 -865286 -939132 -918648 -735787 -630526 -680221 -696370 -592496 -435456 -125276 512133
37741 512133 1245901 1515986 1119111 423243 -197949 -724692 -1180511 -1413288 -1358335 -1137447
37731 -1137447 -774843 -217351 280767 280330 -208785 -722197 -1080012 -1515823 -1896029 -1569988
37721 -1569988 -397726 791031 1306110 1502225 1920875 2176525 1601566 578474 202779
37712 202779 721044 1224882 971838 224909 -366793 -526748 -294987 160156 428891 113403
37702 113403 -516482 -602708 233108 1279533 1524147 767474 -329286 -1032748 -1070428 -597210
37692 -597210 29030 493707 742279 914241 1031005 955517 737250 688163 896289 947533
37682 947533 475809 -186403 -319022 245790 882750 975424 633682 412848 567019 869955
37672 869955 1050126 1074172 995643 840706 747375 917710 1237277 1230637 707398 205652
37662 205652 338278 833653 802786 11257 -735984 -746750 -420712 -629615 -1525882 -2488333
37652 -2488333 -2977215 -2899976 -2313007 -1343638 -367608 255209 645805 1179359 1831800 2224898
37642 2224898 2277330 2245025 2095833 1506218 644287 262026 655201 1141103 1030588 587651
37632 587651 474821 702867 788062 635278 570837 687670 840559 1164371 1868157 2537522
37622 2537522 2414499 1510819 714341 546348 522716 114726 -345140 -267989 226881 602881
37612 602881 778055 1022072 1233462 1036286 518160 211233 297686 393052 186024 -212575
37602 -212575 -626900 -1025294 -1285807 -1239428 -1046207 -1044626 -1149981 -960762 -563216 -535789
37592 -535789 -895072 -800168 186286 1207399 1164349 178789 -711981 -933572 -672185 -104638
37582 -104638 744253 1426754 1260379 298232 -584631 -819326 -771091 -983652 -1347994 -1390315
37572 -1390315 -996562 -470836 -84539 157140 413905 814109 1268599 1476323 1239689
37563 1239689 670611 -88026 -1093727 -2214823 -2815951 -2411103 -1460606 -866359 -759119
37554 -759119 -496997 148240 597980 378941 -337299 -1259566 -2225939 -2710869 -2004344 -326575
37544 -326575 1048911 1301888 977680 928390 1158213 1312181 1464612 1636379 1276163 121827
37534 121827 -1031762 -1325846 -1029969 -831435 -565463 234306 1054395 980536 281290 98214
37524 98214 647344 1007820 727097 350792 176968 -249816 -1041911 -1527473 -1388548 -1223992
37514 -1223992 -1461690 -1647364 -1376613 -1058095 -1109067 -1147409 -656860 147108 712040 871197
37504 871197 682599 137182 -485071 -598540 -180215 -20761 -554261 -1102672 -909258 -242193
37494 -242193 244865 556309 907130 901158 202397 -485510 -277799 374296 245871 -721722
37484 -721722 -1310429 -936285 -402499 -403988 -472210 -28243 502291 445711 49252 11066
37474 11066 283057 231345 -199485 -322554 231049 974414 1306937 1273096 1253441 1265551
37464 1265551 1018271 536137 262437 398531 497719 66020 -593709 -605867 306155 1295127
37454 1295127 1341405 445186 -509401 -875529 -747694 -428188 2974 376070 218344 -661109
37444 -661109 -1596611 -1595455 -508223 683813 917165 172465 -614016 -600831 220971 1251017
37434 1251017 1936174 2105225 1875273 1449160 973543 482206 6952 -226023 119680
37425 119680 1042571 1973500 2253616 1829075 1260917 1055453 1214619 1472522 1703606 1928008
37415 1928008 2063630 1897583 1369219 810080 746373 1309472 1921093 1855405 1146122 549342
37405 549342 454674 332713 -353298 -1184955 -1376732 -984584 -735436 -788437 -518835 380211
37395 380211 1369826 1854296 1817315 1447135 811949 207841 163609 686033 1033034 625520
37385 625520 -276153 -1102119 -1654579 -1951393 -1951553 -1796354 -1789389 -1810615 -1344608 -425241 138425
37374 138425 -101632 -596123 -772202 -838303 -1022106 -873906 -126935 552263 584649 487656
37364 487656 855699 1107554 470516 -457393 -533265 38567 147821 -236420 -166021 323007
37354 323007 82486 -1129844 -2164276 -2376830 -2401330 -2509987 -1857349 -207085 1076161
37345 1076161 859908 -125730 -614584 -680147 -1028025 -1337801 -785918 291648 674866
37336 674866 20402 -817457 -1138656 -1052942 -829125 -536462 -386428 -609667 -904816 -724191
37326 -724191 -185859 -25934 -528330 -1130761 -1279750 -1146087 -1249107 -1742115 -2285610 -2414959
37316 -2414959 -1946102 -1182275 -707003 -825261 -1292040 -1682133 -1774791 -1436822 -576365 409682
37306 409682 595376 -448466 -1840988 -2259706 -1519696 -670998 -559612 -920916 -1000274
37297 -1000274 -520730 165364 499805 141849 -727591 -1455043 -1550942 -1255656 -1128081 -1157441
37287 -1157441 -810126 -15699 494221 129986 -725901 -1232373 -1148224 -951812 -1031096 -1180748
37277 -1180748 -998959 -508668 -155086 -215111 -396627 -180451 481072 1026184 956480 468392
37267 468392 193350 383116 611854 361244 -279185 -680065 -442459 72322 180220 -205379
37257 -205379 -440146 -114257 252570 -45426 -746447 -909379 -298883 308299 362138 260451
37247 260451 449277 598054 280639 -194456 -390165 -626199 -1366276 -2104694 -1871996 -727743
37237 -727743 213578 295955 -19012 -144432 -155039 -277998 -353015 -225981 -91381 -9832
37227 -9832 399291 1290497 2026932 1854662 951656 293599 492406 1145631 1416403 1016100
37217 1016100 459462 395933 830355 1168794 1036872 754820 765076 865935 478594 -398402
37207 -398402 -1009452 -745937 147208 932909 1146055 824145 246682 -305681 -642269 -708384
37197 -708384 -580136 -409138 -337148 -317326 2708 930954 2106374 2583234 1867133 549727
37187 549727 -474706 -1050192 -1476587 -1592631 -989458 -4531 415900 -12669 -552257
37178 -552257 -531454 -56778 564574 1310090 2004812 2165589 1746120 1364677 1315605 1059755
37168 1059755 279356 -304535 6497 616091 441306 -378969 -721775 -345153 -318965 -1261803
37158 -1261803 -2180336 -1766993 -220210 1029244 1122172 517400 -59305 -626637 -1485197
37149 -1485197 -2259705 -2140035 -1065483 -5389 232955 -37963 -55286 235870 370231
37140 370231 405834 885344 1731237 2080074 1516439 696759 326465 232026 868 -111865
37130 -111865 339709 1051516 1303871 1023727 815942 1056857 1565823 2069057 2402652 2338969
37120 2338969 1787743 1124214 793147 678791 422276 210409 514020 1073602 1006057 138510
37110 138510 -579363 -403319 182698 340894 173595 354935 786157 526824 -790607
37101 -790607 -2164430 -2264553 -971391 512555 999664 432306 -382924 -812851 -870009
37092 -870009 -819481 -783630 -862589 -1221797 -1728121 -1804908 -1105626 -181182 17134 -706959
37082 -706959 -1583828 -1861633 -1538145 -995007 -406474 175620 519433 414074 29307 -235576
37072 -235576 -185382 98611 502136 956502 1338762 1510330 1455366 1267053 1052576 947400
37062 947400 1103833 1501096 1850640 1868247 1594173 1284491 1037217 721312 282770 -67402
37052 -67402 -56675 346351 889004 1245229 1250122 972276 573219 103806 -479324 -1044841
37042 -1044841 -1185195 -611848 364283 1014535 984639 696027 739434 1027376 903436 117148
37032 117148 -699379 -794414 -299220 -74057 -573704 -1258413 -1305364 -599295 301623 1012957
37022 1012957 1687971 2441389 2821145 2245755 873099 -337138 -541037 213047 1189447
37013 1189447 1688027 1433133 586762 -257414 -315733 634350 1766493 1983298 1257614
37004 1257614 634210 703303 753811 -48973 -1233398 -1577543 -833100 -42570 -114453 -825732
36994 -825732 -1409311 -1496622 -1219680 -889904 -841887 -1174614 -1444497 -1057967 -161218 364671
36984 364671 46432 -586201 -886082 -985500 -1287335 -1576741 -1368273 -873375 -863937 -1579826
36974 -1579826 -2392911 -2661957 -2419350 -2039139 -1639038 -1100081 -477206 -103194 -239305
36965 -239305 -717215 -1046654 -956389 -716166 -713844 -801383 -422299 557940 1530178 1807919
36955 1807919 1302813 411811 -406143 -793051 -653024 -385048 -573749 -1222708 -1689918
36946 -1689918 -1581914 -1224675 -1010102 -865837 -729939 -914582 -1485544 -1858649 -1598940
36937 -1598940 -1101062 -891085 -814692 -565184 -390816 -480536 -272345 653268 1533164 1379969
36927 1379969 551262 171337 332674 190726 -359906 -553505 -314347 -477645 -1200581
36918 -1200581 -1545278 -1043412 -377483 -53351 296856 725575 428718 -799929 -1760728
36909 -1760728 -1426904 -343240 433797 802716 1073508 966251 309210 -116502 301450
36900 301450 729453 67273 -1136220 -1375008 -482377 203183 -107835 -813186 -1252503
36891 -1252503 -1580902 -1948546 -1917783 -1247129 -478078 -234754 -472595 -755946 -807390 -563345
36881 -563345 -162357 -34393 -507497 -1218615 -1464045 -1226392 -1191094 -1550141 -1536726 -587458
36871 -587458 661034 1149878 774668 330068 269834 207942 -237078 -678970 -471030 250785
36861 250785 549483 -136755 -1183612 -1517503 -942770 -239046 -36199 -240571 -675141
36852 -675141 -1519776 -2690613 -3431635 -3141128 -2170338 -1233438 -462565 340659 1007254
36843 1007254 1346487 1769129 2616525 3157266 2359222 617025 -439262 -88861 568222
36834 568222 239290 -954160 -2036094 -2534012 -2577556 -2211818 -1385417 -395173 235565
36825 235565 261216 -180149 -777605 -1158634 -1061469 -605883 -126165 372781 1176906 2142052
36815 2142052 2588322 2259000 1831205 1963998 2294311 1998463 1032520 135889 -232679
36806 -232679 -278598 -229344 -9784 280136 192517 -402003 -916924 -771685 -246449 -107570
36796 -107570 -462176 -544913 176107 1177764 1594125 1417512 1353780 1557588 1293440 180158
36786 180158 -901332 -796930 374315 1365925 1380539 831267 475649 416683 235214 -285369
36776 -285369 -874998 -1063465 -621911 175145 740316 757283 470078 238304 57985 -169279
36766 -169279 -191370 268566 931645 1265958 1262925 1361364 1705523 2076425 2451265 2934622
36756 2934622 3191915 2746236 1885241 1425451 1423896 1018543 -165732 -1363414 -1857701
36747 -1857701 -1955386 -2191906 -2346224 -1966958 -1268026 -761825 -475364 -211381 -134858 -397100
36737 -397100 -584396 -284448 111720 -88226 -792635 -1226766 -963545 -258908 461518 873138
36727 873138 704624 14640 -631986 -791543 -738805 -914497 -1087737 -749195 -82471 255609
36717 255609 215894 410427 1060911 1648581 1738663 1492938 1192230 820544 316716 -209015
36707 -209015 -640878 -888316 -785442 -368838 -115987 -370252 -690551 -440930 121757 185172
36697 185172 -241124 -279341 323435 727354 456460 276478 878490 1549073 1138737 -169562
36687 -169562 -1081650 -946523 -352097 -19698 17483 -28934 -229574 -675452 -1142275 -1318636
36677 -1318636 -1094791 -480810 431195 1267471 1508278 1093218 602998 537338 657837 404319
36667 404319 -240778 -761727 -890681 -855459 -807236 -588802 -291368 -410715 -974041 -1085319
36657 -1085319 -93229 1168808 1262318 148213 -740759 -584398 -208073 -531382 -1059351
36648 -1059351 -825402 -59236 215252 -147207 -268152 317810 1087405 1484941 1577091 1527044
36638 1527044 1162126 426757 -238425 -318139 234923 1017360 1516831 1457758 1054564 796036
36628 796036 728335 287326 -719653 -1412233 -855502 531481 1449000 1385597 859950 175034
36618 175034 -871575 -1949588 -2165182 -1505903 -1181170 -1925211 -2936487 -3136934 -2565449
36609 -2565449 -1843746 -1187309 -747600 -1019689 -1909987 -2191112 -1043716 469608 727504
36600 727504 -89083 -341785 511172 1150787 454043 -933856 -1665093 -1436314 -984280
36591 -984280 -871251 -933120 -764414 -331426 -68280 -410803 -1166091 -1504768 -865909 266333
36581 266333 867588 566532 -76007 -423763 -446257 -493672 -766684 -1107162 -1114974 -540076
36571 -540076 252775 468342 -121376 -671726 -277320 774124 1408645 1240866 874869
36562 874869 785556 760385 620001 658532 987847 1132611 774882 399489 679098 1536968
36552 1536968 2267042 2376637 1965154 1427123 1043133 765516 311902 -374762 -826124
36543 -826124 -575677 67060 326773 112363 167294 816243 1319371 1007253 400727 439049
36533 439049 1019857 1159487 430941 -569947 -1189153 -1400523 -1404475 -1222637 -960486 -924228
36523 -924228 -1138090 -1175492 -833051 -600866 -1009883 -1764930 -2068986 -1754374 -1525826 -1881148
36513 -1881148 -2264608 -1756730 -415499 619768 495353 -317762 -672636 -154957 594878
36504 594878 858761 631051 324267 161650 183885 534807 1282669 2039104 2179246 1552435
36494 1552435 708065 277805 327841 486430 542013 623094 779858 710170 160351 -541842
36484 -541842 -714912 -173493 443191 410915 -207009 -707776 -671535 -414256 -463921 -825785
36474 -825785 -938848 -343657 674520 1236857 845547 123451 167268 1057587 1577753 823458
36464 823458 -465910 -900518 -365379 2156 -382999 -868087 -856487 -685676 -736869 -661488
36454 -661488 -188704 146280 -86700 -316148 42509 346131 -345290 -1529290 -1795062
36445 -1795062 -962226 -309139 -542816 -937464 -902171 -1013462 -1691692 -2039494 -1115304 437581
36435 437581 1197057 862880 217793 -397610 -1310477 -2346050 -2704529 -2215806 -1662730
36426 -1662730 -1544595 -1443852 -961485 -368840 98964 674394 1213138 867182 -549187
36417 -549187 -1670467 -1155389 356950 1029947 289480 -696660 -924319 -686627 -583168
36408 -583168 -566699 -462059 -483518 -668306 -577361 -97225 216869 135718 256568 836014
36398 836014 1021475 197388 -701068 -429173 586738 872375 173140 -369504 -220316
36389 -220316 -63082 -172254 256416 1519381 2524939 2376141 1712466 1510603 1539982
36380 1539982 1112759 523070 465540 624078 192322 -565346 -655284 -111670 -16273 -664231
36370 -664231 -1078192 -699001 -255363 -333299 -268656 602151 1497822 1170046 -150333 -965025
36360 -965025 -573157 136134 159430 -255886 -224077 395583 888226 741338 206882 -241114
36350 -241114 -502846 -655854 -547535 -30138 556665 642706 205364 -181121 -198009 -162310
36340 -162310 -294871 -195727 426802 1000263 814081 213301 196337 882638 1304624 912939
36330 912939 385502 477674 824753 583705 -197634 -611694 -148730 697563 1134905 971441
36320 971441 694171 851127 1425876 1800692 1429453 528759 -139120 -190189 26201 87743
36310 87743 55390 106553 66484 -247014 -517477 -279090 351583 713569 319700 -745810
36300 -745810 -1989110 -2732904 -2375505 -912935 775245 1539330 988883 -217599 -1049392
36291 -1049392 -932244 -79690 752863 954677 680255 618893 1038854 1439244 1394838 1232322
36281 1232322 1368856 1460296 932391 26759 -528887 -697790 -1024132 -1377597 -898762 501739
36271 501739 1606759 1436106 537816 59874 165030 156269 -240768 -564273 -457913 -144775
36261 -144775 -40136 -342719 -965635 -1495596 -1344368 -365439 766872 1197291 823506
36252 823506 206847 -288799 -720564 -971146 -610758 345519 1030666 574208 -778182
36243 -778182 -1810350 -1684385 -863410 -452205 -756171 -933150 -280017 594666 511097 -539489
36233 -539489 -1244221 -781619 70035 202767 -186683 -118500 484317 705159 131715 -587484
36223 -587484 -858715 -911283 -1108542 -1261858 -1105989 -867447 -845146 -853660 -566691 -98673
36213 -98673 164357 42613 -443941 -1215357 -1923853 -2003739 -1378932 -770998 -790375 -1034165
36203 -1034165 -693868 168942 665478 354493 -234133 -490183 -499273 -616745 -751055 -510797
36193 -510797 153554 825293 1095022 940914 629769 348587 -8476 -624207 -1324337 -1568318
36183 -1568318 -1072419 -269987 145770 16529 -279984 -484434 -636975 -664957 -397477 -105221
36173 -105221 -367791 -1098124 -1360803 -694089 -29318 -519884 -1832659 -2541937 -2120105
36164 -2120105 -1533082 -1655691 -2062300 -1903040 -1197552 -565697 -264851 -273399 -832119 -1938253
36154 -1938253 -2623779 -1916793 -538376 -377205 -1861025 -3061457 -2224264 -170786 969089
36145 969089 683620 300573 600122 834948 418522 102984 678161 1581468 1807281 1486054
36135 1486054 1507644 2009795 2307375 2160667 2104785 2431218 2691030 2440625 1816595 1116755
36125 1116755 375099 -362011 -807228 -791730 -525583 -287152 -166794 -254818 -678324 -1243555
36115 -1243555 -1446352 -1114994 -697559 -637237 -807693 -869265 -823048 -819283 -729627 -388366
36105 -388366 -52698 -107164 -383661 -269436 446735 1223237 1378900 802067 -31725 -548090
36095 -548090 -526015 -214781 -22395 -22477 92625 447863 661597 419339 106120 323379
36085 323379 878136 910231 149702 -600835 -569589 -55162 109833 -273407 -696184 -774199
36075 -774199 -557241 -129596 495818 1064634 1214153 1022798 934539 1030702 931151 611384
36065 611384 668352 1338675 1838521 1345242 238153 -424483 -454578 -678536 -1502787 -2237696
36055 -2237696 -2171288 -1559650 -1077609 -896235 -847553 -974462 -1274535 -1323984 -893734 -641218
36045 -641218 -1362420 -2669913 -3272738 -2672521 -1801046 -1725182 -2396765 -3031484 -3154617 -2855068
36035 -2855068 -2438780 -2241996 -2463154 -2845631 -2838261 -2336623 -1869926 -1753212 -1548017 -825642
36025 -825642 14514 324490 235494 339521 558743 228786 -623513 -974984 -171221 1056649
36015 1056649 1474160 843321 4838 -306069 -168511 -13502 52105 223876 537817 711641
36005 711641 463181 -159132 -844573 -1341480 -1583227 -1530981 -1122493 -506396 -129954 -328059
35995 -328059 -876554 -1208782 -1102729 -918155 -1050829 -1347065 -1264499 -581961 221880 410114
35985 410114 -207394 -1022097 -1270327 -850020 -325690 -159124 -211833 -116095 136426 227413
35975 227413 -11135 -396354 -604994 -408808 206260 967187 1441600 1421217 1111370 811434
35965 811434 565055 315532 197683 347447 542379 408093 -29814 -346889 -320885 -217413
35955 -217413 -361251 -662856 -724982 -307230 400308 911537 853525 293635 -386884 -941866
35945 -941866 -1394755 -1690803 -1564114 -976259 -354296 -62132 65874 296417 458154 336266
35935 336266 254475 581017 909182 559347 -198699 -342470 388697 1096194 1086571 712828
35925 712828 444591 16689 -844561 -1607678 -1642102 -1190259 -859224 -618033 -123650 370756
35915 370756 373591 152555 359051 750442 383388 -738667 -1291558 -423569 926517 1226538
35905 1226538 314698 -608824 -658019 -153532 119608 -146653 -761166 -1415224 -1774936 -1558632
35895 -1558632 -899403 -420477 -560349 -927989 -739806 115800 901707 1020726 698107
35886 698107 436912 300435 170509 255100 690523 944903 390671 -649392 -1227029 -1133981
35876 -1133981 -1101716 -1532306 -1946894 -1983731 -2009192 -2255903 -2243778 -1698834 -1220611 -1255004
35866 -1255004 -1174325 -336521 594404 513364 -389683 -951661 -822615 -689091 -812491 -655135
35856 -655135 -142472 -52823 -702347 -1254055 -869070 234654 1295563 1814103 1470592
35847 1470592 117278 -1588807 -2348728 -1712482 -781599 -768980 -1477275 -1938784 -1960801
35838 -1960801 -2088892 -2388856 -2266399 -1470439 -474924 231327 631533 875822 1001035
35829 1001035 1065415 1179152 1311964 1317778 1120556 678246 -50610 -825591 -1073851 -538050
35819 -538050 224075 431314 6719 -514252 -789245 -867442 -778652 -531052 -401923 -591258
35809 -591258 -662894 -44253 914054 1171019 434714 -441468 -781882 -960958 -1451426 -1795206
35799 -1795206 -1315296 -354190 54203 -463822 -1322254 -1891367 -2036263 -1820638 -1356976
35790 -1356976 -984706 -982422 -1047694 -668876 -64869 -36242 -690898 -1099704 -634056 87784
35780 87784 215610 13624 361343 1286551 1921073 1807950 1367524 1007467 635474 288205
35770 288205 417874 1097476 1572223 1127818 -35173 -1219381 -2045577 -2381360 -1987188
35761 -1987188 -918942 70435 281282 50118 294040 1182967 1958776 2045443 1643916
35752 1643916 1164697 746312 484739 512002 631253 417788 -118733 -494174 -527824 -567224
35742 -567224 -744759 -707167 -429524 -562002 -1380097 -1991779 -1353724 250952 1467170
35733 1467170 1432857 475605 -618999 -1392405 -1735285 -1674226 -1345294 -950460 -664879 -633272
35723 -633272 -846353 -899681 -282919 771870 1199235 401643 -762686 -1023146 -451035
35714 -451035 -266960 -927674 -1393117 -631441 957458 2154422 2383033 1967871 1325007
35705 1325007 561884 -215608 -754127 -934464 -916163 -913317 -988701 -1091206 -1142214 -1044177
35695 -1044177 -731464 -306688 -75848 -310964 -890744 -1273714 -1030651 -396981 -24028
35686 -24028 -93272 -24163 672106 1559329 1730328 959063 -25355 -377826 111881 1049268
35676 1049268 1804342 1843106 1103019 134807 -427237 -551762 -663997 -900092 -980923 -837087
35666 -837087 -803725 -1028966 -1195507 -1059576 -786644 -469112 203796 1379227 2510171
35657 2510171 2851065 2272744 1238785 225164 -466104 -595050 -194331 209108 31269
35648 31269 -710340 -1480026 -1881903 -1908208 -1643613 -1142239 -597888 -248364 -55689 183274
35638 183274 370432 132039 -570313 -1219270 -1334358 -984464 -487185 79808 700454 993459
35628 993459 511134 -481417 -1023624 -547048 371509 721302 332242 -28518 188337 589180
35618 589180 485828 -165761 -847075 -1191352 -1166718 -748312 48297 818735 968756 404465
35608 404465 -342548 -790524 -960058 -1064641 -1164856 -1314859 -1659427 -2122451 -2319483 -2048399
35598 -2048399 -1580174 -1209925 -848135 -389459 -168565 -586294 -1437703 -2042088 -1988780 -1434226
35588 -1434226 -767131 -337297 -425311 -1050684 -1756863 -1937225 -1496522 -966747 -891650 -1270354
35578 -1270354 -1638390 -1531856 -867069 -29120 418136 265186 -121470 -255446 -137447
35569 -137447 -202345 -701548 -1364783 -1695277 -1429660 -709107 27074 301428 -82490 -908199
35559 -908199 -1761702 -2332752 -2487488 -2220752 -1674899 -1068278 -480631 117122 514722 270516
35549 270516 -642646 -1497249 -1545875 -910047 -276526 139265 744869 1669427 2313630 2059743
35539 2059743 1049324 -1371 -507373 -351417 246747 977545 1643812 2194468 2514977
35530 2514977 2332065 1579222 732498 404354 618801 848006 750460 481089 281943 213822
35520 213822 323547 611314 801694 665163 582515 1130502 2012772 2214075 1502121 890012
35510 890012 1089314 1409137 1004547 410955 705999 1666480 2068358 1651470 1440656 1937329
35500 1937329 2270575 1661039 662326 205353 205275 -22686 -482731 -533962 4697 568134
35490 568134 679802 504104 467267 691225 886875 633921 -169622 -1023259 -1230922 -773618
35480 -773618 -406007 -566703 -666781 -49628 753246 609607 -480308 -1210795 -750056
35471 -750056 197184 560562 365401 344510 644136 741808 404157 -54459 -415391 -765250
35461 -765250 -1011943 -840025 -327014 -42008 -260572 -540877 -397847 -26976 -6062 -548809
35451 -548809 -1384742 -2150914 -2573251 -2465072 -1918618 -1381921 -1209892 -1230743 -1069438 -778113
35441 -778113 -747369 -1032302 -1196219 -900234 -277986 378074 922965 1174388 811900 -182696
35431 -182696 -1197413 -1496665 -1034735 -470953 -336235 -445534 -291439 146455 277362
35422 277362 -308274 -1128774 -1229393 -366467 582141 674506 103605 -116902 449417 1145852
35412 1145852 1206646 693210 146491 -211404 -456794 -465095 7349 828060 1531900 1851430
35402 1851430 1848900 1577986 1031466 442503 208610 382973 570817 461109 168181 -75891
35392 -75891 -265705 -489366 -701304 -800256 -741290 -470792 3609 382893 238749 -414386
35382 -414386 -1020532 -1173405 -1090581 -1139415 -1242061 -1126941 -863861 -683668 -497591 -112689
35372 -112689 244435 196130 -84207 -71399 195181 77027 -613461 -1200680 -1111793 -666696
35362 -666696 -475048 -548864 -521828 -335067 -134436 190284 740137 1095097 710296 -269043
35352 -269043 -1177845 -1737639 -2174041 -2481867 -2315769 -1755890 -1458822 -1726724 -2029183 -1820870
35342 -1820870 -1275919 -775122 -227279 484015 831579 230085 -876348 -1325048 -738622
35333 -738622 -36645 -177227 -933445 -1338744 -1005276 -493125 -434226 -738383 -866751 -651486
35323 -651486 -498214 -727156 -1037138 -927357 -471444 -199765 -197697 93766 889840 1443913
35313 1443913 1006235 38703 -276731 360350 1032785 981106 546899 380388 359165 -98263
35303 -98263 -998993 -1686188 -1683148 -1133518 -424990 187375 538025 545551 428100 640449
35293 640449 1358867 2142895 2289003 1510500 210991 -869096 -1237381 -950319 -425967
35284 -425967 -13226 214635 277395 88415 -388967 -879437 -958880 -547134 -21543 286538
35274 286538 505927 924687 1427548 1542964 1040751 201244 -558194 -1056603 -1283200 -1280320
35264 -1280320 -1250528 -1446394 -1703987 -1431988 -441156 534455 659530 107339 -260810 -153392
35254 -153392 -26735 -41321 240936 869000 1124706 632626 58082 72504 344450 305826
35244 305826 221438 532299 715582 1744 -1070169 -1110258 86060 1170982 1135367 459250
35234 459250 30830 -37843 -36518 -40880 -231266 -972697 -1961663 -2102261 -950532 429099
35224 429099 814542 376111 38973 -75330 -525881 -1262789 -1576931 -1259899 -856093 -710051
35214 -710051 -586966 -339982 -201394 -227581 -89111 365253 827725 985175 841683 494779
35204 494779 8343 -402381 -461675 -218785 -26547 -100358 -388741 -812021 -1259846 -1440759
35194 -1440759 -1183990 -855487 -1017801 -1679017 -2308150 -2565009 -2557530 -2413808 -2113204 -1763569
35184 -1763569 -1549993 -1367504 -957204 -384583 101879 587871 1246692 1663503 1206229
35175 1206229 153995 -389765 53037 800240 1242502 1705588 2516432 3052286 2584569
35166 2584569 1548628 1058195 1370191 1625573 1082930 -23653 -908382 -1033162 -404917
35157 -404917 563973 1360433 1677848 1462867 727706 -420080 -1547431 -2121455 -2131421 -2049594
35147 -2049594 -1974663 -1379358 -99109 1000173 961221 -33085 -1004367 -1474926 -1743909
35138 -1743909 -2035904 -2098821 -1730634 -1176031 -850208 -959080 -1391919 -1752171 -1617147 -1014314
35128 -1014314 -429661 -98853 331183 1053497 1506004 1160445 490350 339789 615828
35119 615828 544935 76804 -41216 332124 383235 -227468 -621805 -21855 991229 1279497
35109 1279497 644249 -200076 -708941 -835587 -582765 40790 738846 1201973 1573515
35100 1573515 2115092 2529442 2225342 1274434 519276 549300 998823 1073827 466045 -450726
35090 -450726 -1092246 -1143035 -742066 -369456 -446337 -914482 -1279662 -1162009 -731778 -490685
35080 -490685 -650104 -854929 -603015 125948 817790 1044983 945359 890780 858077 516260
35070 516260 -61206 -241179 355314 1223646 1532689 1126120 579066 337973 218302 -169715
35060 -169715 -849661 -1533024 -2022658 -2301800 -2275792 -1674577 -371061 1236131 2325329
35051 2325329 2313181 1447876 623683 519539 982050 1321838 1138752 740983 750465 1360471
35041 1360471 2034524 2006987 1120374 49627 -453873 -425393 -520890 -1039759 -1518401 -1438789
35031 -1438789 -945772 -543738 -363823 -142530 208075 431882 336392 28724 -310932 -609503
35021 -609503 -774270 -634856 -154989 427534 779422 761536 569034 635955 1261500 2160888
35011 2160888 2538097 1897946 726407 54592 355809 1170754 1780206 1836055 1296043
35002 1296043 273741 -772963 -1159707 -714364 -129334 -168889 -748754 -1238529 -1459337
34993 -1459337 -1788574 -2319008 -2578601 -2296818 -1880090 -1750101 -1659806 -1177268 -544386 -410731
34983 -410731 -774931 -860748 -245560 474579 560718 227567 263835 779157 1055129 721383
34973 721383 354624 519602 794869 379171 -664927 -1489941 -1667108 -1555256 -1394156
34964 -1394156 -848382 157637 855444 542684 -337417 -722978 -322487 192654 265028
34955 265028 8015 -353073 -878832 -1502568 -1796943 -1507700 -919599 -383299 163903 900112
34945 900112 1666373 2126398 2121686 1645756 813435 105289 181020 1017746 1637462 1235874
34935 1235874 274193 -142556 282269 878505 1135677 1224080 1367322 1426771 1291796 1077531
34925 1077531 732769 4962 -990357 -1697113 -1843135 -1714415 -1484774 -879019 146306
34916 146306 996329 1227695 1261079 1726762 2472959 2836875 2628059 2202252 1716378 969114
34906 969114 4188 -688090 -735012 -309255 120644 256264 162578 155133 455447 873171
34896 873171 1006514 852201 899385 1425447 2074810 2407171 2429734 2231022 1613642 638327
34886 638327 19801 240231 667600 399298 -333431 -564355 -183451 -24782 -361409 -470010
34876 -470010 49785 602674 656724 498645 441040 208160 -294242 -480011 -62832 265855
34866 265855 -67497 -491399 -273521 137389 -149931 -854633 -850030 90947 1053150 1491726
34856 1491726 1836646 2331486 2326937 1296562 -158380 -950927 -792562 -369666 -443630 -1082060
34846 -1082060 -1652777 -1426687 -312675 982704 1691306 1774548 1691377 1546723 987830
34837 987830 -45131 -1013511 -1400624 -1227983 -816967 -450615 -406536 -845081 -1406239 -1345232
34827 -1345232 -416621 684129 1092948 735773 190936 -158591 -407454 -656404 -717539
34818 -717539 -465391 -229315 -521561 -1301764 -1740226 -1053267 393152 1224394 585538
34809 585538 -813561 -1607166 -1422039 -1017488 -996898 -1200643 -1433304 -1900624 -2539026 -2658183
34799 -2658183 -1835648 -654632 41627 239369 510400 1012468 1384413 1442077 1337003
34790 1337003 1114435 736387 540010 1039383 2092914 2762772 2279246 875323 -502175
34781 -502175 -1089595 -824897 -226264 97063 -54583 -391549 -608672 -796986 -1168890 -1550999
34771 -1550999 -1549616 -1176344 -870568 -829738 -739147 -328527 173444 363903 163048 -218719
34761 -218719 -560675 -690721 -522413 -242470 -217786 -501195 -684892 -485361 -190254 -204072
34751 -204072 -423071 -484401 -427695 -586273 -899555 -907735 -525887 -290374 -591535 -1084453
34741 -1084453 -1178430 -797097 -318750 -15880 70502 -123593 -634697 -1185885 -1314892 -879657
34731 -879657 -228777 170480 123088 -227182 -523704 -443038 -33191 267922 206878 186589
34721 186589 768518 1749677 2244286 1808932 992410 531914 478133 460530 368460 275788
34711 275788 22588 -543074 -1066246 -984313 -284575 488554 914025 932724 525634 -263916
34701 -263916 -989987 -1103553 -721309 -542487 -852003 -1182515 -1170838 -1117720 -1335393 -1516004
34691 -1516004 -1235789 -640271 -132079 230827 518566 503044 47559 -389148 -295295 58903
34681 58903 -2060 -489967 -759215 -528321 -187445 -49968 9981 79242 64436 168915
34671 168915 745982 1412081 1135977 -275924 -1522895 -1359885 -258893 306312 -134845
34662 -134845 -701408 -701554 -526927 -753175 -1157715 -1150076 -705516 -330903 -311349 -433219 -397550
34651 -397550 -180183 40020 90371 -104224 -491621 -890224 -1096594 -1069569 -997730 -1116356
34641 -1116356 -1398687 -1481881 -1053588 -335309 46774 -160122 -398256 49883 1077948
34632 1077948 1806665 1650645 949211 388862 178500 99519 80732 262862 550694 553225
34622 553225 133490 -288625 -263452 -14869 -288065 -1387428 -2596211 -2839390 -1912953
34613 -1912953 -765024 -413291 -841389 -1244517 -1163265 -933320 -1028156 -1412084 -1683321 -1488696
34603 -1488696 -659641 646510 1735655 1789898 867041 66794 230037 854190 877642
34594 877642 196021 -341349 -234416 217534 727750 1367169 1918834 1780817 913311 151254
34584 151254 122563 486140 667039 674072 694163 587607 405192 690586 1506695 1864865
34574 1864865 1065789 -28752 -180604 326097 306049 -225105 -190678 390824 191315 -1108727
$$ [...]
##END NTUPLES=NMR SPECTRUM
##END=
