##TITLE=31Pdec_SR28_3
 , 124 sc
 23.12.2020
##JCAMPDX= 6.0         $$ Bruker NMR JCAMP-DX V2.0
##DATA TYPE= NMR SPECTRUM
##DATA CLASS= NTUPLES
##ORIGIN= UXNMR, Bruker Analytische Messtechnik GmbH
##OWNER= root
$$ XWIN-NMR		Version 3.5
$$ Wed Dec 23 13:08:16 2020 Russian Standard Time (UT+4h)  she@DPX200
##.OBSERVE FREQUENCY= 81.013821
##.OBSERVE NUCLEUS= ^31P
##.ACQUISITION MODE= SIMULTANEOUS
##.ACQUISITION SCHEME= undefined
##.AVERAGES= 124
##.DIGITISER RES= 17
##SPECTROMETER/DATA SYSTEM= spect
##.PULSE SEQUENCE= zgpg30
##.SOLVENT NAME= CDCl3
##.SHIFT REFERENCE= (INTERNAL, CDCl3, 0, 182.463)
##AUDIT TRAIL= $$ (NUMBER, WHEN, WHO, WHERE, WHAT)
$$ ##TITLE= Audit trail, XWIN-NMR		Version 3.5
$$ ##JCAMPDX= 5.01
$$ ##ORIGIN= Bruker BioSpin GmbH
$$ ##OWNER= she
$$ F:/spectra/data/she/nmr/P31/1/pdata/1/auditp.txt
$$ ##AUDIT TRAIL=  $$ (NUMBER, WHEN, WHO, WHERE, WHAT)
(   1,<2020-12-23 13:07:28.79 +0400>,<she>,<DPX200>,
      <continue with go, POWCHK disabled, PULCHK disabled
       configuration hash MD5:
       00 E9 B6 7A A2 85 ED C7 34 08 36 98 17 FE 4E 26
       data hash MD5: 32K
       F3 9F 59 E2 72 7D AF C0 B5 8E EC 8D 8F 72 E7 EF>)
(   2,<2020-12-23 13:07:30.51 +0400>,<she>,<DPX200>,
      <Start of raw data processing
       efp BC_mod = 2 LB = 1 FT_mod = 6 PKNL = 1 PHC0 = -2464.918 PHC1 = 63.20083 SI = 64K 
       data hash MD5: 64K
       AB AF 61 29 4B 73 44 F7 2D 74 2C 72 62 1E F3 34>)
(   3,<2020-12-23 13:07:41.70 +0400>,<she>,<DPX200>,
      <pk PHC0 = 3.353314 PHC1 = 0 
       data hash MD5: 64K
       22 D7 BF 5A ED AE 3B E9 83 F0 98 69 5E 54 79 56>)
$$ ##END=
$$ 
$$ hash MD5
$$ 83 EF E6 AD 3A 85 EE 00 82 EB D9 7A CB BE 76 99
##$RELAX= 
##$RELAX= 
##$RELAX= 
##$RELAX= 
##$RELAX= 
##$RELAX= 
##$RELAX= 
##$RELAX= 
$$ Bruker specific parameters
$$ --------------------------
##$DU= <F:/spectra>
##$EXPNO= 1
##$NAME= <P31>
##$PROCNO= 1
##$TYPE= <nmr>
##$USER= <she>
##$AMP= (0..31)
100 100 100 100 100 100 100 100 100 100 100 100 100 100 100 100 100 100 
100 100 100 100 100 100 100 100 100 100 100 100 100 100 
##$AQSEQ= 0
##$AQ_mod= 1
##$AUNM= <au_zg>
##$AUTOPOS= <>
##$BF1= 81.014009
##$BF2= 200.13
##$BF3= 200.13
##$BF4= 200.13
##$BF5= 200.13
##$BF6= 200.13
##$BF7= 200.13
##$BF8= 200.13
##$BYTORDA= 1
##$CFDGTYP= 0
##$CFRGTYP= 5
##$CHEMSTR= <none>
##$CNST= (0..31)
1 1 145 1 1 1 1 1 1 1 1 1 1 1 1 1 1 1 1 1 1 1 1 1 1 1 1 1 1 1 1 1 
##$CPDPRG= <waltz16>
##$CPDPRG1= <>
##$CPDPRG2= <waltz16>
##$CPDPRG3= <>
##$CPDPRG4= <mlev>
##$CPDPRG5= <mlev>
##$CPDPRG6= <mlev>
##$CPDPRG7= <mlev>
##$CPDPRG8= <mlev>
##$CPDPRGB= <>
##$CPDPRGT= <>
##$D= (0..31)
0 1 0 0 0 0 0 0 0 0 0 0.03 2e-05 3e-06 0 0 0 0 0 0 0 0 0 0 0 0 0 0 0 0 
0 0 
##$DATE= 1608714258
##$DBL= (0..7)
120 120 120 11 120 120 24 19 
##$DBP= (0..7)
150 150 150 150 150 150 150 150 
##$DBP07= 0
##$DBPNAM0= <>
##$DBPNAM1= <>
##$DBPNAM2= <>
##$DBPNAM3= <>
##$DBPNAM4= <>
##$DBPNAM5= <>
##$DBPNAM6= <>
##$DBPNAM7= <>
##$DBPOAL= (0..7)
0.5 0.5 0.5 0.5 0.5 0.5 0.5 0.5 
##$DBPOFFS= (0..7)
0 0 0 0 0 0 0 0 
$$ [...]
##$SUBNAM2= <"">
##$SUBNAM3= <"">
##$SUBNAM4= <"">
##$SUBNAM5= <"">
##$SUBNAM6= <"">
##$SUBNAM7= <"">
##$SUBNAM8= <"">
##$SUBNAM9= <"">
##$SW= 369.568048894756
##$SWIBOX= (0..15)
0 1 3 0 0 0 0 0 0 0 0 0 0 0 0 0 
##$SW_h= 29940.119760479
##$TD= 32768
##$TD0= 1
##$TE= 0
##$TE2= 300
##$TE3= 300
##$TEG= 300
##$TL= (0..7)
0 120 53 12 22 120 120 120 
##$TP= (0..7)
150 150 150 150 150 150 150 150 
##$TP07= 0
##$TPNAME0= <>
##$TPNAME1= <>
##$TPNAME2= <>
##$TPNAME3= <>
##$TPNAME4= <>
##$TPNAME5= <>
##$TPNAME6= <>
##$TPNAME7= <>
##$TPOAL= (0..7)
0.5 0.5 0.5 0.5 0.5 0.5 0.5 0.5 
##$TPOFFS= (0..7)
0 0 0 0 0 0 0 0 
##$TUNHIN= 0
##$TUNHOUT= 0
##$TUNXOUT= 0
##$USERA1= <user>
##$USERA2= <user>
##$USERA3= <user>
##$USERA4= <user>
##$USERA5= <user>
##$V9= 5
##$VALIST= <valist>
##$VCLIST= <CCCCCCCCCCCCCCC>
##$VD= 0
##$VDLIST= <DDDDDDDDDDDDDDD>
##$VPLIST= <PPPPPPPPPPPPPPP>
##$VTLIST= <TTTTTTTTTTTTTTT>
##$WBST= 1024
##$WBSW= 4
##$XGAIN= (0..3)
0 0 0 0 
##$XL= 0
##$YL= 0
##$YMAX_a= 23640
##$YMIN_a= -41673
##$ZGOPTNS= <>
##$ZL1= 120
##$ZL2= 120
##$ZL3= 120
##$ZL4= 120
##$ABSF1= 0
##$ABSF2= 0
##$ABSG= 0
##$ABSL= 0
##$ALPHA= 0
##$AQORDER= 0
##$ASSFAC= 0
##$ASSFACI= 0
##$ASSFACX= 0
##$ASSWID= 0
##$AUNMP= <proc_1d>
##$AZFE= 0.1
##$AZFW= 0.5
##$BCFW= 0
##$BC_mod= 2
##$BYTORDP= 0
##$COROFFS= 0
##$CY= -3
##$DATMOD= 1
##$DC= 0
##$DFILT= <>
##$DTYPP= 0
##$F1P= 0
##$F2P= 0
##$FCOR= 1
##$FTSIZE= 65536
##$FT_mod= 6
##$GAMMA= 0
##$GB= 0
##$INTBC= 1
##$INTSCL= 5.30512e-09
##$ISEN= 30
##$LB= 1
##$LEV0= 0
##$LPBIN= 0
##$MAXI= 10000
##$MC2= 0
##$MEAN= 0
##$ME_mod= 0
##$MI= 50
##$NCOEF= 0
##$NC_proc= -8
##$NLEV= 6
##$NOISF1= 182.463
##$NOISF2= 159.3651
##$NSP= 0
##$NTH_PI= 0
##$NZP= 0
##$OFFSET= 182.463
##$PC= 4
##$PHC0= -2461.565
##$PHC1= 63.20083
##$PH_mod= 1
##$PKNL= yes
##$PPARMOD= 0
##$PSCAL= 0
##$PSIGN= 0
##$REVERSE= no
##$SF= 81.014009
##$SI= 65536
##$SIGF1= 159.3651
##$SIGF2= -187.1042
##$SINO= 113.3802
##$SIOLD= 16384
##$SREGLST= <1H.CDCl3>
##$SSB= 0
##$STSI= 65536
##$STSR= 0
##$SW_p= 29940.119760479
##$SYMM= 0
##$S_DEV= 0
##$TDeff= 32768
##$TDoff= 0
##$TI= <>
##$TILT= no
##$TM1= 0
##$TM2= 0
##$TOPLEV= 0
##$USERP1= <user>
##$USERP2= <user>
##$USERP3= <user>
##$USERP4= <user>
##$USERP5= <user>
##$WDW= 1
##$XDIM= 65536
##$YMAX_p= 287641640
##$YMIN_p= -78742655
$$ End of Bruker specific parameters
$$ ---------------------------------
##NTUPLES= NMR SPECTRUM
##VAR_NAME=  FREQUENCY,     SPECTRUM/REAL,   SPECTRUM/IMAG
##SYMBOL=    X,             R,               I
##VAR_TYPE=  INDEPENDENT,   DEPENDENT,       DEPENDENT
##VAR_FORM=  AFFN,          ASDF,            ASDF
##VAR_DIM=   65536,         65536,           65536
##UNITS=     HZ,            ARBITRARY UNITS, ARBITRARY UNITS
##FACTOR=    0.456856943014862, 1,           1
##FIRST=     14782.0589164895, 0,            0
##LAST=      -15158.0608439895, 0,           0
##MIN=       -15158.0608439895, -78742655,   0
##MAX=       14782.0589164895, 287641640,    0
$$ Real data points
##PAGE= N=1
##DATA TABLE= (X++(R..R)), XYDATA
$$ [...]
46132 20585532 5755491 -8140744 -9684694 -2796305 1470958 -2640972 -10197923 -12020011
46124 -12020011 -6514935 -1457500 -1982095 -3019683 584810 2860693 -4561986 -16384069
46116 -16384069 -18504823 -8885905 -1125985 -3875265 -8322282 -2966993 8396278 12875345
46108 12875345 7538852 2635255 6664714 15611689 18716777 11187073 -526882 -5415598
46100 -5415598 -40336 6756426 3766472 -8867638 -20667519 -25418867 -27293514 -29584257
46092 -29584257 -25987944 -10523091 10064562 23536955 28621283 33667801 39479380 35353631
46084 35353631 16598668 -3783828 -9125361 298632 9263123 8594496 5810625 12325624
46076 12325624 25935513 31669921 19490151 -2925314 -17237115 -12944335 3486906
46069 3486906 17690686 22198239 19961242 15998770 10725229 2580382 -6680245 -12338258
46061 -12338258 -11269373 -4613963 3269288 7928975 8392596 8161356 10801870 14390758
46053 14390758 13653961 8808161 7708099 15274900 24220370 22179546 7513611 -7068955
46045 -7068955 -7604983 7373784 25655061 30644073 13767032 -16551838 -38649416 -37077607
46037 -37077607 -19619460 -8589431 -14135753 -24517067 -25671407 -19800690 -16862019 -16876219
46029 -16876219 -12429727 -3436917 3317937 7079636 12831660 18240045 13913139 -607889
46021 -607889 -13243073 -16570862 -17890557 -25946551 -37200253 -42940238 -42378031 -40695889
46013 -40695889 -40018327 -39473476 -38565294 -33935089 -19488847 2521292 17534353 15252477
46005 15252477 3935798 -2428339 -4987499 -14553245 -29360009 -34628333 -25612322 -16095657
45997 -16095657 -18719681 -28277844 -30856310 -21526237 -7715038 -839328 -7056148 -19956053
45989 -19956053 -22280757 -4229542 19599210 23896650 5602860 -11571961 -10949637 -3908646
45981 -3908646 -5851947 -8640151 3381178 21527159 21699841 2337489 -11199700 -4911875
45973 -4911875 3122572 -8675215 -32947070 -44572390 -34320504 -16435486 -7435152
45966 -7435152 -10379962 -18613651 -24231248 -22283557 -14480315 -8983504 -10469901 -12295716
45958 -12295716 -6044338 3755877 5299317 -388702 1360448 14591597 21255551 5428500
45950 5428500 -20200444 -27399222 -9409846 10227302 8677331 -9456762 -23328226
45943 -23328226 -23757103 -19566981 -20693928 -25752597 -27453926 -23109945 -16168485 -10185746
45935 -10185746 -4493211 3259758 10748292 10013821 -3120891 -19562565 -23224370 -9234405
45927 -9234405 9698353 18486159 15330263 7531238 -1482147 -12516957 -22307421 -24724098
45919 -24724098 -19309874 -10427956 811781 14681033 23716944 16975807 -3413435 -20048712
45911 -20048712 -19916278 -8191879 2960555 10775261 18808514 24455376 21383539 13229922
45903 13229922 13910717 30272356 50780871 56815229 43202581 23458139 14437368 18955572
45895 18955572 25991153 26161851 21616219 18391317 14664040 3899786 -11760206 -19753872
45887 -19753872 -12180528 2755761 9312896 2203895 -8133195 -8706652 79841 4517067
45879 4517067 -4952315 -19442513 -21023441 -6493555 7229500 5815407 -4181789 -8165571
45871 -8165571 -4798631 -1137982 5545914 22762310 42733398 47731834 37173369 28796013
45863 28796013 27825815 17077607 -11539698 -37005428 -37642701 -22628259 -14706341 -14165821
45855 -14165821 -3561500 18234173 31046394 23195237 5892914 -6404325 -13490308
45848 -13490308 -21016056 -27479900 -27499072 -20953664 -13430587 -11074370 -15760742 -21300400
45840 -21300400 -16308253 3349117 27195245 41094017 42124284 36490217 28645383 21595839
45832 21595839 21846179 31874524 41508874 38982510 27446246 18664320 14732884 9928609
45824 9928609 6032783 8698498 11230566 1300077 -15762293 -20277366 -7805993 4515915
45816 4515915 6259458 7570315 16197600 21042148 11915522 -922802 -2371907 4661566
45808 4661566 6999828 2568968 89694 3685523 8943252 9338949 -325098 -19248332
45800 -19248332 -34214261 -29563173 -10254083 -532185 -10473272 -20802727 -14516413 -5318066
45792 -5318066 -14001595 -31321661 -30350714 -8001351 12343508 17278148 16737363 18696001
45784 18696001 14815884 -877692 -18130721 -24915819 -22117201 -16214060 -9221865 -2638509
45776 -2638509 -824892 -4270134 -8186158 -11563223 -18192419 -26022752 -26578420 -18416306
45768 -18416306 -9698329 -3731940 5198298 16441899 17637613 3667280 -11396185 -12477427
45760 -12477427 -4135997 -1496598 -8324614 -16306506 -20353528 -21800415 -19496927 -10284252
45752 -10284252 1747626 7086214 3443683 -1620787 -2211070 -797604 -1245818 -1889534
45744 -1889534 615453 4859143 6074118 2059819 -4871359 -10801917 -13530150 -13982698
45736 -13982698 -15560028 -21184974 -29522453 -34498032 -30407158 -18180374 -4852556 4485812
45728 4485812 11627523 18787695 20292331 8637804 -10398832 -18546886 -6970080 10500548
45720 10500548 14785163 6094184 101278 3629803 7606540 4458623 -944378 -2118300
45712 -2118300 -1766388 -5124326 -10062684 -10536128 -5373885 1271633 5167239 5334846 5539732
45703 5539732 12395270 26451858 36179206 29333393 10547724 -2526310 -2060788 2502633
45695 2502633 2392408 767266 -189954 -8458551 -27203415 -42876707 -42034986 -30785851
45687 -30785851 -23148383 -18174015 -5319719 12515894 19496530 10070887 -4096328 -11716562
45679 -11716562 -12238249 -7132028 4214160 15516414 14164362 -2089419 -18837706 -21852924
45671 -21852924 -12490667 -1653784 3482467 2079484 -2788430 -3945303 4924326 18900458
45663 18900458 23638515 12821486 -2959870 -9389597 -3081099 11136387 27601179
45656 27601179 37234497 27786779 -1736031 -32887255 -45514154 -40401970 -34503883 -37228383
45648 -37228383 -42300799 -41324501 -34438911 -26799909 -23029403 -25613553 -31623915 -32089311
45640 -32089311 -22537122 -12412506 -14372364 -25229970 -28912531 -19602208 -10197961 -13882887
45632 -13882887 -27593001 -39006421 -41423823 -36525441 -29710741 -27136768 -30527982 -32416457
45624 -32416457 -25566718 -19003027 -30940886 -59578029 -76324571 -60278639 -26737181
45617 -26737181 -6469066 -7436131 -14750167 -19419174 -24727560 -27765503 -19007882 -3437049
45609 -3437049 129229 -12009808 -19818367 -9384042 6701108 11017694 6957132 7166269
45601 7166269 9642154 3821871 -7467637 -10663729 -3003465 4314827 3427585 -2969740
45593 -2969740 -10650229 -17378583 -17627152 -6231873 10930746 20069416 15002380 1718092
45585 1718092 -11569060 -19648455 -17469869 -4126022 9716910 10334850 -968622 -9323331
45577 -9323331 -7745062 -5063209 -9289057 -16011475 -18873502 -19041284 -16640172 -4771754
45569 -4771754 17446380 35483709 35349112 22926696 15711525 19489926 24875458 24533670
45561 24533670 21621823 20167645 17703518 11106174 2116848 -7251320 -19136546 -34431274
45553 -34431274 -46181444 -44449732 -28539309 -10092513 -1027459 -1062856 -2148375 -3735913
45545 -3735913 -14580906 -35489710 -50169310 -43632884 -23672441 -11039992 -11114243 -9970736
45537 -9970736 1134175 13322241 16310606 11960172 4855072 -6439453 -19775872 -24240377
45529 -24240377 -15524610 -5355991 -4514282 -7209740 -3900948 1902979 3128326 3467799
45521 3467799 6025975 -237866 -21846173 -38394928 -24675831 8452056 22350655
45514 22350655 1925359 -27078893 -37903278 -34472064 -32546042 -32678184 -28202631 -22603322
45506 -22603322 -21726849 -21580727 -19077588 -22358807 -34501064 -39314346 -22342290 3444209
45498 3444209 13723973 8568221 9987825 25429162 36434388 28117535 10106081 -484714
45490 -484714 -1348404 158726 2508998 8554102 15899631 19472796 19804401 20669924 21867815
45481 21867815 21342921 21117123 23825720 25734085 20510503 8928408 -1685991 -6925175
45473 -6925175 -7725538 -4010790 5971042 18101156 22245928 14422513 3155436 -1715663
45465 -1715663 -1178241 -1315698 -915875 4838847 10947413 6166212 -7405765 -11810487
45457 -11810487 1722723 16461062 11240881 -9366406 -20833890 -12114717 2312988
45450 2312988 6064581 1701995 1037994 6242614 10395719 9627422 5223217 -1655335
45442 -1655335 -8854157 -10837422 -6099414 -3759794 -13175497 -28597192 -34658747 -27911473
45434 -27911473 -21804211 -25809634 -29878306 -18857093 3515441 16560168 8730484 -8228185
45426 -8228185 -15271218 -8549459 1105669 6127980 9452757 13791819 14373762 8161614
45418 8161614 2960262 8718950 22756141 31775262 27952150 16018898 4368778 -3686583
45410 -3686583 -8342173 -9863093 -10220053 -13705356 -22440862 -33248856 -40128858 -38196580
45402 -38196580 -26724864 -11982319 -4704008 -8955774 -15554008 -13529696 -5581877 -2679681
45394 -2679681 -5538837 -4579120 1054630 69978 -10164745 -14995153 -4302180 10341933
45386 10341933 12269160 2400592 -7538102 -14174379 -19790921 -19142989 -6606722 8481516
45378 8481516 11396693 4663551 4128567 13586339 20863975 19737345 17430555 17276521
45370 17276521 12625366 4124015 4625516 16978431 23405217 10147483 -10550413 -17928106
45362 -17928106 -11887067 -8224670 -11379147 -9890102 1816640 13329052 14016495 7180500
45354 7180500 2572311 2642917 2861813 1430960 1834126 5767831 8666363 5647696 -144837
45345 -144837 -492551 5239269 6724573 -2618262 -13125550 -10292763 4195344 13764482
45337 13764482 8897495 -3771896 -15410623 -25011711 -31665527 -30243313 -21683953 -15677839
45329 -15677839 -15480333 -12084751 -2177810 1677872 -8707051 -19262749 -11977347 8523841
45321 8523841 23828505 29062329 32421917 33823578 25995857 14942335 16865411 32236811
45313 32236811 43474960 42508640 40480148 44274511 44399752 35839426 31109330 39133526
45305 39133526 47860536 43128284 30898629 24693111 23028226 16883601 10098621 13720480
45297 13720480 25997256 35462389 39634856 43939153 45614909 36093365 17993134 3302680
45289 3302680 -4591143 -10736809 -11567200 2817323 26685887 38379804 28703770 12860989
45281 12860989 6504041 6447875 4910559 6278962 15401416 22272562 15186040 926609
45273 926609 -4316547 1234884 5586245 3576285 1086337 -45197 -5452691 -14272389
45265 -14272389 -15716430 -4613928 10426279 19685986 23892865 27062000 25812505 13953221
45257 13953221 -6129780 -23519568 -29294436 -23551199 -13454116 -6661084 -4677830 -672192
45249 -672192 13928899 38596309 61441478 69926855 62494664 48060015 35651586 26925358
45241 26925358 18803285 11321762 9945045 18012338 28735823 30147934 20014546 10784754
45233 10784754 15552483 32812943 49397626 54493208 46001878 28467335 12100471
45226 12100471 8750611 18969580 26763924 18361564 2837682 154851 10719096 14817650
45218 14817650 4789084 -2733763 4289394 11948122 3557299 -11622979 -13132847 -2436745
45210 -2436745 1411109 -5196785 -5086600 9856734 24432856 22905152 10081453 1353975
45202 1353975 4170574 17200772 36554701 54060714 58803208 49493801 38027405 32988123
45194 32988123 27539865 12670978 -5097422 -10711352 -1116077 12315601 20180200 23869121
45186 23869121 28001117 32858894 36236190 36636527 32894868 24898317 15451375 8133644
45178 8133644 3607480 665280 -1167451 -3375176 -9221348 -17661628 -20432423 -12536965
45170 -12536965 -2429370 -2275796 -9577176 -9979853 103819 6517136 -670441 -9704416
45162 -9704416 -3003922 16207436 26564452 16890961 -444476 -7837046 -4293066 -2614721
45154 -2614721 -11025489 -25123155 -35365094 -35653108 -25296141 -9005876 3964782 6329419
45146 6329419 760271 -3070792 -1494357 -1301882 -7385931 -12430794 -6954929 4321077
45138 4321077 6944009 -2016859 -8162830 121369 14817898 19325268 10749359 2385568
45130 2385568 5946612 18983437 30437209 33157112 29286746 25839922 25716242 23284124
45122 23284124 11869495 -3884601 -9356137 2399447 20311774 28417866 23724264
45115 23724264 14153808 5306744 -575466 1928088 15266705 28203675 25809222 11259845
45107 11259845 3455520 10052061 17557685 13485475 3415345 -2178634 -3831492 -4841699
45099 -4841699 -183659 12278630 19836200 10250455 -7723535 -15003889 -8751488 -2739444
45091 -2739444 -4724584 -9733855 -14295174 -20746532 -26650901 -25552551 -19971672 -18766148
45083 -18766148 -20252926 -14244136 -3021666 -1687520 -12359980 -17318837 -6490950 7107791
45075 7107791 10650270 11360228 18494841 24110750 21200565 24204805 46291807 67830598
45067 67830598 56673858 16048476 -16304641 -18516150 -7230017 -4339805 -7727949
45060 -7727949 -7129791 -6251077 -11815198 -16402491 -9884115 2318163 7892101 6840080
45052 6840080 8453934 15779497 25532809 36894769 47637812 47658894 30534249 7712892
45044 7712892 -2734283 495949 2995528 -2214748 -6631960 -2896365 3584004 4080624
45036 4080624 -2062022 -9843249 -14818216 -13440497 -4243502 7661272 12856750 7282325
45028 7282325 -4628396 -16776297 -25305189 -25816302 -15229876 1030225 11358828 10879552
45020 10879552 5694090 2179180 200434 198393 7200255 20908423 30032564 25537321
45012 25537321 13862858 7633737 7726381 5201353 -1385398 -2681401 5757185 15003871
45004 15003871 14711618 6044249 -2543004 -6729671 -7952197 -7894886 -7264450 -7274507 -6889614
44995 -6889614 -1185706 11428406 22763326 23676726 18549327 20695249 30580962 30078146
44987 30078146 6926520 -23783180 -35000365 -20663483 -329176 8053896 5901912
44980 5901912 1850131 -3520850 -12407105 -19791834 -19132058 -12047464 -4222575 2459659
44972 2459659 6197405 1070757 -13339200 -24000044 -17463466 2605349 20861107 29019970
44964 29019970 28845951 22168096 11644058 7305357 16305066 27680484 23943316 7615307
44956 7615307 -1966982 251618 -1821669 -15344236 -23844941 -14709922 -1528769 -2312695
44948 -2312695 -11206949 -10879719 -831746 7100070 12268666 22095402 30763162 24409158
44940 24409158 7645188 2674981 17066110 31559227 27975516 13376390 5899041
44933 5899041 8080114 6195676 -9171913 -30807288 -41511055 -29835955 -2258665
44926 -2258665 19615180 19194918 2585474 -9887786 -8568588 -1569986 2766166 7611002
44918 7611002 16912197 24324174 21204861 8506649 -6284778 -17826904 -22612898 -17371216
44910 -17371216 -5529896 837985 -5804557 -17385539 -19975038 -10788284 1798579 10604929
44902 10604929 13116738 6554108 -9335292 -25228049 -28993650 -21781502 -18131435 -26578034
44894 -26578034 -38407397 -40726068 -33590028 -26911177 -24659916 -20691715 -10316715 1000222
44886 1000222 3983034 -2474600 -9371574 -7814989 751264 6075201 1120638 -8727036
44878 -8727036 -10720750 91106 12961662 12034701 -4879585 -21800577 -21808264 -6406331
44870 -6406331 7201218 7783806 2294440 2726473 7139781 2887819 -12182376 -22025109
44862 -22025109 -11352692 13887822 32532503 32157255 19235242 5759768 -4551006
44855 -4551006 -11563009 -8686803 10603471 36916795 47780461 32606877 7095813
44848 7095813 -5391341 -1442541 3068786 -2610860 -13091296 -20395479 -24506776 -25354483
44840 -25354483 -17603643 -3090222 2347409 -12181664 -33254838 -37220235 -21274730
44833 -21274730 -6384119 -8529805 -20548518 -26506586 -22411493 -15859262 -13360268 -15654501
44825 -15654501 -21036316 -26782631 -28968166 -24850686 -15352192 -5182171 -1963537 -12031077
44817 -12031077 -31363661 -43232397 -33814263 -10672255 3274592 -3581888 -19203677
44810 -19203677 -24756260 -14943474 2347388 17808466 26147661 26536206 23444955 22091395
44802 22091395 19725298 8070839 -12607793 -30647270 -38530557 -41557196 -45372501 -45991102
44794 -45991102 -40486322 -35956153 -36176246 -29981689 -7922739 17662584 26332057 18068845
44786 18068845 10101177 8588714 4073224 -4199010 -2278485 12157984 17821810 -1521188
44778 -1521188 -30290497 -38994206 -20749280 4907375 19528108 22315988 20688563 18279711
44770 18279711 15778363 14461910 14410814 13931126 12761000 11998024 10583347 6790139 3791558
44761 3791558 7922327 18785648 25903428 19613113 3292288 -9140105 -7770082 3835514
44753 3835514 14185964 16754898 15167048 15723392 17884248 15734065 8371428 3774726
44745 3774726 8980674 19551040 23832709 17169618 7361182 5281728 13839190 27027622
44737 27027622 35736450 33028913 18753149 2698299 -963912 12177017 30197853
44730 30197853 37342067 31216432 22044659 16826027 12111917 3129344 -8034157 -16439556
44722 -16439556 -19920090 -17333688 -7480392 6322348 16564645 20501275 22747939 25555539
44714 25555539 25043790 22384512 27785266 43278000 51577404 36476715 7785698 -10036245
44706 -10036245 -10257101 -7878754 -12769312 -17153099 -12517298 -2137516 7946539 15724436
44698 15724436 17027731 7855814 -3134911 -1499365 8531613 5847196 -13467070 -25676615
44690 -25676615 -16117114 -4512657 -14500580 -36815702 -46508508 -41992630 -39881481 -40705075
44682 -40705075 -29058357 -4965778 12518849 14772848 12321978 10875390 1947819 -16612670
44674 -16612670 -31701195 -34238275 -29618612 -22662011 -10601658 1604656 -1524026 -22126985
44666 -22126985 -38973568 -34404849 -17952135 -10037092 -13663316 -16216598 -10831923 -2190278
44658 -2190278 3951542 5480207 867235 -10269781 -24941046 -38710696 -46382443 -40615849
44650 -40615849 -18252881 10499159 29284043 33965461 32714527 27586913 12610588
44643 12610588 -6582715 -12125476 -2362304 164655 -16153575 -29307261 -16773469
44636 -16773469 6082538 7221791 -13284781 -24762907 -12722973 4483801 8895756
44629 8895756 6522855 8431630 9647792 661576 -13773426 -20680427 -16023361 -6007518
44621 -6007518 3255194 9502490 11207706 6668334 -4322107 -18584857 -27531673 -20589119
44613 -20589119 2525256 25383503 29744983 16310143 1665092 -4409376 -7229336
44606 -7229336 -12173835 -14983482 -12586890 -11987115 -19652177 -29577852 -30633209 -21461107
44598 -21461107 -10932463 -6474330 -7334064 -7389435 -900483 12280149 24687625 27559277
44590 27559277 21343857 15715572 16305827 16451497 7087775 -8875221 -18529290 -14681619
44582 -14681619 -4108250 1355794 -1922290 -8055233 -11633045 -14282097 -19331408 -24107884
44574 -24107884 -23113175 -17489407 -14381234 -15955047 -16580335 -13441402 -11337226 -12265931
44566 -12265931 -9954755 -2759548 -2387339 -17836997 -38070222 -45129228 -39589657 -36690735
44558 -36690735 -39725145 -36142524 -22179685 -11879330 -13969310 -16767089 -7568185 6252215
44550 6252215 9021183 314988 -7192715 -7532162 -5461192 -3406484 2737321 13515343
44542 13515343 21055547 17421441 3255766 -12720116 -19809866 -12485364 4450004 18664469
44534 18664469 21267428 13987163 4518950 -1148335 279479 9754790 21678531 24110371
44526 24110371 10270212 -12186623 -28811507 -33097514 -28730218 -20586882 -10694927 -1952914
44518 -1952914 1438152 -1123522 -5552173 -7660031 -5762146 665046 10810051 20443418
44510 20443418 23316188 16361922 3104777 -8053956 -9993926 -4216757 -1529602 -10354881
44502 -10354881 -23526728 -23512473 -4058466 20255770 31117264 26516272 17509615 12247463
44494 12247463 12311164 18764033 29843814 35713179 28200588 15144527 12267493 19680668
44486 19680668 20275563 5953608 -8086511 -4052530 13491814 23970292 16138767 -2449811
44478 -2449811 -17250390 -19493389 -10445563 -890662 -3543889 -18452591 -29052541 -20738820
44470 -20738820 224049 15933341 21314899 26293096 34359629 34933550 22255818 7375453
44462 7375453 1761944 316718 -7705779 -19790122 -25670828 -25553173 -27836454 -31619411
44454 -31619411 -27377350 -15894869 -10944104 -18524405 -27143702 -25761938 -19613518 -19247088
44446 -19247088 -23505461 -24117609 -20687995 -19988126 -23373583 -24359214 -17836299 -5206726
44438 -5206726 8317001 16739592 16326693 10157885 6293993 7721140 9376937 8920658
44430 8920658 11969851 19656400 20597113 6580012 -11443138 -16789699 -11074992 -9671804
44422 -9671804 -16467369 -19750083 -13056397 -3439458 3560517 11177260 18935912 17985256
44414 17985256 5987910 -5936336 -8548316 -5795788 -4162664 -2187972 1615492 1499373
44406 1499373 -5548756 -12031240 -11614521 -10077875 -15005416 -22517221 -24547436 -22437483
44398 -22437483 -22569071 -23974030 -20829159 -13071919 -5057057 1986444 6745002 2059256
44390 2059256 -16054285 -36036581 -39104168 -20880927 3633372 17200430 15246914
44383 15246914 3640694 -10468840 -22431248 -29029845 -27558802 -17491154 -4013095
44376 -4013095 3010016 -544389 -4808979 3472681 21385521 30890913 21819303 2906967
44368 2906967 -13050017 -21626269 -19773503 -3707594 15893414 14280468 -15002197 -42083219
44360 -42083219 -35120912 -2837186 18546522 14080238 3022214 5500125 18852430
44353 18852430 29741341 30896348 21515704 6048905 -4263473 -1474367 6867385 8453062
44345 8453062 6613359 13387926 24488011 22057396 4428931 -8341607 -4430452 4402262
44337 4402262 5277824 2783235 4606253 5602870 -1317545 -11473913 -16837942 -17293658
44329 -17293658 -14779836 -7817045 14416 -1446079 -13312176 -22211100 -18027009 -4963519
44321 -4963519 10507369 26646818 34926552 22193029 -3671025 -11516521 12169210
44314 12169210 39035404 36246662 11278101 -4503109 -2680013 -370764 -4936753 -5512400
44306 -5512400 2260969 9194194 11334463 13708004 15235803 11394232 10758459 24808124
44298 24808124 40842404 32164693 266347 -20963952 -13198450 1188765 -2646014
44291 -2646014 -13535468 -6205037 16424431 28249733 18075894 -176038 -11099828
44284 -11099828 -11903638 -4605671 7955946 16945795 12956766 -707396 -11159653 -13359302
44276 -13359302 -13537675 -14547203 -10383696 799859 9723617 8761985 3020965 890710
44268 890710 268668 -6262212 -15994181 -16550292 -3430413 11279731 12538832 -223629
44260 -223629 -14600341 -20881769 -19773227 -15536199 -9070881 -518445 7278198 12515233
44252 12515233 17622036 23902263 26261147 18944083 4666868 -7585364 -12878202 -13090040
44244 -13090040 -10170888 -2959154 7814523 16139612 14901092 1919600 -17756839 -33484546
44236 -33484546 -35030195 -21105139 -1102261 14626630 23806013 28368074 26889909 18279291
44228 18279291 8971066 6610104 8188838 4606961 -3807922 -7729103 -5125293 -4001441
44220 -4001441 -6048973 -2014920 9941788 15411860 4215863 -11687906 -14392269 -5987983
44212 -5987983 -3117075 -10245190 -14628204 -7992263 1677035 3764818 -1650937 -9745074
44204 -9745074 -20508198 -34796438 -46829707 -48436461 -38904382 -25664633 -16361972 -13711462
44196 -13711462 -16886456 -23952456 -31712261 -35003047 -28658160 -12265291 6771065 17449262
44188 17449262 14807244 4441437 -4027142 -6319215 -4792438 -3357587 -4513165 -9096710
44180 -9096710 -14646441 -15575869 -9820448 -4347050 -8373255 -20577896 -28718344 -24091834
44172 -24091834 -11681941 -2982260 -2621899 -6071952 -8094009 -8379691 -8226428 -5563952
44164 -5563952 3128722 15741796 22258366 13121313 -9385077 -30936027 -38506422 -32336188
44156 -32336188 -22977680 -19009387 -20848030 -24597494 -27061472 -26341372 -21227181 -12102641
44148 -12102641 -1599097 6135992 7182500 1156202 -6111726 -6434009 1632651 10724700
44140 10724700 14592827 15677421 18239433 19327313 14465502 8417809 10032948 17530114
44132 17530114 19547313 11538211 444373 -8729537 -19233659 -31284038 -36252690 -29259643
44124 -29259643 -17914143 -11007854 -7506885 -4439368 -5709324 -13094036 -17946292 -13737423
44116 -13737423 -8219466 -9696563 -9872412 2796840 19468076 20803423 7494926 -727457
44108 -727457 3018505 5057966 -110029 2003046 17831166 28504970 17424669 -2967165
44100 -2967165 -11277001 -9320391 -12366244 -18438938 -12505566 3390766 9341979 -1475103
44092 -1475103 -12986664 -12255587 -6334425 -6133619 -9974427 -12057536 -13748024 -16739802
44084 -16739802 -15732389 -7563867 634034 1021386 -4154772 -8858578 -13511734 -21062674
44076 -21062674 -28521551 -30424256 -27113695 -23348483 -21766621 -22094717 -23086296 -22197660
44068 -22197660 -18431233 -17500444 -26183491 -38324937 -36987933 -17243844 3651524 8306908
44060 8306908 1737872 -125096 4280239 4235300 -826299 545709 9721230 10880060
44052 10880060 -6956755 -32341749 -44064400 -34495703 -13903692 2951798 8459681
44045 8459681 4457719 -1168253 -1643021 1667567 1273436 -5218459 -9367901 -1890484
44037 -1890484 12934179 18238871 2991303 -22622363 -35055106 -23041997 -1815644
44030 -1815644 3530396 -13009886 -33505366 -40156327 -33852107 -24446944 -14182668 -1581489
44022 -1581489 6365407 989564 -10993407 -11854751 2966374 17128089 14639239 -1367874
44014 -1367874 -17511781 -28865917 -39369084 -48570231 -48938699 -37600619 -23080032 -16043776
44006 -16043776 -16945915 -17795465 -15170206 -15027567 -21056478 -24184753 -12587111 9329298
43998 9329298 22583531 16925210 2313550 -7518324 -11834643 -15311616 -15043492 -7752761
43990 -7752761 -1684274 -6516320 -16442616 -18056486 -11128394 -5808103 -2375785 7868312
43982 7868312 21898756 25137245 15812658 9201794 10807266 5542099 -14600266 -30187224
43974 -30187224 -18446774 14151193 40362976 45961911 39919267 35752724 36700367 37397335
43966 37397335 29813587 9965964 -13242845 -21096798 -6332574 14425464 20311697
43959 20311697 12779209 9904884 18378564 25807916 20421325 4780284 -11929803 -23339069
43951 -23339069 -24958779 -14968063 -334305 6783995 3289140 -1549705 -822655 -79932
43943 -79932 -7007558 -17650304 -21018214 -14946823 -9936493 -16076138 -30913256 -42874738
43935 -42874738 -43987357 -35527391 -22204697 -6825992 6060213 7292422 -7781674
43928 -7781674 -29211820 -40521135 -37390668 -29654760 -24406346 -18608194 -11385157 -9982253
43920 -9982253 -15584663 -15412197 -246661 19448147 27255478 23384288 20662745 23673729
43912 23673729 25357501 20896999 12472950 2996203 -3475557 873214 17147526 30982111
43904 30982111 28864708 19631868 22789430 37150299 40527534 23103636 1582660 -6385970
43896 -6385970 -3899969 -1355119 2660954 13745809 25918765 27187678 15289894 -1883042
43888 -1883042 -16500498 -23821309 -21103600 -11636809 -5028590 -6298702 -8998357 -5107364
43880 -5107364 3095426 6834532 1892850 -9016357 -19945704 -23976272 -18359469 -11209574
43872 -11209574 -14546866 -25653684 -25859670 -6025879 17479297 23929057 16264371 13264392
43864 13264392 19839472 22436424 13210364 1879339 -730821 2774020 5210702 7774833
43856 7774833 15045265 22789620 20065024 3446686 -15941656 -21504509 -7137639 15302082
43848 15302082 25423881 13669186 -8816321 -21727439 -16096948 -374978 12452003
43841 12452003 18143622 19699916 17627075 7625918 -11406995 -31078605 -38986718 -30690322
43833 -30690322 -13736659 932113 8701423 11162000 10796775 9788017 10060749 8945764
43825 8945764 -1021937 -20285204 -34574794 -30289998 -15025643 -8412300 -12578748 -9934073
43817 -9934073 4593343 10165280 -7462830 -28737284 -26920374 -9426208 -6728800 -24792842
43809 -24792842 -36102061 -21976058 1394685 10017268 5066629 4017693 13137629 24650311
43801 24650311 31722467 31075706 17895147 -5891849 -22309907 -12846070 16201395 38054066
43793 38054066 37519818 25828395 19781031 19790707 17019137 11136079 8470678 8197648 3237291
43784 3237291 -6247054 -11499198 -8650534 -3940929 -2849140 -2770694 -351193 2140495
43776 2140495 2867845 4939893 8278951 4723305 -9709193 -24051465 -25033305 -16360124
43768 -16360124 -13244266 -20053519 -26369582 -24370176 -15810462 -1065272 21831524 42564353
43760 42564353 41356809 17316368 -1765130 7044853 30332419 37255814 20945277
43753 20945277 1835709 -5309277 -6735117 -11124715 -15034844 -12967158 -7523089 -2630707
43745 -2630707 2359588 6138766 3135065 -6876643 -16395754 -22136407 -28694769 -34595622
43737 -34595622 -27139442 -1517786 24897273 30910856 19163948 12323703 22981583
43730 22981583 39040033 40762477 23263668 -1279167 -17621557 -19986021 -14030034
43723 -14030034 -9354839 -9689229 -10619969 -7155911 -534387 4595941 6160152 4306398
43715 4306398 -1126158 -7867326 -9679934 -4329413 -318990 -7121859 -19578213 -22020197
43707 -22020197 -10103790 1686681 52847 -8422892 -7678799 4442422 14592565 14629276
43699 14629276 12654217 19691960 33577043 42056852 37576398 23964633 11368933 8594424
43691 8594424 17260599 28830198 30118248 17035107 814463 -4971578 -1364814 -772103
43683 -772103 -8095457 -14603258 -12321968 -4263701 4858095 17867489 35046276 42140834
43675 42140834 23247991 -13789108 -38124918 -28549887 2471245 24601180 24334789
43668 24334789 15499513 16927803 29039247 36421979 27776368 6991270 -13679748 -24906542
43660 -24906542 -23601815 -11331058 5473165 16632831 15479095 5520603 -3364916 -5095019
43652 -5095019 -1007689 4657092 7900529 4794864 -5206765 -14859709 -14361978 -3145032
43644 -3145032 9012348 14503774 15523425 16965173 18643383 18365220 16227153 11582132
43636 11582132 2566505 -6316967 -4055090 11581022 25258165 20602505 1631098 -12186318
43628 -12186318 -9916760 1633291 11629128 17601020 21846169 23877612 21345594 14987475
43620 14987475 9435269 9366264 14439212 18240369 15573178 10768914 12120738 16538547
43612 16538547 9870134 -11788324 -32149488 -36079687 -30828783 -32439198 -39249626 -35995348
43604 -35995348 -19839952 -3783884 5383904 14050773 23611206 22855461 5806647 -15993365
43596 -15993365 -26805301 -23139995 -11957685 -1452224 2575338 117818 -522680 7353416
43588 7353416 15891250 11394753 -3502305 -11104961 -4527389 4223331 6751920 10589044
43580 10589044 20144396 23115549 9210986 -11449574 -22663452 -23693876 -23214867 -22247525
43572 -22247525 -17236276 -11661469 -11138173 -13853467 -16888907 -23341975 -32116601 -31534698
43564 -31534698 -16736165 -2593099 -3464117 -10105172 -4395904 11950970 22966808 25183681
43556 25183681 27391132 29005364 21715114 10263860 7762341 9908012 -1549971 -25826322
43548 -25826322 -38481113 -28227329 -15307417 -20616653 -36252597 -42088882 -35682757
43541 -35682757 -28672787 -25284482 -22161273 -22067031 -30361599 -40639449 -38917578 -23070813
43533 -23070813 -7149770 -4165628 -12048608 -19071181 -18415545 -14518492 -15884517 -23196705
43525 -23196705 -27762940 -24292774 -20232294 -24561201 -30978607 -24779769 -7133163 1862347
43517 1862347 -9860695 -29193912 -36569308 -30842972 -24071645 -20160232 -13064719 -2397045
43509 -2397045 3948168 4392653 8986616 24581264 41782250 43694582 26223696 4637128
43501 4637128 -2175563 8204187 21224707 24856668 22895051 24080409 25094513 15357573
43493 15357573 -3698335 -16768053 -13909691 -712357 12912143 22071610 21368989 3949086
43485 3949086 -25578400 -48576070 -52517622 -44779149 -37863529 -31675483 -21659737 -13574411
43477 -13574411 -14704752 -17980126 -11939274 -1992615 -3568756 -15171349 -17114380 -775252
43469 -775252 17877951 21397062 13965111 12057600 21797487 35443069 44099754 44764550
43461 44764550 38261575 27987738 19486872 15803053 13653705 7628603 -2325882 -9998510
43453 -9998510 -9547770 -2337880 3302540 977715 -4860210 -3686749 4690772 5988432
43445 5988432 -8371775 -23868907 -18859668 5203953 25346092 29435003 28901774 33524672
43437 33524672 33090933 17735098 542253 444409 11998657 13236267 -506182 -12054414
43429 -12054414 -11973545 -10610360 -14464320 -11493605 7054278 26046927 24634767 5880569
43421 5880569 -8515509 -8419988 -4120481 -6068259 -11213256 -13053047 -13181131 -16636469
43413 -16636469 -22985484 -27128297 -24773658 -15073632 -2402787 4137034 -762216 -10227405
43405 -10227405 -12767315 -8549250 -8399082 -14676120 -15414676 -3788315 8368675 6661311
43397 6661311 -5449528 -14262181 -16323529 -16971837 -13507105 2610911 25765594 35083520
43389 35083520 19862301 -5848460 -21301135 -22066586 -17370164 -13175025 -8339342 -3217822
43381 -3217822 -1790301 -5020121 -8515590 -7663991 -1737735 6278397 10867219 6535664
43373 6535664 -6995849 -22454783 -30468965 -27322952 -16640588 -5618800 -1075841 -5829601
43365 -5829601 -15229666 -19065427 -11009766 3960620 14518178 15318947 11617183 11264533
43357 11264533 15403386 19434577 20981353 22365947 24370214 22729435 15580567 10641757
43349 10641757 16619970 27747629 27127696 9517788 -9254780 -13170645 -7180332 -6594399
43341 -6594399 -12615408 -12650476 -1576978 12235652 21615667 26661567 25281187 13335868
43333 13335868 -2272641 -6504047 1533582 4125715 -9176519 -25867873 -30806792 -27590470
43325 -27590470 -26025211 -21451624 -4409264 17578771 26885069 20600092 11065179 3791539
43317 3791539 -7187006 -20901061 -24402274 -12338639 2195377 4363393 -4308906 -11555531
43309 -11555531 -10489102 -3191064 5993758 13527720 15896615 11775936 4908243 1779931
43301 1779931 5744466 13743384 18872264 17204252 12067571 9135648 7897078 3661834
43293 3661834 -1290017 2260893 14547767 21037500 11851656 -1578819 -1623975 10052010
43285 10052010 16559144 11640229 5274933 3461678 -1110562 -13706964 -26437408 -29027200
43277 -29027200 -21214462 -9662824 -866291 108775 -6690624 -11235479 -2994344 12188728
43269 12188728 17136776 8871331 4249776 12920690 20214603 9192410 -13156370 -27009732
43261 -27009732 -27533120 -24567328 -20504696 -7622131 12113009 21944699 11295137 -9338558
43253 -9338558 -21234132 -18550517 -11333891 -11650830 -20612633 -27314815 -19714430 1613419
43245 1613419 21997716 28131620 22369908 16654547 15683259 14569540 11923912 14279551
43237 14279551 23810260 30878782 25840063 12855322 4737966 6821803 12441298 13224088
43229 13224088 8006701 1416557 -1560338 987422 5652090 4360150 -7978843 -24981801
43221 -24981801 -32902496 -25986441 -12939833 -4442873 -24674 5777879 9177118 130868
43213 130868 -20466460 -37609022 -39865728 -31352009 -21899110 -14724711 -10238795 -12516221
43205 -12516221 -21845246 -27585661 -20151126 -6471249 -2091186 -9562302 -15613431 -9708264
43197 -9708264 4357830 15770054 16996135 7209608 -5876962 -8880620 2696678 14439044
43189 14439044 9337203 -6994569 -11604218 4472152 25999531 37723339 40960830
43182 40960830 39065165 25377056 -639212 -20632472 -18579719 -5224224 -3577635
43175 -3577635 -16185699 -24694713 -19058821 -9191921 -6225541 -8166633 -8879585 -8711778
43167 -8711778 -9838825 -9841010 -5938182 40467 4718099 6052829 923738 -13461806
43159 -13461806 -31853032 -41016451 -33837538 -19834151 -14719955 -20313344 -22013599 -9062728
43151 -9062728 9166938 14834162 6972738 3799007 15888946 29106906 25118395 9304789
43143 9304789 1359185 3014697 -3126515 -20190875 -25827781 -5235864 24700727 39931110
43135 39931110 40928763 40807198 36921974 19602831 297768 1831903 20473566 25809387
43127 25809387 5999286 -11732798 279132 30328018 44366416 31127320 11172449
43120 11172449 5261020 10831503 12227072 2230778 -12639680 -22890307 -26201321 -26639060
43112 -26639060 -26743527 -23939182 -16085675 -6908949 -1574290 860873 5130881 11424962
43104 11424962 15800439 18245800 22732657 28080718 26607033 15364188 2436363 -2509094
43096 -2509094 481498 4286933 5324238 6392283 9754238 11992714 8305953 720609
43088 720609 -1866818 4998048 12780861 9662796 -1244506 -3149527 10518639 23790043
43080 23790043 19075725 2316712 -5357297 3449935 15466668 17495760 10817861 3414616
43072 3414616 -309796 1211178 7871357 14385374 13029152 2871555 -9172883 -16516428
43064 -16516428 -15922236 -5064432 12966218 24323004 15957241 -5975222 -20451664
43057 -20451664 -16159548 -1089222 13001746 22468428 25644545 19270282 6866800 -1515903
43049 -1515903 -3659835 -7779978 -16068094 -19252431 -14210526 -12492557 -21623856 -31358478
43041 -31358478 -30392284 -24880788 -26645095 -32639634 -31238819 -22411012 -16525505 -16388360
43033 -16388360 -14245420 -6243069 1039762 -317971 -10681530 -23083784 -28725190 -24703281
43025 -24703281 -18078683 -16898892 -16878402 -7400258 7474125 9519099 -5205461 -15728009
43017 -15728009 -6574598 7847959 6897405 -3030086 -1738228 8665140 7969335 -5035275
43009 -5035275 -7310112 12023888 33880984 37143884 25844149 17381576 17494600 18464740
43001 18464740 13255908 1932902 -10412326 -16367108 -12129893 -3942099 -2399012 -8368949
42993 -8368949 -11878022 -6784872 1482276 5028798 2524152 -2848056 -6973370 -5420278
42985 -5420278 1148678 1922231 -13270587 -36582731 -47197533 -37684589 -24295554 -25151676
42977 -25151676 -37532146 -43676972 -32238242 -7961874 14556834 22294487 13881915
42970 13881915 1138563 -4234862 -5537741 -14825560 -31815062 -40463161 -30516914 -11869655
42962 -11869655 -1356303 -3729173 -11773189 -17711448 -18152978 -13662609 -8746009 -7628950
42954 -7628950 -7605891 -2907657 3688020 2234598 -9214222 -21190664 -27479417 -31228227
42946 -31228227 -32208577 -22250437 -1706211 12880306 9037881 -4118542 -10244446 -8103817
42938 -8103817 -7103801 -9345149 -10508873 -12287753 -18935066 -25056348 -21184995 -10055901
42930 -10055901 -4423026 -8848508 -14799828 -13845016 -5844840 5361160 14534638 13924755
42922 13924755 58058 -17401736 -23069870 -14198009 -4109220 -5440689 -15959659
42915 -15959659 -22481172 -14800774 3984487 18402485 15391855 1297386 -2973857 10344730
42907 10344730 22501777 13059210 -11213170 -27414490 -29345799 -29932770 -33573331 -28213322
42899 -28213322 -9360517 8147867 11627661 7868399 8381050 10804560 7263334 701619
42891 701619 -529137 2418948 2006510 -1891514 -2812017 -79540 132597 -3983790 -6347340
42882 -6347340 -2557139 2800188 990721 -10901466 -25952999 -33516426 -30377601 -24065654
42874 -24065654 -21384550 -16776733 -820368 20330115 26491090 9411172 -14462758
42867 -14462758 -25640921 -25623089 -27651151 -32146471 -27527671 -12845261 -3083566 -8442317
42859 -8442317 -20881913 -26528134 -21611109 -10258899 4679692 20460801 30012152 28034491
42851 28034491 19974666 17519564 24788201 34451299 38211067 35971727 32681850 30574632
42843 30574632 28217041 24765692 21106459 17579421 14196617 12803708 14924454 16909206
42835 16909206 12245592 1342563 -5798140 -1536918 8151818 10635888 3388305 -3032338
42827 -3032338 498637 10508513 17003777 16133359 13238763 15348064 22876289 28115408
42819 28115408 22452741 7077125 -5242013 -3147230 9712978 19065150 17043756 8777786
42811 8777786 2391527 -156617 -939437 -1818707 -4220902 -6797151 -2869904 11346187
42803 11346187 25467916 23470393 6543460 -6025516 -5002255 -5038477 -19034690 -33734341
42795 -33734341 -29161892 -12156928 -7879192 -20983017 -28409973 -14398289 8279314
42788 8279314 20377520 21677753 22372992 22753756 16538525 6551353 2138994 3782147
42780 3782147 2944251 -2648112 -4317846 4033525 15516477 18446813 11299426 4230091
42772 4230091 5245979 8670024 1572248 -18277505 -36088098 -35464923 -16425107 6851935
42764 6851935 22297139 26875499 21032906 7183304 -5975693 -8618355 -2454789 885434
42756 885434 -2885330 -4946714 1008687 8109577 7850969 2345916 -3172947 -10696647
42748 -10696647 -21842039 -27552325 -17685302 3231616 20737402 27684568 26818662 20353425
42740 20353425 9196339 606400 3719638 16155332 25661518 26550548 24652362 24486927
42732 24486927 22105228 14378735 6339289 4203991 7262902 10541664 10595301 6378731
42724 6378731 -658767 -5960088 -6408530 -5723831 -9429148 -15164707 -15831767 -12176075 -12838765
42715 -12838765 -20459507 -27301517 -27231021 -22864777 -18244665 -14104675 -13238947 -19843775
42707 -19843775 -29690432 -32190281 -26500643 -22839901 -22657814 -13604920 6076838 15591080
42699 15591080 521624 -20333531 -18145435 4958472 21255809 19201542 14523735
42692 14523735 17875606 17087555 1700755 -15553217 -16867554 -5517969 1212248 -3174662
42684 -3174662 -10486339 -13382273 -11993409 -7455688 -139095 5652705 4309528 -2305247
42676 -2305247 -5482627 -960141 5526188 6134460 493581 -5397133 -7478436 -7097665
42668 -7097665 -5937094 -1634319 7150330 13179205 6017100 -11995829 -23260171 -15987837
42660 -15987837 -1642649 -898047 -15907610 -28968232 -27603022 -16934644 -5197620
42653 -5197620 7725350 20724280 24432135 14417064 1358551 -3064711 -2513726 -7031454
42645 -7031454 -14929205 -16320708 -9717628 -1929422 5284949 14648307 20786290 12952902
42637 12952902 -7166439 -23102626 -23221185 -11934595 2502906 19102097 35537998
42630 35537998 39868600 23873188 -53457 -8411873 5709929 23839336 24436595 7027184
42622 7027184 -11323587 -18878429 -20079512 -22819833 -23620060 -13258562 6118981 19675049
42614 19675049 18571657 11990889 14451048 26203442 33188548 23972343 791428 -24255813
42606 -24255813 -38535576 -36427460 -23198842 -10068448 -1640195 7764660 20636150
42599 20636150 26856354 18199322 5902121 8193262 21775792 23297969 3188368 -19025540
42591 -19025540 -21976327 -10390516 -3388020 -6037273 -7417506 -458914 11239619 23674244
42583 23674244 35928594 43624515 40825212 30126980 21294684 18286009 16243923 12552870
42575 12552870 11421581 14510100 15936739 11672831 7155185 9837899 18595255 25455943
42567 25455943 24587757 15617940 1652202 -11042438 -13774050 -1869910 18333796 32219815
42559 32219815 29143876 12415122 -3237646 -5075098 5918871 17313420 19574429
42552 19574429 15660587 14137460 15834221 12691000 -213153 -16423157 -23886119 -16720467
42544 -16720467 -544088 12378299 14141081 9187948 9017423 16435356 19960685 9997055
42536 9997055 -4732547 -7759192 551626 3141322 -6597409 -12936646 -1234898 19437939
42528 19437939 29030250 22995677 12894276 6630372 2329150 -949000 -559845 1523260
42520 1523260 372333 -1014893 5477922 17680491 23100686 17917121 13587299 18666917
42512 18666917 25514117 22815756 11231069 -2523295 -18091597 -36727468 -50610961
42505 -50610961 -49471567 -35534833 -21372867 -13847177 -9098950 -2691700 3926060 7483056
42497 7483056 6422560 448345 -7339683 -9278415 -1382573 8475219 8915986 1376115
42489 1376115 -688456 9869674 24765744 31845104 28287581 19458243 11254891 6676121
42481 6676121 4574794 -265945 -10715765 -20665125 -21819892 -17298836 -18911165 -28462323
42473 -28462323 -32111047 -18520932 6322628 28311476 40947059 45709433 45222535 43565447
42465 43565447 45762395 49342314 44431165 30499648 23328271 33418971 46207246 39420379
42457 39420379 15080430 -2700586 -204047 12599244 22228257 27661541 31002631 28285126
42449 28285126 18949896 12837109 17596177 26919181 29674000 23896207 14255268 2902033
42441 2902033 -8384057 -12899647 -5586240 8330234 19229598 24657868 27932311 29189449
42433 29189449 26700328 24672360 29922555 40299156 44726848 36730352 21795189 9860510
42425 9860510 5957762 9121541 14299790 13313982 144270 -20798480 -35893189 -35753406
42417 -35753406 -24511845 -12344265 -2144285 11053922 28553356 41915218 41121747
42410 41121747 26168779 7778678 -2654563 -1989287 4927538 11493886 14089205 12641202
42402 12641202 9124526 5841713 4016560 3649356 4701792 7303626 10000232 9430842
42394 9430842 3864059 -3623430 -7420522 -4275986 5572554 20260802 35880203 45416933
42386 45416933 43244638 32308663 23186825 23624683 30962034 36130311 32717747 20881418
42378 20881418 5470368 -6914414 -10811100 -5179558 5482429 14044736 15070996 7360745
42370 7360745 -5725991 -18029593 -24189813 -22456620 -14584466 -5056838 -938389 -7851543
42362 -7851543 -21745189 -28406159 -17981703 1813435 14649967 16852554 20123132 31399081
42354 31399081 41011565 37151096 23154061 11219012 4563088 -3903593 -17180631 -28036855
42346 -28036855 -28405704 -18335986 -4417068 5371821 4504640 -8309853 -25114593 -32626334
42338 -32626334 -24511280 -8954060 -1279712 -8616680 -23139551 -30929459 -26157452 -14819583
42330 -14819583 -5589170 -1271591 -857617 -4446892 -10375920 -11265306 -1392538 12563127
42322 12563127 16711751 7412218 -4300954 -7854651 -4432652 194457 5426285 12653111
42314 12653111 19130427 21165194 18461702 11193372 -761226 -11544329 -10802786 2272911
42306 2272911 14940035 18332701 19439760 25994758 29735631 19294087 2686608 -185223
42298 -185223 15051606 33641693 44732776 51005725 53582063 45688609 28543677 17590551
42290 17590551 21758788 28433991 22053592 9269805 10445794 28851602 43464071 36499293
42282 36499293 17026483 8608633 18784759 31570250 31501381 24502338 26287928 36569778
42274 36569778 38589624 24578573 6988126 -1495386 -5307141 -13064730 -19483115 -15012501
42266 -15012501 -5296376 -4187368 -11364120 -13250836 -4586486 6520592 14391465 20873499
42258 20873499 24201532 19028910 10044771 10114465 21394129 32542642 36971897 38046024
42250 38046024 34094790 17828699 -3586193 -8863199 6468391 18888438 10159520
42243 10159520 -6229960 -8415507 216391 1065663 -7706010 -11308587 -4422676 3416280
42235 3416280 6811318 11619297 22471473 35998983 46447998 48836016 40016659 25560018
42227 25560018 19177633 24951445 28751637 20280524 13216774 25296444 46987289 52529326
42219 52529326 38042965 24511702 22587786 19123185 4096709 -11852826 -16238325
42212 -16238325 -12472342 -8866269 -5906962 -3876699 -7686854 -14292002 -10430097 6462262
42204 6462262 20131232 19978061 17895146 26078617 33772439 25798611 12033064 14630624
42196 14630624 31668573 37862669 21883417 661040 -7983939 -6626897 -3905289 2733446
42188 2733446 16405583 25827556 17698238 -1041127 -8365038 4837913 23063057 25708208
42180 25708208 10710824 -5702288 -8261488 3382260 18442821 27929994 31499813
42173 31499813 33114920 33612847 30154587 21974428 13196576 8515690 8278261 9639519
42165 9639519 10669507 10781248 8607980 3233029 -2208839 -1745588 6885891 19184910
42157 19184910 28830783 33327510 33106243 28144491 19035268 9777932 5625644 8073672
42149 8073672 13966897 18548482 17871170 11236732 4384742 6338581 17781521 26342673
42141 26342673 20781056 6751273 -740206 1919394 5643778 7265152 14089306 25902261
42133 25902261 28801793 16784545 5841271 13434974 34067945 49025082 51678556
42126 51678556 47865356 38858128 22649709 8523990 10187899 22849870 25794282 12649680
42118 12649680 1874190 8772837 21902726 19402101 -828394 -20148981 -24128845
42111 -24128845 -17203303 -11941399 -11521096 -7622205 5056211 17038164 13887193 -1550884
42103 -1550884 -7672881 7220037 25519361 23730502 7067810 1142407 12585512 21073754
42095 21073754 13849931 4868493 9923529 23105221 31264378 34491578 36788742 31683394
42087 31683394 15375042 2379300 8171334 23947572 28296900 18934969 12916875 17391676
42079 17391676 20595742 14692374 9312567 15335376 28505226 37261772 38267996 37338202
42071 37338202 40086190 45849445 47660757 37776584 17488788 -252303 -4332590 568447
42063 568447 1810707 -1124115 4872579 26453507 52371617 66239740 63548126 52430096
42055 52430096 43519145 42154834 45594243 45509936 37182297 26451330 22604978 25607346
42047 25607346 27838379 27767385 31915799 41369037 47183639 44549976 42141483 49473869
42039 49473869 61455246 64325008 53779253 39461714 32501115 34556544 39068759 38971278
42031 38971278 33059712 27713152 31836737 47443211 65776377 75140126 72102616 62848799
42023 62848799 54143056 46131650 35607259 24253572 19561690 25409545 34605399 35938777
42015 35938777 28370951 21664008 20822589 18260334 8095644 546436 10139307 32400168
42007 32400168 45729139 38579206 22602685 13869620 12520239 9727481 5732579 8543319
41999 8543319 18236982 24795151 22734470 18135401 17520454 17468185 11323403 1627885 -1655324
41990 -1655324 5155603 14338493 18071112 19343522 25561719 34012356 32578387 17556951
41982 17556951 2645770 2863597 14075053 17958168 6921366 -5363694 -1739478 17389484
41974 17389484 36294122 42476872 36595725 26326418 17594983 13124500 13940806 18278484
41966 18278484 21309924 19958039 17752608 21408117 31401859 38949479 34792122 19089658
41958 19089658 307743 -13015540 -15652598 -4256966 19820962 46013450 60523004
41951 60523004 59827845 52509575 45404430 35137540 17602618 -1431285 -11792726 -9955842
41943 -9955842 1295743 18823352 37916245 50555429 53521954 54693438 62965987 75048816
41935 75048816 80682633 77814939 73257321 70811451 69008780 69324466 75803222 85851191
41927 85851191 91031977 88304678 82517288 78190352 77649293 85742533 104900486 125645710
41919 125645710 135156923 137413775 151126396 182974247 216165899 232551450 234071376
41912 234071376 233650483 235603707 235595288 231601684 223384525 206587436 178630724 147909883
41904 147909883 127695025 121620973 121871937 120562355 117171164 115225468 115497543 112406302
41896 112406302 97327223 69604846 43913201 38654534 54386886 72093411 76622321
41889 76622321 72314054 69653453 67381033 58491345 46358383 42355461 50523025 64880310
41881 64880310 79716970 93054847 101506554 101272254 94785982 89005566 86504930 84173545
41873 84173545 80672563 79171824 81564803 84281074 81529361 71501145 59672183 55418745
41865 55418745 62204804 71850358 74138992 71541529 75815898 89127210 99999694 101941289
41857 101941289 103128130 110017309 114522741 109024714 102443658 106591146 115626315 116228961
41849 116228961 112490519 122061122 148456682 174388316 185457439 186977864 193726202
41842 193726202 213457222 243061061 271960121 287641640 285602294 274007945 261944624
41835 261944624 246632824 221599973 192635622 172353949 161509590 150002309 135318857
41828 135318857 124984366 120433091 114087885 104742431 100895477 105508920 111376904 114388835
41820 114388835 116964671 116093557 104775007 89408824 87423508 100628723 109227752 101616805
41812 101616805 91669861 94002266 99973907 94913150 84633121 85760169 99640207 114286127
41804 114286127 124951730 135082382 142392455 141486305 137097245 138786950 144852846 146380192
41796 146380192 144987665 151364487 167190748 183138031 194527711 204564028 211543051
41789 211543051 207495199 192083485 175138213 163026516 154392696 150644808 156801908
41782 156801908 168628596 172765759 164936708 155443086 150843341 143041588 124283664 100919050
41774 100919050 82602568 68287314 53813565 44015017 44087110 45628783 36332733 21328577
41766 21328577 20218161 40468169 65248864 72518105 58751399 39687068 33351743
41759 33351743 45848454 68469416 84275043 81139611 62994702 46871764 46111539
41752 46111539 57954425 69375238 72106114 68462529 64833779 64699176 68337607 74771786
41744 74771786 81586478 85234647 83893821 79221432 74299927 70936086 69444757 69284602
41736 69284602 69252381 69370610 73430966 86178829 105400433 119909486 119306648 104354128
41728 104354128 85214712 72498813 73627501 93151605 128337530 165468342 189068497
41721 189068497 196655151 198019603 199157014 194969896 180455020 160471430 142913872
41714 142913872 128890578 116015558 106050121 101957239 100523368 94756270 82447127
41707 82447127 67668929 55282573 47599661 44246589 41941403 37013143 30984676 30041751
41699 30041751 36142871 43451979 46899909 48323527 49983310 49430393 46774852 48507806
41691 48507806 55271662 54419370 37183488 16741076 14244867 30174870 44931246 46403764
41683 46403764 40639434 34850292 28234103 24111093 32542316 51552517 61915322 52999704
41675 52999704 40436534 43610124 56460515 57913501 45060008 37623087 49526635
41668 49526635 71144799 82953324 76042534 56184295 36417045 28827634 37007564
41661 37007564 53396357 66926849 72153225 67683814 51622410 27545455 10136752
41654 10136752 11880736 25077779 30045395 21335471 11264256 5922912 -3842832 -20088238
41646 -20088238 -25369189 -7360700 18716388 30274584 28753026 29893652 31146636 15547316
41638 15547316 -12097463 -21460280 768404 28297034 30809090 13326255 1020508
41631 1020508 -179605 -3969312 -12856396 -13062739 -907571 8796626 6960825 4007805
41623 4007805 10582375 20087327 21516779 17539163 17472239 20881734 20640069 16928222 16799809
41614 16799809 22925962 32214916 42622250 52189250 54058763 42565447 24000925 12625671
41606 12625671 15134459 25654559 35572746 40785293 39219477 29786706 16641783 8116891
41598 8116891 8224217 13611746 20600762 29772614 40605211 46660149 41355535 27004241
41590 27004241 14105782 11171632 17179294 24719782 28887480 30272961 28799462 19742102
41582 19742102 1732371 -14408953 -14764639 -1552166 7555606 3893145 -267240 6883991
41574 6883991 15276631 8011264 -9898477 -16783798 -6945808 1104156 -6726850 -20250734
41566 -20250734 -22263315 -12420718 -3287692 -1811410 -5477455 -10742793 -15101411 -14365875
41558 -14365875 -6883253 1093200 1207765 -6564440 -14369692 -16465897 -14523755 -13445428
41550 -13445428 -15229967 -17719552 -18766856 -20854131 -28141023 -36535355 -32853808 -12056894
41542 -12056894 9507688 10891589 -4644213 -12808048 -2767289 8517832 3863123
41535 3863123 -9350115 -15291250 -16535149 -26671923 -43857782 -50521706 -37969710 -16616328
41527 -16616328 -1910786 -1533206 -14606988 -31768921 -38155782 -28629654 -17752414 -21558059
41519 -21558059 -32655242 -30104770 -12789678 -2624499 -10328086 -18718323 -10299560 6346648
41511 6346648 12036075 5336134 -670331 -584319 1030514 3872527 11868879 20900604
41503 20900604 21462299 14015839 8954729 10422283 12648575 14206668 22369122 37596736
41495 37596736 45529383 33857600 10328789 -5015612 -1916225 12630697 25297467
41488 25297467 27452270 17830006 2598735 -6762188 -2740224 8847216 14144706 8470442
41480 8470442 3014460 9816431 23995026 28303413 15945651 1628478 4196356 21605393
41472 21605393 31635989 19971594 -155297 -4322535 10795768 22927538 14405259
41465 14405259 -4797741 -13093966 -7675126 -4724460 -12035721 -18204958 -14058357 -9528866
41457 -9528866 -17195471 -28964588 -25045668 -3578180 13812368 9200422 -10331030 -24093469
41449 -24093469 -22392875 -13277528 -9762982 -16588616 -27607816 -32130595 -24800465 -10998911
41441 -10998911 -814753 2663897 5617864 13560695 23871760 30022500 28597301 19833891
41433 19833891 6021621 -7499195 -14252991 -13410989 -11247432 -12704154 -15286303 -14445049
41425 -14445049 -10483525 -5933689 -422883 6642208 11691735 10862933 6043441 2197011
41417 2197011 729260 4536 -8744 1113768 170431 -6909806 -18016748 -24531810 -18882888
41408 -18882888 -1268206 19718251 32451721 31863305 25580299 26522120 37417710 47770260
41400 47770260 48438944 42224924 35869167 29543939 21147898 14050955 12322717 13818407
41392 13818407 15775260 20983086 29844773 33703418 26898545 18228021 17617985 18713649
41384 18713649 10617060 405691 3732838 15968268 16067144 1611671 -4318830 10428696
41376 10428696 26676289 23379897 7704171 -1666163 -5208790 -15886099 -32268538
41369 -32268538 -39716910 -33495231 -21652411 -7674938 11127132 28070578 28321387 10083468
41361 10083468 -9824938 -17016078 -14699511 -12890461 -13450096 -12632488 -10015131 -7402060
41353 -7402060 -4130574 644717 5135459 8929411 15616893 26945674 38116664 43358731
41345 43358731 42929811 40242394 35462951 27597468 20653872 20732089 26448210 28833159
41337 28833159 23691598 18392184 20960525 26602074 23553214 11753255 5434051 12745774
41329 12745774 22557531 20835444 12951826 16185826 32502135 44280786 40248626 30998183
41321 30998183 31065734 37865343 39233633 32708124 24675410 16297198 3719427 -10204685
41313 -10204685 -17100722 -15930399 -13419665 -10861327 -1978962 12961628 22076729 17679719
41305 17679719 9245975 11727387 24252630 29124703 13601333 -12813707 -27217852
41298 -27217852 -18356296 1862851 14305636 15277768 16129056 22701832 27023731 23259874
41290 23259874 19795746 25951119 36056666 39301103 38540641 43998762 51820986 46563799
41282 46563799 26617215 9845600 7734878 9068511 -1268716 -19628687 -31274085
41275 -31274085 -31470843 -26407016 -19416195 -9329124 710340 5208312 6050628 8937565
41267 8937565 10446538 1034816 -16615661 -24938650 -13960603 3575894 8873265 1721205
41259 1721205 -2552198 3623160 12898689 18965296 25658149 34837707 37542285 27340993
41251 27340993 14170857 12666495 21440744 26825633 24728311 24449076 30097073 33284796
41243 33284796 28669354 22478907 18732906 10857430 -3378098 -11720477 -5027309 5845425
41235 5845425 5202483 -4535550 -10836475 -13872630 -22659177 -33530800 -32930405 -20693852
41227 -20693852 -11027872 -9362213 -7317348 -2458392 -2673100 -7039065 -4022057 4276193
41219 4276193 -1403455 -25505720 -43874875 -37400090 -19900104 -13690908 -14989443 -6991933
41211 -6991933 5770189 3228851 -15411369 -28052532 -21168017 -3871560 10786897
41204 10786897 19298994 20059762 10895010 -714287 -770226 12120093 23911558 25780104
41196 25780104 24358596 26679461 28360970 23200422 12972209 1594748 -9629928 -15622442
41188 -15622442 -8376904 8733816 18786256 11764547 -2426916 -9131921 -7039659 -2387384
41180 -2387384 4489474 15147297 23286956 21511862 13357816 7823387 5709258 1542546
41172 1542546 -4259098 -5454689 -444872 6095281 10364089 10791124 5387809 -4120715
41164 -4120715 -9189677 -4862446 198240 -5133865 -16017761 -16882393 -4291383 8911705
41156 8911705 13842973 15833926 19673554 18202935 4520018 -14454454 -26768143 -30951200
41148 -30951200 -32719949 -31240136 -19873128 375619 17765360 22429289 16579626 10476152
41140 10476152 11851867 20269146 29195232 32607403 30264626 25995972 21521400 15670660
41132 15670660 10299385 11034725 18422012 23801038 19783804 10691997 5903504 6166520
41124 6166520 4358224 -2174647 -8652204 -11716081 -12313539 -8923169 2471273 18467742
41116 18467742 27550668 24899707 20278775 24179163 32130675 30929281 16513411 -2641238
41108 -2641238 -17344534 -24084945 -20411983 -3587450 22623721 45885407 54393486 46003195
41100 46003195 27392066 7674564 -5862878 -9495897 -3570212 9144925 25110058
41093 25110058 38407490 40457406 27707612 10038173 4484066 16649515 32917306
41086 32917306 35619492 22920842 8936077 5773328 10520042 11131299 2277720 -7307506
41078 -7307506 -4410363 12098924 27438094 27109817 14772035 7886357 15648842 29091828
41070 29091828 36038417 37125726 39421085 40819529 32605501 16674034 8417994 17599350
41062 17599350 34106813 39925295 31789147 24303992 29553277 39866811 36856487 16819973
41054 16819973 -265382 6783275 32762972 51119393 47676745 36926521 36893338 39927013
41046 39927013 25184518 -4869514 -21503427 -8242211 16263161 25704570 22020397
41039 22020397 26817892 45363534 59395989 55487390 41650395 30200479 20407623
41032 20407623 8394207 1459556 8101585 20693181 23480300 16102518 14526392 26253931
41024 26253931 38136492 35450130 22495793 14838104 18061283 24837115 29288876 32904517
41016 32904517 36277692 35595419 30475205 26879200 27757754 27711103 22460226 17733422 21492495
41007 21492495 30901890 34826733 28022078 15646175 4106929 -4547541 -7511602 536702
40999 536702 17856439 30229171 23949674 3163897 -13336270 -13694281 -4415510 2656235
40991 2656235 7456335 18267547 34709082 44149556 37848876 23554208 16467211 21159452
40983 21159452 27956768 25904777 14336836 1442316 -4566357 -1642664 6219909 14082898
40975 14082898 21577966 32272807 46481646 57537992 58536049 50575639 40249415 31117347
40967 31117347 22931608 17530914 18508889 24565140 29444015 29480332 25702840 18789972
40959 18789972 9611662 5353813 15216071 36050574 51226873 49456071 37158599 26459439
40951 26459439 19215001 10566261 470793 -8142185 -16754537 -26085151 -27732077 -12306340
40943 -12306340 15691140 40872444 53709805 55776780 50687082 40009660 27412324
40936 27412324 17040974 7625052 -3557618 -12616545 -14648773 -15022915 -22911734 -34614825
40928 -34614825 -36970619 -27730247 -17426338 -9272228 4595803 20653182 17648400 -13132509
40920 -13132509 -46232932 -48958777 -22052063 3778301 7820701 -682549 -2161491 8763363
40912 8763363 22589296 28982726 26664761 23442408 27347897 35173138 33387508 15464287
40904 15464287 -6952074 -18089424 -18031496 -17839034 -18746665 -10716533 7608677 22459756
40896 22459756 24172887 20947033 25353672 36003560 41699216 37658342 28269884 17530855
40888 17530855 6029613 -4025387 -9398941 -12015842 -17236667 -24311259 -25126564 -15294697
40880 -15294697 -544701 12054878 23540708 36920537 45534924 37631562 14010922
40873 14010922 -7913443 -12734333 -3297876 7547978 15121361 23450044 31058413 28457628
40865 28457628 13092702 -2165154 -1953076 13681704 29127958 30361453 20407270 17054703
40857 17054703 32979509 57594408 64978960 44827275 17824622 10319733 20947014
40850 20947014 27713402 23365818 22266830 30103222 30748855 14099809 -3851610 -4753057
40842 -4753057 4853303 8058330 5230326 6506245 8190797 471233 -8335657 -600365
40834 -600365 19576972 28945393 20542971 12661515 17257208 22543328 16460310 6912153
40826 6912153 5727920 8788324 6156879 -409398 -3567738 -4171251 -6303934 -6600971
40818 -6600971 -540952 6941584 8108678 4590927 3342690 5235505 6447200 6545922
40810 6545922 6772485 4524178 -2544896 -10684655 -15050204 -16295375 -16253413 -12705219 -5117799
40801 -5117799 717590 1593957 4043076 13388497 21622178 17554684 5605131 2363523
40793 2363523 14132871 27848206 26945358 10031044 -8662680 -14610600 -8330544 -5517826
40785 -5517826 -18300380 -36655913 -37059708 -12853490 14739150 23529227 17982528 18457173
40777 18457173 30826356 41172641 37330504 22321070 6992623 46658 4420380
40770 4420380 13856506 14981739 2869540 -8047162 -79316 22695083 38157274 34244259
40762 34244259 20236010 9592553 5594780 6841955 13262925 21240695 24002009 22073831
40754 22073831 23037161 26409370 20601723 1855044 -14946312 -14071783 330578 11224533
40746 11224533 11193843 8526675 13250317 24807300 33724531 31743781 20618383 11415878
40738 11415878 12563259 19735569 22897548 21565243 24074922 31574027 34064312 25841828
40730 25841828 13927345 5907586 101709 -5353200 -4246717 7448769 21239882 25691216
40722 25691216 20071203 10418463 -321680 -8946654 -7028638 8483791 25171518 27823838
40714 27823838 17598377 8058836 7055349 13971977 28725316 48209139 57933312 45397668
40706 45397668 21875465 12449363 21039990 24061803 6153884 -16171712 -19379099 -6676000
40698 -6676000 39625 -6777040 -13710051 -10489485 -3640803 -2487519 -4519324 -1883104
40690 -1883104 5248355 9861956 9864968 11540779 19707447 28897594 29127481 20241216 14636605
40681 14636605 21072824 30227259 25287618 6442718 -5930588 3239506 24908336 40197714
40673 40197714 44940755 48725744 54930731 55982392 48765677 41477840 40655456 41759246
40665 41759246 38772877 34695942 34875419 36375766 33142161 28253789 31322907 43354532
40657 43354532 52147319 45851207 26689144 8333517 1965287 7124119 15463963 21622385
40649 21622385 28179709 38074720 44870299 37781160 18329327 3501416 5363084 14200115
40641 14200115 12048477 -1551352 -10587330 -8640354 -8532107 -20441529 -33803658 -31363044
40633 -31363044 -12982841 5057852 9311170 -1432141 -20752089 -38053508 -40778447
40626 -40778447 -24757247 -2525686 8043985 4106788 -1417797 275839 2940369 -2529189
40618 -2529189 -13061220 -16489322 -6396548 10236143 19960370 16937577 9708142 10798828
40610 10798828 19506227 22726745 16248644 13556674 23590221 32062256 22415401 6272834
40602 6272834 8884423 26870068 28810564 4157106 -17091093 -8686391 12986318 16418054
40594 16418054 2059755 -4702708 4980829 17805702 28095267 43357229 58591771
40587 58591771 53118309 21815086 -12636698 -29594129 -34213468 -39622213 -42473193 -32575478
40579 -32575478 -15343190 -6572217 -9439667 -12254232 -8407346 -5328038 -10664324 -19265016
40571 -19265016 -19487143 -7986460 6738411 14812471 15699647 16551879 20863512 22662458
40563 22662458 14848538 589251 -8581436 -5914449 3315457 8252113 3517483 -5824303
40555 -5824303 -8560345 1124836 14188062 13548339 -4810848 -22914222 -20614149 35577
40547 35577 19499621 26107465 25152554 24459139 24070037 22214158 20091884 17758817 14569615
40538 14569615 14521969 20416196 23140691 11467246 -5727083 -4880412 18185887 38144779
40530 38144779 35815141 26854632 37341381 62573496 71165584 46816493 8211777
40523 8211777 -14169458 -8705174 11817244 26370116 25129665 16793938 15846203 22448705
40515 22448705 22858201 12053186 2706310 3556749 3185802 -10840099 -29113743 -34503659
40507 -34503659 -29615622 -29643064 -34073287 -28376350 -12280801 -3142294 -7959048 -13249531
40499 -13249531 -8872820 -2898024 -4710347 -9996603 -11802647 -12546918 -16168089 -20697328
40491 -20697328 -26310630 -37954113 -51951822 -53310852 -36106156 -14636489 -4435970
40484 -4435970 -3683726 -3463384 -4120557 -9001465 -12962361 -11151028 -10352313 -17316261 -23398187
40475 -23398187 -15807057 1566188 13460918 15120255 14175498 13902690 10007024 3598725
40467 3598725 2872529 9654105 15758485 15245572 11242982 8813076 8321121 6475784 -1430184
40458 -1430184 -17737456 -35225151 -39850109 -29341188 -21175111 -29292832 -40786440 -33201140
40450 -33201140 -9331323 6980695 8410147 12809083 29337810 40897792 32549003
40443 32549003 16380554 11747879 17254820 20365891 21367359 27288425 31016243 18407090
40435 18407090 -6539920 -22815616 -19301007 -5061661 7581183 15218110 17274395
40428 17274395 12962303 8263399 12610856 23394388 25454572 11830811 -5604223 -12683878
40420 -12683878 -10221360 -7073045 -4700660 1822849 13024303 24264680 32482378 36745560
40412 36745560 35445871 29129849 22207967 15692101 3370627 -16795431 -32771459 -30986373
40404 -30986373 -15847055 -4124421 -252960 8480283 28309790 45079730 43347592
40397 43347592 28574124 18064944 16619538 14571230 6890960 283504 15643 1737970
40389 1737970 284405 -2883243 -5273389 -7850748 -9197817 -3693864 8253856 16120390
40381 16120390 13286526 8122650 11506574 19239958 18804577 10069203 5537783 10082597
40373 10082597 14730628 14079690 15592497 23599150 26376094 11449105 -13710138 -29415125
40365 -29415125 -28439142 -20262677 -12597854 -3053138 8277388 12213225 4643358 -3000095
40357 -3000095 1873909 14408564 19438365 13657130 8073280 8674772 8541355 3774018
40349 3774018 3745516 15111453 25660439 18661362 -1408873 -13278212 -8669223 -1412426
40341 -1412426 -3251501 -7684126 -7055277 -9654595 -24315638 -39468119 -36599042 -18512687
40333 -18512687 -4280957 1371291 11923719 30345126 39696388 31252489 20906906
40326 20906906 23262462 27086215 15236809 -4197391 -8631894 4480723 16446347
40319 16446347 18328256 20425256 27594244 26577503 7570082 -17427036 -29499430 -25449056
40311 -25449056 -14967910 -4064282 6958500 14473710 12717950 3861404 -1417091 4701098
40303 4701098 18904080 30172622 29726270 18651714 6585478 1382921 1325171 1193382
40295 1193382 3111933 12990791 26886093 32209609 25876260 20011291 23583837 29362349
40287 29362349 27716792 22806094 23141992 24704533 18326307 8818042 10518575 24697632
40279 24697632 36842353 38469365 37307583 41356788 45929243 43643845 36790352 31224334
40271 31224334 25601686 15596793 4063089 -1339654 1221800 5443723 4589961 -1574131
40263 -1574131 -6378524 -1818039 12788924 27950868 34218920 33877358 35058073 35850865
40255 35850865 26845261 11938375 10804211 30934064 51048365 47285727 26062323
40248 26062323 13055428 15748579 18024765 11579368 9864919 22609032 35533023 29891643
40240 29891643 10477187 -1171107 4763128 18865465 30288850 37918982 42662569
40233 42662569 41312099 33892909 28812316 32950114 40197286 37324155 21588659 6449752
40225 6449752 6186058 18506530 28416538 28539399 27269003 32609188 36486147 25710586
40217 25710586 4480780 -7857862 -3386108 3539566 -1357913 -10694910 -6990049 11711171
40209 11711171 30025250 35670833 30554317 23014737 19908707 26713743 44676731 64452158
40201 64452158 70905411 59057276 40449476 30497490 33086480 39055333 36015837 19162994
40193 19162994 -3172692 -14651340 -6643858 11443231 23155736 24926052 27023213
40186 27023213 35574289 44994842 50842852 57652330 66911319 68218473 53150722 30853655
40178 30853655 18362691 19271407 22594252 20270444 14976665 11077669 8517157 7978736
40170 7978736 13326441 24901952 36287383 41361671 40449945 36939001 31908056 25305503
40162 25305503 19629121 18905832 24338064 32606922 39032208 42507067 46376538 52568797
40154 52568797 56171287 50744971 39398824 33381292 36407794 38784723 34005493 32645585
40146 32645585 47724178 71260934 80542634 68136180 50868638 44620187 44566076 39924036
40138 39924036 36609821 49729569 76649614 92977903 81225949 54680208 43573576
40131 43573576 59449949 82438945 87712876 76398300 69566748 75008495 76441712 61746729
40123 61746729 45597836 48627875 64596064 68557048 54118505 40954808 42774007
40116 42774007 49323428 48955501 49878474 64205279 83826827 88793351 73702785 52493865
40108 52493865 40577889 42282613 52246741 60430890 59396687 53698495 56928805 72956099
40100 72956099 87607293 87081105 75985517 67058678 62627254 59671655 64064968 81716837
40092 81716837 100440284 100149075 81143369 64853289 64955445 74479605 84161613 95812882
40084 95812882 110966943 122031216 123987625 122783983 122988285 117518127 99461840 76369977
40076 76369977 63401974 66948027 81262480 96141026 102796579 97931697 87531932
40069 87531932 82486232 87223760 97041342 106858824 114785081 116754609 108536916 95488397
40061 95488397 88767220 88788963 85377498 77836961 78368855 88251070 89031701 70475690
40053 70475690 50647506 51272859 67252927 79971750 87906487 100198558 109258360 98306290
40045 98306290 74489489 66302710 83328390 103630184 108724232 106928414 110531745 112855739
40037 112855739 105246406 98425736 106018277 119165123 119095091 107496396 102993831 110693016
40029 110693016 116250215 111364494 105498376 106951562 109570677 107015780 105875179 112840535
40021 112840535 119266504 112022761 93794067 79434303 75372637 75995307 79449257 91687083
40013 91687083 110367453 119241443 108972471 93725646 94193882 109627231 120303300
40006 120303300 115402912 103900896 96638818 92794169 90019135 94174247 108477091 122443816
39998 122443816 123259980 112464260 101330792 95253865 93128460 96314018 105191059 110723167
39990 110723167 103964597 92251478 90315945 95100032 87473329 63708737 46268562
39983 46268562 52363609 68414214 71803720 65117223 67796009 80291282 80744567 60417125
39975 60417125 40670265 43934088 63636600 77407449 79528354 83042881 94152743
39968 94152743 102959027 102301117 99471820 101036593 98801042 83126703 61969210 52005774
39960 52005774 54048773 52639025 41605595 35001186 45821295 65765978 76340857
39953 76340857 72791585 66614663 68191700 76341913 83720043 85299433 81821464 79259085
39945 79259085 83252340 91344015 94796982 90484480 83735994 75866890 60304072 39610322
39937 39610322 33432298 53908449 82383373 89979330 76526680 67896912 75719808 83162949
39929 83162949 75994065 65423480 68424207 82058566 90395708 85088939 68256959 46192298
39921 46192298 30737173 35676346 59770346 82231344 85837591 75977636 67118580 61278701
39913 61278701 52646493 43731188 41516388 43478525 41611824 36361001 34594414 38093537
39905 38093537 44690552 54753596 65387206 65845748 52012165 37930325 38283550 47299385
39897 47299385 51862917 56910103 75803847 100833179 109017856 97770485 88846785 91612154
39889 91612154 88079877 65311370 39623466 32689905 41019837 46299373 43066462 39007452
39881 39007452 37114345 34102542 30831117 30039005 27920069 20438856 14293261 19381515
39873 19381515 32383411 39061790 33027181 23588261 23875984 36354001 50067389 49916559
39865 49916559 31672170 9337956 1533147 8519000 12088461 2606668 -6192413 917606
39857 917606 15510895 17061482 2697675 -10909378 -12741833 -8540782 -5852465 -2830216
39849 -2830216 3406944 8576836 7501011 1458240 -5039913 -9199551 -8924048 -2492045
39841 -2492045 8015556 17452533 23163352 25306333 21795931 9760145 -6286128 -14569461
39833 -14569461 -8087045 7772901 22143746 29127830 29301480 25415670 20135841 15730297
39825 15730297 13567446 14594608 19408166 25158292 24527854 13606782 221872 -3023576
39817 -3023576 4051069 6625184 -5805882 -23984127 -29984199 -20074660 -7979012 -5378288
39809 -5378288 -7482236 -2161351 12100108 24229189 25433165 19504924 16076105 18551026
39801 18551026 22638953 23004365 15998474 -1136395 -25955041 -46063590 -47512531 -31216353
39793 -31216353 -14157994 -10118722 -15024664 -15726215 -7325755 3967538 10386124 8737300
39785 8737300 487628 -8554534 -11290625 -6392802 756243 6655189 12968168 17804713
39777 17804713 13298618 -409403 -8271628 1153968 17669741 23084282 17099986 14719367
39769 14719367 21625587 28404149 28201784 23952790 17484057 7686119 1192464 7804958
39761 7804958 21868529 25864050 17616961 14877937 24803678 29450910 15357719 -1273147
39753 -1273147 1981002 19272693 27292272 21502587 18241398 23898685 25024878 12486210
39745 12486210 -3425162 -8965946 -4437139 1499985 4992505 7420716 9229106 9299289
39737 9299289 7508780 5600343 7439884 16415538 28296595 30697368 17384856 -233409
39729 -233409 -5867153 -478662 289001 -9002776 -14871088 -5758347 10194546 16080106
39721 16080106 7038706 -7645682 -17610173 -18851606 -11533873 2149377 17864149 30927059
39713 30927059 38755276 40848121 38141694 33092712 28007350 22605864 15620587 8951947
39705 8951947 7514387 14691667 29554442 46876265 57976331 55866413 44178276 36075452
39697 36075452 37409647 36350404 19912178 -3630995 -12498112 -603330 15449119
39690 15449119 20072335 14335622 4251971 -9942003 -24307041 -25904360 -9483286
39683 -9483286 10704811 17788139 12994277 8588113 8211466 6506126 2109468 -1237766
39675 -1237766 -2305298 -868330 6193986 17301891 21287206 11609148 -1302534 -4615957
39667 -4615957 -2458714 -5331640 -7918638 2137726 17272469 15561310 -4364339 -17088926
39659 -17088926 -6711991 11211303 15313588 8630976 9029544 22095462 38133161 48025059
39651 48025059 49508828 43258857 32562018 22377537 12626387 -801845 -14097224
39644 -14097224 -15710038 -5013721 2514633 -1428648 -3508610 9023200 25144621 26501180
39636 26501180 15870490 9007454 6699301 -1792899 -12027077 -6713283 13744591 27391976
39628 27391976 23357877 16248757 19206881 23443731 17387991 8486251 9905465 18457099
39620 18457099 22551770 23244730 30522187 43432759 49690921 44346386 36149201 33847883
39612 33847883 35531282 34029013 26753431 17445345 10425338 4525922 -5418478 -18296840
39604 -18296840 -21898220 -7212228 14459962 21981720 13603107 9706970 20609872 29870672
39596 29870672 21561866 6272456 1660388 1944040 -9347248 -25343950 -21764587 4461998
39588 4461998 28185177 31604668 24333102 21731129 24173257 26673360 30307119 33422183
39580 33422183 27909755 15130076 9882732 16864561 19139403 4289754 -13280849 -14050268
39572 -14050268 -4772004 -7194408 -23332890 -34038450 -29435082 -20094351 -16849502 -17708874
39564 -17708874 -17934602 -17091877 -12017072 2403141 20163898 25532446 14308631 1833453
39556 1833453 2004066 8546499 6271272 -6579535 -16628457 -12019290 5989680 25117397
39548 25117397 31675109 22409426 10198137 12500438 30648201 47367742 49216011 42955804
39540 42955804 42056853 45217705 40523713 27289657 20057476 28238391 41915938 43345614
39532 43345614 27029159 3764563 -11558650 -11858002 -1446 15651703 26500245
39525 26500245 27574975 19950822 10484233 6938690 10829296 16178135 17913919 19360461
39517 19360461 26238659 34647362 33497072 21422690 12317605 17490789 29519193 33042496
39509 33042496 26650493 22573977 26153718 28138093 20273563 7512835 -1275885 -6145548
39501 -6145548 -11972093 -17934442 -20099060 -20721212 -25276885 -31203916 -29222684 -17734751
39493 -17734751 -7301309 -6576151 -10821182 -10384739 -5189686 -2946546 -5681667 -6724839
39485 -6724839 -1524178 6417779 12856428 19190618 27618853 35705733 40783274 44937704
39477 44937704 49700913 49860979 39810400 23603880 11046845 4999412 492968 -3832797
39469 -3832797 -2178690 8723025 24059068 37234315 44465736 41861412 27744408 11365974
39461 11365974 8148836 19227774 26082760 15198344 -1369273 -2836254 10024429
39454 10024429 17082791 8553069 -3604436 -5333811 3169437 14821187 26213300 34323515
39446 34323515 33312430 22657738 11663167 9446349 15531150 23863000 29164601 26214454
39438 26214454 12440790 -3154055 -3771130 13986024 31315597 29562893 13996876
39431 13996876 4149322 6955419 13055265 16000915 19691505 25476156 25673498 15291991
39423 15291991 1217522 -5488837 -1116385 9210275 16344009 12638080 -1201564 -14047157
39415 -14047157 -15179148 -7030977 -472047 974646 2621357 5292842 3387067 -1225334
39407 -1225334 2674516 17028609 26970228 21966199 13885602 21464468 43830426 62250852
39399 62250852 63687748 50474474 30278013 9780249 -2606636 -854686 9520927
39392 9520927 16246473 15812742 15132740 17123772 15458044 6267594 -5330214 -14036626
39384 -14036626 -19741962 -20294742 -10253789 6864613 16471822 12077860 6168433 10528050
39376 10528050 15642518 5644036 -12840228 -17051665 -3606136 3409724 -12077317 -32516717
39368 -32516717 -30933106 -8520650 9707249 11119506 8325760 14494660 23165063 20712961
39360 20712961 7189211 -5513648 -9464896 -5040779 5862729 20713114 32079379
39353 32079379 32286235 23642754 16405356 14625555 10948112 -1425032 -17515343 -25805546
39345 -25805546 -21546642 -11558184 -7419585 -14465670 -24565840 -20907981 3752162 33533984
39337 33533984 43151743 28491847 13595387 20178786 39427848 44822284 26374868
39330 26374868 -952603 -19429476 -24539109 -18437887 -2637695 16523418 26072723
39323 26072723 18726650 1935153 -10717319 -12899137 -7512605 -1536370 -2641989 -14567829
39315 -14567829 -31097387 -39922569 -36521899 -28536931 -22992244 -17236765 -8399571 -3029307
39307 -3029307 -7548137 -15162828 -13580904 -2841325 5407428 5123956 1357573 -2232168
39299 -2232168 -10095175 -24291474 -35346494 -30467473 -8335503 17904080 31072164
39292 31072164 22926197 446416 -18849468 -20532056 -4809939 15035792 24782803
39285 24782803 19689489 6426152 -2465812 857765 11053939 15123708 9922721 8142679
39277 8142679 19975163 35386547 36278474 22630060 12034924 12995171 14882896 9665114
39269 9665114 7140250 16663769 26236268 16667579 -8593336 -24828872 -18551285 -4434208
39261 -4434208 -4111064 -18375752 -29236948 -24825661 -13231312 -10708044 -21887443 -35380543
39253 -35380543 -37297274 -25306323 -8170738 5359789 13406478 18079540 20846087 22316757
39245 22316757 23092084 22916422 21389348 20064269 20370605 19422915 13717107 8573449 16088751
39236 16088751 38147634 57996569 57086938 36871858 15578317 5828559 5089251 7723305
39228 7723305 14900313 27695909 38913487 39372419 28962464 16427608 10729973 15581683
39220 15581683 27718457 35863863 26944914 1626646 -19355629 -14638406 11127972
39213 11127972 29830056 22480019 -90728 -14950607 -15912721 -13994653 -15579483 -14916664
39205 -14916664 -8327916 -1499592 2242039 8856900 21136474 29316322 24340233 13572017
39197 13572017 12008124 21848384 31833993 34484081 32673710 29678540 24231567 17508322
39189 17508322 14923911 17335786 18091459 11836235 45687 -13030000 -22334111 -20050704
39181 -20050704 -2342249 19925539 29007713 23250049 20144115 29769374 37838816 26249971
39173 26249971 713636 -15685366 -11182374 4898844 17764631 20791903 15214294
39166 15214294 7190054 5494979 13433766 22794712 22873485 14232500 6017820 1693144
39158 1693144 -3190993 -9631040 -11865941 -7790591 -4193391 -7629668 -15670665 -20865252
39150 -20865252 -20120432 -17782975 -20751433 -30363714 -38353038 -34031019 -17681731 -2073105
39142 -2073105 2858425 661333 -1300746 -4059985 -10786737 -15803808 -11953258 -4034309
39134 -4034309 -1820466 -3043280 2468282 13314511 16549249 8442319 603569 2141447
39126 2141447 8893071 14253870 18164850 20673830 18080372 10459169 3153713 -2276724
39118 -2276724 -8124064 -10578725 -3774214 4087660 -4052644 -26839004 -40085072 -28634433
39110 -28634433 -5759906 9607287 16740797 20104547 11577627 -12808448 -31915845
39103 -31915845 -20449778 14597330 40763507 41022050 27661097 16585107 8754931
39096 8754931 494421 -5958182 -8620672 -9751476 -9398292 -5979867 -5228226 -15997798
39088 -15997798 -34073669 -42406521 -31833598 -11094830 7268797 20088527 28351305
39081 28351305 29683745 22837601 12645173 5221918 2861292 5247147 9733602 10452312
39073 10452312 4839790 350039 5214083 13635999 12477982 2936699 639965 10558157
39065 10558157 17629988 10122966 -2096813 -3793696 2590031 3466637 -3505856 -7094668
39057 -7094668 -166664 10771239 13796738 3315118 -15398808 -29466248 -28370623 -13432212
39049 -13432212 4940142 18874969 26069182 23131732 7553510 -11587327 -18099614
39042 -18099614 -9498724 -892487 -1728291 -3169667 1818798 1982135 -12843793 -29059716
39034 -29059716 -26146762 -8328143 1487069 -4442030 -11658612 -9740439 -4955444 -3507601
39026 -3507601 -1274117 3169139 1615132 -9280656 -19971584 -23282529 -25971261 -35100964
39018 -35100964 -42411385 -33816266 -9600001 14491007 24435486 20021942 11480343 8702169
39010 8702169 13375173 20033452 24476617 27470366 26868215 13467752 -14649960 -38860474
39002 -38860474 -36852473 -12817554 5359446 1637213 -12582259 -22740836 -30391455
38995 -30391455 -37459544 -31776859 -6753081 19153681 23460047 10764220 3018046 6972337
38987 6972337 12901459 19353088 33973912 50475662 50406387 32783204 18765790 18994997
38979 18994997 18322684 4317953 -9852555 -7198938 4907402 7210741 -2104049 -9975568
38971 -9975568 -13207982 -20928409 -34209524 -40697108 -31989256 -14064359 1750837 8888935
38963 8888935 6315292 -1656789 -6158222 -2683504 1662091 -1616246 -7155530 -1864263
38955 -1864263 14266792 25863235 22692937 10784558 -262067 -9353114 -17768348 -21464046
38947 -21464046 -17120469 -8590584 -916942 5536206 9760060 6965149 -2298284 -7646513
38939 -7646513 -2244727 5563296 3630007 -5887479 -10386568 -5908723 -1365293 -3861983
38931 -3861983 -9505640 -10246167 -2140281 14132339 33191643 43997000 37281679 17564951
38923 17564951 1355261 -409616 7065573 12434663 12582995 11931618 12452418 11529160
38915 11529160 8334540 6286255 8278555 13161478 18109780 22317728 27200148 33528273
38907 33528273 38688664 37458000 27320430 13274434 4743943 6300242 13759614 20747292
38899 20747292 25432970 27745131 24328566 12888396 -279286 -5279161 -2456183 -3081409
38891 -3081409 -12380041 -20054468 -14879451 -1774536 6121908 7791615 13196257 22550442
38883 22550442 22599895 8878506 -3141237 560924 11700257 13223944 4840294 75107
38875 75107 3988620 10403250 18065214 31590032 45972255 48296816 38726667 32912107
38867 32912107 37835272 41774537 36027798 30122089 34329238 41497950 39511285 30293712
38859 30293712 23244966 19831368 17509047 19222624 26226102 31414547 32198917 37384621
38851 37384621 46405586 37620351 -247349 -38341228 -38133219 -4794683 20445399 19011071
38843 19011071 13079974 21163625 30150424 24738596 14392473 11994737 10166869 267502
38835 267502 -5039940 8408905 28802339 33966691 23595092 13683431 7692939 -3544639
38827 -3544639 -18077432 -21781968 -10988760 2567725 10141446 12825437 9612588 -4214204
38819 -4214204 -23132810 -30695472 -18833977 2349167 18314004 24596821 24022374 18229079
38811 18229079 7662758 -4557362 -13121830 -14395831 -10343302 -8829107 -15268708 -22205769
38803 -22205769 -15497232 4053273 15666173 4987729 -14204780 -18397595 -6742930
38796 -6742930 1946476 445582 2035466 16579449 35422129 46150475 48679871 49358247
38788 49358247 49363489 46286643 40172290 32138932 21970703 10752601 1723223 -3246703
38780 -3246703 -4243956 -985423 5354346 9886413 9161013 5694340 1616312 -6551454
38772 -6551454 -18447652 -22659141 -11593842 3037069 5547030 1749606 9425116 25839057
38764 25839057 28348814 11050893 -3078504 3537375 17583147 17412696 4310153 -4623003
38756 -4623003 -2749095 2376975 3412460 -1519869 -11194543 -18413847 -12173107 7475444
38748 7475444 24377408 25315944 15640652 6893418 -526767 -10559155 -17854770 -16083425
38740 -16083425 -12478737 -18074437 -27617663 -24572351 -4702993 18428064 30805754 29555474
38732 29555474 18489225 3624267 -6249123 -4156365 7885700 21170841 28311447
38725 28311447 25689022 14158265 2836910 3645673 14027917 15296703 -651130 -14628233
38717 -14628233 -6535578 11960795 13206801 -3720990 -11998276 -37969 11221086
38710 11221086 3351466 -10625771 -8258040 8068030 17553693 12146408 3026804 -482318
38702 -482318 -2336834 -8455070 -15836839 -17539916 -11795442 -1738696 10264603 23423585
38694 23423585 34267275 36269470 27463412 16247062 13139150 15873059 10862737 -6118816
38686 -6118816 -19756710 -14470848 3575004 15604813 16079274 15197449 18398509 20176460
38678 20176460 20198386 28543492 47731655 63337909 62227979 50134751 41171142 37544645
38670 37544645 30186854 15083163 -602084 -7432672 -2683721 8209406 15202129 10872552
38662 10872552 -2483759 -14743487 -18193753 -12907088 -2513053 9009406 15527508
38655 15527508 11867301 2089089 -2486754 2727271 10431240 13863389 16353167 23001399
38647 23001399 30258636 30931779 24508791 16212206 9728278 5507489 1943266 -4869793
38639 -4869793 -16202600 -22688235 -10917165 15996588 34913296 29437865 11541639
38632 11541639 4899831 13815166 22444323 20499214 14444003 13098755 15867717 18591168
38624 18591168 20716945 22573068 22697007 20780623 18127897 14844083 11952326 14387035
38616 14387035 24085700 32027686 27285434 13690378 6133595 8756481 9205613 -1059770
38608 -1059770 -12970045 -13850031 -5053107 3514199 8245594 11132321 11145472 8132677
38600 8132677 10763363 27381352 49931248 59902848 52390091 42532879 43704173 50200618
38592 50200618 49069806 40649012 37341504 46102296 61403070 73888054 77972349 71858461
38584 71858461 58377931 46703697 45687572 53344924 58960725 57111121 53232763 54010244
38576 54010244 59962855 69665214 81898890 89387749 81167123 59143039 42461387 44721376
38568 44721376 55294042 55892629 47603048 44982146 48980323 46117492 34012883 26087787
38560 26087787 26431701 21521170 6228225 -2242208 9617148 29032343 37507839 39243318
38552 39243318 48557775 60170447 56143447 37639360 25502506 28461375 33194028 30231381
38544 30231381 28013370 32267880 31016030 14553988 -3321991 -760432 22175009 43689499
38536 43689499 47885186 40057382 34446527 36860012 42207130 42830105 35709341 24099507
38528 24099507 14388425 11037584 14054580 20239218 24926368 23424306 14678411 4348552
38520 4348552 579129 5269050 12424987 15660174 13641219 7963425 946064 -2958071
38512 -2958071 735554 10025666 16869244 17389295 16866017 20692752 25108000 22202898
38504 22202898 10949057 -2009928 -10357535 -11971795 -6553824 5236669 19982623
38497 19982623 32373446 38681505 38546648 34944780 33461595 38409154 47328448 52671773
38489 52671773 51630315 50136485 53438217 57907726 58289919 57997759 62825069 67075472
38481 67075472 57863195 35448876 18312938 21825187 39722179 54125995 57819680
38474 57819680 57232752 56579542 50473272 35371352 20138322 18184218 30967817 44767093
38466 44767093 45502057 34114188 24139406 24283927 27916092 23682147 12945334 8431433
38458 8431433 14864030 20730968 14903185 2857149 -2727908 -761770 785627 1542934
38450 1542934 7914066 16664926 16312316 8358382 9661151 25730296 38718371 34333266
38442 34333266 24809388 27993176 36956573 32471284 17363440 13457475 26453592 38762660
38434 38762660 39817808 39080336 42095659 37346542 18877013 1567236 -1036459 2766513
38426 2766513 425975 -1689996 9146683 27695916 37777957 36084144 32161832 31411344
38418 31411344 34208823 44963397 64605526 79691388 77183679 66081506 65950661 76914972
38410 76914972 80558971 69875127 58226763 56214812 58530709 58317780 57392081 56081280
38402 56081280 47908920 31413501 15587810 8398730 9876099 18210371 30620833 37699805
38394 37699805 31806067 22644686 28049524 46428331 56066434 46373170 31409461 26052390
38386 26052390 27516159 28597430 30266351 31279328 24188843 12731432 13543112 27589432
38378 27589432 30806813 10175699 -11258011 -6699366 14913156 26313930 24186756
38371 24186756 26534645 37498258 43182639 38332903 31205114 23880531 11982549 2805740
38363 2805740 9475425 26144725 32067093 22245366 11882705 8849884 5631829 1947030
38355 1947030 9486125 26388359 32089119 19285499 8300982 15436766 27806093 26590462
38347 26590462 17022177 15237939 19667975 17911661 13228644 20906103 39984268 49183734
38339 49183734 35653527 13626063 7204022 21665690 38266250 36323554 16997596
38332 16997596 1822336 6423766 21714819 28349972 23528402 19652876 19838667 14469709
38324 14469709 5057614 9273788 31523033 49090144 44236992 32816640 39667359 58501788
38316 58501788 61650698 43481378 27535318 29365755 36918459 35207680 29938403 34294729
38308 34294729 46000739 50938195 42657566 27866961 16228720 12250060 15085269 20906948
38300 20906948 26186056 30885199 36879600 42805335 43828700 37618100 27589360 19341291
38292 19341291 16029758 16931898 18485486 18284085 20040988 30571727 47617591 55812015
38284 55812015 42601158 15389892 -5385169 -8413720 1427228 15251092 27717029
38277 27717029 32221401 21624376 -936761 -21369543 -30402793 -32654480 -35358414 -36362635
38269 -36362635 -30034703 -18289903 -7852834 -912978 4275049 6836036 4553437 -17347
38261 -17347 -1241726 1836115 4124879 1363543 -4398114 -6340130 915521 14964494
38253 14964494 25190564 22275482 9292391 -1072120 -1844955 1543371 2647441 4491229
38245 4491229 12077413 20440974 19619348 9606299 1865659 5627489 19041713 34065773
38237 34065773 44190147 46919853 44049078 40124594 36422631 27769158 11211420 -4045325
38229 -4045325 -4508784 8607052 17868941 11218760 -3571467 -12199310 -13810570 -18500054
38221 -18500054 -29265366 -36861452 -33027495 -21269092 -12482775 -14234853 -25052231 -35676519
38213 -35676519 -36253852 -26079335 -15473748 -14096646 -19159227 -20520878 -15479984 -11033938
38205 -11033938 -12015564 -15732042 -19635228 -24851474 -28926462 -25025365 -13789993 -6043278
38197 -6043278 -6071925 -2581969 12336242 24779924 16228446 -5509072 -11966965 7349312
38189 7349312 30185281 32190914 16726492 4109868 4179764 12137921 21680134 27716012
38181 27716012 22443114 4193043 -12315829 -9460958 8820004 19491008 10317054
38174 10317054 -4781912 -5399070 10501693 28129463 34398656 27254514 11970528 -3525189
38166 -3525189 -11625357 -10094600 -4610384 -3067137 -7985997 -16341450 -24231180 -28564426
38158 -28564426 -26536104 -17668907 -5874174 3449894 8093604 9182099 8311180 7068970
38150 7068970 7795461 11215400 13529998 9279227 -1772227 -12760033 -16053270 -10259268
38142 -10259268 66445 10349366 19598174 28251267 35159063 38916116 40730551 42598521
38134 42598521 42716603 36722322 24801776 13301668 6718986 2499393 -2521720 -5619581
38126 -5619581 -4238059 -3969667 -11591872 -22275800 -23814293 -14020624 -3867164 -1112676
38118 -1112676 -870083 3572551 10437823 15791383 20982229 26322372 25613325 15859146
38110 15859146 5388346 2469276 2031172 -5194528 -15523116 -17182685 -9328755 -2499052
38102 -2499052 -781260 2395506 9026485 11369123 6742273 4530050 11257814 19511091
38094 19511091 20169521 16642383 17175008 19663915 14959522 2741119 -4675014 5146260
38086 5146260 31816049 59565674 66688371 44676335 11822448 -682925 17065831
38079 17065831 41290644 44188783 26975447 11699107 8287525 6655117 -675122 -6088758
38071 -6088758 -1555005 7974830 13151638 13397311 14823557 20350763 26337678 25758910
38063 25758910 14186820 -3026107 -12124879 -7292740 -1878290 -10938961 -25152369 -19761636
38055 -19761636 8022709 30853699 29509011 19362667 22806209 32358000 24219212 -855345
38047 -855345 -16000751 -7155111 9610099 15193890 12425825 13955855 19984752 21544561
38039 21544561 18299779 19893543 30318950 39860692 35822149 18602196 4123668 7982897
38031 7982897 27331794 43020898 42097114 32061030 27370098 28723562 25626533 15130384
38023 15130384 5908287 4487483 8739974 15745632 25358398 34031248 34762705 25772359
38015 25772359 11913492 -2514014 -14422938 -17990624 -11104670 -3067844 -2440667 -541776
38007 -541776 15163293 33604040 29897266 5651461 -7825030 3298244 13313752
38000 13313752 -69576 -17789752 -11064419 10296919 13868495 -4070781 -17602892
37993 -17602892 -15677620 -12838486 -14537987 -5531320 18575514 37156288 34816824 22876899
37985 22876899 17470171 16081498 9971351 3001530 2993165 6946498 7952650 6463393
37977 6463393 4723931 1303031 -242850 9052869 25538919 29894149 14854774 682945
37969 682945 7118050 24138489 29705316 24184250 23957839 28849985 22441723 4536696
37961 4536696 -2196603 14494116 35962612 36274938 13548520 -12408303 -24890924 -23106997
37953 -23106997 -15358016 -8287987 -2918872 2929143 10439831 19208734 29947310 42871135
37945 42871135 51999218 48672642 35530261 28372322 35942647 46153812 43426000 32191920
37937 32191920 29216702 38141118 47655878 51486042 52309162 46744688 26513822 -1524896
37929 -1524896 -15902914 -9358739 -668798 -7499574 -21613289 -23026836 -7684287 11167471
37921 11167471 20800479 17610987 5897656 -2151006 6188783 26455030 35572547 19818143
37913 19818143 -4862745 -14231044 -8573239 -6799715 -14054282 -16171779 -6110972 4807000
37905 4807000 7020698 6178239 8740035 9661296 4439825 343735 3640850 5991960
37897 5991960 -2951103 -16810669 -20868128 -14742183 -11067277 -12128435 -4401451 17964332
37889 17964332 38222047 36760223 17941879 4585752 7831603 14571250 7682218 -11002979
37881 -11002979 -24572017 -22091068 -7905883 7656936 18533780 22876810 20232750
37874 20232750 12968563 6309546 3009714 813482 -1822727 -1448886 4190584 9061251
37866 9061251 4815695 -6735439 -13921529 -9723247 -624088 1764250 -6151142 -18219065
37858 -18219065 -26720145 -28678731 -25909779 -22288918 -20624723 -20076871 -16809001 -8252397
37850 -8252397 3821348 14613345 19048121 13671810 42682 -12026972 -9980411 7186055
37842 7186055 23290740 20961905 2820823 -11057044 -8542066 207058 -982997 -11622070
37834 -11622070 -17921494 -14607107 -10780036 -12598362 -12415543 -1975054 12673410 19184177
37826 19184177 16497825 13719600 13847902 10198085 336033 -7334538 -5549453 1738770
37818 1738770 7078943 10324203 14789782 18223651 15956808 9960724 6440076 5529086
37810 5529086 1198754 -8161439 -16244980 -17907123 -15920083 -15421766 -15293293 -8683837
37802 -8683837 8383545 30135793 43511223 39796432 24845722 14161996 15564074
37795 15564074 21643552 23113230 22258436 24805631 25468180 15398671 1350097 962047
37787 962047 16047320 26370715 17039065 -1969685 -13169159 -15444947 -17711245 -19384539
37779 -19384539 -13424177 -2966174 1509943 -621813 -1017209 277302 -5839617 -18323847
37771 -18323847 -21212126 -4426257 21887249 40463395 45488634 42231096 36699082 32540501
37763 32540501 31528275 30516291 23094285 9474498 -746220 -486274 6296737 13169095
37755 13169095 21181129 32694088 41190651 37142785 22038782 7782164 1467883 -2793280
37747 -2793280 -14734401 -33893728 -46927293 -39876869 -14406564 10237189 16089950
37740 16089950 5830507 -3457180 -4135590 -4386884 -9324737 -10416104 -1748297 6138648
37732 6138648 1066241 -11397218 -17011723 -14667888 -14793728 -20380966 -24249274 -23111744
37724 -23111744 -20298958 -15421289 -5500516 3022712 -2177293 -20455671 -35257554 -34395358
37716 -34395358 -23068928 -12797101 -6858773 -1040607 8647076 22000408 32363649
37709 32363649 29064043 10606778 -6582365 -4561506 11610094 19444522 9584817 -5010162
37701 -5010162 -12963763 -19516578 -30702355 -39778336 -40091034 -37019369 -35527922 -28836830
37693 -28836830 -11985082 5165928 12041599 14173272 21899638 31430701 32011808 24406134
37685 24406134 17019347 9558415 -4025722 -20210085 -28140867 -25128566 -17717770 -10131419
37677 -10131419 -3150285 -758278 -5729637 -11679705 -10721302 -5011563 123376 7873069
37669 7873069 21006696 28247197 17052583 -3990275 -13721361 -7361128 1072268 3521107
37661 3521107 5041445 5816856 -2153071 -15755596 -18983900 -8108618 415366 -3351910
37653 -3351910 -6305988 5378673 23328875 31153079 29294712 29677371 33458046 30123305
37645 30123305 15986431 509447 -6562226 -5738833 -3484071 -1846205 4744625 20520503
37637 20520503 36244392 33482935 8331151 -16854216 -18909861 -5312290 -1706013
37630 -1706013 -10877171 -8851628 12821876 27377199 11043873 -19782260 -30829591
37623 -30829591 -16657070 -3125491 -9101395 -25863736 -34956595 -31185601 -23688441 -22157419
37615 -22157419 -25572704 -23610009 -10752993 3289399 5040621 -2962874 -6961014 -6249657
37607 -6249657 -14227232 -30640720 -34280439 -14733283 8573141 14509458 9614566 11618503
37599 11618503 20140505 24233134 24643223 26091432 19835947 -1699338 -22820309 -22462106
37591 -22462106 -6597974 2808338 4142063 12966241 26835787 25134690 6762728 -2238332
37583 -2238332 12975282 35379467 43346004 36821854 26783860 18217477 13300494 14553257
37575 14553257 16749636 11361656 3979781 9118916 23149467 24038270 5696556 -9879547
37567 -9879547 -5698369 6498209 8789864 3059332 -922869 -4907410 -12557958 -16135090
37559 -16135090 -9937447 -3571595 -6159158 -11160293 -12357042 -19117930 -36990090 -48326859
37551 -48326859 -35022872 -9179770 2780416 -1649973 -3184999 4339566 6934977 -1876657
$$ [...]
##END NTUPLES=NMR SPECTRUM
##END=
