##TITLE=31Pdec_SR28_2
 CDCl3, 24 sc
 23.12.2020
##JCAMPDX= 6.0         $$ Bruker NMR JCAMP-DX V2.0
##DATA TYPE= NMR SPECTRUM
##DATA CLASS= NTUPLES
##ORIGIN= UXNMR, Bruker Analytische Messtechnik GmbH
##OWNER= root
$$ XWIN-NMR		Version 3.5
$$ Wed Dec 23 12:44:33 2020 Russian Standard Time (UT+4h)  she@DPX200
##.OBSERVE FREQUENCY= 81.013821
##.OBSERVE NUCLEUS= ^31P
##.ACQUISITION MODE= SIMULTANEOUS
##.ACQUISITION SCHEME= undefined
##.AVERAGES= 24
##.DIGITISER RES= 17
##SPECTROMETER/DATA SYSTEM= spect
##.PULSE SEQUENCE= zgpg30
##.SOLVENT NAME= CDCl3
##.SHIFT REFERENCE= (INTERNAL, CDCl3, 0, 182.463)
##AUDIT TRAIL= $$ (NUMBER, WHEN, WHO, WHERE, WHAT)
$$ ##TITLE= Audit trail, XWIN-NMR		Version 3.5
$$ ##JCAMPDX= 5.01
$$ ##ORIGIN= Bruker BioSpin GmbH
$$ ##OWNER= she
$$ F:/spectra/data/she/nmr/P31/1/pdata/1/auditp.txt
$$ ##AUDIT TRAIL=  $$ (NUMBER, WHEN, WHO, WHERE, WHAT)
(   1,<2020-12-23 12:43:32.50 +0400>,<she>,<DPX200>,
      <created by zg, POWCHK disabled, PULCHK disabled
       configuration hash MD5:
       00 E9 B6 7A A2 85 ED C7 34 08 36 98 17 FE 4E 26
       data hash MD5: 32K
       DA 8E 39 97 99 97 A7 B4 CE EA D0 2A 6F 8B B8 CA>)
(   2,<2020-12-23 12:43:36.85 +0400>,<she>,<DPX200>,
      <Start of raw data processing
       efp BC_mod = 2 LB = 1 FT_mod = 6 PKNL = 1 PHC0 = -2456.281 PHC1 = 70.60083 SI = 64K 
       data hash MD5: 64K
       ED 5B 4C 55 F9 49 E5 14 7C B1 3A 12 F3 24 D0 A8>)
(   3,<2020-12-23 12:43:56.23 +0400>,<she>,<DPX200>,
      <pk PHC0 = 8.390874 PHC1 = -7.399998 
       data hash MD5: 64K
       AB 86 70 DC 3F 1F 0D 0C A1 DC C2 6F A5 AB B6 DF>)
(   4,<2020-12-23 12:43:58.90 +0400>,<she>,<DPX200>,
      <abs ABSG = 5 
       data hash MD5: 64K
       AF 00 B3 D5 22 B5 8A 02 8D 3D 09 42 4E 7B C8 E2>)
$$ ##END=
$$ 
$$ hash MD5
$$ AE D5 16 6B 65 B1 C9 07 39 09 EB DB 5B 23 37 05
##$RELAX= 
##$RELAX= 
##$RELAX= 
##$RELAX= 
##$RELAX= 
##$RELAX= 
##$RELAX= 
##$RELAX= 
$$ Bruker specific parameters
$$ --------------------------
##$DU= <F:/spectra>
##$EXPNO= 1
##$NAME= <P31>
##$PROCNO= 1
##$TYPE= <nmr>
##$USER= <she>
##$AMP= (0..31)
100 100 100 100 100 100 100 100 100 100 100 100 100 100 100 100 100 100 
100 100 100 100 100 100 100 100 100 100 100 100 100 100 
##$AQSEQ= 0
##$AQ_mod= 1
##$AUNM= <au_zg>
##$AUTOPOS= <>
##$BF1= 81.014009
##$BF2= 200.13
##$BF3= 200.13
##$BF4= 200.13
##$BF5= 200.13
##$BF6= 200.13
##$BF7= 200.13
##$BF8= 200.13
##$BYTORDA= 1
##$CFDGTYP= 0
##$CFRGTYP= 5
##$CHEMSTR= <none>
##$CNST= (0..31)
1 1 145 1 1 1 1 1 1 1 1 1 1 1 1 1 1 1 1 1 1 1 1 1 1 1 1 1 1 1 1 1 
##$CPDPRG= <waltz16>
##$CPDPRG1= <>
##$CPDPRG2= <waltz16>
##$CPDPRG3= <>
##$CPDPRG4= <mlev>
##$CPDPRG5= <mlev>
##$CPDPRG6= <mlev>
##$CPDPRG7= <mlev>
##$CPDPRG8= <mlev>
##$CPDPRGB= <>
##$CPDPRGT= <>
##$D= (0..31)
0 1 0 0 0 0 0 0 0 0 0 0.03 2e-05 3e-06 0 0 0 0 0 0 0 0 0 0 0 0 0 0 0 0 
0 0 
##$DATE= 1608713011
##$DBL= (0..7)
120 120 120 11 120 120 24 19 
##$DBP= (0..7)
150 150 150 150 150 150 150 150 
##$DBP07= 0
##$DBPNAM0= <>
##$DBPNAM1= <>
##$DBPNAM2= <>
$$ [...]
##$SUBNAM3= <"">
##$SUBNAM4= <"">
##$SUBNAM5= <"">
##$SUBNAM6= <"">
##$SUBNAM7= <"">
##$SUBNAM8= <"">
##$SUBNAM9= <"">
##$SW= 369.568048894756
##$SWIBOX= (0..15)
0 1 3 0 0 0 0 0 0 0 0 0 0 0 0 0 
##$SW_h= 29940.119760479
##$TD= 32768
##$TD0= 1
##$TE= 0
##$TE2= 300
##$TE3= 300
##$TEG= 300
##$TL= (0..7)
0 120 53 12 22 120 120 120 
##$TP= (0..7)
150 150 150 150 150 150 150 150 
##$TP07= 0
##$TPNAME0= <>
##$TPNAME1= <>
##$TPNAME2= <>
##$TPNAME3= <>
##$TPNAME4= <>
##$TPNAME5= <>
##$TPNAME6= <>
##$TPNAME7= <>
##$TPOAL= (0..7)
0.5 0.5 0.5 0.5 0.5 0.5 0.5 0.5 
##$TPOFFS= (0..7)
0 0 0 0 0 0 0 0 
##$TUNHIN= 0
##$TUNHOUT= 0
##$TUNXOUT= 0
##$USERA1= <user>
##$USERA2= <user>
##$USERA3= <user>
##$USERA4= <user>
##$USERA5= <user>
##$V9= 5
##$VALIST= <valist>
##$VCLIST= <CCCCCCCCCCCCCCC>
##$VD= 0
##$VDLIST= <DDDDDDDDDDDDDDD>
##$VPLIST= <PPPPPPPPPPPPPPP>
##$VTLIST= <TTTTTTTTTTTTTTT>
##$WBST= 1024
##$WBSW= 4
##$XGAIN= (0..3)
0 0 0 0 
##$XL= 0
##$YL= 0
##$YMAX_a= 33487
##$YMIN_a= -35444
##$ZGOPTNS= <>
##$ZL1= 120
##$ZL2= 120
##$ZL3= 120
##$ZL4= 120
##$ABSF1= 182.463
##$ABSF2= -187.1042
##$ABSG= 5
##$ABSL= 3
##$ALPHA= 0
##$AQORDER= 0
##$ASSFAC= 0
##$ASSFACI= 0
##$ASSFACX= 0
##$ASSWID= 0
##$AUNMP= <proc_1d>
##$AZFE= 0.1
##$AZFW= 0.5
##$BCFW= 0
##$BC_mod= 2
##$BYTORDP= 0
##$COROFFS= 0
##$CY= -3
##$DATMOD= 1
##$DC= 0
##$DFILT= <>
##$DTYPP= 0
##$F1P= 0
##$F2P= 0
##$FCOR= 1
##$FTSIZE= 65536
##$FT_mod= 6
##$GAMMA= 0
##$GB= 0
##$INTBC= 1
##$INTSCL= 5.30512e-09
##$ISEN= 30
##$LB= 1
##$LEV0= 0
##$LPBIN= 0
##$MAXI= 10000
##$MC2= 0
##$MEAN= 0
##$ME_mod= 0
##$MI= 50
##$NCOEF= 0
##$NC_proc= -3
##$NLEV= 6
##$NOISF1= 182.463
##$NOISF2= 159.3651
##$NSP= 0
##$NTH_PI= 0
##$NZP= 0
##$OFFSET= 182.463
##$PC= 4
##$PHC0= -2447.89
##$PHC1= 63.20083
##$PH_mod= 1
##$PKNL= yes
##$PPARMOD= 0
##$PSCAL= 0
##$PSIGN= 0
##$REVERSE= no
##$SF= 81.014009
##$SI= 65536
##$SIGF1= 159.3651
##$SIGF2= -187.1042
##$SINO= 113.3802
##$SIOLD= 16384
##$SREGLST= <1H.CDCl3>
##$SSB= 0
##$STSI= 65536
##$STSR= 0
##$SW_p= 29940.119760479
##$SYMM= 0
##$S_DEV= 0
##$TDeff= 32768
##$TDoff= 0
##$TI= <>
##$TILT= no
##$TM1= 0
##$TM2= 0
##$TOPLEV= 0
##$USERP1= <user>
##$USERP2= <user>
##$USERP3= <user>
##$USERP4= <user>
##$USERP5= <user>
##$WDW= 1
##$XDIM= 65536
##$YMAX_p= 288846786
##$YMIN_p= -1744012
$$ End of Bruker specific parameters
$$ ---------------------------------
##NTUPLES= NMR SPECTRUM
##VAR_NAME=  FREQUENCY,     SPECTRUM/REAL,   SPECTRUM/IMAG
##SYMBOL=    X,             R,               I
##VAR_TYPE=  INDEPENDENT,   DEPENDENT,       DEPENDENT
##VAR_FORM=  AFFN,          ASDF,            ASDF
##VAR_DIM=   65536,         65536,           65536
##UNITS=     HZ,            ARBITRARY UNITS, ARBITRARY UNITS
##FACTOR=    0.456856943014862, 1,           1
##FIRST=     14782.0589164895, 0,            0
##LAST=      -15158.0608439895, 0,           0
##MIN=       -15158.0608439895, -1744012,    0
##MAX=       14782.0589164895, 288846786,    0
$$ Real data points
##PAGE= N=1
##DATA TABLE= (X++(R..R)), XYDATA
$$ [...]
45164 10101 290847 377002 256835 44206 -163160 -267048 -175854 36283 115650 -67197
45154 -67197 -309685 -338699 -179727 -73943 -104563 -132209 -81541 -58973 -140012 -240964 -286652
45143 -286652 -341827 -468973 -584106 -576323 -481300 -413435 -386900 -327741 -228706 -164573 -154509
45132 -154509 -130664 -74586 -70667 -153835 -199418 -78384 130479 223708 164455 135155 246577
45121 246577 354012 287113 130818 90789 158019 137849 4191 -26221 152766 341036
45111 341036 329237 195911 120916 62710 -132395 -387822 -444448 -264677 -133351 -258502
45101 -258502 -467299 -446883 -165499 111693 176643 88170 10099 -21870 -76316 -140357 -102243
45090 -102243 47478 126073 -12294 -229955 -251910 -49412 105608 22530 -154427 -187775
45080 -187775 -80514 -4824 -18736 -47807 -74128 -140076 -197899 -152459 -45015 -5669 -22230
45069 -22230 42073 174958 175188 -37431 -267946 -314052 -224889 -166035 -169745 -168839 -165651 -196091
45057 -196091 -189053 -29114 254218 493974 590111 603451 630444 666410 622850 438702 159231
45046 159231 -81067 -169820 -126965 -73790 -77942 -80544 -6547 111893 171636 112814 -46691
45035 -46691 -240676 -370937 -352451 -209505 -83599 -77255 -125960 -93376 42999 181928 249084
45024 249084 264625 256234 193858 53507 -105105 -178072 -130728 -43847 -30941 -111623 -187413
45013 -187413 -158535 -39836 72898 124148 129701 109684 72474 61732 122944 203729 188320
45002 188320 70756 -8522 41620 130993 134533 80198 80031 133195 119581 -25191 -222392
44991 -222392 -336883 -290293 -105879 100942 198180 157231 76853 53304 74600 84597 79859
44980 79859 74650 41371 -27310 -62894 -25122 4635 -50078 -104280 -30049 102100 70014 -190350
44968 -190350 -467862 -523362 -350534 -137985 -49610 -90978 -143657 -101681 3767 37022 -46012
44957 -46012 -99082 22089 230220 314066 246412 208580 287653 334153 202815 -18077 -136645
44946 -136645 -112040 -53713 -30908 -7914 49706 106441 111846 67315 14437 -22401 -60729 -115684
44934 -115684 -147004 -105430 -44838 -96135 -264729 -358630 -241519 -62917 -55845 -168747 -133076
44923 -133076 105315 284715 230416 105654 119795 208914 205864 159475 244796 441848 532304
44912 532304 399153 158178 -3128 12764 184858 372157 364514 74491 -319348 -533012
44902 -533012 -482024 -335397 -282025 -338675 -380277 -281704 -46032 155005 127746 -92520 -234921
44891 -234921 -134656 41715 59874 -28359 -16217 76885 45017 -113581 -162769 -36947 27855
44880 27855 -106791 -240201 -176773 -58272 -99814 -184279 -26817 345474 587191 515629
44870 515629 334288 306490 416256 466123 366259 195792 52467 -43647 -116585 -177769 -207530
44859 -207530 -170671 -62926 51757 79336 -17730 -193992 -374457 -494294 -493340 -342394 -107081
44848 -107081 72460 120142 107523 140670 192499 137321 -32467 -123665 38207 352983 519368
44837 519368 375942 72458 -138267 -183665 -168074 -168728 -166141 -155496 -187150 -255872 -256703 -121430
44825 -121430 66603 165163 142671 89477 75402 54751 -70106 -311511 -543222 -606308 -480916
44814 -480916 -321706 -285409 -356497 -403955 -375404 -335491 -319503 -272930 -175502 -109902 -133670
44803 -133670 -173996 -137896 -55450 -14962 -7221 55795 182902 261678 189558 -10262 -213557
44792 -213557 -305483 -277735 -236355 -281032 -360544 -313289 -91683 134706 174926 45334 -89213
44781 -89213 -139015 -140209 -128524 -96277 -64289 -71881 -85877 -26091 108790 236519 308737 327552
44769 327552 257115 56639 -184346 -292082 -232987 -152472 -140291 -112689 -6873 74184 42795
44758 42795 8368 105533 243773 225777 58839 -59425 -56464 -76335 -209927 -325782 -278490
44747 -278490 -151876 -155772 -336230 -504561 -453408 -181952 98767 165761 4240 -171190
44737 -171190 -150543 27939 136968 60956 -66419 -65649 56983 168967 217945 256794 301383
44726 301383 291306 203003 102915 58323 63231 77781 89264 117518 199999 365071 567502
44715 567502 673036 593882 430558 368351 420324 407093 241608 86747 124865 299055
44705 299055 427548 468450 486379 432891 198693 -113501 -213639 -6111 250659 276788
44695 276788 91254 -123379 -296307 -427828 -427287 -234479 -20859 -10782 -124499 -64705
44685 -64705 205323 341227 95960 -307624 -465612 -301814 -88506 -53872 -177304 -344445
44675 -344445 -505436 -634313 -668377 -562129 -347068 -109453 56287 86021 -2862 -108648
44665 -108648 -149296 -148845 -161589 -153646 -56819 88470 168257 176852 233130 378867 488075 450172
44653 450172 339077 301588 346137 347463 230585 61565 -36815 -475 130606 234667 199536
44642 199536 40415 -98080 -99382 3737 110163 188674 253036 261811 172649 73625 109322
44631 109322 248447 272502 70536 -178916 -228158 -71317 90531 131900 104058 76553
44621 76553 35723 -23406 -36735 27733 106562 156258 246552 439446 639168 686502 579544
44610 579544 472711 443337 388674 214536 14295 -49744 16398 48021 -32415 -97940 1044
44599 1044 217544 355289 309758 182045 137706 216017 327892 408173 491344 609188 674949
44588 674949 550652 237880 -62993 -131258 56156 317104 457957 439183 355846 298620
44578 298620 262527 188499 74818 14202 86648 228928 276508 166160 36482 65874 252941
44567 252941 433582 487055 432458 330579 200324 61103 -43549 -121464 -250179 -451246
44557 -451246 -609632 -595801 -427550 -241795 -139002 -117691 -126524 -112121 -43019 48958 79546
44546 79546 25438 -13571 60344 202328 303134 361479 453008 554074 548662 423247 298962
44535 298962 226959 112188 -76714 -178836 -61440 141464 174749 -11826 -240987 -380706
44525 -380706 -473700 -578020 -631860 -548590 -354809 -166604 -80130 -121576 -246915 -353120
44515 -353120 -344588 -232224 -126204 -99537 -108648 -86079 -52422 -72014 -140250 -196083 -228247
44504 -228247 -277899 -323166 -258386 -51767 144010 138383 -52723 -204013 -143792 63113 233905
44493 233905 281842 239377 148120 41674 -7309 39337 73766 -49804 -273379 -354973 -189001
44482 -189001 42596 129187 94676 76138 80269 41246 22053 141804 337842 408715 298195
44471 298195 146488 44106 -65640 -195375 -232171 -139740 -59895 -89903 -113583 355
44461 355 154723 141155 -73253 -317676 -420017 -322262 -67938 192565 253920 68928 -134194
44450 -134194 -106535 80794 128508 -58965 -232741 -159740 47628 93895 -101492 -308874
44440 -308874 -274355 -2280 268393 317713 144423 -71059 -165461 -123418 -29076 40602 45325
44429 45325 -20468 -92731 -62463 77554 161284 34707 -215362 -337729 -214928 36628
44419 36628 263348 422988 499789 434214 245634 109203 168711 326183 351161 185359
44409 185359 15922 21425 147441 199299 101538 -17696 -1243 147272 291333 338311 315391
44398 315391 272498 198621 78014 -48104 -148646 -269910 -445709 -590383 -592388 -485166
44388 -485166 -403691 -384261 -340962 -247452 -193766 -218473 -222922 -125345 10733 74134 32286
44377 32286 -100741 -301788 -463403 -417578 -166220 22891 -81927 -340736 -382930 -70488
44367 -70488 334550 482497 287168 -64297 -336768 -423212 -368721 -288291 -257277 -270815 -298754
44356 -298754 -329195 -333872 -262588 -129777 -36257 -32364 -37709 10886 24993 -86504 -219383
44345 -219383 -209037 -115173 -155105 -347787 -449626 -305211 -52168 119271 210509 281411
44335 281411 259995 84888 -88884 -56701 116313 166065 23005 -76044 63835 308509
44325 308509 381112 240469 132169 266807 547365 669106 461992 81104 -160859 -107250
44315 -107250 148322 441811 693988 855170 830569 587460 274205 92826 61199 19653
44305 19653 -124032 -281442 -344534 -335411 -327570 -318180 -272388 -228460 -254356 -326301 -343170 -262998
44293 -262998 -159411 -138447 -245446 -440675 -609662 -612494 -403039 -115235 39002 -10567
44283 -10567 -126822 -144316 -55109 23047 7698 -76431 -150422 -151638 -76784 2286 -570 -68093
44271 -68093 -76061 32623 137957 103885 -12081 -44606 24420 62657 26998 6431 -7226
44260 -7226 -160578 -443756 -580243 -392931 -94320 12345 -37393 -14281 52042 -84975
44250 -84975 -412608 -585122 -413389 -121037 14749 -591 -57925 -186421 -396831 -505223
44240 -505223 -366691 -123719 17344 99282 242872 323519 151625 -120622 -145494 77953
44230 77953 179166 -4703 -185799 -101411 90714 102080 -57603 -184684 -224848 -254918
44220 -254918 -252110 -144728 -28378 -84583 -287465 -394894 -263078 -18769 118681 74429
44210 74429 -57762 -151273 -175193 -209153 -311023 -377131 -240264 56256 239593 172589 75071
44199 75071 200723 437285 479663 312610 219690 313702 365133 186956 -67961 -131570 47841
44188 47841 328941 569956 673595 586983 382585 217774 123801 -16353 -202906 -250234
44178 -250234 -126788 -123568 -442764 -813888 -824586 -505624 -249576 -210429 -147730 105863
44168 105863 373106 438896 337333 188420 -3100 -217070 -299844 -176538 -27702 -60439
44158 -60439 -216583 -285950 -214186 -123194 -98468 -124660 -182745 -257484 -281242 -201976 -77156
44147 -77156 8260 69015 158804 250462 299440 352753 452223 504359 416521 297412 319164
44136 319164 415242 342846 57028 -206019 -271110 -229659 -215304 -186637 -76064 17767 -30128
44125 -30128 -145252 -151819 -44363 9961 -63827 -128673 -26547 201297 352291 297240 124563
44114 124563 20543 31349 30233 -42526 -32559 191510 443155 393989 52212 -189472 -81352
44103 -81352 145218 137215 -83390 -217210 -148326 -38783 -14507 -19473 -1362 -17516 -97726
44092 -97726 -177755 -227904 -293307 -355041 -312072 -170672 -91208 -150917 -211582 -145364 -50083
44081 -50083 -76798 -157495 -113410 19500 5727 -226000 -454687 -494871 -459492 -536508 -647794
44070 -647794 -556254 -260443 -36851 -44873 -114006 -45042 64811 -9323 -240696 -365738 -247551
44059 -247551 -21252 130067 155591 68969 -104420 -255236 -253677 -164591 -210475 -418668 -511245
44048 -511245 -303247 -16404 20379 -166061 -279379 -202844 -93646 -70415 -69485 -23562 43452
44037 43452 125760 241295 314416 250449 128511 99116 88878 -123072 -490603 -664643 -488075
44026 -488075 -236055 -188829 -235626 -136763 52275 107304 25011 -16177 14009 2569 -30350
44015 -30350 41780 159145 103880 -134928 -296849 -240292 -152030 -231263 -371074 -340553 -149603
44004 -149603 -24166 -62240 -98927 49589 325362 488674 405070 204955 124015 214222
43994 214222 287553 172099 -57731 -182512 -108611 66885 228256 355124 459301 522892
43984 522892 536384 516993 459035 336777 179519 71660 49643 61048 50706 30866 45345
43973 45345 111989 208033 268425 218072 72918 -19821 60344 226138 272264 138075 -47650
43962 -47650 -181285 -282927 -353385 -318549 -199692 -164264 -279626 -364554 -242110 -21031
43952 -21031 53771 -51495 -149735 -123288 -35169 40017 119170 219053 302319 343317 336509 240868
43940 240868 47236 -102220 -25931 230742 400909 326557 130898 -11340 -108597 -235357
43930 -235357 -328604 -277468 -136018 -71784 -130727 -200008 -192524 -137289 -89197 -73952 -130860
43919 -130860 -285244 -445796 -440546 -214156 78773 222622 138284 -82337 -278744 -338314
43909 -338314 -265052 -156406 -89283 -54088 -39243 -101189 -235804 -254640 16222 424498 603876
43898 603876 451605 263339 283985 364974 255341 17381 -112722 -126868 -200521 -328681
43888 -328681 -333087 -220110 -203506 -320398 -343522 -184081 -77929 -198450 -349827 -270757
43878 -270757 -36629 89381 53318 3285 -6266 -45852 -109129 -124694 -140999 -271000 -456555
43867 -456555 -501552 -358255 -191453 -135090 -161235 -210840 -272459 -294760 -198576 -30365 55813
43856 55813 22176 -1946 55667 98028 36534 -80662 -194577 -327832 -458911 -465413 -309831
43845 -309831 -138966 -74870 -43817 54173 147831 133212 89339 162442 314546 379450 316210
43834 316210 219380 114871 -57598 -263529 -363920 -313147 -207669 -111122 15743 177985
43824 177985 294305 334923 371861 433339 443813 377306 333992 375279 411707 364575 316677
43813 316677 358914 386989 235290 -30110 -151053 -36099 96253 14263 -221503 -365999
43803 -365999 -318018 -204392 -166505 -199532 -226618 -212864 -140129 37286 308080 526991 546017
43792 546017 419041 353846 427658 471503 315808 48650 -94494 -43495 43956 25930 -53833
43781 -53833 -75074 -3162 123425 276158 420788 479388 403529 261192 171906 170254 203384
43770 203384 239599 282897 282473 150470 -76918 -205515 -112771 57411 56099 -141077 -302231
43759 -302231 -249708 -60817 97555 195006 285936 340653 287438 175714 133853 168412 161996
43748 161996 93487 93475 203432 226901 -41780 -510030 -836971 -780917 -424287 -68590 41824
43737 41824 -84217 -218102 -158235 44850 161620 81108 -72553 -155686 -191641 -240725 -225797
43726 -225797 -59627 145485 200685 136032 155779 283416 277951 -623 -327007 -366343 -93544
43715 -93544 195832 255999 143412 90190 215028 404014 456908 321442 150841 110060
43705 110060 172499 184673 108590 81407 198110 346510 347951 197712 62499 57214 119075
43694 119075 126260 71638 57762 134024 203621 137244 -49040 -200566 -217350 -161619 -135889
43683 -135889 -144260 -151718 -193058 -297406 -360288 -245447 -4915 154402 145307 99887 155378
43672 155378 274872 338637 292391 140786 -87753 -291692 -323770 -164004 20181 72467
43662 72467 23558 -11317 -13494 -34045 -67633 -71376 -53446 -35885 18757 138410 247418 246375
43650 246375 143711 10630 -139669 -314487 -439914 -438688 -382283 -417187 -538020 -578134
43640 -578134 -457091 -308548 -299067 -407448 -453314 -305377 -20270 208697 233255 93505
43630 93505 -38518 -63877 -39567 -27359 29090 177973 310621 289679 165320 95842 87331
43619 87331 638 -180944 -293076 -252955 -196123 -258033 -370155 -387265 -302044 -212955 -158953
43608 -158953 -97235 5190 141016 277761 345965 276529 106416 -29246 -72341 -118647
43598 -118647 -239443 -326084 -235580 -24825 96397 17624 -186136 -395799 -545242 -574742
43588 -574742 -423480 -125262 172485 342071 377668 332698 222618 52908 -100955 -134745
43578 -134745 -56071 -13013 -119852 -287180 -315291 -169388 -56623 -156620 -366983 -443135
43568 -443135 -335319 -221236 -209012 -194808 -77383 55150 64263 -37713 -142333 -201116
43558 -201116 -216781 -181941 -147869 -243550 -474057 -605384 -442693 -144093 -29421 -116498
43548 -116498 -110561 116522 308414 200453 -110573 -339114 -388758 -367819 -335277 -235552 -57563
43537 -57563 103829 154444 68194 -132279 -362918 -477099 -398232 -246912 -219629 -336382
43527 -336382 -426330 -377767 -265731 -178804 -60936 155775 356385 342955 114296 -101099
43517 -101099 -130452 -56773 -63135 -174559 -267749 -285647 -303298 -368703 -406155 -339285 -214425
43506 -214425 -117459 -39417 71697 170623 149388 10857 -106631 -108966 -57973 -60333 -124944
43495 -124944 -189010 -225093 -254065 -283353 -287128 -230882 -85398 150671 407348 560648 541861
43484 541861 408598 272306 184888 135942 124011 164155 229287 239044 129852 -73082 -253899
43473 -253899 -287848 -163028 -20067 -9926 -96974 -85797 110738 324120 340852 184071
43463 184071 59232 62087 90117 50143 3461 41887 130000 158488 95964 14250 -8304
43452 -8304 37875 91850 74271 -24240 -100136 -42325 104501 161740 41988 -128578 -177352
43441 -177352 -105653 -59065 -125199 -249463 -326810 -298102 -175895 -53460 -70086 -276315 -530598
43430 -530598 -616177 -477621 -263512 -117903 -26930 73730 133979 46858 -156441 -290872
43420 -290872 -239559 -108721 -82846 -169216 -196681 -86078 -3193 -143200 -431785 -585507
43410 -585507 -469777 -249842 -133723 -107256 -34488 88901 138216 66086 -48801 -148793
43400 -148793 -246893 -315924 -275366 -140905 -61695 -130652 -249786 -265094 -165090 -66269 -55985
43389 -55985 -126804 -227033 -302999 -311310 -243036 -123733 30012 210475 356400 367905 238153
43378 238153 98953 62462 80368 44800 -33105 -59789 -39164 -82846 -226567 -351922 -341721
43367 -341721 -237534 -182379 -241712 -328979 -305635 -135744 70102 176872 176339 169531 203715
43356 203715 214361 160517 110050 114551 108548 46891 31547 135050 193329 8443 -279780
43345 -279780 -305257 -10074 216102 70859 -240399 -336528 -215172 -188969 -368635 -516817
43335 -516817 -425138 -172843 59976 225842 357087 442818 468892 460837 393322 176339 -160405
43324 -160405 -383498 -300741 -20857 175513 178671 113830 90155 68605 19344 34142 166204
43313 166204 279514 216590 66016 91990 371642 649529 638961 367569 103309 -8695
43303 -8695 -82286 -242754 -394497 -350903 -123342 62671 48399 -80081 -147440 -127863 -133355
43292 -133355 -214395 -292948 -305963 -306487 -359473 -411988 -361692 -228223 -156202 -223991 -326357
43281 -326357 -302283 -140124 7281 11892 -72562 -74636 79812 250654 222590 -36352 -313621
43270 -313621 -392077 -292357 -190542 -143613 -44449 138140 251512 190409 90995 139151 282866
43259 282866 322247 236726 213232 333976 438025 365941 176642 22717 -54924 -96980 -105442
43248 -105442 -80862 -94503 -192945 -292564 -292204 -231449 -201414 -154078 24330 258661 296767
43237 296767 43516 -269289 -355068 -214688 -89023 -133749 -274990 -377325 -423382 -473609
43227 -473609 -537781 -577456 -604338 -682196 -815176 -912323 -907288 -850081 -816328 -782768 -688059
43216 -688059 -578681 -565638 -634528 -641106 -538198 -459889 -492135 -500641 -331330 -82810 -3402
43205 -3402 -161920 -393145 -553411 -649578 -695603 -632223 -472694 -375409 -451864 -600241 -642098
43194 -642098 -547976 -415187 -289671 -148511 -32279 -48008 -208863 -378738 -425552 -351913
43184 -351913 -227565 -72757 113462 263403 279650 156079 -22842 -202763 -385350 -515708
43174 -515708 -464937 -209311 64735 156308 99214 83529 160575 187717 81619 -40083 -29977
43163 -29977 124005 378936 726320 1085790 1253786 1118106 825041 580643 389284 167823
43153 167823 8249 70615 253133 250332 -10225 -236808 -172762 87225 301937 416226
43143 416226 532734 689878 827808 882784 790126 499689 121552 -64749 71612 270703
43133 270703 166630 -218348 -473878 -311449 117058 458094 532055 382309 114827 -156207
43123 -156207 -289318 -206568 1027 166244 241354 305614 381404 369186 221712 75248
43113 75248 97542 256852 361462 315658 213606 160608 132523 77533 38612 68056 107818
43102 107818 83309 57399 146119 306049 354894 213732 -7319 -189945 -338186 -476049
43092 -476049 -539037 -457812 -279620 -128990 -81237 -112831 -141504 -101526 -22056 -20707 -154852
43081 -154852 -305414 -308280 -180991 -89626 -96632 -101247 -56353 -64968 -182942 -287685 -257342
43070 -257342 -157175 -129378 -190892 -248174 -240544 -185752 -149811 -217765 -398421 -528602 -414183
43059 -414183 -111014 108849 131908 126322 189326 137169 -154242 -443458 -435835 -222446 -108400
43048 -108400 -148284 -180629 -213173 -397089 -651467 -696223 -501362 -350559 -373732 -354513 -137856
43037 -137856 81956 71174 -94172 -196449 -200178 -202452 -215836 -206989 -237086 -366019 -491628
43026 -491628 -459829 -288326 -134916 -79074 -63089 -28879 -3261 -42528 -152497 -261070 -259365
43015 -259365 -119129 25011 -6191 -215050 -414684 -459133 -379279 -267445 -162618 -104531
43005 -104531 -164274 -334185 -491015 -541175 -506416 -419043 -261405 -69012 53163 96589
42995 96589 176610 300253 283042 39013 -211703 -211001 -13766 125807 119060 80376 63490
42984 63490 -12500 -173497 -318023 -368498 -357558 -338672 -322151 -316399 -339439 -378386 -403319
42973 -403319 -406950 -380467 -305925 -235669 -287917 -461594 -554589 -407757 -147112 -21266 -70772
42962 -70772 -143883 -177501 -234717 -280140 -169263 82394 241094 164126 -9279 -81253 -49945
42951 -49945 -18011 8752 67729 76392 -95315 -405774 -642797 -669570 -563308 -470284 -414827
42940 -414827 -331015 -234727 -248891 -420604 -599418 -590003 -393533 -197830 -137591 -178959 -249514
42929 -249514 -334094 -381884 -271999 9559 272948 334964 236257 128416 55458 911 38145
42918 38145 224981 417122 409968 236117 104731 68050 -8952 -138289 -136443 61928 256189
42907 256189 256429 109326 -57852 -217951 -343536 -327480 -168555 -65072 -142828 -238884 -148783
42896 -148783 49746 141611 127580 174883 279948 261090 93158 -20447 23572 67996 -25553
42885 -25553 -145666 -135236 -62134 -92944 -200951 -212001 -103019 -45990 -132666 -244742 -267076
42874 -267076 -263357 -326252 -388636 -335517 -208932 -128665 -75560 41533 133531 -2732 -317727
42863 -317727 -469533 -285775 -32404 -20976 -146763 -88175 168813 325193 240769 84881
42853 84881 -14742 -154810 -376834 -484796 -324899 -50123 86375 64094 42600 83880
42843 83880 107626 63100 -7891 -47396 -12036 124318 301119 366463 247379 67521 -7769
42832 -7769 17772 25746 -13428 -19933 48962 153022 248693 313482 321511 293248 325208 455486
42820 455486 547785 451989 247720 158412 222126 237139 86124 -81694 -116285 -149296 -407013
42809 -407013 -813870 -1015016 -832358 -499448 -327777 -295026 -155435 121025 271373 146176
42799 146176 -43297 -37962 80805 34210 -212485 -394277 -325515 -114574 37669 57002
42789 57002 -46505 -253299 -475845 -581998 -569548 -576544 -641157 -621320 -456834 -322767 -361889
42778 -361889 -428498 -297905 -10605 201989 249434 230493 210143 159146 86325 32612 -54682
42767 -54682 -252742 -467011 -486888 -261992 32003 220968 278989 239414 120980 -23858
42757 -23858 -127661 -207728 -324088 -430314 -410630 -277293 -170682 -138485 -87245 7078 33226
42746 33226 -31116 -20926 160536 343481 305720 76704 -124207 -170050 -98168 28903 165224
42735 165224 211533 73510 -177820 -328195 -256594 -74169 15047 -64575 -213820 -284420
42725 -284420 -209399 -42130 85085 52831 -143957 -367829 -444862 -330158 -154233 -81296
42715 -81296 -143716 -250949 -324433 -347185 -298230 -147708 55630 195245 230519 230113 215211
42704 215211 100975 -115895 -251901 -168172 940 29286 -70333 -101642 -25391 -8810 -114537
42693 -114537 -169896 -36347 167367 230413 124599 7443 20675 161206 303236 310142
42683 310142 177010 70036 149776 360338 495292 470502 405283 417274 477780 516837 541345
42672 541345 583634 635583 685487 724575 688247 510788 269790 133282 114977 44952 -135903
42661 -135903 -229229 -70014 174835 185364 -95939 -397442 -456924 -293035 -120400 -94283
42651 -94283 -187816 -277747 -293379 -253980 -188034 -100392 -46292 -121140 -285555 -328171 -159856
42640 -159856 -23206 -181934 -495119 -591430 -419268 -274799 -266574 -156141 147145 347170
42630 347170 253129 140251 293652 493214 344503 -83617 -365003 -341884 -244736 -237764
42620 -237764 -226818 -139790 -66832 -60558 -59657 -61752 -144298 -280388 -347136 -337197 -357286 -416806
42608 -416806 -432947 -430471 -490504 -508158 -283315 113333 353142 299551 167628 142466 126662
42597 126662 11456 -74094 8995 141367 127789 4190 -42738 42105 164075 262304 344773
42586 344773 397455 402783 409029 466365 532166 533298 478733 427453 389693 335633 263434 198408
42574 198408 157392 144687 137231 67902 -100678 -286193 -372697 -385151 -444736 -540847 -516709
42563 -516709 -330291 -153844 -130493 -196167 -242257 -288887 -366339 -374484 -220080 12334 174122
42552 174122 249472 310518 369324 405160 446553 490902 433096 217448 -22446 -122999 -113030
42541 -113030 -126440 -166941 -126505 11602 148410 213508 195669 80268 -98514 -202147
42531 -202147 -148021 -68127 -122462 -205891 -69055 272577 495078 393380 137998 6603
42521 6603 43083 111641 141738 161286 172925 149181 117986 134535 178413 172577 109219 79735
42509 79735 151467 259412 261165 99518 -111974 -187404 -53448 182545 347217 352203 233854
42498 233854 99449 51452 101470 130135 5087 -220544 -315343 -141508 167350 381014
42488 381014 426661 356276 167472 -162817 -510049 -658197 -546072 -321755 -143562 -55263
42478 -55263 -50543 -103496 -116126 7921 201573 292690 252587 217142 216183 88368 -222315
42467 -222315 -477355 -428075 -162581 14935 -34070 -201854 -370037 -523843 -639447 -644522
42457 -644522 -533704 -390853 -265392 -149317 -97837 -216685 -455683 -560732 -365564 -44305
42447 -44305 80394 -48299 -151299 17407 368059 619627 649126 578934 556275 578713
42437 578713 565702 492876 378986 205715 -50312 -319388 -463419 -429237 -323901 -296851
42427 -296851 -368027 -405986 -279476 -17207 197078 200874 18106 -174670 -240827 -198583 -141633
42416 -141633 -119760 -139180 -200182 -247978 -150891 143635 452952 508995 299973 124027 220075
42405 220075 458352 521508 325340 110928 121970 326888 511307 544660 470494 387753
42395 387753 341401 328482 331348 315214 246782 151591 109451 147565 174493 80630 -116481
42384 -116481 -292624 -368768 -363858 -298703 -151796 46726 172353 140227 31370 8248 130959
42373 130959 314894 442870 463790 400689 305416 191743 6706 -275672 -528302 -551758
42363 -551758 -335904 -116103 -70430 -88069 15378 171764 159247 -37801 -205264 -231630
42353 -231630 -226867 -264326 -235471 -66429 108928 122870 -17106 -204677 -384408 -506818
42343 -506818 -471665 -267724 -66321 -21434 -56807 -2129 135844 209711 187877 185145 237563
42332 237563 225312 70517 -122178 -194141 -122385 -27324 -41347 -196472 -397079 -490431 -404282
42321 -404282 -213688 -36684 100828 225745 281596 152340 -157970 -477219 -650518 -693182
42311 -693182 -692203 -621090 -359528 93401 506278 586898 277180 -159183 -380250 -290588 -87798
42300 -87798 4054 -26075 -35996 47761 157648 212859 229808 277818 369935 429274 362704 174336
42288 174336 3723 9394 187109 346429 313828 126113 -29440 -37853 42831 89356 60969
42277 60969 32784 112800 317743 517026 543878 396114 264620 298277 405276 387550 223201
42266 223201 79811 53104 40418 -73800 -225882 -255483 -115041 85712 212746 220997
42256 220997 151725 70689 14759 -22978 -60831 -88282 -77565 -30635 12165 7790 -65884 -198635
42244 -198635 -318248 -301263 -87508 216244 416953 428841 324107 196219 68289 -39659
42234 -39659 -61036 29708 155033 233777 280516 329365 325118 200520 26869 -40318 22284
42223 22284 59593 -46467 -213430 -287031 -263841 -278263 -383616 -454060 -345753 -88113 142882
42212 142882 206468 99571 -90545 -263471 -340062 -297923 -203150 -155684 -175978 -191475 -153784
42201 -153784 -104857 -93587 -102255 -112093 -162567 -260697 -305097 -216549 -90634 -81607 -165730 -182259
42189 -182259 -110559 -122503 -304766 -504659 -549390 -462462 -337281 -147761 134746 350499
42179 350499 309073 101891 25499 167441 287143 187922 6928 -5651 155851 296720
42169 296720 333520 362423 438641 482349 446982 414154 427961 364173 102419 -239544 -397999
42158 -397999 -287750 -97808 -23963 -32199 18938 113501 85368 -113366 -288128 -216587 82567
42147 82567 372519 461292 375519 277646 269649 303508 261187 98836 -94196 -182129 -121497
42136 -121497 5612 92440 104333 68802 27026 30828 126390 273039 329608 220130 84084
42125 84084 137211 376953 564717 544039 425901 363020 291700 73403 -201028 -274352 -91288
42114 -91288 100994 83695 -62624 -102983 60441 328427 531268 531436 300260 -15322 -184868
42103 -184868 -130002 19769 158418 338735 573662 683899 533413 276887 146038 101483
42093 101483 -39475 -213173 -167051 104330 312056 318536 311834 431359 532786 484737 407537
42082 407537 409770 348228 95413 -176802 -248219 -194906 -203202 -213509 -61537 167228 263311
42071 263311 268457 364848 460320 286191 -84657 -226650 34945 369008 425560 258610
42061 258610 97138 -13460 -129991 -199912 -151115 -39137 61015 164160 251469 215771
42051 215771 59598 -46422 -37977 -67617 -180601 -139409 189668 513613 481285 194709
42041 194709 26614 72732 140418 172697 278266 369668 198703 -175367 -348835 -153089
42031 -153089 76294 14899 -167573 -110980 168453 330018 220617 36229 -13675 51339
42021 51339 127379 213355 344029 451381 421262 267868 160011 236748 434972 555918
42011 555918 504202 392718 367207 397266 338883 170506 41597 64576 165451 194102 109962
42000 109962 1170 -39333 -17348 -38872 -208679 -489168 -682865 -628575 -397515 -198813
41990 -198813 -104793 -5602 145199 209833 84148 -105987 -169194 -118270 -115413 -196348 -223904
41979 -223904 -128122 -30618 -60462 -164316 -198497 -136997 -74202 -49957 2940 107747 152963
41968 152963 42091 -130042 -170463 -46527 75388 84645 92172 249205 495694 619723
41958 619723 524426 309085 103672 -48312 -138092 -156034 -149104 -205700 -329521 -413909 -390506
41947 -390506 -320789 -284947 -260232 -182392 -70011 -12199 -61483 -188872 -317100 -368632 -327229
41936 -327229 -284303 -365545 -567125 -727362 -722907 -637326 -653433 -807923 -937538 -873345 -629021
41925 -629021 -378767 -278463 -323696 -379966 -347247 -268332 -245256 -284755 -301204 -259526 -215240
41914 -215240 -194155 -140275 -33702 40708 14884 -61873 -129646 -238378 -446663 -662796 -723404
41903 -723404 -612902 -482341 -445544 -465083 -457880 -410213 -343855 -247325 -105975 28797 48344
41892 48344 -122706 -434292 -705132 -751689 -566863 -341511 -260791 -312627 -356304 -334394 -315576
41881 -315576 -341803 -353415 -302311 -241133 -236256 -259537 -238806 -175600 -138577 -152618 -160817 -109020
41869 -109020 -18893 51921 91607 132270 171810 153561 60748 -9470 62811 259187 429056
41858 429056 478624 477980 534857 634490 676459 615483 481151 299851 97668 -37492 -4398
41847 -4398 185883 414173 589690 697584 713009 595316 416912 371305 546655 773592
41837 773592 821617 695147 592534 590262 542173 347162 147709 121454 188529 125088 -64799
41826 -64799 -116782 92145 320944 294820 100647 42812 195598 342760 342881 298760 310278
41815 310278 303373 222596 180933 253280 293568 152562 -55301 -117426 -60583 -93951 -264204
41804 -264204 -392841 -345301 -155415 115965 434007 680245 701932 523776 325664 168542
41794 168542 -51669 -321342 -424207 -269267 -89051 -133700 -332678 -446501 -413097 -338156
41784 -338156 -253265 -110059 48112 128722 176537 313909 505472 583828 521479 473964 508029
41773 508029 487283 319724 144491 134889 233753 238372 91464 -55260 -60781 37965 111028
41762 111028 112785 116336 188253 278394 264813 97479 -141161 -328496 -409334 -383316 -239813
41751 -239813 23958 334425 555570 589021 449019 259418 179709 262490 344497 173394
41741 173394 -267163 -647788 -645857 -349977 -146097 -221042 -367562 -317529 -88447 90972
41731 90972 71024 -95784 -229357 -154449 144063 437980 432846 95678 -292404 -460339
41721 -460339 -397771 -231137 -29007 152096 202600 113134 57875 144871 213465 85315 -113459
41710 -113459 -137388 -28182 -34750 -177685 -227113 -124763 -75621 -140729 -96589 144002 312411
41699 312411 217986 100998 252065 519277 547898 346758 230596 280760 263523 95415
41689 95415 3843 121385 251879 204272 93715 113949 212856 207208 81238 -34756 -91708
41678 -91708 -134680 -143465 -45652 115037 176031 59168 -113914 -146846 30074 291118 427599
41667 427599 342421 140432 -3084 -45925 -76518 -120791 -77891 109813 344860 501892
41657 501892 558721 532517 413430 259930 227703 366982 504987 484454 407704 453615 551282
41646 551282 482548 268588 181388 334878 520574 537081 447344 375435 264802 37632
41636 37632 -162099 -128083 72233 157369 36692 -51601 120111 448222 635045 561380
41626 561380 392903 331274 373242 361742 206346 -22768 -200857 -272884 -260388 -217192 -217173
41615 -217173 -321895 -498557 -614530 -576785 -437287 -299657 -179448 -43546 75167 126158
41605 126158 155637 219323 210215 -33262 -425932 -650374 -552926 -335447 -239031 -223822 -129674
41594 -129674 8547 33404 -43800 -69942 -38836 -111566 -313850 -427962 -279439 18445
41584 18445 205656 158665 -45119 -252827 -343817 -285479 -164592 -119115 -181059 -229831 -142944
41573 -142944 62537 279983 434642 497144 449997 332115 272002 373472 573527 696249
41563 696249 654176 525360 418353 334337 207031 35323 -84028 -65373 49444 110883
41553 110883 16202 -164720 -256577 -185891 -72077 -65195 -137144 -123276 29482 160317 100272
41542 100272 -89825 -180115 -49250 193196 378804 482898 586913 693988 689433 506008
41532 506008 248465 91220 89642 162036 239703 335190 423946 360887 37454 -402004 -637178
41521 -637178 -517334 -235075 -84300 -125278 -185502 -124249 41146 247218 464279 631009
41511 631009 650575 526024 393519 343482 306964 207320 122253 168796 297646 343380 246728
41500 246728 97553 -24370 -125903 -224040 -310482 -394534 -478409 -501945 -422403 -323870 -309633
41489 -309633 -310688 -180769 12811 8995 -264152 -527914 -496783 -223579 29609 118223 63958
41478 63958 -88290 -278016 -378474 -315921 -190452 -135301 -121465 -51580 30049 7180 -81396
41467 -81396 -90078 -25708 -49813 -198606 -295147 -195512 39884 275543 449069 533993 510660
41456 510660 452727 500449 654159 719128 558262 290715 130198 119116 137477 96549 -560
41445 -560 -135698 -284984 -372441 -323210 -165587 -6510 86975 117922 86378 -41022 -276316
41434 -276316 -563535 -791324 -844480 -681101 -389592 -132863 -1847 43716 76650 117273
41424 117273 183865 330145 538977 651988 531848 263441 64468 2691 -57708 -198535
41414 -198535 -285875 -163919 93753 264917 271286 245995 286781 274086 25256 -444569 -928765
41403 -928765 -1274098 -1503871 -1677170 -1744012 -1624536 -1363134 -1103457 -936224 -857875 -858143
41393 -858143 -941819 -1045732 -1031124 -818016 -488350 -223477 -160112 -296447 -480726 -494645
41383 -494645 -232219 168556 430695 405552 190315 -22997 -134210 -152999 -135522 -161681
41373 -161681 -286417 -441013 -463514 -310605 -157473 -175866 -279502 -232909 11435 236248
41363 236248 243254 82906 -55146 -77631 -35712 -4773 -2321 -4623 14066 53181 64761 -23169
41351 -23169 -230317 -480934 -658391 -694837 -607401 -486704 -464076 -621505 -868132 -957136
41341 -957136 -731702 -349327 -146555 -246733 -418363 -393817 -205460 -70595 -42130 17035
41331 17035 131900 128491 -69544 -265871 -262285 -150125 -149082 -260577 -282619 -118584 117434
41320 117434 279025 296837 131484 -195476 -520300 -668621 -679652 -717251 -759207 -611207
41310 -611207 -276040 -40660 -67555 -145829 -40358 116986 31165 -291789 -542501 -516963
41300 -516963 -305466 -93382 32945 78903 102018 189826 351819 447808 349171 143485
41290 143485 39628 93297 172725 172620 95902 -68818 -361943 -705836 -910978 -893151 -751489
41279 -751489 -582479 -365928 -110418 38049 -37899 -237879 -343135 -268351 -128774 -84504
41269 -84504 -186459 -360283 -492429 -534109 -531925 -538791 -514275 -377509 -157108 -641 -271
41258 -271 -82235 -118080 -88138 -77670 -144566 -241900 -264151 -153083 25751 112370 -3678
41247 -3678 -258115 -464600 -500656 -409740 -319986 -306672 -346246 -366249 -318125 -216939 -120508
41236 -120508 -72339 -80540 -143635 -246365 -324084 -307424 -232320 -217056 -280308 -286183 -149354
41225 -149354 15315 57498 -1607 -58716 -110119 -173938 -146604 33992 165772 3579 -319545
41214 -319545 -395030 -105161 214191 272524 183933 160082 123920 -108982 -441382 -567469
41204 -567469 -366702 -10227 279540 397752 332816 151403 -3207 -35524 -11154 -44806
41194 -44806 -117243 -117561 -24920 76446 136790 177632 204716 191187 144023 104809 92824 105882
41182 105882 143531 169898 104667 -78447 -293816 -445410 -519587 -517298 -394133 -163733 36509
41171 36509 102050 100876 140441 193662 199608 231575 373596 503560 421136 169178 8565
41160 8565 56040 151035 126133 20677 -44313 -39597 7280 82518 136953 88409 -37292 -73611
41148 -73611 81081 305288 394163 299208 151349 97977 189980 381960 561209 599162 454390
41137 454390 238735 134755 220174 382847 426001 265643 12319 -159830 -199787 -183398
41127 -183398 -155298 -76065 43872 80389 -46957 -242973 -359385 -376115 -365456 -354612 -332061
41116 -332061 -312576 -279328 -148078 74703 192931 52241 -208490 -328152 -273380 -197953
41106 -197953 -120471 74509 316336 338100 75964 -183116 -181086 -5137 102973 62068
41096 62068 -59179 -193507 -268230 -191201 16912 195790 256955 283192 318697 238625 -26561
41085 -26561 -302968 -384275 -295833 -180766 -65151 71426 128522 21459 -106586 -49435
41075 -49435 137647 211286 112557 35581 111422 236275 264394 199915 132188 106720 115504
41064 115504 127340 102844 49781 47567 131126 187502 82004 -139563 -291930 -270846 -124183
41053 -124183 54553 177046 152844 -17884 -177381 -186420 -126818 -163508 -259011 -237503 -103483
41042 -103483 -46974 -110344 -105416 70499 276090 373699 403175 398687 271088 27220 -114610
41031 -114610 -21052 129597 122380 39561 90102 250087 335178 332017 377497 452238 371349
41020 371349 93287 -200331 -361469 -398759 -322693 -100750 171496 276915 154596 -11942
41010 -11942 -79194 -130311 -260421 -361633 -289537 -104823 30873 99323 187041 276250 256265
40999 256265 109086 -70715 -210977 -276316 -194208 64422 351698 463306 395066 317102
40989 317102 297918 248025 158097 164929 291638 336447 167016 -45341 -60087 92377 190882
40978 190882 153266 97946 131160 248317 411986 566906 610557 509304 410519 468403 589447
40967 589447 546566 336796 210712 320957 556910 774557 959667 1077259 1001030 746303
40957 746303 570189 648746 808137 773163 554782 380473 341830 343670 349762 444005 638619
40946 638619 812009 869315 829391 749534 690654 734955 890358 995822 883410 626498
40936 626498 456762 434480 389160 211413 6501 -97802 -105615 -40549 129227 346565
40926 346565 426938 306378 177044 219207 329765 293533 114397 -27790 -79437 -149098
40916 -149098 -255447 -260529 -108928 43062 30024 -106576 -194023 -142784 -10662 90479
40906 90479 90313 9080 -38242 64679 283435 418422 305750 3780 -278277 -406065 -404366
40895 -404366 -344601 -250847 -134770 -28049 70640 206927 368161 438370 338573 158594
40885 158594 50373 29384 -4670 -80811 -132332 -151073 -194009 -201883 -6410 378654 649654
40874 649654 553146 206979 -80007 -191811 -223371 -224257 -163025 -100585 -155809 -292102 -352094
40863 -352094 -317189 -321127 -391055 -408837 -369354 -424064 -583791 -629966 -447375 -210333 -88587
40852 -88587 -2020 143650 204993 33432 -217934 -294989 -223046 -209990 -271501 -251547 -155599
40841 -155599 -147392 -217756 -167176 34026 156483 64382 -107978 -232281 -370485 -536463
40831 -536463 -534426 -258390 43834 68973 -100188 -123190 82091 226988 85485 -201391
40821 -201391 -355575 -316966 -224983 -153498 -31739 184456 395826 462348 356600 168697
40811 168697 -355 -100946 -118497 -62380 17917 55955 30959 -23938 -81731 -139667 -167323
40800 -167323 -112640 -2019 44565 -27494 -99358 -26405 152322 261008 214011 78565 -71855
40789 -71855 -228456 -355014 -368822 -274498 -199536 -218289 -239009 -157603 -38246 -22515 -108331
40778 -108331 -150059 -76465 10966 -4497 -94565 -156089 -181743 -255510 -376436 -398448 -224704
40767 -224704 5278 48103 -126670 -285211 -243482 -101230 -62210 -138498 -191805 -195178 -253203
40756 -253203 -366726 -384894 -257829 -158460 -234760 -372372 -351306 -162150 -10504 -26446
40746 -26446 -110819 -101636 13274 116555 135027 107071 77759 10968 -128566 -248123 -189136
40735 -189136 60423 314330 405422 364644 308350 248071 131328 -13214 -121593 -223246
40725 -223246 -359197 -428399 -314908 -133662 -114420 -234761 -225442 7638 236717 285684
40715 285684 272495 319958 295944 75561 -161338 -177444 -65373 -95338 -285809 -422317
40705 -422317 -430184 -421850 -404092 -252284 -3986 113696 20865 -103177 -124429 -132028 -213348
40694 -213348 -280218 -252172 -218361 -268094 -318077 -256008 -124673 -24497 46657 120402 142106
40683 142106 77033 32055 114191 246010 279935 233010 240321 312178 312058 179890 19251
40672 19251 -73056 -130723 -210682 -262795 -186530 31046 294899 493253 565898 507322 360749
40661 360749 218329 173291 220881 230040 88810 -112735 -143342 66276 285506 268330 91835
40650 91835 37591 181335 324653 354996 415595 595582 687330 473371 106739 -51818
40640 -51818 80361 227701 165948 -12170 -103402 -79100 -50124 -66433 -79590 -54535 -12619
40629 -12619 32131 106294 221398 318860 311581 194378 81777 88159 183659 240352 223036
40618 223036 229106 298102 307816 165222 -766 12657 194259 336389 321414 230531 156664
40607 156664 74553 -46798 -146098 -171958 -175465 -207094 -210770 -129356 -50297 -117333 -315263
40596 -315263 -465453 -459266 -390505 -394335 -436903 -375244 -203126 -102705 -194162 -348396 -370975
40585 -370975 -295203 -309406 -404180 -320826 51864 436660 509357 338772 254912 356126 410869
40574 410869 258508 54911 28676 183464 357100 435368 393455 241470 53672 -24511
40564 -24511 86828 297448 451484 489130 448560 372030 278872 180497 64233 -90185 -241257
40553 -241257 -303915 -278661 -275348 -351445 -419473 -386742 -291281 -209798 -124452 8687 139526
40542 139526 196169 211922 249417 253545 128253 -70162 -172782 -135663 -95056 -159113 -271988
40531 -271988 -327688 -306300 -238248 -127166 13760 106216 68397 -76229 -195313 -159859 42251
40520 42251 290634 426991 376254 179379 -69118 -268836 -315045 -158468 83826 171035
40510 171035 -16125 -331106 -541572 -580025 -518288 -388745 -196136 -56502 -126222 -370486
40500 -370486 -566946 -580623 -492319 -418838 -367863 -339801 -409564 -587025 -718834 -667522 -507229
40489 -507229 -405954 -372134 -265160 -39656 166392 224428 188976 206152 300277 336792 213857
40478 213857 29449 -16214 118588 248334 207925 76709 39728 91206 45453 -162638
40468 -162638 -373231 -449470 -453934 -480851 -473503 -355764 -226505 -245860 -386472 -463916 -393460
40457 -393460 -271432 -205762 -198650 -208884 -208975 -152160 12409 247801 427725 465677 392832
40446 392832 285887 171584 29929 -141647 -283060 -282951 -74080 240490 415164 312366
40436 312366 99927 85092 341828 610520 602523 312973 -13950 -150589 -61279 121256
40426 121256 228425 197038 119216 123768 198907 200331 62192 -91984 -119488 -58781 -52109
40415 -52109 -117554 -132193 -42333 45039 31119 -27141 -23994 23606 25309 -5818 42388 192879
40403 192879 317411 305859 193615 61154 -84811 -228404 -237100 4095 375419 596676
40393 596676 547724 388740 320459 347783 352539 295450 239185 218940 183862 67729 -117754
40382 -117754 -257556 -221425 -30466 100831 42 -206747 -235031 -50458 73595 -15677
40372 -15677 -104430 32733 249650 264050 127017 137343 342969 461867 339721 179882
40362 179882 198357 295791 239233 4645 -228872 -328221 -313593 -272156 -255533 -232811 -125577
40351 -125577 48617 99854 -122234 -447791 -518059 -250300 32625 30613 -176703 -327252
40341 -327252 -328923 -240845 -84490 103449 161902 -6693 -216749 -200221 24235 209631
40331 209631 267179 340066 482442 530672 385796 209958 205225 339550 427904 393731 326373
40320 326373 328313 403841 478914 466542 325171 96931 -112992 -212699 -181614 -64550 80056
40309 80056 241651 463046 734306 894184 761830 417039 200110 311564 547285 598761
40299 598761 484831 447121 510547 459554 250159 114317 158776 164918 -46065 -311706 -405625
40288 -405625 -394444 -458987 -530434 -406683 -137748 15643 -12649 -25626 67046 95906 -48552
40277 -48552 -188494 -115439 97861 223048 202414 170963 218079 302468 384728 482370 571608
40266 571608 573287 488232 434045 474180 500135 380991 171655 54296 86865 132948 76556
40255 76556 -1490 57458 259359 441428 465701 347762 195997 96447 72857 103607 151124
40244 151124 198241 256084 315121 315177 208600 26587 -169249 -361893 -531484 -582549 -440935
40233 -440935 -210152 -96214 -157361 -253673 -267131 -229086 -187855 -111279 -4542 26687 -57152
40222 -57152 -132559 -100980 -37002 -11409 79500 309748 479393 334479 -24638 -221398 -95096
40211 -95096 129518 198342 115177 5810 -74796 -90145 20917 197469 232401 42131 -175226
40200 -175226 -194070 -46887 94188 194198 325214 448100 436499 297308 184738 182522
40190 182522 215796 191754 98879 -47572 -232316 -381460 -389351 -254150 -110869 -88081 -181429
40179 -181429 -285489 -303025 -220281 -121470 -116975 -207091 -248969 -129704 66238 158687 109902
40168 109902 42734 34425 31544 -7367 -23562 27054 82364 71553 21876 685 19017 49448
40156 49448 71255 44876 -79972 -261750 -347454 -245353 -66740 -1063 -77004 -140514 -70143
40145 -70143 67953 113420 17645 -88239 -39353 172603 395788 506877 529766 519186 425426
40134 425426 204840 784 26054 257948 439399 430151 366261 393108 445957 429802 421676
40123 421676 503887 556832 446155 295938 320130 457347 445920 235490 46069 -1969
40113 -1969 -37975 -149671 -206942 -107283 22808 36260 9474 106265 314569 475920 490807
40102 490807 360566 108384 -206096 -459132 -574706 -612206 -643835 -620893 -477586 -288079
40092 -288079 -177859 -137699 -80003 -39369 -138673 -344525 -428425 -245674 58738 211152
40082 211152 121911 -35437 -41799 124153 285185 296168 223444 236844 356931 425990 354943
40071 354943 266669 307384 423170 443950 317975 139885 -1112 -76166 -61033 44331
40061 44331 157242 183340 128496 51661 -35877 -105960 -29301 258464 549183 546522 279445
40050 279445 109404 258793 547664 710438 766508 894549 1084811 1137195 956703 672311
40040 672311 469314 431326 533536 674198 722289 642791 567041 635361 786909 835373 759810
40029 759810 764538 977183 1219320 1212641 952909 728208 750937 901420 911614 716138 501886
40018 501886 432239 454882 430782 342651 272855 239893 188309 129335 158520 297627 431394
40007 431394 462208 431299 406687 340992 161302 -51499 -120221 -17515 77318 16827 -131315
39996 -131315 -218552 -234641 -266439 -294079 -195338 25095 171610 112383 -24607 -35202 73912
39985 73912 139620 124082 146931 239381 275496 205961 160729 215156 240045 131704 23614
39974 23614 75789 186723 146290 -9821 -51777 70024 158219 95740 -2600 -25081 -26470
39963 -26470 -64400 -68536 11311 87617 80826 40125 9744 -78480 -252129 -379252 -356713 -301624
39951 -301624 -383707 -550849 -599824 -470856 -297998 -184652 -93066 28107 148183 229813
39941 229813 297793 380855 446345 434588 328849 171957 26945 -78412 -167334 -253083 -279192
39930 -279192 -186145 -36846 21971 -42914 -94839 -25536 94350 145603 143362 179665 256284
39919 256284 294924 268787 212974 135000 15009 -126492 -241514 -306757 -302391 -201248 -54318
39908 -54318 1175 -68714 -89276 82618 288406 242324 -49722 -276968 -271024 -233081 -390377
39897 -390377 -620383 -621330 -359724 -123359 -123042 -232505 -203731 -5924 174629 202345 117047
39886 117047 1605 -126628 -237770 -230800 -60460 159176 297724 395106 571090 791925
39876 791925 885010 777280 562463 327919 85794 -98341 -98024 76494 229265 209203
39866 209203 59438 -112317 -248085 -268922 -93445 172936 272687 150222 66549 206009
39856 206009 385475 359366 208556 168470 235098 230026 141843 107240 124216 71165 -29596
39845 -29596 -39669 29384 39324 -1199 53887 205450 290156 259430 237329 283075 331745 387134
39833 387134 526669 683201 672081 488167 336514 306700 256085 98061 -25067 30970
39823 30970 199181 317799 311315 194726 50142 28382 195121 357966 258775 -36012
39813 -36012 -177676 -14888 229204 336110 369961 446165 485137 382307 224728 154369
39803 154369 165339 185780 215756 247206 188814 5817 -185033 -267523 -256899 -206763 -128319
39792 -128319 -67872 -101935 -186752 -181733 -79175 -21462 -43537 -25226 44022 19986 -87592
39781 -87592 -52451 185550 363235 293031 149265 167007 314769 463409 614019 739620
39771 739620 672822 405733 244770 389633 599807 572128 408546 379297 445907 395749
39761 395749 277742 309029 459319 504599 420286 372685 383708 340644 281976 338779 437429
39750 437429 394910 277422 325266 528573 613173 472028 296522 235679 213852 141765 50952
39739 50952 -30869 -106578 -89522 105234 335825 353075 173013 76988 198591 360610 383251
39728 383251 314255 267608 243131 204344 173868 171666 179935 201124 232605 194481 26580 -164446
39716 -164446 -215537 -142041 -95648 -115845 -102893 -20795 51026 64495 51132 41759 59842 133447
39704 133447 197359 103430 -120953 -185711 84149 450592 589163 539223 535842 574133 506560
39693 506560 427811 537473 699198 585064 248677 113642 344520 643101 756525 807107
39683 807107 999033 1323610 1669085 1942918 2008735 1775635 1404761 1162918 1055523 886383
39673 886383 656166 556017 575046 503468 355458 385830 622898 789109 776583 799043
39663 799043 953988 1031273 909164 773051 771325 783599 695436 605180 607265 634490 629392
39652 629392 629509 628485 606314 687243 962670 1206710 1144317 947871 1023094 1339183 1480519
39641 1480519 1372004 1403623 1762588 2185864 2490461 2842808 3395612 4128247 5066578 6118570
39631 6118570 6713934 6278869 5123752 4170828 3744446 3375545 2843469 2510014 2453695
39622 2453695 2228025 1775141 1647968 1977330 2157317 1944476 1893910 2253782 2442783 2165841
39612 2165841 2022963 2389123 2711353 2598232 2577198 3035442 3460482 3523787 3829242 4721842
39602 4721842 5482510 5647673 5949800 6926732 7864378 8272119 9056351 10909632 12955504
39593 12955504 14488792 16541459 19988190 23722287 26765130 30513231 36534510 43960095
39585 43960095 51897194 62478583 78170074 98550538 124474146 162193288 214356110
39578 214356110 265914803 288846786 267689109 215968626 162092360 122974684 96804876
39571 96804876 76558355 60646170 49800385 42045703 35042426 29295417 25828790 23391917
39563 23391917 20394194 17381212 15456061 14054233 12184955 10354909 9486903 9143502
39555 9143502 8393591 7413991 6827588 6369783 5521898 4668900 4406851 4395903 4025531 3569083
39545 3569083 3580416 3722625 3298192 2500344 2089490 2147240 2117373 1851594 1718024 1801339
39535 1801339 1789678 1612197 1534157 1632503 1699909 1647104 1588952 1583882 1600781 1634306 1616936
39524 1616936 1415112 1121265 1066566 1322795 1532890 1473726 1381682 1432455 1356455 958609
39514 958609 582751 594699 778175 734900 555889 579612 755707 776137 636888 571049
39504 571049 584092 520238 448505 537457 668703 600402 409209 365906 470002 498866 430957
39493 430957 438620 531696 570238 568141 643480 736806 714548 677610 819236 1035955 1037115 813713
39481 813713 651944 683385 756847 783569 889131 1148976 1437874 1628471 1731225 1766658
39471 1766658 1681292 1471854 1265201 1199769 1276957 1343016 1213158 883983 625225 713162
39461 713162 1045527 1231527 1130117 1029428 1163343 1366672 1437067 1522839 1822175 2159570
39451 2159570 2254195 2212970 2327130 2513035 2421383 2056668 1818428 1876972 1940056 1762715
39441 1762715 1510083 1429206 1461201 1397227 1210725 1025671 889860 763922 664015 670613
39431 670613 808193 987449 1070417 994424 853075 815699 920178 1006115 921467 721489
39421 721489 575870 561559 650823 809560 973637 1013410 878383 719113 715529 830681
39411 830681 873658 759538 572184 416809 343752 378445 506475 661402 806724 959120
39401 959120 1067809 1005591 783250 618207 651258 750815 749673 694022 666645 562571 297484
39390 297484 67016 99666 283973 354170 330014 423710 591724 566998 327689 155025
39380 155025 181814 240298 232147 296168 482079 583513 471434 322629 323351 374175 300688
39369 300688 177952 218346 440953 650047 690599 577943 413205 294180 291002 405815
39359 405815 539013 552370 401888 208203 161492 303788 427179 297394 -9499 -151264
39349 -151264 32499 297313 344356 208442 113296 113172 115692 124418 193086 238708 171341 122937
39337 122937 257526 424982 323924 -19221 -258614 -225060 -100384 -63026 -62862 -8020 101933
39326 101933 290255 586440 839019 806419 499045 194770 81795 130933 312315 623568
39316 623568 883667 851704 616288 517935 613422 597225 351332 149691 155722 155169 22427
39305 22427 18770 305795 548541 393427 39347 -72008 106332 303636 441114 633339
39295 633339 810115 761552 516215 317889 248884 178482 46394 -91312 -250091 -455800
39285 -455800 -535974 -278784 201748 543278 592642 528032 515265 509602 443755 368616 333695
39274 333695 317118 325102 388928 432082 318024 70304 -115766 -118623 -6791 106780 182427
39263 182427 216367 235144 337189 587164 855047 916412 737604 509698 368001 235772
39253 235772 11321 -223484 -281057 -94604 202304 409039 450489 428721 455909 469843
39243 469843 332169 107151 44815 203484 312295 178820 18985 131220 416194 531719
39233 531719 413432 299146 287296 233653 104851 74877 180147 202141 27618 -155845
39223 -155845 -177749 -141738 -183384 -196141 -15532 286857 507896 595779 632446 623688 503534
39212 503534 308745 186268 232807 430134 709427 983923 1151956 1166527 1093306 1036164
39202 1036164 1022578 1006140 947854 849194 732481 618515 498845 335304 143856 59847
39192 59847 211839 513365 698536 617587 399983 268513 283098 331583 292539 138918
39182 138918 -59875 -189193 -196066 -164715 -208614 -281851 -217086 18304 242153 297293 239073
39171 239073 201509 207456 219261 260570 356701 437251 420772 331972 237796 148721 78163 90581
39159 90581 170481 170595 53882 55137 368322 764946 820523 516021 300202 466010 762572
39148 762572 807272 636698 582847 748767 910356 911795 880364 980737 1168196 1300213
39138 1300213 1347152 1364103 1350151 1269552 1163242 1114903 1119350 1089734 1001389 935411 953571
39127 953571 1006880 1011134 960460 919420 935854 1006381 1107592 1209462 1249517 1140295 857620
39116 857620 529411 374068 477913 658392 654917 470965 386176 546514 696789 505783
39106 505783 65071 -183810 -25274 272330 354752 217702 101699 121974 188984 206357
39096 206357 179009 161770 213664 357388 502521 492344 320819 197296 272364 409148
39086 409148 382924 210799 99291 135864 227784 296036 326398 263835 74890 -96173 -61537
39075 -61537 105075 132865 -31648 -121303 43530 277591 317758 202425 172947 313789
39065 313789 481735 536881 478990 368593 245117 146211 129212 233403 424250 577052
39055 577052 557947 383440 261700 369744 609786 720147 622984 494182 459883 422862
39045 422862 285697 161004 203276 359391 454562 445999 433082 463217 467268 367152 151677
39034 151677 -116205 -292812 -234072 14948 199726 156340 43831 112336 319506 400056
39024 400056 293794 247583 421134 623447 589789 353945 160171 106942 78913 -5733
39014 -5733 -83344 -107985 -147097 -232718 -259714 -148397 -756 49498 65331 202616 402225
39003 402225 398741 103049 -204928 -191386 143886 520924 716804 706669 555725 351769
38993 351769 223701 267840 435595 592808 677881 711840 702191 657540 640815 661590 579875
38982 579875 306966 46845 86855 349045 436952 204297 -15766 92215 365563 442850
38972 442850 307944 251451 378016 467056 353429 181853 166168 272640 300139 194924
38962 194924 128536 249473 469192 569421 476968 339094 318266 409789 517904 618576
38952 618576 737560 824569 788468 654823 566554 605258 708157 785806 836018 905384 990253
38941 990253 1001277 821017 438461 41691 -117275 -772 184908 293886 399301 544001
38931 544001 568735 396102 252312 315159 357692 112650 -199926 -171232 101721 159596
38921 159596 -28027 -16850 299879 463876 239074 31936 220167 589678 801349 940731
38911 940731 1189842 1369574 1261139 1048462 1007767 1053616 1003047 995814 1233162 1571851
38901 1571851 1783512 1949712 2221668 2495352 2707036 3095513 3770173 4438522 4997584
38892 4997584 5881638 7338951 9089937 11421751 15624364 21871552 27241663 27794326
38884 27794326 22948751 16283662 11516100 9108861 7464883 5842077 4695506 4128606
38876 4128606 3608894 2980225 2578766 2414055 2143215 1792062 1702606 1813656 1731390 1487821
38866 1487821 1517259 1853859 2036019 1903690 1854142 2136021 2453951 2506614 2449088 2554580
38856 2554580 2780438 2939312 3041029 3222751 3505388 3794989 4012898 4116199 4076649 3893100
38846 3893100 3567275 3098441 2577844 2188583 1984857 1796004 1507761 1278092 1259353 1282983
38836 1282983 1111357 859604 828561 1013796 1136849 1103064 1053651 990756 758487 442146
38826 442146 383684 671944 957297 930710 705150 566348 599843 729681 898576 1023504
38816 1023504 947895 625362 247048 53758 97555 255704 374716 348197 173750 -9200
38806 -9200 -43277 52918 120951 93130 50856 54744 74971 101326 161980 219928 208961 171279
38794 171279 186448 178781 10087 -226484 -244082 50029 419347 614993 623529 535859 383696
38783 383696 198400 47676 -68093 -186632 -208884 30125 452167 736461 727338 607716
38773 607716 558995 509370 379811 317501 448646 599548 528257 301910 187157 249994
38763 249994 309353 248843 148685 98906 66516 -3123 -71468 -47764 101234 299420 411461
38752 411461 371509 257722 185562 152972 88384 17919 30451 85308 47663 -57184 -38540
38741 -38540 148237 311558 341997 379765 514364 555533 323424 -16293 -152918 -39345
38731 -39345 134439 269125 405480 508590 458997 268601 108999 99183 204745 345884
38721 345884 473335 540673 519181 441448 351268 245933 141012 116132 192024 240405 141108
38710 141108 -33737 -110879 -27859 153411 358210 501998 482710 319247 203212 251545
38700 251545 309928 193552 20764 59763 296614 430787 320066 174125 227937 430105
38690 430105 563250 526394 391440 271647 213383 170740 68355 -63814 -59344 184566
38680 184566 522571 708034 691010 626384 619308 634423 642649 663104 638300 463779 197692
38669 197692 63226 166083 360082 464459 464110 412349 287715 67492 -163710 -295825
38659 -295825 -317512 -281581 -220574 -163229 -150606 -158210 -74279 165147 470142 684224 731981
38648 731981 646105 511758 418673 400881 393160 313867 199502 160803 198843 203128 171645
38637 171645 267023 552700 821306 837270 650866 503496 480012 437673 279362 123210
38627 123210 131562 282608 402353 375812 254239 169500 200478 327399 463819 501909 371881
38616 371881 128160 -34162 57109 334228 520944 443510 233108 140433 232869 385621
38606 385621 492282 531567 477649 325258 193213 220009 339347 341203 190129 87551
38596 87551 146750 203054 70492 -173138 -305350 -249492 -107729 8428 54752 31801 -9382
38585 -9382 -4922 7760 -79859 -223463 -184830 139006 479297 481980 150858 -183839 -281269
38574 -281269 -184078 -39996 62196 71687 -26341 -156133 -224424 -248578 -283202 -255673 -58072
38563 -58072 208121 295412 158565 30350 76814 180631 175085 99847 72764 68597 9283
38552 9283 -39355 43499 210713 293234 238556 145860 84865 34633 -951 29952 107858 127275
38540 127275 42314 -64851 -81348 54178 355545 752134 1042252 1034196 786861 577047
38530 577047 561868 606779 532814 389209 341447 399768 431425 385777 338710 332001 318023
38519 318023 263978 184230 74861 -59947 -131806 -59184 74201 105707 35805 12997 76172
38508 76172 121116 150947 304737 544975 591719 342591 101209 141501 271093 151269
38498 151269 -113346 -98381 280083 630012 660444 530555 499108 545412 523526 439997 366093
38487 366093 260362 83463 -57224 -70297 -59864 -151832 -255370 -203036 -43439 21062
38477 21062 -55032 -118257 -76959 -16336 -25802 -63042 -34405 95074 298515 504365 603579
38466 603579 525964 324583 117247 -48771 -197595 -305928 -285695 -109727 118722 256065
38456 256065 243797 136530 33360 -16557 -41231 -52973 40706 322881 649058 706888 400283
38445 400283 34624 -38077 146262 267223 176475 28532 -17651 9206 38856 87128 152866
38434 152866 151431 45574 -82451 -165643 -237793 -315196 -327472 -255884 -205714 -224056 -172579
38423 -172579 61901 324085 348221 128906 -56111 -24156 79179 12686 -214183 -355642
38413 -355642 -244140 32499 273937 374539 333718 156927 -129682 -388068 -431618 -241946
38403 -241946 -35985 -36608 -224265 -385994 -368282 -205736 -31023 58754 50012 -10830 -82286
38392 -82286 -186039 -362757 -556135 -629873 -554294 -469885 -470224 -431843 -201200 139970 367905
38381 367905 407945 343108 189608 -100519 -416249 -515022 -334719 -74028 98827 215073
38371 215073 319317 340957 262878 212541 252983 272496 219327 244969 438255 604736 524392
38360 524392 278177 96119 13844 -81707 -181886 -198975 -199065 -308382 -419264 -273045 145017
38349 145017 547379 718069 712314 642995 511213 329535 194793 136450 76822 27292 125964
38338 125964 373846 534772 443058 238272 135857 121968 55906 -62047 -133884 -178010
38328 -178010 -280494 -384120 -342399 -174553 -64829 -81236 -76046 74960 284024 382569
38318 382569 330766 212344 98721 2746 -72469 -103442 -54866 96945 314817 471834
38308 471834 437404 223448 -10792 -135637 -178848 -236037 -317332 -359695 -354107 -363394 -407272
38297 -407272 -419663 -363456 -318815 -383506 -515302 -555268 -415316 -171686 54092 234366
38287 234366 394923 494644 451682 291483 168093 185152 256450 213253 28902 -126771
38277 -126771 -71508 182405 429043 477479 344815 214613 199854 202423 61808 -203863
38267 -203863 -406225 -428288 -336490 -216862 -31845 262834 559848 694737 651315 545494
38257 545494 436584 293684 141921 89816 173542 300650 391990 452820 451206 279146 -53585
38246 -53585 -316735 -308120 -127199 -37833 -108476 -166890 -96559 17997 81066 133099 214578
38235 214578 238788 136406 20630 54551 208628 297096 237989 143184 140421 226671 337161
38224 337161 463451 636079 833352 961307 926984 734865 520775 451606 544098 624389
38214 624389 545046 407642 453945 730456 986781 962902 684843 410734 356983 541964
38204 541964 829005 1038563 1060271 938721 839068 878208 1006711 1087117 1047301 919414
38194 919414 782667 721758 786004 919916 980690 899359 782260 771264 842620 839980 685222
38183 685222 460036 283539 194258 152692 89369 -35511 -148047 -73877 255368 632596
38173 632596 747868 542559 262639 137312 144581 141510 76781 -17777 -121750 -195648 -147966
38162 -147966 47927 272139 403271 473269 551669 547263 301533 -130712 -471114 -534120
38152 -534120 -408878 -259468 -88490 170266 416159 419726 118216 -254446 -401493 -260365
38142 -260365 -5554 184842 271586 286619 242085 155675 86660 76229 99936 143132 268909
38131 268909 517803 773709 844054 682552 439665 280745 244990 293735 386083 465239
38121 465239 471150 425986 428824 515990 603798 611054 549621 453507 329529 235443 277853 444897
38109 444897 572454 587746 642849 847674 1008900 861744 483820 224276 231258 298107
38099 298107 222915 85873 64250 156281 226438 209340 146483 92249 72648 84182 81734
38088 81734 27410 -25446 16693 136596 220133 243255 302239 410772 432931 311985 207179
38077 207179 266651 392520 390390 260283 174814 223411 325823 364427 282271 96308 -72454
38066 -72454 -46346 198650 434526 443415 315177 304271 439469 498571 376882 242735 245690
38055 245690 275661 152258 -79854 -193359 -53493 252517 514475 556160 351389 60181
38045 60181 -88099 -1910 214860 427066 602073 731391 728714 526706 229697 48108
38035 48108 73064 199622 287780 323557 377841 456113 466262 354306 211931 173782 220532
38024 220532 187881 11691 -150465 -140337 -34112 1688 10147 176389 468238 599816
38014 599816 441559 236868 252656 394085 368460 114588 -148223 -244263 -211999 -160994
38004 -160994 -132754 -122974 -108128 -34835 105590 198337 127872 -18087 -5170 256299 595016
37993 595016 787162 768168 601195 363476 145139 63631 164651 331238 371493 215659
37983 215659 4164 -37626 165372 428534 490569 329784 202377 291100 433322 355204
37973 355204 92003 -46075 82436 273511 300111 194465 105582 69906 68463 152276 334255
37962 334255 462590 376751 128035 -96848 -208196 -236790 -202790 -118296 -61684 -85418 -96598
37951 -96598 -822 79011 -65100 -377164 -539791 -380191 -78767 107054 143259 134211 113171
37940 113171 79942 117327 275222 408708 333354 127403 81201 299078 523764 459207
37930 459207 146654 -114450 -155795 -104100 -158144 -334178 -486641 -495128 -362794 -182046
37920 -182046 -63237 -52794 -66248 40667 263063 382766 229886 -56037 -193835 -155083
37910 -155083 -170963 -321202 -381646 -209176 -22220 -66861 -199861 -106964 175357 294534
37900 294534 116914 -108630 -177134 -194653 -290519 -352654 -249476 -96127 -74605 -144777 -152713
37889 -152713 -99155 -75273 -35246 118886 283868 248200 46132 -19348 230005 612760
37879 612760 815092 708074 384531 29250 -170797 -119192 84129 208568 134346 -41637
37869 -41637 -174682 -231079 -216096 -82167 160906 337759 268682 10172 -199161 -222979
37859 -222979 -135969 -54932 -6220 -2403 -108936 -330560 -522331 -544257 -468363 -498700 -675020
37848 -675020 -784638 -631587 -295595 -28654 44840 14822 5145 36303 85100 156627 229869
37837 229869 218227 68763 -145539 -301922 -358805 -349469 -289990 -177423 -61825 -34814 -126205
37826 -126205 -253881 -286718 -145787 126289 368779 421204 287173 138947 108434 130444
37816 130444 68283 -64813 -122839 -40363 89136 153667 138648 85180 22172 -34746 -85158
37805 -85158 -158810 -271735 -375900 -414681 -398149 -345695 -214291 -12016 81580 -90619 -361453
37794 -361453 -373071 -73684 165634 63453 -173014 -170535 65496 199001 71279 -119883
37784 -119883 -161801 -108239 -138257 -298272 -484922 -592960 -601905 -562577 -540863 -552278 -554093
37773 -554093 -528258 -529202 -589440 -629262 -551923 -393522 -281541 -275328 -347310 -480987 -659305
37762 -659305 -782487 -747766 -618184 -572242 -670032 -808175 -922352 -1070452 -1264490 -1385809
37752 -1385809 -1357530 -1260722 -1173092 -1017081 -697844 -300942 -17367 75031 43816 -34005
37742 -34005 -130460 -225600 -309228 -399957 -484861 -483337 -359483 -222437 -203878 -264282 -241423
37731 -241423 -88993 52951 56919 -18035 -4998 168175 394958 487538 350039 79920
37721 79920 -106331 -74541 108514 270221 302494 202770 11890 -199409 -313998 -245751
37711 -245751 -50423 113441 149900 94662 19342 -57605 -142598 -215511 -246109 -230622 -193010
37700 -193010 -169894 -186207 -215319 -189646 -102570 -64825 -176225 -364874 -462584 -436536 -412477
37689 -412477 -436866 -373134 -135470 107490 125625 -43198 -137309 -39253 81801 53901 -34688
37678 -34688 14515 197532 309030 232652 76680 -8025 -8226 20776 81921 178860 214727
37667 214727 92801 -115041 -243559 -267945 -308882 -390271 -373403 -207073 -66758 -106785
37657 -106785 -209611 -153884 58831 229711 257797 215387 153349 37016 -102657 -153916
37647 -153916 -125769 -190159 -427174 -670938 -722036 -603091 -483792 -432002 -362825 -198377
37637 -198377 21430 184304 215898 157540 136925 214401 280211 203952 66202 78427 245947
37626 245947 312268 136920 -71646 -63816 85008 135196 80978 122791 297794 412745 363711
37615 363711 273865 248029 212527 106065 42458 137164 300038 354923 291944 257730 324741
37604 324741 396905 361858 251795 204887 291268 420756 449153 355821 252605 206178 150315
37593 150315 40473 -14234 90708 239651 217818 25727 -114971 -88825 -30559 -79384
37583 -79384 -162587 -127518 37037 212801 292376 235726 84375 -23053 36505 187696 222855
37572 222855 111278 69607 224408 396154 375141 233118 158360 138411 53327 -38455 5472
37561 5472 101464 33955 -150984 -164598 58652 227616 151985 50428 206816 535777 724394
37550 724394 668744 535181 461012 415460 346843 286383 273195 292782 318153 339325 349183
37539 349183 357606 403538 502351 614470 710881 803206 843344 692821 326302 -2018 24976
37528 24976 399838 776728 874771 746885 596541 489293 367781 243005 210910 302524
37518 302524 437852 531016 551560 482202 312202 100128 -37020 -43653 17485 64381 95066
37507 95066 140247 179059 184272 209807 319754 430970 359331 87248 -126669 -24914 315381
37496 315381 553211 472916 176787 -116266 -309794 -393864 -313619 -37525 286596 409995
37486 409995 262023 44738 -16355 55021 46081 -143798 -361327 -394319 -242795 -115583
37476 -115583 -161616 -289210 -304541 -168182 -18355 41492 56797 88062 88228 16583 -16248
37465 -16248 123588 338382 342586 20641 -392046 -581601 -506230 -350544 -214498 -36733
37455 -36733 171060 220950 -76 -302277 -376543 -162004 109629 219868 168672 61003
37445 61003 -50508 -132581 -115430 6517 100036 46900 -79413 -115598 -46591 -3352 -41859
37434 -41859 -74855 -35000 44837 146392 300826 441506 386263 92827 -190895 -186766 72244
37423 72244 302716 322185 196462 69814 6933 17930 103980 231213 344550 432516 506647
37412 506647 521391 416141 248178 172931 254963 391247 456228 429780 347682 234229 141505
37401 141505 149142 244851 296534 231029 151012 166810 197925 89077 -123930 -232299 -143728
37390 -143728 5480 75883 117136 236553 379351 377622 190690 -25385 -112592 -88332 -77510
37379 -77510 -123239 -142440 -68408 32936 36066 -86407 -237232 -322088 -342521 -343463 -333147 -305203
37367 -305203 -290490 -314825 -329739 -262340 -127868 -15974 37851 81371 128572 113873 15328
37356 15328 -74190 -86572 -104063 -218168 -319012 -195412 145021 429017 462516 370487 373207
37345 373207 451081 410109 215796 55157 52359 112811 118933 118462 208314 358140 483579
37334 483579 598989 741477 808327 657480 367850 215176 326983 506450 492817 291128
37324 291128 131333 163205 308066 395852 353610 246680 198456 290116 502319 737820
37314 737820 911192 1007655 1043867 1004714 861752 641693 429927 292848 218562 145606
37304 145606 41691 -55120 -82319 -41245 -9713 -32342 -29423 107818 327827 420678 264304
37293 264304 -1503 -121255 -525 232606 400726 425631 326618 168609 32419 -25376
37283 -25376 -7250 51539 119978 143450 35155 -209044 -418762 -400147 -192635 -48051 -108803
37272 -108803 -231870 -216720 -100239 -96088 -290174 -524591 -588171 -435092 -203509 -78037
37262 -78037 -136137 -280889 -333286 -235002 -130711 -185615 -358553 -457594 -408032 -338401 -368389
37251 -368389 -438214 -427120 -337622 -249660 -162270 -18224 139813 182841 86531 -23580 -70623
37240 -70623 -141099 -300451 -404050 -260140 50657 203419 31462 -247692 -314737 -150090
37230 -150090 -8711 -47503 -148233 -135998 -26199 28172 -57495 -237405 -423313 -549727
37220 -549727 -586154 -557622 -523314 -472674 -296996 38395 343066 369215 134728 -75861
37210 -75861 -82874 -28401 -118354 -288271 -300356 -104221 93663 121559 24183 -90684 -212230
37199 -212230 -326753 -298605 -23066 349028 504900 317190 -10869 -189803 -152890 -68166
37189 -68166 -100338 -233713 -325142 -282413 -163970 -102521 -141886 -179066 -94144 85141 200317
37178 200317 146219 -16401 -154299 -215356 -245501 -290454 -339464 -354353 -302385 -166444 20877
37167 20877 151064 120370 -25101 -87320 69492 332784 453760 348232 198649 217098
37157 217098 383662 496977 437334 278460 145257 71703 42278 74461 161888 181492 -22128
37146 -22128 -426559 -777187 -802864 -478443 -50543 193984 180255 78803 98017 250228
37136 250228 343040 210106 -86331 -322852 -360261 -262928 -176148 -154706 -147070 -98391 -13890
37125 -13890 63226 89373 34021 -105819 -280044 -385909 -328725 -118643 90056 105625 -105973
37114 -105973 -355463 -422337 -305676 -205211 -237886 -275744 -140998 117107 266437 196255
37104 196255 45920 -10511 8388 -27185 -129673 -189163 -190178 -280992 -547217 -824700 -871232
37093 -871232 -684015 -504571 -498896 -572691 -554058 -421527 -252890 -68741 127684 239102
37083 239102 180978 64141 81141 204387 195725 -29061 -239881 -202753 14495 184343
37073 184343 228888 220974 181227 66826 -84635 -179144 -220803 -291376 -387886 -426622 -397375
37062 -397375 -361274 -302711 -152778 32266 106795 89155 171657 386262 464577 189847 -264510
37051 -264510 -533733 -496388 -325388 -187190 -102678 -73616 -118639 -146804 -1075 280688
37041 280688 411210 186989 -231201 -500248 -485336 -339728 -244025 -214787 -178140 -100243
37031 -100243 3453 93270 89507 -76950 -328654 -444818 -310063 -102276 -95395 -292450
37021 -292450 -409205 -253013 43650 254558 372266 531735 719833 767151 623842 457918
37011 457918 426000 487760 515962 470365 377928 242297 80332 -16147 35204 186481 304204
37000 304204 312882 228788 88404 -67117 -152218 -83263 106500 268124 292929 220763 150314
36989 150314 82283 -68978 -291516 -387213 -170087 252765 522161 423202 145898 32306
36979 32306 137408 213811 110318 -28961 -27731 60760 90971 71637 98934 138979 69672
36968 69672 -93378 -186643 -123584 6127 80078 74480 35005 11038 31208 64509 13627
36957 13627 -163413 -341590 -349546 -198205 -70958 -78369 -149592 -193229 -231430 -313201 -406963
36946 -406963 -458385 -476238 -490787 -488102 -441847 -357857 -251266 -141235 -90847 -162863 -296027
36935 -296027 -323870 -178077 18517 130951 187073 279897 383382 393103 308666 254819 325035
36924 325035 484771 616490 595478 357802 -19574 -329842 -417866 -342293 -281014 -298683
36914 -298683 -305046 -232765 -138575 -96971 -94506 -87564 -93921 -158021 -261842 -332963 -334814 -306223
36902 -306223 -298986 -294623 -211171 -16251 183140 225783 95387 -32397 2289 152790 264013
36891 264013 295113 315175 314342 194638 -19614 -139625 -77481 -5986 -110385 -291122 -298494
36880 -298494 -109929 33087 -20265 -137899 -146589 -93930 -128099 -230027 -241336 -122207 -14662
36869 -14662 -24769 -71470 -7271 197010 441674 608399 635142 537638 402620 313024 245026
36858 245026 98245 -130965 -283552 -221312 -14751 151120 220087 299809 460305 614316
36848 614316 632531 488939 247566 -20792 -252078 -376689 -367790 -289137 -245000 -278712 -344030
36837 -344030 -374167 -358213 -339609 -344919 -337214 -268939 -168475 -116621 -126389 -122247 -75520 -66125
36825 -66125 -132066 -157020 -38105 112269 107958 -3938 14906 220973 368447 248465 -30549
36814 -30549 -222306 -254858 -220731 -170478 -80776 29567 94266 86936 19650 -105840 -265360
36803 -265360 -387727 -441720 -476744 -496859 -394181 -125173 140991 197370 55987 -112342
36793 -112342 -223548 -304119 -335742 -270571 -174156 -159825 -184677 -99416 88828 193573 118621
36782 118621 -27480 -117927 -126982 -31817 194519 424451 427847 194713 4942 36214 97666
36771 97666 -57334 -319807 -371724 -157354 43589 11003 -158455 -238654 -163867 -54027
36761 -54027 -34755 -101510 -145242 -92891 -7438 -2419 -61558 -43353 99974 235231 257788
36750 257788 246985 284288 265647 101930 -5082 229414 702406 957584 776392 467373
36740 467373 405395 510948 434348 120093 -109451 -25958 213065 325989 257275 134989
36730 134989 28768 -73160 -121852 -34859 132626 209415 143743 73502 96900 122176 64009
36719 64009 58131 296071 708194 1007668 1040923 905188 705910 419104 77462 -124604
36709 -124604 -80176 27503 -29870 -173240 -125932 159008 403561 377801 184772 83327
36699 83327 157967 280454 325447 300285 268620 243007 196304 134816 104195 124092 166633
36688 166633 218592 304308 393659 358588 136807 -103163 -126924 20817 25230 -265422 -601834
36677 -601834 -667180 -482496 -288931 -161881 8868 222483 323741 271600 210775 223804
36667 223804 229062 195543 237815 379438 426500 249086 30329 24975 167933 155966 -101569
36656 -101569 -338404 -296182 -55510 111151 100103 40831 44849 55709 -2542 -59781 -2389
36645 -2389 125141 170037 115128 111806 221670 291110 196862 74285 130875 325009 428824
36634 428824 371603 315046 375006 460778 447191 352915 279912 290479 388707 512615 520725
36623 520725 320664 41996 -67879 36075 138012 76273 -59772 -127048 -130280 -103371
36613 -103371 20012 242365 369942 258723 78202 98340 286532 362531 230380 101490
36603 101490 146532 260737 284394 272097 381884 598525 735560 690796 559210 459693
36593 459693 362998 184889 -8547 -33690 135240 263143 149235 -71938 -105072 74273
36583 74273 185043 64307 -110074 -119414 -6787 78325 147157 272896 364332 279923 95578
36572 95578 26168 107122 165565 106353 28963 32561 75801 79145 38996 -2341 -11278 24260
36560 24260 67331 49792 -7208 29713 193981 289982 149759 -79981 -135178 -48324 -90279
36549 -90279 -317387 -479723 -429542 -321788 -301780 -276086 -154247 -68142 -142773 -243284 -177256
36538 -177256 -7469 64157 21980 14041 58535 2487 -210981 -415759 -422218 -235871 -23032
36527 -23032 84705 111363 173461 311315 418573 382040 244121 126951 31838 -133235
36517 -133235 -326606 -359963 -167714 85314 238049 295346 271276 85540 -229710 -415939
36507 -415939 -291615 -30972 73839 16649 20176 161628 292017 287985 166141 -30715
36497 -30715 -254015 -366332 -243725 20003 187642 174971 112347 105766 113138 86288 67892
36486 67892 97237 153239 224058 306456 320875 173568 -65013 -184696 -81135 139779 320274
36475 320274 382110 292610 67258 -148513 -162528 24680 194559 189034 85432 29835 33861
36464 33861 27028 -4513 -30738 -47287 -55706 -44402 -39094 -94478 -203766 -306370 -395032 -490202
36452 -490202 -505437 -322514 -47349 22629 -202911 -442465 -429189 -274121 -243696 -337716
36442 -337716 -348701 -249520 -236428 -384514 -511731 -449563 -255509 -73259 62529 176674
36432 176674 219847 110919 -118203 -309076 -325981 -193649 -71897 -85497 -191307 -249422
36422 -249422 -211490 -156383 -125771 -44848 119154 232932 156370 -44273 -171135 -136043 -7462
36411 -7462 132465 241593 270361 214012 191380 314917 492563 527372 417327 365414 454489
36400 454489 514979 402778 220819 137856 147696 160756 197721 309130 398845 325525 128950
36389 128950 -34392 -151143 -345209 -603875 -715649 -550358 -238631 9888 127726 145512
36379 145512 75799 -31926 -43411 90897 196187 75284 -188322 -304365 -152468 81818
36369 81818 177795 128571 56480 17346 -19011 -88852 -217839 -406369 -568713 -579759 -452047
36358 -452047 -360924 -406073 -463103 -388838 -256326 -224868 -270408 -241100 -128727 -75411 -119478
36347 -119478 -136971 -55217 64588 185691 342398 482730 465602 292321 151429 140499
36337 140499 131930 27316 -50169 28816 164350 184851 95607 -10396 -143977 -310464 -343520
36326 -343520 -110923 189587 214056 -67588 -349550 -429341 -405881 -396279 -325996 -126049 70572
36315 70572 91252 -45234 -191981 -268473 -277716 -217469 -95250 16596 38734 -20589 -78270
36304 -78270 -56031 69001 236041 311417 209270 23296 -54684 23332 109687 99650 97232
36293 97232 242420 463769 534277 351105 61395 -98777 -39193 113459 156558 29961
36283 29961 -116157 -110962 4687 28334 -114789 -252048 -194265 12013 152548 100342 -90463
36272 -90463 -301073 -455286 -514685 -458888 -317366 -188560 -174869 -270922 -338991 -256194 -91954
36261 -91954 -44088 -150857 -196503 -27218 169450 113205 -127009 -225161 -124993 -141364 -432900
36250 -432900 -704430 -647970 -401692 -278468 -249151 -56759 260380 346333 54393 -326696
36240 -326696 -465323 -355843 -189018 -66505 20692 79602 109774 116533 54022 -141616 -403538
36229 -403538 -543204 -484191 -369065 -352734 -410156 -442280 -444816 -442957 -368003 -162799 51829
36218 51829 84251 -70443 -229372 -285182 -326847 -451941 -577064 -522805 -238490 124358
36208 124358 351209 348408 200289 59540 -16031 -96876 -241354 -378585 -399291 -325436 -284278
36197 -284278 -310540 -288557 -133094 78549 223696 285491 294660 217631 41819 -94170 -29619
36186 -29619 176259 307978 304901 308592 357887 275637 -9526 -249179 -191364 51140 186092
36175 186092 166877 158794 173627 64212 -133152 -193612 -98973 -103582 -286362 -363101 -137305
36164 -137305 151142 176485 -9856 -144921 -187230 -268329 -346881 -250102 -8500 154848
36154 154848 153412 88211 -5160 -176179 -325501 -249206 32409 261252 318467 345108 409043
36143 409043 346614 83533 -154432 -155072 -35582 -26129 -105172 -91745 8262 -3165 -207280
36132 -207280 -457644 -587034 -579110 -519657 -482164 -473905 -433360 -296609 -106160 1781 -30083
36121 -30083 -93102 -62899 42399 127719 159309 151358 99548 21357 -24335 -54592 -191925
36110 -191925 -447662 -589420 -411151 -66549 79099 -81448 -279984 -254973 -57794 101716
36100 101716 153557 184477 248420 291731 250559 137990 22555 -40954 -47246 -19855 31307
36089 31307 114940 223784 328576 410363 447332 362548 77855 -324730 -591662 -553427 -331691
36078 -331691 -178672 -159143 -129018 -7280 96064 69563 -15449 -471 148479 306344
36068 306344 342379 255740 161182 161570 238560 278883 212159 88093 -4442 -45907 -69940 -90897
36056 -90897 -112365 -163353 -248417 -297086 -246322 -143850 -82624 -62256 -14544 55478 64530 -17554
36044 -17554 -135546 -244868 -334334 -358485 -271063 -141190 -112766 -215214 -322864 -328475 -245333
36033 -245333 -120551 13109 67306 -49562 -233836 -217413 71222 331897 258363 -33263
36023 -33263 -155338 25752 243416 229455 49993 -43162 54656 231935 333225 285910
36013 285910 99709 -156660 -376204 -473674 -440159 -321038 -160051 5745 123127 147902
36003 147902 93918 16866 -56363 -145171 -253628 -337033 -361231 -359887 -385587 -422896 -404583
35992 -404583 -311656 -202384 -134139 -111297 -122235 -161505 -187804 -133583 -8016 74168 28182
35981 28182 -96967 -214409 -321328 -429097 -453579 -321818 -140484 -83849 -123211 -60233
35971 -60233 136685 237586 90057 -139183 -219684 -201254 -296914 -516774 -654584 -619958
35961 -619958 -549668 -536148 -458086 -207323 66938 110332 -106656 -367807 -502674 -551645
35951 -551645 -612606 -661201 -616311 -503388 -436079 -455931 -493512 -497724 -507801 -560342 -608550
35940 -608550 -594921 -546707 -538993 -609183 -755624 -952721 -1102137 -1058005 -813524 -587480 -575696
35929 -575696 -668184 -594634 -326458 -110090 -65029 2193 256546 525771 536659 320186
35919 320186 157312 190040 293038 300289 168583 -71373 -333458 -426441 -176385 329713
35909 329713 763156 891612 791129 667851 595644 520898 421742 337031 278494 212433 115169
35898 115169 -15608 -182079 -359776 -469048 -435092 -280226 -116191 -36312 -36584 -48105 -33186
35887 -33186 -30951 -86364 -142121 -69742 136170 258826 76006 -324716 -576874 -436545 -53582
35876 -53582 231186 273127 206233 193391 220323 155743 -59966 -323440 -451599 -361335 -167352
35865 -167352 -54661 -41359 44199 295166 545250 582565 464444 439511 579799 695728
35855 695728 654629 567209 545305 476242 232538 -36891 -76241 71972 93116 -142067 -389854
35844 -389854 -395011 -229077 -120885 -111258 -66066 54535 131465 75116 -64243 -177351 -188279
35833 -188279 -83128 59532 94968 -32578 -195126 -243695 -211454 -217092 -221652 -77637 182849
35822 182849 325660 239678 89108 50679 81818 72528 57228 110309 162129 106223 3512
35811 3512 -7279 51773 33549 -84786 -166475 -134407 -64839 -35617 -19938 29673 106052 192671
35799 192671 283449 324416 229813 -4906 -276316 -473930 -538197 -435833 -194845 29206
35789 29206 61033 -70993 -142490 -32341 97547 13421 -283304 -558536 -602266 -402196
35779 -402196 -112006 69276 24873 -184370 -361990 -372609 -279934 -240441 -294123 -330051 -240679
35768 -240679 -37390 183952 321610 303035 119604 -123727 -242345 -134599 79511 145405
35758 145405 -52806 -343565 -463114 -380805 -318698 -413396 -495524 -332642 2561 199608
35748 199608 137581 43984 152363 368253 410566 184918 -130405 -324940 -348807 -274872
35738 -274872 -186231 -130017 -108088 -78519 -893 108856 194856 228533 232525 246789 297517
35727 297517 387552 491154 566319 583623 523772 353867 69628 -218930 -330852 -213238
35717 -213238 -32867 17384 -48375 -73721 -15314 9023 -63235 -123238 -61207 58563 92001
35706 92001 13718 -83822 -145425 -192005 -214591 -149719 4072 144847 206930 265241 410380
35695 410380 567140 552274 319013 42104 -82268 -46248 9603 -19327 -122665 -231208
35685 -231208 -274352 -205553 -42552 126168 227129 270082 275348 183114 -59974 -346895 -474513
35674 -474513 -384045 -215075 -81386 68725 284301 442533 405830 272041 274982 429773
35664 429773 465620 200328 -161359 -255694 -22683 233295 262998 177861 224781 387344
35654 387344 413379 214291 10668 -5598 39455 -80751 -316544 -402118 -245315 -33338
35644 -33338 70284 125169 235379 345730 332790 188442 12206 -98909 -86365 46664
35634 46664 181924 165045 11959 -82419 -23823 38025 -32875 -113490 -21047 161389 192764
35623 192764 54221 -19949 99804 267755 295292 161722 -68612 -353194 -595334 -620952
35613 -620952 -370036 -18691 205984 263809 260652 249092 189517 67310 -65921 -159248 -188272
35602 -188272 -128845 13487 153042 182139 92963 -16053 -62355 -51154 -20023 17139 39105
35591 39105 -4234 -120577 -219652 -202443 -96754 -26833 -31096 7591 189351 412978 457190
35580 457190 241443 -69294 -234031 -154318 83600 319977 446742 466381 450889 421774
35570 421774 294704 8866 -311746 -439439 -310060 -99409 16018 64924 168601 316705
35560 316705 367567 235014 -6654 -186715 -174175 1611 149154 115215 -4324 12119
35550 12119 152754 142614 -120268 -329542 -186998 131174 215078 14338 -142225 -87963
35540 -87963 -27390 -137293 -280809 -267711 -150087 -84192 -88514 -113323 -193170 -349619 -463701
35529 -463701 -422130 -299807 -234649 -205032 -104625 25357 33482 -79269 -114513 52777 283247
35518 283247 331552 136606 -114830 -205327 -124003 -57844 -153935 -347878 -472952 -476506 -426843
35507 -426843 -346589 -190356 -1830 69674 -21306 -126037 -106638 -8559 70173 155350 299360
35496 299360 398228 281108 -29331 -284695 -275365 -64134 66190 -107074 -487000 -690540
35486 -690540 -437141 86574 392968 273173 29696 16093 151832 127872 -50216 -49469
35476 -49469 263399 586829 582950 289484 -3259 -118092 -76277 56993 222999 311531
35466 311531 225775 23074 -130508 -172373 -203736 -299077 -369800 -310954 -197540 -188504 -258864
35455 -258864 -199298 63973 310626 308126 126850 10741 25457 39253 5710 23696 97520
35444 97520 87053 -19841 -19129 190759 408773 420840 309804 272499 281566 177975 3147
35433 3147 -29928 131076 321027 438315 545421 646165 595182 337611 61493 -27468
35423 -27468 28867 33367 -77706 -168751 -114620 27256 92150 9661 -120848 -161946 -99343
35412 -99343 -23658 16103 52454 94778 97236 67835 97624 221949 357956 438463 480772
35401 480772 449057 213768 -213174 -552906 -557714 -333017 -174365 -171905 -177530 -91576 39975
35390 39975 177159 318821 393764 312422 124842 -36597 -140282 -214200 -190137 -3776
35380 -3776 208090 254915 192949 213611 275301 164008 -82567 -168059 -15201 109315 60544
35369 60544 45579 215816 372655 315327 184715 188945 237872 148422 13148 51538 231814
35358 231814 332867 285677 197818 133092 108114 206210 440759 593049 448024 128167
35348 128167 -54574 -9788 128061 329883 686646 1101623 1292026 1171472 968787 884124
35338 884124 868865 847001 918740 1183753 1527421 1753956 1842286 1936832 2145330 2460433
35328 2460433 2856032 3370831 4075196 4981057 6011945 7090653 8225945 9399335 10339989
35319 10339989 10587734 9932124 8684769 7359547 6183518 5101393 4132341 3426373 2985482
35310 2985482 2623652 2266152 2040481 1987167 1918190 1689850 1417086 1266572 1194165 1046115
35300 1046115 806405 593921 490676 491207 552188 591868 511704 312025 119828 26941 -11644
35289 -11644 -35986 48877 323898 650522 774840 628839 400614 288110 285250 252474 127971
35278 127971 712 -19934 47400 91450 84673 134591 298231 434809 371522 164298 28374
35267 28374 22414 -2694 -102651 -105426 103143 346399 388636 273061 226001 295190 298581 130439
35255 130439 -78251 -164532 -154782 -189658 -306387 -387611 -314311 -119432 28769 201 -146548
35244 -146548 -218532 -104803 104629 240015 235443 145319 40125 -30776 -8514 137645 327611
35233 327611 407399 309020 127361 888 -53071 -139075 -321771 -505507 -517043 -311534
35223 -311534 -52546 51647 -33965 -165913 -212345 -172751 -105746 -29922 52428 95001 39569
35212 39569 -108152 -272506 -366533 -346591 -241429 -138452 -100717 -88349 -14445 113359 184200
35201 184200 148069 102348 149170 239268 251179 184169 166453 269820 405832 439828 351867
35190 351867 240846 194609 202443 205770 199735 236913 327237 392471 361899 268639 193975 158400
35178 158400 142762 172203 267128 333416 241517 33744 -87229 -25298 85780 92032 18119
35167 18119 -37518 -75312 -127661 -124203 5524 147795 101759 -134534 -328403 -303422 -148313
35156 -148313 -79073 -180635 -354612 -471072 -497465 -482081 -463497 -431573 -373776 -320936 -308212
35145 -308212 -307710 -255337 -145819 -41695 18622 49952 41108 -65176 -265274 -442622 -484628
35134 -484628 -400697 -279278 -185930 -145494 -153945 -153474 -63130 110960 263142 332699 375225
35123 375225 433769 443099 348633 224990 174171 187056 203025 215348 208737 98442 -122654
35112 -122654 -266793 -154194 122859 309373 319341 285184 307479 344311 352590 359582 362690
35101 362690 308258 201099 107623 39860 -32334 -60496 33394 185128 242145 210504 259529
35090 259529 432543 545692 455151 248351 76479 -28688 -60011 58147 300770 426537
35080 426537 240115 -104662 -263893 -139476 31112 40014 -10403 113769 418683 633047
35070 633047 526947 191673 -69889 -97848 -14415 9683 -8923 37160 135134 199748 250260
35059 250260 346637 404392 301628 149391 190563 399570 470126 292101 145767 260994
35049 260994 458956 454905 281544 147383 69545 -52042 -140337 -46332 135285 173907 81955
35038 81955 74481 171204 167287 28954 -13592 144239 306837 322677 319296 423318 498951
35027 498951 380972 169961 64980 55381 14216 -24372 64216 220303 253726 153660 104013
35016 104013 169363 192929 72641 -60829 -45333 89601 217453 304253 367285 340965 147496
35005 147496 -131685 -303423 -291292 -199540 -131115 -58514 77610 246784 382535 476887
34995 476887 527463 456270 209137 -84462 -190087 -42066 171464 248543 196834 144334
34985 144334 125742 80046 11381 12601 112801 205665 171200 5629 -200136 -356042 -415135
34974 -415135 -371174 -262765 -161506 -119620 -127027 -130637 -94879 -41762 -27608 -65784 -79123
34963 -79123 25721 219478 346509 312147 218347 226082 315047 296290 83520 -156665 -195447
34952 -195447 -23236 138968 98432 -99612 -242311 -200803 -70239 -39520 -156783 -292791
34942 -292791 -338937 -342819 -387402 -429145 -370203 -236299 -146662 -124591 -77363 26328 99555
34931 99555 90815 56827 28784 -55295 -202082 -276978 -182097 -19499 51756 45294 97487 241003
34919 241003 373385 432181 462174 492442 458716 287636 262 -278064 -375916 -189390
34909 -189390 183870 463561 437760 177734 -72344 -165149 -107759 65358 294668 407969
34899 407969 251428 -57618 -210511 -100862 54806 63595 9942 42387 120022 151222 206417
34888 206417 376699 556001 589702 528243 496324 414162 128142 -242587 -395640 -279097
34878 -279097 -140255 -113831 -65312 85023 188574 144411 71949 59329 3129 -130536 -152154
34867 -152154 26292 160321 28283 -196788 -224376 -114020 -137262 -304704 -379783 -290523
34857 -290523 -185546 -113755 19667 182145 219029 145394 125524 148309 52056 -95470 -6542
34846 -6542 343307 598679 534824 352828 295204 292459 206239 121785 142533 152921 57269
34835 57269 26798 221593 460170 461412 259766 95414 30444 -45311 -153761 -253747 -407943
34824 -407943 -645595 -775805 -627796 -367515 -275805 -323209 -290833 -204477 -268390 -424665
34814 -424665 -381804 -90706 188556 328296 463366 616801 578533 284912 -12143 -98707
34804 -98707 -44395 13351 50510 29205 -112703 -249320 -157626 84832 142563 -28171 -78112
34793 -78112 117509 190272 -99010 -411677 -386917 -254911 -416037 -706982 -636464 -189445
34783 -189445 152131 142064 17125 -14293 -62236 -223425 -348173 -298179 -154976 -36750
34773 -36750 66029 169713 214343 183773 130470 31866 -190055 -464615 -584285 -475181
34763 -475181 -282189 -148077 -82110 -69618 -117981 -158190 -89935 37161 66867 -16257 -71160
34752 -71160 -45231 -28705 -53934 -71697 -142442 -379700 -652430 -641086 -300137 15486 25670
34741 25670 -139421 -236412 -263649 -302347 -250409 13144 366990 606938 730483 823552 803132
34730 803132 548440 198351 35269 100636 171946 116688 43654 77554 171758 191974 63483
34719 63483 -175232 -370052 -344090 -110667 64887 -45200 -341083 -543341 -552154 -472402
34709 -472402 -356988 -168127 25540 67283 -35889 -103783 -73183 -78161 -178646 -239272 -182512
34698 -182512 -144512 -236770 -344093 -329304 -276018 -332501 -439337 -423738 -282339 -159251 -95666
34687 -95666 -19159 37649 -58731 -278249 -383272 -247678 -47296 -4787 -85259 -107027 -56449
34676 -56449 -92884 -260800 -392148 -349738 -215867 -145390 -141914 -100544 -8589 31446 -27076
34665 -27076 -90681 -36540 161436 422775 605495 568145 293977 -15953 -82866 145204
34655 145204 408256 431821 239948 76318 70221 108183 33267 -148136 -302745 -336705 -269556
34644 -269556 -178787 -117396 -80646 -32877 37998 98367 107426 66492 18884 10076 49881 94492
34632 94492 70675 -42020 -150648 -126361 40930 227049 334181 386761 425835 407589 296677
34621 296677 180386 167967 218441 195129 80192 15703 117466 345562 576944 718275
34611 718275 725743 598260 393593 206318 108667 131533 266755 431580 483548 369393
34601 369393 222875 200959 259184 237077 145894 178582 393707 584151 556831 377750 216996
34590 216996 100668 -24391 -99358 -22310 150234 259375 285124 359434 529919 679779
34580 679779 730083 766913 871956 938179 787237 438742 145102 121387 298432 401906
34570 401906 272315 49987 -4133 160927 320703 257067 14071 -190002 -232098 -170874
34560 -170874 -105782 -62367 -24837 6849 23410 19507 -11339 -52338 -41112 67782 216190
34549 216190 281312 212100 70218 -69718 -190067 -280235 -292072 -197840 -54540 32656 -1870
34538 -1870 -137388 -271342 -274489 -109375 84097 92183 -138660 -427570 -565051 -531472 -448512
34527 -448512 -381331 -300305 -219467 -246132 -438362 -682029 -778985 -649639 -418763 -297528
34517 -297528 -376923 -528419 -531359 -328468 -120192 -137495 -342038 -457558 -320594 -78830
34507 -78830 34720 9537 3414 58455 60189 -24716 -73543 -40376 -74715 -267978 -431878
34496 -431878 -327208 -29848 149651 85345 -49207 -102606 -137969 -211574 -196035 -7564
34486 -7564 163611 85007 -148545 -220673 -40731 153445 166651 89221 78400 95772 16039
34475 16039 -127025 -172232 -60763 98385 177195 146735 59209 -7715 4736 83541 140181
34464 140181 104110 937 -98873 -167238 -204666 -196653 -164362 -209062 -393833 -597041 -605276
34453 -605276 -378408 -122761 -55793 -172823 -294766 -285933 -169407 -64009 -57806 -136121 -216288
34442 -216288 -254963 -291611 -344246 -309285 -71486 288868 523645 496067 323221 183282
34432 183282 100939 19508 -29368 23773 132613 190876 213312 302192 433366 440062 254715
34421 254715 26656 -69822 -33333 28478 58785 67219 72981 117574 259284 468519 598005
34410 598005 545420 375622 190742 -24453 -283754 -412402 -201332 238312 490485 303078
34400 303078 -108258 -339411 -263086 -82843 -14302 -79325 -189479 -270676 -272018 -174877 -51056
34389 -51056 -25532 -122585 -217355 -200000 -122940 -106628 -150639 -144864 -58080 -5053 -91770 -279102
34377 -279102 -450407 -542509 -545711 -443355 -253305 -97023 -109656 -263262 -371869 -304587
34367 -304587 -117803 53256 144606 150171 49718 -145792 -316073 -306619 -99778 144881
34357 144881 235753 114704 -103826 -234171 -190650 -83336 -97290 -252742 -369986 -331709
34347 -331709 -268751 -355165 -506632 -476622 -233380 -26067 -17796 -52793 80679 303951 345603
34336 345603 124270 -140327 -210350 -93230 25086 22590 -56219 -107815 -101598 -72076 -26618
34325 -26618 57056 131865 81051 -107998 -253237 -182767 22064 135150 107205 97161 169900
34314 169900 172739 1528 -194042 -209024 -56900 93184 149063 133018 79358 27589 39055
34303 39055 98711 82525 -64135 -219361 -276400 -304015 -352457 -261209 92390 474511 531324
34292 531324 294405 130027 179967 189052 -33867 -309765 -395851 -324289 -248109 -175986 -68944
34281 -68944 -19003 -110181 -232492 -240232 -190855 -233401 -350088 -400482 -355450 -309951 -315419 -353112
34269 -353112 -414959 -470244 -432425 -307920 -274288 -428564 -569180 -460858 -225871 -188969
34259 -188969 -375345 -483183 -384962 -320598 -468094 -623546 -514808 -212965 2802 39974
34249 39974 14275 -25958 -147282 -319502 -374777 -231945 -22058 69016 -2725 -141484 -244159
34238 -244159 -285163 -296246 -295393 -256477 -172646 -125057 -206154 -357955 -391515 -233108 -55728
34227 -55728 -63645 -215400 -281239 -136443 122140 327669 388327 291738 97149 -59114 -74233
34216 -74233 -29501 -115861 -368852 -600665 -657351 -609955 -584807 -530629 -323946 -37219 101527
34205 101527 31041 -44759 48619 215803 260706 182451 146839 214008 264197 213243 149792
34194 149792 178066 229620 149662 -68194 -247711 -246492 -125035 -57396 -120388 -223082 -233730
34183 -233730 -134452 -35419 -51456 -181754 -316411 -355509 -308299 -265667 -282521 -308079 -246391
34172 -246391 -79208 94517 160376 120939 94772 170421 294564 341036 267964 151529 66659
34161 66659 751 -85507 -169246 -192203 -149474 -101302 -107622 -186159 -313505 -420562 -407215
34150 -407215 -231118 6491 125565 53020 -94815 -152602 -99766 -63849 -134506 -228809 -182572
34139 -182572 37984 264073 292741 104889 -126945 -244130 -258505 -276527 -324007 -320498 -217989
34128 -217989 -85611 -19084 -16540 -1793 50235 81325 59216 50303 120816 205115 168007 6121
34116 6121 -115903 -82849 13651 27061 -18523 7501 105725 155476 164674 307425 627039
34105 627039 877572 807687 491157 226371 184025 297599 437141 528884 528177 425957 288725
34094 288725 181411 66544 -108968 -265591 -277138 -183337 -145318 -179498 -119506 103370
34084 103370 315081 328733 186154 67529 65591 150266 268211 370533 402363 360041 320716
34073 320716 348942 413419 440880 398214 287568 137674 40506 98534 269237 356094 237476
34062 237476 24377 -90519 -57052 46277 156252 238565 236034 142193 81549 179652 372604
34051 372604 468132 384120 209470 38674 -117732 -230395 -192779 40358 311934 358812
34041 358812 84415 -288849 -395825 -106505 301843 435970 241880 43867 96780 260156
$$ [...]
##END NTUPLES=NMR SPECTRUM
##END=
