##TITLE=31Pdec_SR28
 CDCl3, 24 sc
 23.12.2020
##JCAMPDX= 6.0         $$ Bruker NMR JCAMP-DX V2.0
##DATA TYPE= NMR SPECTRUM
##DATA CLASS= NTUPLES
##ORIGIN= UXNMR, Bruker Analytische Messtechnik GmbH
##OWNER= root
$$ XWIN-NMR		Version 3.5
$$ Wed Dec 23 10:23:05 2020 Russian Standard Time (UT+4h)  she@DPX200
##.OBSERVE FREQUENCY= 81.013821
##.OBSERVE NUCLEUS= ^31P
##.ACQUISITION MODE= SIMULTANEOUS
##.ACQUISITION SCHEME= undefined
##.AVERAGES= 24
##.DIGITISER RES= 17
##SPECTROMETER/DATA SYSTEM= spect
##.PULSE SEQUENCE= zgpg30
##.SOLVENT NAME= CDCl3
##.SHIFT REFERENCE= (INTERNAL, CDCl3, 0, 182.463)
##AUDIT TRAIL= $$ (NUMBER, WHEN, WHO, WHERE, WHAT)
$$ ##TITLE= Audit trail, XWIN-NMR		Version 3.5
$$ ##JCAMPDX= 5.01
$$ ##ORIGIN= Bruker BioSpin GmbH
$$ ##OWNER= she
$$ F:/spectra/data/she/nmr/P31/1/pdata/1/auditp.txt
$$ ##AUDIT TRAIL=  $$ (NUMBER, WHEN, WHO, WHERE, WHAT)
(   1,<2020-12-23 10:20:27.37 +0400>,<she>,<DPX200>,
      <created by zg, POWCHK disabled, PULCHK disabled
       configuration hash MD5:
       00 E9 B6 7A A2 85 ED C7 34 08 36 98 17 FE 4E 26
       data hash MD5: 32K
       01 3A 19 F0 32 DB 58 34 FD 95 75 6C F0 BB 68 34>)
(   2,<2020-12-23 10:20:38.79 +0400>,<she>,<DPX200>,
      <Start of raw data processing
       efp BC_mod = 2 LB = 1 FT_mod = 6 PKNL = 1 PHC0 = -2466.097 PHC1 = 80.60083 SI = 64K 
       data hash MD5: 64K
       2C 12 8D 72 BF 97 1E CD 91 21 61 E4 4C F2 43 D0>)
(   3,<2020-12-23 10:20:59.23 +0400>,<she>,<DPX200>,
      <pk PHC0 = 9.816511 PHC1 = -10 
       data hash MD5: 64K
       21 F6 E3 79 52 CE B1 A7 48 80 CE 50 2D 73 BD 0F>)
(   4,<2020-12-23 10:21:02.81 +0400>,<she>,<DPX200>,
      <abs ABSG = 5 
       data hash MD5: 64K
       DC A3 00 52 27 A9 1D 1D 66 5D D1 89 E7 17 A9 24>)
$$ ##END=
$$ 
$$ hash MD5
$$ 9E DB 5F F7 23 7A D1 F0 61 CE 2C 1A 52 44 F9 A3
##$RELAX= 
##$RELAX= 
##$RELAX= 
##$RELAX= 
##$RELAX= 
##$RELAX= 
##$RELAX= 
##$RELAX= 
$$ Bruker specific parameters
$$ --------------------------
##$DU= <F:/spectra>
##$EXPNO= 1
##$NAME= <P31>
##$PROCNO= 1
##$TYPE= <nmr>
##$USER= <she>
##$AMP= (0..31)
100 100 100 100 100 100 100 100 100 100 100 100 100 100 100 100 100 100 
100 100 100 100 100 100 100 100 100 100 100 100 100 100 
##$AQSEQ= 0
##$AQ_mod= 1
##$AUNM= <au_zg>
##$AUTOPOS= <>
##$BF1= 81.014009
##$BF2= 200.13
##$BF3= 200.13
##$BF4= 200.13
##$BF5= 200.13
##$BF6= 200.13
##$BF7= 200.13
##$BF8= 200.13
##$BYTORDA= 1
##$CFDGTYP= 0
##$CFRGTYP= 5
##$CHEMSTR= <none>
##$CNST= (0..31)
1 1 145 1 1 1 1 1 1 1 1 1 1 1 1 1 1 1 1 1 1 1 1 1 1 1 1 1 1 1 1 1 
##$CPDPRG= <waltz16>
##$CPDPRG1= <>
##$CPDPRG2= <waltz16>
##$CPDPRG3= <>
##$CPDPRG4= <mlev>
##$CPDPRG5= <mlev>
##$CPDPRG6= <mlev>
##$CPDPRG7= <mlev>
##$CPDPRG8= <mlev>
##$CPDPRGB= <>
##$CPDPRGT= <>
##$D= (0..31)
0 1 0 0 0 0 0 0 0 0 0 0.03 2e-05 3e-06 0 0 0 0 0 0 0 0 0 0 0 0 0 0 0 0 
0 0 
##$DATE= 1608704426
##$DBL= (0..7)
120 120 120 11 120 120 24 19 
##$DBP= (0..7)
150 150 150 150 150 150 150 150 
##$DBP07= 0
##$DBPNAM0= <>
##$DBPNAM1= <>
##$DBPNAM2= <>
$$ [...]
##$SUBNAM3= <"">
##$SUBNAM4= <"">
##$SUBNAM5= <"">
##$SUBNAM6= <"">
##$SUBNAM7= <"">
##$SUBNAM8= <"">
##$SUBNAM9= <"">
##$SW= 369.568048894756
##$SWIBOX= (0..15)
0 1 3 0 0 0 0 0 0 0 0 0 0 0 0 0 
##$SW_h= 29940.119760479
##$TD= 32768
##$TD0= 1
##$TE= 0
##$TE2= 300
##$TE3= 300
##$TEG= 300
##$TL= (0..7)
0 120 53 12 22 120 120 120 
##$TP= (0..7)
150 150 150 150 150 150 150 150 
##$TP07= 0
##$TPNAME0= <>
##$TPNAME1= <>
##$TPNAME2= <>
##$TPNAME3= <>
##$TPNAME4= <>
##$TPNAME5= <>
##$TPNAME6= <>
##$TPNAME7= <>
##$TPOAL= (0..7)
0.5 0.5 0.5 0.5 0.5 0.5 0.5 0.5 
##$TPOFFS= (0..7)
0 0 0 0 0 0 0 0 
##$TUNHIN= 0
##$TUNHOUT= 0
##$TUNXOUT= 0
##$USERA1= <user>
##$USERA2= <user>
##$USERA3= <user>
##$USERA4= <user>
##$USERA5= <user>
##$V9= 5
##$VALIST= <valist>
##$VCLIST= <CCCCCCCCCCCCCCC>
##$VD= 0
##$VDLIST= <DDDDDDDDDDDDDDD>
##$VPLIST= <PPPPPPPPPPPPPPP>
##$VTLIST= <TTTTTTTTTTTTTTT>
##$WBST= 1024
##$WBSW= 4
##$XGAIN= (0..3)
0 0 0 0 
##$XL= 0
##$YL= 0
##$YMAX_a= 27097
##$YMIN_a= -31019
##$ZGOPTNS= <>
##$ZL1= 120
##$ZL2= 120
##$ZL3= 120
##$ZL4= 120
##$ABSF1= 182.463
##$ABSF2= -187.1042
##$ABSG= 5
##$ABSL= 3
##$ALPHA= 0
##$AQORDER= 0
##$ASSFAC= 0
##$ASSFACI= 0
##$ASSFACX= 0
##$ASSWID= 0
##$AUNMP= <proc_1d>
##$AZFE= 0.1
##$AZFW= 0.5
##$BCFW= 0
##$BC_mod= 2
##$BYTORDP= 0
##$COROFFS= 0
##$CY= -3
##$DATMOD= 1
##$DC= 0
##$DFILT= <>
##$DTYPP= 0
##$F1P= 0
##$F2P= 0
##$FCOR= 1
##$FTSIZE= 65536
##$FT_mod= 6
##$GAMMA= 0
##$GB= 0
##$INTBC= 1
##$INTSCL= 5.30512e-09
##$ISEN= 30
##$LB= 1
##$LEV0= 0
##$LPBIN= 0
##$MAXI= 10000
##$MC2= 0
##$MEAN= 0
##$ME_mod= 0
##$MI= 50
##$NCOEF= 0
##$NC_proc= -4
##$NLEV= 6
##$NOISF1= 182.463
##$NOISF2= 159.3651
##$NSP= 0
##$NTH_PI= 0
##$NZP= 0
##$OFFSET= 182.463
##$PC= 4
##$PHC0= -2456.281
##$PHC1= 70.60083
##$PH_mod= 1
##$PKNL= yes
##$PPARMOD= 0
##$PSCAL= 0
##$PSIGN= 0
##$REVERSE= no
##$SF= 81.014009
##$SI= 65536
##$SIGF1= 159.3651
##$SIGF2= -187.1042
##$SINO= 113.3802
##$SIOLD= 16384
##$SREGLST= <1H.CDCl3>
##$SSB= 0
##$STSI= 65536
##$STSR= 0
##$SW_p= 29940.119760479
##$SYMM= 0
##$S_DEV= 0
##$TDeff= 32768
##$TDoff= 0
##$TI= <>
##$TILT= no
##$TM1= 0
##$TM2= 0
##$TOPLEV= 0
##$USERP1= <user>
##$USERP2= <user>
##$USERP3= <user>
##$USERP4= <user>
##$USERP5= <user>
##$WDW= 1
##$XDIM= 65536
##$YMAX_p= 431956119
##$YMIN_p= -3705576
$$ End of Bruker specific parameters
$$ ---------------------------------
##NTUPLES= NMR SPECTRUM
##VAR_NAME=  FREQUENCY,     SPECTRUM/REAL,   SPECTRUM/IMAG
##SYMBOL=    X,             R,               I
##VAR_TYPE=  INDEPENDENT,   DEPENDENT,       DEPENDENT
##VAR_FORM=  AFFN,          ASDF,            ASDF
##VAR_DIM=   65536,         65536,           65536
##UNITS=     HZ,            ARBITRARY UNITS, ARBITRARY UNITS
##FACTOR=    0.456856943014862, 1,           1
##FIRST=     14782.0589164895, 0,            0
##LAST=      -15158.0608439895, 0,           0
##MIN=       -15158.0608439895, -3705576,    0
##MAX=       14782.0589164895, 431956119,    0
$$ Real data points
##PAGE= N=1
##DATA TABLE= (X++(R..R)), XYDATA
$$ [...]
44962 356307 282617 100255 -88714 -315719 -446558 -237316 201801 369438 4333 -527260
44952 -527260 -699234 -452720 -118515 93479 249125 445474 680669 938383 1197346 1364067
44942 1364067 1342668 1151356 865185 513203 151936 -56713 -7279 176876 296156 335720
44932 335720 405140 489715 470944 359173 288751 288296 272422 266405 391444 572012 523188
44921 523188 170732 -140687 -66372 260502 403211 196373 -101360 -235872 -290486 -457361
44911 -457361 -635214 -481842 103687 708310 749924 82086 -836977 -1398900 -1395266 -1086393
44901 -1086393 -821826 -698961 -567446 -267161 159010 442425 302586 -236324 -760807
44892 -760807 -816438 -382220 85692 131525 -247558 -671896 -815339 -668467 -408576 -153923
44882 -153923 74366 214725 122736 -264948 -766675 -1046338 -909789 -487691 -106170 118
44872 118 -157512 -394747 -527113 -485617 -310578 -68016 193501 394932 415289 227926
44862 227926 4998 -59358 -21223 -95088 -260929 -220299 113216 349529 130083 -298417
44852 -298417 -400940 -149130 -41048 -278275 -418550 -96747 330029 275215 -193458 -451688
44842 -451688 -228766 60910 -8706 -279963 -315029 -14295 346623 544297 598467 589533
44832 589533 523957 408265 294683 211427 148376 118496 134915 141616 90681 74895 220336
44821 220336 427757 419790 135622 -115465 -54114 176312 236080 102065 82155 325888
44811 325888 591409 591713 372993 222897 330875 645983 973666 1127625 1067088 938701
44801 938701 896471 870732 668140 321139 109248 134743 133873 -93150 -300890 -143565 255320
44790 255320 430994 224232 -53538 -139029 -162645 -338755 -576869 -604722 -333346 74781
44780 74781 424832 654752 830958 1047715 1279927 1326205 1016844 510219 222981 365959
44770 365959 676021 731942 439780 67855 -131550 -173630 -216202 -322546 -410186 -370046
44760 -370046 -177313 86582 260489 157882 -304251 -942390 -1339705 -1207424 -728652 -370089
44750 -370089 -303076 -229887 95708 439324 435193 152427 -46612 -89187 -209662 -406806
44740 -406806 -354981 11706 253332 11896 -472043 -706126 -563533 -272968 -3074 217278
44730 217278 287818 79203 -317987 -620927 -648422 -443286 -142689 120075 224860 133116
44720 133116 -51828 -178845 -170121 -9102 275619 538804 581267 404751 259273 300616
44710 300616 354100 178371 -189367 -525984 -697742 -649764 -309598 234547 614898 551108
44700 551108 237170 63241 51975 -82361 -376193 -521632 -375249 -186774 -190630 -274824
44690 -274824 -223085 -53168 61428 51504 -4060 11690 172950 431385 588482 480256
44680 480256 200001 -11468 -81598 -122417 -152018 -49379 177109 325882 282248 144193
44670 144193 5168 -162044 -340332 -434587 -485892 -654933 -877520 -812889 -304538 350301
44660 350301 774636 927785 953710 848919 540753 131250 -196143 -405041 -530152 -499963
44650 -499963 -269594 -33091 -57340 -336937 -599742 -622610 -399539 -62685 217383 318212
44640 318212 283735 288079 389754 443232 347538 201190 80254 -105141 -330716 -288910 195259
44629 195259 783047 1016858 947106 973381 1170310 1214237 947208 555544 159268 -294999
44619 -294999 -631218 -456615 166886 525666 117476 -610043 -810040 -317098 262517 432580
44609 432580 316545 241307 224686 89713 -143663 -232875 -40573 259917 350663 111959
44599 111959 -235489 -371433 -248179 -128141 -212898 -361581 -299554 -21431 179780 75096
44589 75096 -246948 -506034 -498816 -223069 155831 414041 427793 284311 190080 229248 261799
44578 261799 115969 -150007 -258073 -19982 398316 594436 348027 -126547 -412650 -339505
44568 -339505 -89439 129173 338700 627669 887501 905781 665025 361082 131299 -61327
44558 -61327 -261320 -425305 -540581 -645729 -650613 -353457 197689 559439 368990 -143682
44548 -143682 -404817 -211480 112060 282841 416619 665083 837885 688184 364576 230882
44538 230882 327241 349437 153747 -42869 -28897 128117 290758 479156 726729 914463
44528 914463 933925 854586 746813 496925 21276 -463610 -651880 -566495 -494321 -521527
44518 -521527 -428032 -103140 221278 294333 166381 3499 -209966 -537960 -818840 -840740
44508 -840740 -733097 -835641 -1122654 -1110769 -530404 206960 512730 390903 328739 517579
44498 517579 636927 486439 373092 601264 923740 881637 493371 198322 195805 245494
44488 245494 148700 50415 140634 350445 497735 512352 388437 130955 -111024 -73330
44478 -73330 280764 610691 566298 181287 -234682 -450737 -423043 -213939 13336 39805
44468 39805 -193169 -492532 -648758 -642595 -535682 -356323 -221206 -321960 -589574 -626391
44458 -626391 -238222 211436 303562 179438 239387 420145 291498 -191084 -573038 -602803
44448 -602803 -543383 -631944 -684552 -471705 -121703 104004 152550 77451 -127786 -364501
44438 -364501 -360172 -25481 328004 370817 169605 -6131 -85266 -139211 -108602 104000 371830
44427 371830 459736 345039 186275 42134 -133510 -271577 -226031 -34193 90662 58025
44417 58025 1346 40216 104707 57964 -116265 -297943 -338896 -180637 75326 227162 160927
44406 160927 -35723 -179592 -163953 2858 249923 485864 662935 827994 1015259 1090935
44396 1090935 876239 459747 167813 129911 106760 -105638 -348801 -391612 -318039 -344429
44386 -344429 -422591 -339402 -102973 83488 167253 261217 347284 262621 -3721 -248991 -307459
44375 -307459 -166838 118562 406503 437005 109562 -263934 -295769 -67773 15390 -108096
44365 -108096 -75519 246288 495371 406379 245722 353499 590937 613670 460816 469523
44355 469523 707412 858704 682114 309155 39541 18603 154678 242738 159581 -1416
44345 -1416 -31730 112893 239289 198755 112637 197750 475597 774821 916886 788753 367559
44334 367559 -176538 -521239 -495906 -247461 16069 276829 527094 555729 223049 -190756
44324 -190756 -280485 -104825 -81890 -269120 -196210 385131 975576 914111 279222 -197237
44314 -197237 -83983 241226 147744 -445886 -1036220 -1175282 -901134 -513992 -160382 177070
44304 177070 395031 256896 -258048 -806098 -1042868 -1001088 -929869 -885532 -736896 -519517
44294 -519517 -469608 -632685 -719190 -511940 -202601 -113322 -233448 -273173 -102810 104209
44284 104209 162444 90170 -16798 -149421 -332462 -520738 -631662 -613029 -440460 -138113
44274 -138113 159986 284187 236505 219299 370679 574602 638793 549242 402156 194808
44264 194808 -100002 -318053 -244759 -8141 -46567 -549420 -1160646 -1413387 -1258082 -954371
44254 -954371 -647311 -351229 -204155 -348938 -583835 -528585 -220891 -165221 -603794 -1079985
44244 -1079985 -1008606 -425280 159758 465027 609769 677043 539191 194786 -80251 -94273
44234 -94273 -11906 -86356 -296556 -423358 -351836 -135447 124690 298907 230342 -92411
44224 -92411 -419274 -475415 -290115 -136103 -176721 -341345 -510790 -607423 -502459 -104540
44214 -104540 362656 429079 -85649 -787579 -1164983 -1168148 -1088140 -1009431 -743589 -291274
44204 -291274 11299 -54040 -270945 -310029 -156881 -26261 -20313 -83233 -172207 -264667 -285092
44193 -285092 -216952 -200134 -316186 -360779 -64822 493813 920445 933828 585718 114418
44183 114418 -192303 -68315 471690 947116 842697 296843 -4282 250726 578276 442077
44173 442077 26317 -126914 28060 48218 -242046 -506761 -468566 -295065 -257814 -337179
44163 -337179 -369341 -336963 -294020 -191228 -12630 48522 -188927 -550092 -635694 -327790
44153 -327790 48635 153041 48433 66535 374552 833190 1212783 1362710 1183280 657220
44143 657220 5824 -370985 -283571 14227 137599 30685 -62640 -5659 95576 153951
44133 153951 241500 393622 483903 404678 225327 89879 85913 242772 479611 539017 236155
44122 236155 -150986 -59350 609189 1216945 1135159 510989 -11715 -112322 27177 178325
44112 178325 264560 181660 -129506 -402650 -248182 270756 618705 460258 31718 -278553
44102 -278553 -383860 -351063 -122736 324992 745442 829850 565194 181860 -161961 -444695
44092 -444695 -602116 -502065 -124872 359398 735111 914490 961138 964153 902512 684814
44082 684814 355414 148738 208355 353492 320414 147779 54062 -10156 -321313 -839806
44072 -839806 -1101596 -838556 -368551 -109505 8121 318627 815328 1131810 1050100 725522
44062 725522 436588 351685 507723 794811 978322 916849 726594 592537 524274 473331
44052 473331 532384 747841 869777 635348 233386 104850 287383 374817 197159 83783
44042 83783 251890 378838 138444 -184442 -87182 338840 515037 265724 77561 329264
44032 329264 728246 806972 625320 576304 702914 669365 363890 77755 1461 -42213
44022 -42213 -183452 -214567 -14276 57420 -397876 -1162169 -1624146 -1573030 -1338446 -1168734
44012 -1168734 -945187 -597073 -332006 -256479 -167114 36013 85397 -216977 -608371 -726477
44002 -726477 -598892 -458847 -340746 -216389 -270924 -606809 -875864 -688615 -250832 -82533
43992 -82533 -201313 -164205 86730 75755 -340670 -591824 -235144 316917 371213 -87008
43982 -87008 -493153 -545485 -456638 -448785 -463680 -424713 -407010 -411910 -249762 171755 609918
43971 609918 725698 503524 284441 357229 604568 635178 262149 -242367 -443843 -235243
43961 -235243 86036 194418 26034 -318385 -754718 -1183371 -1432363 -1411103 -1261474 -1203543
43951 -1203543 -1250528 -1208431 -965716 -660592 -506685 -536763 -605648 -610382 -590739 -574691 -449582
43940 -449582 -127394 224935 318876 126225 -72818 -76969 23686 105963 203859 276465 100845
43929 100845 -331898 -627331 -567549 -567560 -1034771 -1534876 -1289447 -401798 210157 189068 191939
43918 191939 659398 981281 486606 -404829 -784376 -571104 -429262 -628744 -793347 -702325
43908 -702325 -580663 -526169 -323812 7518 68109 -293159 -676672 -698124 -459351 -230816
43898 -230816 -42405 147742 202441 23748 -207401 -283690 -292215 -439011 -686505 -797133
43888 -797133 -667994 -444258 -332998 -412048 -584494 -656080 -494707 -135664 295288 689806
43878 689806 905493 756912 269668 -180166 -271353 -199245 -386155 -780512 -876314 -486041
43868 -486041 -43637 21165 -203601 -431016 -606529 -750391 -737094 -559360 -503387 -720759
43858 -720759 -908739 -774034 -530542 -517207 -582112 -355832 40303 137249 -77705 -92383
43848 -92383 292184 599842 398426 -44820 -150655 200380 600636 669998 410601 79898
43838 79898 -77561 18792 268245 502197 645383 731057 764479 675592 443161 171945
43828 171945 -5145 -44364 5561 56459 41411 -11540 8313 135628 241735 214106 148491
43817 148491 205733 338687 355889 223913 95071 51938 63440 196403 570015 1000603
43807 1000603 986540 267673 -761303 -1391640 -1269220 -617549 60002 351618 146302
43798 146302 -321316 -655999 -646115 -405178 -147509 51209 200775 265987 227733 154514
43788 154514 78379 -79552 -317014 -423170 -236470 80432 243924 249635 326404 525811
43778 525811 622317 467587 220629 134855 274212 519399 722555 780454 665508 455681
43768 455681 258425 85622 -92833 -177839 1058 401969 727262 774569 670078 605703
43758 605703 498888 142151 -380419 -687167 -552545 -161801 170756 353603 450163 423440
43748 423440 191522 -106030 -171962 23211 108181 -200791 -637721 -692885 -324491 -31475
43738 -31475 -138615 -347300 -226993 119508 241968 55859 -53901 127150 297833 111554
43728 111554 -305428 -546336 -445165 -173436 44859 81800 -125964 -503442 -768972 -666953
43718 -666953 -272170 114046 344971 511477 677121 778468 816430 897057 1012298 1025124
43708 1025124 966336 1068108 1329488 1333502 798846 118842 -35333 399071 763886 525518
43698 525518 -92093 -482228 -413601 -182017 -138613 -312910 -501719 -556099 -509012 -487705
43688 -487705 -564650 -701219 -809373 -819474 -680359 -384991 -67440 33385 -140725 -291514
43678 -291514 -80472 403886 730514 690536 501668 381601 249109 39828 -4834 299801
43668 299801 640976 526973 -33537 -543890 -696626 -671872 -709133 -749014 -662846 -553654
43658 -553654 -609395 -818045 -998498 -1001362 -774272 -371795 -13700 14274 -341295 -798970
43648 -798970 -1033866 -966654 -702852 -352775 -19008 207428 379125 666009 1048122 1200864
43638 1200864 884501 316541 -62977 -104338 -8216 52651 130281 325860 616779 885021
43628 885021 991369 843670 517968 264032 246826 333353 286153 102609 -19602 -3183
43618 -3183 26418 -35595 -153980 -256414 -297325 -239042 -121225 -100453 -250728 -391326 -308087
43607 -308087 -64422 131230 254607 365608 296831 -144210 -690666 -810804 -477076 -268678
43597 -268678 -528552 -881335 -859705 -571766 -376687 -274190 -73016 113273 47813 -114195
43587 -114195 -2610 327830 412817 70701 -336785 -428299 -241046 -33114 56105 10149
43577 10149 -175745 -472126 -803486 -1096779 -1231425 -1018455 -448405 112155 266009 104566
43567 104566 65363 276393 420314 315495 209984 309283 392904 183904 -186597 -386905
43557 -386905 -341382 -192432 -687 208184 255873 12723 -291816 -277151 97281 516844
43547 516844 751671 838553 851146 793194 747197 825186 893017 641570 74884 -342895 -235601
43536 -235601 203853 526683 643058 785991 929440 663451 -174825 -1052700 -1257534 -770326
43526 -770326 -306075 -440269 -973125 -1296327 -1145123 -744456 -371104 -92054 89013 133678
43516 133678 90951 81100 78364 -68574 -320114 -402956 -212173 4162 42585 59129 229546
43505 229546 343549 94540 -386934 -686930 -716348 -749534 -862543 -783237 -420667 -124837
43495 -124837 -178636 -351628 -261155 35567 134901 -119681 -424324 -404404 -29333 393120
43485 393120 532441 336637 72271 40225 233515 350055 153754 -295688 -779037 -1100771
43475 -1100771 -1099626 -729344 -262243 -156679 -501430 -810931 -643928 -224178 -98595 -338165
43465 -338165 -530573 -529625 -697185 -1239466 -1744369 -1684669 -1102009 -479397 -125165 4118
43455 4118 -2486 -151744 -386814 -557474 -602698 -582162 -500863 -277862 69641 370788 491495
43444 491495 460663 366981 262974 224604 354329 608617 730297 505625 56936 -252794
43434 -252794 -222922 -28880 -1016 -256554 -594645 -713151 -477528 542 477216 739935
43424 739935 715250 494839 267561 169836 163936 83629 -179838 -559424 -887173 -1038702
43414 -1038702 -972736 -688188 -227040 280864 641503 703546 454336 42781 -284275 -341225
43404 -341225 -171871 -23531 -81213 -254459 -301555 -135756 79328 120155 -93702 -450043
43394 -450043 -693183 -575503 -123081 269505 210207 -194830 -429887 -220668 143383 266308
43384 266308 162994 85691 61956 -50124 -168756 -50793 239303 299716 -49690 -484321
43374 -484321 -610111 -422639 -153512 84910 248042 157863 -312286 -919730 -1219867 -1064134
43364 -1064134 -700267 -373718 -83578 205003 362191 269561 34720 -145791 -246845 -368345
43354 -368345 -474463 -365759 34076 488949 663261 503343 309611 384340 670641 833193
43344 833193 682135 392151 244833 268598 254233 65726 -196237 -317570 -147759 305283
43334 305283 820331 1044132 814310 401550 225213 308148 275971 -16462 -186183 100869
43324 100869 527086 491224 -42444 -497742 -507774 -352849 -422580 -619524 -587883 -294286
43314 -294286 -54470 -88897 -325753 -590705 -759599 -756585 -603989 -447115 -363798 -228306
43304 -228306 39221 215863 74211 -151352 -7413 444230 594120 155483 -375722 -433740
43294 -433740 -175990 -145224 -413227 -560954 -383046 -102080 113422 357803 619835 651343
43284 651343 396246 189794 293709 516942 545325 408655 346568 388070 355019 198212
43274 198212 90236 219941 645036 1261921 1774102 1814211 1294785 556838 2663 -308419
43264 -308419 -518317 -591690 -385698 -24496 143842 18138 -109879 24161 320048 508189
43254 508189 491644 364769 230121 114874 -25436 -291537 -724700 -1159196 -1328806 -1187479
43244 -1187479 -975585 -884602 -828076 -677956 -549452 -627553 -816591 -833296 -646610 -565115
43234 -565115 -797587 -1140879 -1262356 -1138661 -1002008 -927832 -732737 -326026 68575 184029
43224 184029 46446 -132613 -284230 -484874 -689989 -721406 -558426 -416613 -449736 -558972
43214 -558972 -595531 -574831 -570682 -565681 -548642 -605372 -751698 -819785 -693567 -531012 -545264
43203 -545264 -659856 -603030 -296426 53994 238326 247725 207201 224438 283355 226571 -54615
43192 -54615 -355061 -282079 216477 685721 735822 536357 465183 524989 487113 395993 472118
43181 472118 661578 771817 944146 1445290 2039002 2163028 1772875 1402820 1283681 1040992
43171 1040992 476945 7928 -8633 188392 283112 414062 756859 1061460 1090198 1093337
43161 1093337 1344393 1594808 1527382 1380782 1523525 1721827 1484980 908487 505183 364594
43151 364594 165945 -81479 -35239 253268 331458 154873 205334 617016 848851 523771
43141 523771 20636 -133043 15393 120487 144327 241884 308145 100807 -278482 -405410
43131 -405410 -79747 373604 451410 68545 -276837 -52260 586712 875202 413048 -243551
43121 -243551 -319441 129341 427768 351116 304062 457696 464519 212225 124057 357964 375374
43110 375374 -199372 -849905 -894383 -519749 -436323 -772671 -991866 -805485 -537278 -525356
43100 -525356 -679974 -773354 -785483 -801135 -826556 -850122 -920224 -1068100 -1240867 -1330355 -1222451
43089 -1222451 -894015 -525575 -379083 -459653 -466821 -217079 78956 134327 -27024 -215030
43079 -215030 -388573 -548436 -505225 -94020 480513 828920 845222 716167 543326 259284
43069 259284 -114540 -413840 -543347 -531421 -417732 -298476 -392712 -789076 -1180921 -1143553
43059 -1143553 -669648 -180841 -25359 -199347 -514460 -760935 -731778 -387665 -16160 50684
43049 50684 -103507 -80326 248153 554899 526582 232247 -71812 -236309 -192773 114459
43039 114459 583407 899187 796497 317064 -257172 -643460 -721153 -591380 -500560 -584018
43029 -584018 -695016 -626966 -450149 -405877 -486653 -398682 -5959 440302 620332 484746
43019 484746 180380 -145718 -349916 -317720 -150845 -147251 -410692 -640794 -540163 -319671
43009 -319671 -511671 -1255753 -2015254 -2139144 -1567745 -816378 -333413 -103133 65132 113534
42999 113534 -146876 -611649 -890521 -769135 -406164 -30724 279355 462779 458274 444244
42989 444244 718617 1149610 1172253 633662 187428 384423 779565 561273 -219194 -765346
42979 -765346 -738585 -577073 -598018 -553655 -271008 -41705 -69405 -98897 81475 277427
42969 277427 360213 601002 1131545 1510992 1301755 751899 437656 468458 489211 288900
42959 288900 -12645 -254955 -336187 -130018 338025 705944 607008 160390 -155961 -108515
42949 -108515 70460 69988 -118275 -264421 -211971 -62627 -67580 -323344 -624750 -727164 -677983
42938 -677983 -674807 -659334 -378697 131860 502879 567638 567884 670266 664767 371312 -1167
42927 -1167 -157955 -84208 106566 361314 513395 303527 -165568 -401244 -241432 -146912
42917 -146912 -404007 -549941 -136852 386594 257046 -428805 -860794 -704271 -430446 -470242
42907 -470242 -696434 -846670 -911439 -948992 -924860 -847945 -760975 -598970 -356676 -284376 -539073
42896 -539073 -793372 -664420 -394281 -544550 -1091933 -1438577 -1319423 -1069073 -925830 -727695
42886 -727695 -460062 -464656 -836909 -1165733 -1159497 -1029431 -954886 -668608 38930 801926
42876 801926 1080636 820065 383844 62054 -83190 -102167 -134179 -318586 -560143 -580763
42866 -580763 -313200 -686 161739 173167 -34569 -583352 -1239951 -1464951 -1090090 -562987
42856 -562987 -321898 -334311 -446195 -699125 -1007016 -997883 -557501 -120741 -37797 -49141
42846 -49141 197249 502689 472146 182082 -4836 -29602 -66002 -99672 -42723 -44933 -239023
42835 -239023 -406030 -346422 -320807 -614615 -933240 -824129 -485942 -499294 -882575 -1104445
42825 -1104445 -991836 -922845 -1067786 -1135478 -1017427 -1012422 -1177146 -1090179 -597298 -222821
42815 -222821 -405091 -780581 -732341 -332777 -205748 -601892 -1109645 -1286796 -1175148 -1077136
42805 -1077136 -1100608 -1105155 -981503 -819515 -786508 -928558 -1155965 -1374751 -1516542 -1458308
42795 -1458308 -1112223 -670961 -534311 -808418 -1075028 -905548 -440914 -162427 -215209 -318481
42785 -318481 -290840 -263589 -309025 -219827 170265 678398 952436 837580 476843 138641
42775 138641 -23598 -106453 -311390 -609773 -710121 -495509 -273102 -338434 -509584 -440978
42765 -440978 -216095 -200917 -426426 -583802 -573262 -568934 -558358 -343658 -43211 -46960 -364080
42754 -364080 -556370 -464988 -428589 -565213 -457781 82960 515247 323420 -160808 -234464
42744 -234464 194863 629528 748102 641413 452071 265509 255315 496331 704484 554839
42734 554839 187805 30246 187635 375946 381521 221495 -76995 -461625 -660631 -410976
42724 -410976 105199 422071 406796 352896 440538 502492 408362 290865 241347 121234 -140185
42713 -140185 -346767 -328268 -192979 -97483 23335 288377 594022 715576 595800 377444
42703 377444 217533 181164 249261 338911 366918 332836 268896 119595 -182871 -513446 -623376
42692 -623376 -491696 -416848 -628160 -958401 -1058913 -836029 -513859 -317042 -232844 -88200
42682 -88200 216191 558493 676231 435983 10226 -295727 -368303 -308297 -160308 157321
42672 157321 593380 879640 867014 750709 752507 740360 435338 -89459 -424566 -360981
42662 -360981 -140359 -82445 -194010 -284148 -275762 -211465 -74270 174228 411175 413649 140830
42651 140830 -193282 -378142 -409198 -375247 -285764 -130613 -7873 -22895 -88059 7070 285606
42640 285606 481851 341396 -55184 -367347 -363420 -126698 109198 243607 359550 521218
42630 521218 631383 573503 437580 456999 695517 950676 1046163 1048174 1036249 834241 247613
42619 247613 -511558 -970446 -1002025 -966842 -1140504 -1313736 -1167591 -784716 -502673 -419915
42609 -419915 -344438 -156109 55182 191400 244096 179477 -54977 -356663 -476009 -284850
42599 -284850 54509 238398 93534 -287886 -620907 -659661 -418740 -134976 15484 68128
42589 68128 101622 84262 4465 -11260 118977 273236 329088 364888 438645 358357 -6341
42578 -6341 -342926 -248761 100673 121942 -277330 -476972 -42845 598958 746225 369015
42568 369015 48219 119904 312444 254090 -7120 -141609 -16171 138766 32527 -294922
42558 -294922 -466797 -206467 289250 556020 420214 156542 43291 -18110 -290817 -762440
42548 -762440 -1103531 -1021465 -549439 -23331 178181 -53727 -461010 -706426 -739152 -732127
42538 -732127 -709360 -519327 -224541 -172211 -493231 -832896 -832988 -621230 -524913 -540830 -465049
42527 -465049 -371163 -520378 -861998 -1050393 -962522 -791924 -593941 -186041 353483 524190
42517 524190 36838 -687639 -982736 -727289 -370558 -282427 -392140 -460155 -424924 -375518
42507 -375518 -343352 -256443 -67613 147321 246018 172897 33361 -15700 66310 183776 223716
42496 223716 138892 -42349 -202553 -184725 18767 177183 94007 -63921 55735 451607
42486 451607 674505 400026 -143575 -511772 -606658 -649096 -723626 -658725 -353300 34257
42476 34257 283154 321382 195064 -11126 -159041 -102441 157633 436471 549262 482651
42466 482651 352372 247629 156250 18846 -153529 -218787 -30436 324322 520896 373328
42456 373328 143081 273347 814895 1319305 1359763 976813 526076 264151 214682 294352
42446 294352 401236 457959 503633 670982 956762 1119005 959767 619449 396866 336146
42436 336146 217094 -48774 -250138 -178016 87385 293229 288433 95873 -173903 -390271
42426 -390271 -470918 -454281 -430335 -372777 -166371 154268 361709 336268 247766 283448 337713
42415 337713 184971 -122302 -274426 -136079 47103 -55065 -478672 -940470 -1110068 -888175
42405 -888175 -499311 -318682 -519655 -880554 -1013620 -772946 -349915 1717 198454 276719
42395 276719 254298 117193 -111928 -326053 -345290 -48484 425767 707369 579534 265748
42385 265748 151414 292672 436895 462115 464132 398353 36901 -568985 -959342 -848359
42375 -848359 -531388 -427430 -501584 -484123 -395255 -405930 -358060 55018 676705 979592
42365 979592 829802 649765 664158 497480 -155344 -864779 -919903 -247101 527706 845695
42355 845695 695274 359482 24547 -261417 -446885 -430551 -133354 371034 783868 769144
42345 769144 321449 -173910 -375112 -336701 -271959 -155693 154593 528728 644963 438087
42335 438087 137830 -142890 -497068 -842960 -858565 -478147 -99321 -46768 -139260 -80369
42325 -80369 22953 -77846 -230398 -87384 247894 293941 -60927 -369328 -316681 -155542
42315 -155542 -221040 -398547 -388406 -218993 -152959 -264793 -426463 -570344 -662656 -540385
42305 -540385 -98735 434824 720562 733608 663262 479330 7692 -568524 -748141 -392306
42295 -392306 40537 149054 112418 281435 565306 598360 332228 92364 120638 360814
42285 360814 646622 837577 805615 528340 172803 -105029 -367527 -693499 -901542 -782579
42275 -782579 -511815 -442717 -506640 -250869 429575 1029043 1110828 878980 785792 876128
42265 876128 880408 749218 692910 765824 773551 609360 402336 296179 305105 410248 587015
42254 587015 716069 677136 558068 556872 643593 565670 274702 94632 297750 707739
42244 707739 925148 810144 534432 265735 51563 -26144 135985 410783 425435 -20706
42234 -20706 -622635 -842828 -522620 -68138 46120 -162316 -277788 -97697 89641 -34135
42224 -34135 -284627 -194771 285753 657030 543764 189092 39014 82690 -42557 -403148
42214 -403148 -615927 -381205 148637 624516 858875 831668 611467 417387 501726 777123
42204 777123 795010 327238 -252744 -458597 -361189 -392001 -596335 -544584 -38372 524600
42194 524600 681193 481825 300730 288959 279390 125899 -93457 -192904 -68894 203429
42184 203429 400619 342334 96022 -102463 -150263 -138933 -75191 218138 762788 1196862
42174 1196862 1136999 668586 242929 134374 208993 219826 141279 161651 434867 857100
42164 857100 1079599 838580 307801 -44155 -30605 46411 -77248 -180900 49708 427850
42154 427850 516471 360264 441470 854330 1050887 639152 10345 -169324 178544 537208
42144 537208 493032 119652 -267712 -465098 -474724 -428431 -442146 -462467 -300480 103819 533122
42133 533122 715433 626389 466412 400122 419654 423027 355129 303430 453084 838290 1153038
42122 1153038 1023386 532041 216208 383646 680764 596571 194718 -1563 232547 544428
42112 544428 520053 173082 -191884 -372292 -372223 -261771 -97333 55084 116596 32852 -189210
42101 -189210 -467158 -684283 -766614 -689849 -423106 24209 474888 666844 561987 418501
42091 418501 431424 473083 355569 154157 28158 -91977 -315210 -437523 -185532 252785
42081 252785 394949 195692 142484 482755 815740 707828 321566 105070 161817 278061
42071 278061 329703 303398 125293 -152590 -184472 224182 644771 480280 -162578 -564082
42061 -564082 -393154 -95288 -125268 -304137 -244992 -4076 105191 89518 241182 638932
42051 638932 1038468 1213814 1130992 841101 469633 259502 345446 505398 402854 69361
42041 69361 -125540 840 229789 302151 222421 118728 53515 79189 245197 433580
42031 433580 419141 218336 133569 291903 389560 111225 -405672 -760635 -771291 -540397
42021 -540397 -219815 44186 96914 -24434 -27598 227183 432037 261991 -85076 -178721
42011 -178721 -32985 -8309 -112470 48056 564421 1010857 1075287 899750 611613 54450
42001 54450 -710617 -1143064 -902443 -415560 -297752 -491112 -462141 -56332 337739 377468
41991 377468 77073 -414092 -933719 -1223584 -1104343 -767173 -589230 -643727 -660318 -460910
41981 -460910 -172671 -20095 -131364 -490797 -859148 -868629 -474385 -143354 -244715 -458917
41971 -458917 -275737 105602 36019 -458558 -587254 -36942 444769 136904 -604745 -945070
41961 -945070 -740320 -463452 -288728 21883 435945 567849 364654 267200 477014 569625
41951 569625 161244 -416259 -520364 -86505 306594 236257 -77242 -208956 -150581 -214782
41941 -214782 -465290 -605731 -494331 -429995 -693441 -1040549 -992143 -528217 -126190 -87270
41931 -87270 -168935 934 430338 834953 976374 778869 306839 -226953 -599796 -834648
41921 -834648 -1124708 -1418370 -1358693 -807209 -148178 174000 184879 180463 227230 196548 135455
41910 135455 233678 479649 656763 643835 467709 146144 -239213 -418754 -229338 33590
41900 33590 -58039 -405482 -470399 -73499 343557 411432 345398 480385 672842 579650 305587
41889 305587 308691 709050 1103151 1132497 898325 675009 496483 251150 2996 -56945
41879 -56945 71418 164837 80969 -95656 -243590 -341613 -347694 -156655 184913 419075 411311
41868 411311 352707 409306 401496 177658 99449 644453 1581484 2114643 1944320 1608858
41858 1608858 1564606 1534925 1156002 699669 583879 595758 282211 -161518 -136721 327793
41848 327793 536305 188093 -207371 -175674 69618 128190 71307 207900 526682 753239
41838 753239 764708 644665 474035 317195 296234 464198 681882 767347 693384 557234
41828 557234 472584 550382 825832 1127470 1182997 938293 622453 445504 404553 422891
41818 422891 461392 432513 237395 -32469 -164714 -173423 -316577 -666411 -937066 -873432
41808 -873432 -546144 -125025 343980 755055 843117 530701 150158 74372 308844 635392
41798 635392 914466 1019991 749165 114727 -467293 -592305 -326631 -5836 224510 383472
41788 383472 401160 263347 237193 540291 885367 770352 183341 -375850 -571688 -542922
41778 -542922 -505649 -438214 -274967 -80887 125971 468988 960247 1336978 1311564 888656
41768 888656 341933 -58252 -263797 -450621 -770193 -1053079 -903850 -234283 473780 691443
41758 691443 499140 413363 648851 923848 989036 941249 897584 730248 356416 36635
41748 36635 104661 498346 782636 648548 268376 92026 296772 527136 333658 -152859
41738 -152859 -282613 230045 814927 762857 164951 -313201 -414001 -487963 -742880 -885235
41728 -885235 -669759 -324266 -200306 -363718 -708146 -1108476 -1283808 -901877 -67158 631969
41718 631969 805141 672555 583277 504454 291336 96804 116946 201460 113263 -39367
41708 -39367 -5396 173315 304434 437662 725956 1057717 1225251 1310730 1484050 1550228
41698 1550228 1170106 468403 -51518 -185837 -157911 -64464 280747 827729 1121242 905732
41688 905732 520399 420493 601352 758557 761437 680268 526436 253453 -63794 -257392
41678 -257392 -231880 -1720 337678 610100 696134 758252 1110154 1707439 1999731 1549002
41668 1549002 652323 64836 155136 586511 820409 685052 389751 193394 200423 382816
41658 382816 656858 915859 1039770 930306 591947 186918 -56575 -43428 114098 253030
41648 253030 335274 412921 474293 418741 191043 -117556 -328697 -326574 -146526 78913 250255
41637 250255 349914 367763 264138 70120 -58704 -4168 154484 272956 368173 521704
41627 521704 600965 348582 -193296 -626081 -705589 -661127 -801196 -1024533 -1004100 -703433
41617 -703433 -385516 -180732 17189 224334 278009 169954 172573 466870 852035 989026
41607 989026 779539 378086 130 -145316 70626 493586 725834 597639 446881 659976
41597 659976 1074926 1192405 905089 591118 446304 199735 -300045 -657393 -465040 34044
41587 34044 268389 150169 87428 243565 299263 63425 -142878 24887 384709 480419
41577 480419 209256 -74293 6992 499877 1101029 1340799 932007 122555 -435143 -370700
41567 -370700 -23335 28502 -298135 -623820 -738558 -792628 -857445 -725968 -310411 99653
41557 99653 210206 116318 75268 63747 -150049 -560936 -832207 -703749 -320858 -63707
41547 -63707 -131648 -379890 -538644 -499236 -327835 -72930 267362 549408 483419 32300
41537 32300 -351624 -202029 295053 455309 -24790 -680234 -910963 -687213 -398183 -269019
41527 -269019 -238653 -250242 -329620 -425744 -442699 -416407 -447825 -491728 -422403 -283439 -256223
41516 -256223 -383770 -529859 -613291 -672034 -679053 -525021 -255448 -118675 -260220 -515582
41506 -515582 -624631 -546726 -452688 -472000 -542541 -487352 -203412 195148 427600 311985
41496 311985 -18844 -251363 -244960 -148784 -145618 -202203 -158470 3780 93333 -53071 -303223
41485 -303223 -286944 192353 840089 1114887 819686 279835 -120977 -338161 -454668 -372451
41475 -372451 -39847 232247 121784 -125801 49586 657399 1023518 674970 -67663 -598460
41465 -598460 -740705 -673886 -483255 -139967 271165 611518 837291 892496 686134 391327
41455 391327 445003 910744 1157369 637161 -251877 -629276 -330716 -53069 -302766 -789943
41445 -789943 -1003124 -861104 -574670 -294535 -137781 -202757 -344275 -283954 -126686 -343447
41435 -343447 -983951 -1372068 -985308 -236073 112463 -26358 -197504 -312864 -723354 -1430340
41425 -1430340 -1924125 -1953006 -1855108 -1897581 -1834418 -1451500 -1071221 -1071307 -1251544 -1172404 -891230
41414 -891230 -834855 -1049733 -1127417 -920732 -820220 -1119919 -1517021 -1541899 -1216150 -952304
41404 -952304 -945341 -992135 -889296 -726990 -702892 -806808 -795939 -449236 173747 726290
41394 726290 894888 757140 692918 860940 957004 690081 306395 292942 640332 821116
41384 821116 557865 187288 91178 174290 179996 143712 149595 -39289 -609293 -1162775 -1118144
41373 -1118144 -572256 -205825 -312500 -490827 -405862 -258968 -256201 -181614 108174 242089
41363 242089 -117732 -635334 -747073 -517111 -487371 -783215 -923681 -556572 79781 530371
41353 530371 603725 378662 20473 -306910 -533462 -704110 -767784 -499160 97901 513556
41343 513556 300215 -211912 -304266 74088 268337 7254 -176571 115284 475185 412978
41333 412978 165359 186968 288664 -13837 -572386 -768714 -501646 -300819 -417939 -475386
41323 -475386 -201719 63876 -94301 -548818 -862007 -846712 -611435 -269650 126533 495424
41313 495424 760965 881895 763832 329792 -221132 -467245 -261110 22167 -58228 -456746
41303 -456746 -756423 -708074 -426924 -128706 99542 262146 353462 339798 196119 -18682
41293 -18682 -132682 -34165 106886 -6442 -336410 -453785 -126836 279586 279554 -59559 -291984
41282 -291984 -317415 -460734 -792897 -857139 -314318 480469 863234 631002 136556 -252935
41272 -252935 -482591 -633856 -716099 -706777 -610718 -404049 -59802 298894 398396 81123
41262 81123 -475178 -888893 -924505 -689770 -505508 -587677 -827551 -885898 -547039 16275
41252 16275 371941 222232 -364836 -1071969 -1572331 -1663584 -1332904 -799829 -397469 -273274
41242 -273274 -239861 -32575 319695 516322 376372 56326 -181790 -284623 -372314 -473041
41232 -473041 -452481 -220890 112851 357451 439220 417732 354808 264832 179679 144856 117235
41221 117235 -7527 -180552 -149914 201825 572683 555691 221922 78514 362889 713438
41211 713438 729915 516045 346434 115455 -398612 -922692 -940174 -530471 -348429 -650072
41201 -650072 -938611 -814135 -579758 -623125 -740176 -592321 -387914 -485741 -652414 -418595
41191 -418595 16030 -21253 -609422 -1082478 -1029584 -773075 -688152 -700323 -710145 -889265 -1198961
41180 -1198961 -1180049 -657905 -165809 -174497 -330959 -30896 592830 889713 688862 419422
41170 419422 307574 104127 -297901 -544389 -347037 66264 267724 138088 -127348 -327387
41160 -327387 -415369 -468487 -571354 -645267 -432729 186887 921649 1324526 1298248 1116345
41150 1116345 969216 754225 338791 -216980 -752701 -1131074 -1263956 -1206172 -1178326 -1265159
41140 -1265159 -1176620 -634568 60465 264827 -161062 -658353 -729732 -474403 -199126 65785
41130 65785 375457 560625 471371 295031 296660 406423 350220 56169 -304725 -546530
41120 -546530 -549017 -296002 -24068 -106208 -565826 -958587 -992572 -969812 -1263087 -1641708
41110 -1641708 -1581582 -1061449 -564678 -399678 -495066 -773644 -1189458 -1404722 -1008278 -184810
41100 -184810 338393 193401 -221918 -414022 -401103 -397741 -352457 -175415 -79290 -275280
41090 -275280 -561321 -606562 -472370 -467250 -610137 -629494 -445931 -286297 -290320 -310691 -172379
41079 -172379 105604 416178 700108 905906 959944 837932 575587 210918 -173455 -382062
41069 -382062 -251767 101677 329483 216862 -81206 -234063 -112280 89702 103225 -83191
41059 -83191 -204082 -63007 192508 279639 202559 235648 464123 620007 498922 267150
41049 267150 151534 76812 -115792 -311691 -329910 -321633 -558834 -907809 -945523 -609077
41039 -609077 -303593 -279702 -310874 -144798 93220 156462 24098 -225679 -592833 -958182
41029 -958182 -1004980 -664808 -404395 -675008 -1214598 -1317795 -778481 -165557 -70558 -407467
41019 -407467 -632150 -438311 -29915 205355 124048 -79566 -134628 -9652 64876 -99618
41009 -99618 -401027 -575887 -505510 -277626 62 280697 465916 396914 74503 -205338
40999 -205338 -90839 420494 912696 977401 676764 459555 597420 877322 970633 913109
40989 913109 962872 1118704 1146358 1051094 1094129 1261507 1187559 809428 612378 882358
40979 882358 1179395 1039692 788098 1006455 1489260 1515932 1059625 869769 1233373 1497608
40969 1497608 1157491 658701 602789 772284 594642 142214 -36959 158952 321689 292199
40959 292199 335168 526754 555935 279026 -13886 -82847 -82422 -179952 -159099 287651 1051590
40948 1051590 1669994 1826111 1592040 1214450 839069 497091 263235 293058 614562 930313
40938 930313 816786 223131 -381971 -527810 -293465 -149092 -338672 -659010 -814063 -732250
40928 -732250 -501557 -223902 -23043 -25033 -220634 -434558 -492414 -367096 -163956 -31421
40918 -31421 -62623 -213087 -352379 -436575 -521657 -561528 -402789 -105532 5017 -152079
40908 -152079 -153259 289651 690935 345905 -590477 -1203984 -1045438 -635140 -576295 -775236
40898 -775236 -856397 -807433 -769648 -603494 -168248 231611 168488 -281177 -634088 -618915
40888 -618915 -362028 -75893 103937 68240 -163556 -356893 -328740 -195451 -133360 -80523
40878 -80523 39710 14817 -361658 -856297 -1063773 -984115 -913964 -876210 -635001 -233218
40868 -233218 -18253 -97534 -229079 -307013 -487803 -742018 -760066 -465099 -177735 -81903
40858 -81903 48593 374676 661441 688537 612604 635293 666156 618461 681701 938334 1034185
40847 1034185 648046 37580 -302981 -315209 -282253 -271338 -160421 -82416 -303160 -674522
40837 -674522 -725822 -377355 -101430 -237465 -555706 -682554 -601300 -503274 -428755 -311652
40827 -311652 -189884 -142567 -139587 -120889 -118672 -177578 -267637 -372449 -524838 -658838 -592021
40816 -592021 -288820 7489 58133 -77492 -179398 -182338 -190667 -269795 -388237 -503244 -557628
40805 -557628 -460284 -224633 -59082 -136978 -310543 -249825 118170 491697 573504 412792
40795 412792 270263 253364 225712 61280 -130565 -105360 216924 632284 876744 903488
40785 903488 835120 693244 371759 -75223 -345983 -259834 -41306 -6841 -93553 6297
40775 6297 293386 389896 93303 -306236 -410016 -163624 234340 627980 897999 897682 679090
40764 679090 596294 848098 1054407 685181 -136209 -686585 -557309 -102513 158183 172462
40754 172462 156103 135782 35440 -44551 1288 30752 -60524 14312 561011 1286403 1543304
40743 1543304 1196612 763447 614876 537235 267897 -26033 -118407 -160594 -349555 -478138
40733 -478138 -267254 75652 109599 -156107 -315334 -256480 -308378 -634772 -935503 -899014
40723 -899014 -581824 -179058 237317 567882 609660 373125 197230 291925 410991 245949
40713 245949 -94033 -303041 -361185 -436705 -482575 -356704 -253859 -548032 -1163010 -1529861
40703 -1529861 -1301106 -745768 -281017 32999 301316 415037 203217 -193620 -411609
40694 -411609 -278205 66721 402186 592855 581806 395664 140031 -107702 -319986 -355718
40684 -355718 27277 786441 1392402 1326497 729137 265446 358768 826969 1260923 1440677
40674 1440677 1326595 976339 616428 520509 648159 642516 355923 135168 372930 991362
40664 991362 1599662 1947525 1950023 1493863 624095 -188577 -421163 -176712 -89210 -450361
40654 -450361 -826169 -746518 -406554 -323196 -522484 -519999 -93201 351478 363379 109800
40644 109800 158023 701910 1312421 1507331 1304252 1034423 805890 456234 1724 -208195
40634 -208195 56720 526061 727545 560442 356100 410555 658145 828915 776718 597953
40624 597953 506205 621882 856987 1025662 1069944 1082914 1093979 1011899 875087 936125 1289388
40613 1289388 1599967 1482119 1018608 595258 322981 -1643 -389800 -530131 -259411
40604 -259411 185801 518292 699734 767011 671626 467495 387603 543879 775001 939024
40594 939024 1095976 1236323 1126954 669091 157617 -78577 -88333 -112259 -200492 -263426
40584 -263426 -287027 -241018 -1690 353997 424557 -10090 -578656 -768148 -567385 -289950
40574 -289950 -12484 331313 520610 304512 -16499 110863 615239 840661 535745 179495
40564 179495 166087 290572 306672 401767 742476 1046619 1029522 866332 794468 649645
40554 649645 261554 -48072 99863 482068 614736 549917 708283 1014542 878133 139672
40544 139672 -562868 -620275 -189382 183051 310990 397889 550615 642292 604435 559243
40534 559243 596915 584093 296214 -281407 -832749 -943866 -498767 181915 639878 683233
40524 683233 463882 248576 209424 356615 543592 588213 505417 539983 818099 1065149
40514 1065149 901005 377377 -37942 -37431 219538 438635 552830 597908 469783 69907
40504 69907 -410734 -605714 -380340 32084 304130 294571 66183 -212570 -332147 -155222
40494 -155222 214510 449165 307875 -90658 -418076 -542721 -633876 -822817 -950678 -808543
40484 -808543 -487676 -259593 -171845 -32003 197257 284456 115005 -90029 -128899 -158131
40474 -158131 -424465 -819717 -980084 -750942 -318759 49737 180193 -6883 -401247 -658344
40464 -658344 -516177 -140309 88119 80288 49437 62728 -41597 -249574 -286079 -76596
40454 -76596 76651 -13607 -99514 55103 222478 72280 -237599 -251965 101077 430977
40444 430977 480853 419921 460188 523142 464396 383955 482328 725054 860144 753460 558923
40433 558923 511087 623958 674881 503213 255987 231031 476151 688485 594123 296830
40423 296830 108793 132396 189777 114744 -83764 -338985 -596972 -726532 -561869 -147846
40413 -147846 196159 184176 -137971 -480991 -614049 -503970 -257034 -36898 29773 -14051
40403 -14051 38310 308690 636253 756758 650241 551819 597826 631384 449048 102745
40393 102745 -184665 -313449 -334685 -215911 189339 835589 1329905 1290157 809840 371236
40383 371236 278814 365064 330855 184472 163287 335017 512467 554085 524668 502751 444617
40372 444617 356950 392653 566818 550493 63297 -589243 -743616 -230446 354448 433987
40362 433987 186942 179752 510027 761853 712236 590154 585133 576557 513428 607536 878341
40351 878341 923948 526721 138455 287819 763541 936327 733370 665505 894716 934003
40341 934003 459061 -157000 -416483 -335104 -173801 46681 362180 545277 434399 345363
40331 345363 678214 1249610 1471127 1139968 652841 447236 580769 861778 1071312 1036376
40321 1036376 756792 461031 316426 179833 -93232 -257873 -3672 450853 582314
40312 582314 343475 186841 289927 359701 325115 549386 1058244 1216635 656278 -18450
40302 -18450 -38143 441871 707785 614975 609755 793434 754608 386029 157603 372699 727818
40291 727818 861238 848655 869034 807196 531588 250176 252754 516728 829992 1079999
40281 1079999 1171405 907792 273915 -344351 -539459 -355764 -106461 130871 499060 941344
40271 941344 1176823 1111426 950358 843007 702089 468761 299968 343808 504130 569482
40261 569482 459468 243847 33976 -48669 86307 366450 546284 450209 179387 -27721
40251 -27721 -101568 -186072 -371238 -507677 -384594 -49498 182418 111557 -42768 115895
40241 115895 610556 978535 829749 351160 46827 87178 207210 238071 384879 809375
40231 809375 1224737 1204026 750476 251677 -72131 -334297 -563253 -495685 -3512 556337
40221 556337 745052 641183 674517 922632 994305 698916 402814 465683 679989 653480
40211 653480 495123 634967 1068790 1310780 1143053 895305 810133 633507 162678 -211664
40201 -211664 30195 753297 1286939 1226177 757677 279354 50074 160819 505527 779420
40191 779420 779022 666805 692272 776799 705265 581908 652852 774873 594688 239089 216137
40180 216137 529126 552779 57752 -294139 75729 743826 915077 571363 351511 525411
40170 525411 731273 656198 414905 238619 237490 475161 875330 1072331 756480 151108
40160 151108 -246933 -351122 -456965 -571353 -332915 294621 804767 858749 746419 851411
40150 851411 1062862 1063770 884886 792803 830425 813270 661274 456736 260454 83698 -44355
40139 -44355 -141839 -292575 -467472 -480358 -254689 45499 284321 525969 764797 750151
40129 750151 349445 -131968 -302520 -190363 -88401 -52175 88693 321509 439982 418289
40119 418289 433064 497025 424312 218841 150639 329803 519507 531472 519686 665163 805887
40108 805887 659143 281658 29032 87609 281011 373226 372034 436252 599487 719571
40098 719571 690888 605274 638388 801071 876009 645727 165962 -230619 -229613 156161 582394
40087 582394 713105 567123 450552 512446 515231 211322 -171641 -126367 420040 910558
40077 910558 861491 510841 482192 934691 1366052 1275600 770704 406815 555815 1044230
40067 1044230 1388250 1313301 982061 701110 529142 335500 156913 201783 455797 601365
40057 601365 486006 385049 579579 930164 1136168 1189459 1264562 1358210 1376135 1402973
40047 1402973 1516624 1491122 1105224 637277 593566 985792 1334039 1372921 1276821 1172851
40037 1172851 969613 767234 868644 1173344 1112455 503117 -38691 49083 439302 425208
40027 425208 -62678 -500414 -635068 -729717 -968484 -1122524 -928247 -454842 40729 404239
40017 404239 627928 751203 795670 745764 598639 435542 326693 154896 -240193 -669189
40007 -669189 -655723 -87289 505858 607759 369765 257620 315155 230883 -44811 -252779
39997 -252779 -320333 -420689 -550787 -499778 -248025 30460 353836 849992 1286180 1226699
39987 1226699 746492 419256 439972 363285 -38291 -305292 -89572 192972 78963 -95906
39977 -95906 213842 700423 567808 -181964 -670019 -419812 46051 105601 -131914 -230387
39967 -230387 -118399 32423 215016 452571 554344 404388 258720 370496 524551 354529
39957 354529 -30908 -184890 -19980 84601 -84285 -254472 -129631 167055 323295 286664
39947 286664 263950 393029 585230 635718 406994 -16730 -314948 -205232 197959 447690
39937 447690 289939 -19303 -56252 240155 556781 649222 597558 604291 681612 615727 218710
39926 218710 -402466 -858986 -838406 -454502 -131032 -108576 -205827 -132274 132420 402501
39916 402501 581598 712227 816690 861851 831889 702148 413470 4210 -332138 -474112
39906 -474112 -538576 -637183 -612246 -276464 199631 463716 494742 596215 873078 1073762
39896 1073762 1022318 862124 751800 643504 517788 535091 763219 1014118 1134990 1213527
39886 1213527 1327026 1371059 1329495 1391071 1539511 1374951 712042 50713 -14634 359844
39876 359844 526071 311675 162599 340020 571314 637931 758338 1101795 1353412 1130555
39866 1130555 561609 112739 18634 167253 380440 515787 425505 133651 -9401 340217
39856 340217 1029153 1523396 1552664 1377447 1337968 1412766 1406203 1348544 1416958 1547200 1446353
39845 1446353 1049552 687223 644231 772991 769968 667693 738660 976268 1035382 760686
39835 760686 440980 375438 471688 494843 471742 572976 779677 969663 1194052 1541599
39825 1541599 1823509 1745338 1361135 1017262 853510 717925 596179 705772 1029556 1162647
39815 1162647 877039 520182 544858 873621 1056256 900915 616032 417053 331039 378842
39805 378842 622343 941688 1020999 707313 242362 15269 176911 585816 1033201 1395042
39795 1395042 1610966 1651247 1537354 1322813 1025758 643201 268526 112627 297601 654008
39785 654008 867347 877268 990172 1462285 2062808 2253338 1830028 1222304 1047479 1448409
39775 1448409 1982626 2139456 1844916 1405837 1067313 805876 583317 572988 903590 1288105
39765 1288105 1235758 692197 173898 123261 394337 578999 588984 615627 684198 600457 299810
39754 299810 -34557 -205458 -159851 38768 228211 254786 251733 614117 1415322 2079675
39744 2079675 2045755 1557046 1269374 1218319 853457 118465 -267243 127010 776019 1012913
39734 1012913 938624 999958 1131784 960959 595940 567796 1048324 1630013 1873067 1688170
39724 1688170 1237235 835232 884199 1498003 2206137 2406552 2109444 1863778 1954463 2098224
39714 2098224 2015154 1871424 1945867 2184171 2346642 2390069 2445209 2525703 2494742 2323032
39704 2323032 2232908 2508683 3158258 3794550 3944215 3521779 2898918 2444320 2163096 1926626
39694 1926626 1831233 2018333 2266769 2161477 1690018 1306332 1308829 1504551 1643413 1818834
39684 1818834 2147412 2350748 2082863 1545302 1317952 1540731 1696652 1393208 982666
39675 982666 1065028 1615088 2035896 2006261 1830906 1886509 2145348 2419323 2678187 2862531
39665 2862531 2761289 2455138 2557270 3515422 4877818 5790260 6112732 6490932 7378891
39656 7378891 8598644 9890384 11209728 12270743 12442470 11488288 9965619 8562954
39648 8562954 7440416 6505743 5866138 5594152 5415208 5059761 4679887 4585652 4809120
39639 4809120 5186831 5595500 5895335 5977720 6052585 6475857 7125384 7473083 7471403 7714039
39629 7714039 8426257 9051116 9272682 9651405 10654968 11836763 12676499 13497369 14794915
39620 14794915 16397936 18093449 20288425 23184788 26193663 29166850 33200913 39016061
39612 39016061 45637595 52151672 59618833 69539056 81761452 96137270 114898893 140746084
39604 140746084 174239450 216599022 272257229 340661277 404010820 431956119 406443192
39597 406443192 340001595 264491524 203545502 160146499 127243712 101075824 81757938
39590 81757938 68037023 57286434 48574844 42131368 37004824 31842099 26972760 23529598
39582 23529598 21242373 18917949 16425443 14506330 13128046 11599291 9984776 8976255
39574 8976255 8521923 7820585 6620712 5491543 4833686 4494844 4318117 4280854 4121541
39565 4121541 3533178 2724257 2212402 2106031 2086285 1998097 1979426 2095008 2243993 2321440
39555 2321440 2193014 1760446 1308784 1376074 1933445 2199193 1723527 1094944 976379 1041278
39545 1041278 668412 158887 244243 711853 641336 -70331 -520907 -247813 187691 335408
39535 335408 583903 1271082 1891331 1820252 1258593 838155 700146 555971 373893 415552
39525 415552 700873 921771 890592 733995 622084 559190 479293 373366 274128 197950
39515 197950 126053 39044 -2323 134107 449960 683670 568878 203088 -66852 -133438
39505 -133438 -228939 -463659 -563462 -261528 273144 654893 810594 1031052 1508961 2043178
39495 2043178 2277613 2105856 1726817 1342152 936956 438942 -8346 -134829 63679
39486 63679 242456 159418 25274 188174 607613 915703 932187 819746 731502 614431
39476 614431 434671 308133 271903 174826 -28504 -89693 200900 647093 875407 856077
39466 856077 913131 1189386 1379266 1158905 704810 535266 861652 1333314 1507657 1371896
39456 1371896 1231580 1240764 1301628 1358820 1475713 1572477 1410528 1001893 772419 1086052
39446 1086052 1785185 2430335 2835361 3107078 3287037 3270999 3059292 2813039 2632505 2482502
39436 2482502 2345469 2256090 2177927 2031388 1853817 1758136 1731756 1655926 1528638 1482288
39426 1482288 1563010 1678418 1794886 1996105 2275940 2432260 2269808 1831826 1369438 1111161
39416 1111161 1052610 944206 556565 5544 -314985 -213913 59089 205171 287518 498708
39406 498708 726437 718885 558905 554854 698496 669390 414498 272366 392283 461350 235887
39395 235887 -15092 111786 578114 984587 1071745 916530 738955 671297 635039 392632
39385 392632 -131226 -586971 -524723 -9875 423917 507659 504604 595137 502503 68683 -273312
39374 -273312 -109508 225925 127025 -305878 -421885 -71904 181178 -2539 -245475 -153976
39364 -153976 34189 -103459 -469477 -637525 -525611 -445111 -562463 -685597 -600629 -341527
39354 -341527 -82959 23412 -122329 -493162 -825097 -768390 -255644 398965 841428 988678
39344 988678 923022 665906 256558 -65384 -36595 255504 417846 243401 -56679 -207304
39334 -207304 -220540 -223275 -158217 77233 336411 371181 219981 166390 324314 524424 608240
39323 608240 573820 431082 197948 57950 208238 496810 539591 284215 104354 201433
39313 201433 295518 127681 -105058 -126051 -74584 -252567 -597708 -784093 -699743 -487091
39303 -487091 -238440 26218 196018 193993 152377 181781 129309 -115361 -278629 -80444
39293 -80444 226173 185522 -117565 -208671 -62074 -139382 -506848 -597425 -121493 402206
39283 402206 428012 180629 179843 382311 382814 210822 292132 681630 918259 732436 413933
39272 413933 291468 230242 -81983 -587766 -894643 -775151 -397497 -48612 193529 419305
39262 419305 615182 589470 219205 -334432 -768588 -942199 -913636 -737785 -430217 -134973
39252 -134973 -72132 -209297 -217220 66346 324930 166761 -283175 -492127 -208925 231788
39242 231788 373419 186398 10019 83796 319961 516613 629270 742600 857365 862497
39232 862497 759152 761933 1020544 1316104 1250696 761329 236916 42717 119800 176509
39222 176509 89085 -68948 -243315 -412586 -467629 -311456 -53356 103425 151306 239939
39212 239939 343738 219545 -207957 -629741 -682853 -375275 -29139 121982 131611 172836
39202 172836 310354 458438 488231 365596 224730 274237 561740 869201 947553 835821
39192 835821 799509 924124 960789 709222 382477 343814 564035 659690 507186 462835
39182 462835 775732 1094837 913666 339035 8115 251666 714352 888509 688392 334770
39172 334770 -38579 -407350 -651564 -595244 -232051 239406 604924 796739 906575 1074306
39162 1074306 1318700 1498427 1524698 1523856 1592385 1492527 959935 341308 454042 1542342
39152 1542342 2738024 2950286 2088855 1038314 575880 714394 1041729 1272674 1357987
39143 1357987 1342666 1278328 1168191 964251 701364 568347 703520 984743 1168668 1161282
39133 1161282 1018134 810009 660317 750709 1057165 1231682 1004251 558327 248070 133770
39123 133770 110507 254517 591142 715939 217296 -591670 -942497 -612474 -75681 354256
39113 354256 838367 1329480 1333209 715806 106953 37819 218958 162583 4252 118341
39103 118341 352444 318977 148945 266287 600722 704586 547369 512579 617448 421394
39093 421394 -165533 -602720 -481342 -70165 170811 222977 361659 667757 971057 1105562
39083 1105562 1017955 752800 462153 314393 326703 407236 550315 794627 1004508 952061
39073 952061 655738 395719 352692 464082 641476 835918 862830 520172 -8661 -220996
39063 -220996 57765 404383 386235 128299 27715 146958 216980 110346 -3232 55594
39053 55594 261641 457266 485579 274676 -81684 -354393 -404314 -360271 -479180 -829215
39043 -829215 -1169401 -1161465 -713236 -121356 191474 132997 31811 175616 420059 458634
39033 458634 317522 260104 298186 206506 31883 146115 655973 1150384 1233394 978952
39023 978952 653684 324719 11268 -71974 235251 715552 990256 947983 748592 537385
39013 537385 357496 225708 128579 54472 114144 435863 869762 1082467 1059955 1165715
39003 1165715 1518756 1713999 1446834 1028430 910020 1036282 1080065 995157 874681 570786
38993 570786 4054 -391776 -147860 456773 710372 500419 395635 676766 937087 815079
38983 815079 546566 499431 580833 424739 -70064 -606040 -750919 -283779 546892 1152466
38973 1152466 1226024 1125668 1316131 1593188 1362043 624423 102704 284944 877175 1354859
38963 1354859 1556861 1542577 1342921 1099922 1038981 1069409 807963 223805 -146599 109530
38953 109530 735575 1192806 1243294 929975 369533 -162675 -303258 -45104 193423 160200
38943 160200 77613 163455 286001 366481 648457 1186619 1493336 1144146 416489 -86378
38933 -86378 -165909 -20179 190473 400944 544111 715444 1131979 1676957 1912796 1825151
38923 1825151 1991558 2606001 2973331 2560647 1943961 1976163 2545832 2999371 3342605 4078744
38913 4078744 5160578 6063985 6725259 7537352 8619743 9942061 11877619 14727968 18182383
38904 18182383 22430039 29077315 38830194 48213229 51113232 44956142 33820137 24098847
38896 24098847 18370574 14925555 11877018 9362111 7975502 7278776 6577101 5872466
38888 5872466 5361667 4829449 4085258 3384490 2970771 2667335 2262225 1894361 1759998
38879 1759998 1768530 1743121 1695461 1702719 1739522 1784956 1895212 2048769 2088913 1912419 1597354
38868 1597354 1318368 1225605 1342326 1473031 1355203 1052947 982645 1314944 1619949 1466554
38858 1466554 1122233 1172926 1621493 1937171 1940550 2015948 2357712 2609103 2475703 2189981
38848 2189981 2081301 2109803 2139853 2307261 2756393 3282685 3579769 3641000 3618697 3487460
38838 3487460 3164789 2795266 2572076 2385692 1991057 1467158 1167244 1197104 1265767 1146097
38828 1146097 1004875 1103915 1361263 1426810 1135683 712922 512439 659363 974228 1163909
38818 1163909 1048295 681919 330228 266575 483203 633010 395151 -95013 -343027 -83357
38808 -83357 392852 608941 444151 132083 -153944 -461731 -809986 -998651 -774426 -120072
38798 -120072 651652 1074385 876907 257960 -239466 -232896 165170 586669 851426 1012204
38788 1012204 1081370 972425 709776 472355 375333 361503 340762 299247 243102 154508 27108
38777 27108 -136641 -337934 -512765 -533437 -390264 -247218 -157623 102558 651727 1110211
38767 1110211 974572 333689 -200899 -303317 -231657 -217451 -53515 419273 824980 688905
38757 688905 149482 -186222 -20551 352927 521772 389284 95480 -219355 -447613 -475936
38747 -475936 -252899 141024 534999 758402 713266 427874 49836 -254667 -406081 -421946
38737 -421946 -366355 -304695 -258765 -185470 -45100 107240 169411 142411 150726 285821 500158
38726 500158 677367 737095 656598 465460 241865 62534 -38279 -23417 161012 465210
38716 465210 692549 711074 614767 517402 326888 -22045 -245652 881 542508 808132
38706 808132 605644 359770 434343 634395 620453 443069 353012 379202 426675 544873
38696 544873 759201 852362 661821 402553 335738 306087 20303 -363256 -395748 -42272
38686 -42272 239641 169298 -29507 -71204 -7586 -27074 -131602 -162192 38809 540039 1183417
38675 1183417 1543613 1324497 819968 634925 884384 1066931 868751 638133 768096
38666 768096 1023739 939170 610966 553551 851706 1002136 694744 282187 233088 461179
38656 461179 521302 272004 -14211 -145355 -266462 -525858 -748975 -646970 -224318 224349
38646 224349 478990 569046 585331 514726 342821 171310 107831 115128 70381 -76398 -272132
38635 -272132 -426195 -451015 -325356 -178211 -192313 -338307 -351060 -106829 135141 82031
38625 82031 -124772 -76582 299992 603014 477891 35430 -344684 -417916 -173864 268046
38615 268046 698779 887438 775728 545985 395658 325985 252424 220028 351970 619848
38605 619848 808161 727206 381240 -75600 -470066 -680421 -655576 -436114 -159118 3915
38595 3915 -33597 -197426 -319527 -296188 -157330 16765 181015 301987 331314 267930 187971
38584 187971 152820 145970 139599 121084 6907 -297092 -630543 -584101 -8772 643602 805879
38573 805879 526307 348887 499233 628985 468406 277123 376991 596490 550642 249252
38563 249252 32501 13014 -30360 -214197 -363402 -344089 -292255 -364669 -470872 -428771 -256965
38552 -256965 -128095 -88749 -11039 150061 214996 23717 -255995 -254272 116185 468582
38542 468582 377668 -98678 -505337 -516638 -165622 385247 997296 1444009 1479103 1175410
38532 1175410 926896 923234 880082 525307 82202 -75130 -38825 -204641 -583671 -745357
38522 -745357 -487640 -123268 33872 59513 81898 -68631 -535918 -1017812 -1056249 -639095
38512 -639095 -178407 51873 133574 179364 140966 34791 58415 304946 568249 624777
38502 624777 560431 612157 783277 840921 671645 430599 296605 245587 146550 -34321
38492 -34321 -221786 -359399 -461793 -555992 -617348 -563049 -318865 64377 377730 422321
38482 422321 223718 -4542 -117299 -143339 -120782 -3367 173730 212797 19751 -171008
38472 -171008 -58726 300801 561650 540664 350695 86926 -300640 -712028 -792715 -373234
38462 -373234 196671 445208 380984 377830 515399 417150 -141475 -786675 -955359 -577428
38452 -577428 -92382 133132 143248 145957 187296 195515 184586 241039 358122 412103 305217
38441 305217 69462 -155958 -218016 -76526 120528 172144 92817 122180 356622 520873
38431 520873 307197 -171050 -524507 -619138 -654999 -727543 -670461 -421578 -192215 -112127
38421 -112127 -29630 139925 192057 9210 -156518 -87507 -3692 -209890 -599113 -891377
38411 -891377 -1106927 -1349859 -1373802 -931625 -392949 -370474 -777743 -920101 -566436 -238981
38401 -238981 -278440 -326347 -54958 224676 126169 -152420 -225924 -185803 -360638 -696041
38391 -696041 -854924 -753834 -601929 -557038 -649771 -852317 -950203 -613146 101614 617704
38381 617704 553869 247838 187205 289353 236462 160798 367218 633324 482909 22978
38371 22978 -183059 -18976 98619 41471 162453 554622 800511 669870 463013 424095
38361 424095 380713 226994 205666 387319 386621 -26955 -484975 -572942 -419658 -338004 -269723
38350 -269723 -40128 165836 74050 -172058 -249786 -216243 -360705 -629023 -660763 -353065
38340 -353065 16941 214527 243635 154937 9497 19842 365817 827042 935375 592457
38330 592457 253602 362825 819857 1156591 1095346 781108 528649 472106 494246 447848
38320 447848 347572 265300 125825 -188677 -535016 -576934 -261273 29340 -30925 -301677
38310 -301677 -470044 -521406 -637305 -808341 -871918 -823629 -781530 -719905 -531156 -278135
38300 -278135 -94819 76099 327388 470220 270756 -48915 -16485 337136 437224 56319
38290 56319 -253473 40286 616334 722939 203238 -383128 -570923 -449629 -272568 -43774
38280 -43774 309601 655865 804701 771733 680506 524524 255839 25286 59789 291780
38270 291780 382924 209983 78673 288595 701549 974524 1044428 1077461 1058905 824490
38260 824490 500687 494665 897326 1250926 1142601 756130 573423 743773 1028529 1206573
38250 1206573 1241919 1151582 979370 846409 815239 777048 659011 620790 827221 1160319
38240 1160319 1402349 1556885 1702572 1694976 1389100 1038558 1032209 1273949 1290636 985187
38230 985187 789158 943404 1117623 977034 692210 577067 584480 525970 511947 768591
38220 768591 1179087 1382633 1258187 1012348 843919 777904 781992 817468 809357 739708 695548
38209 695548 676000 510737 184497 44970 349784 740670 596162 -91752 -616352 -442943
38199 -442943 173280 633679 726655 645732 533101 360356 178424 161418 347542 537182
38189 537182 523375 312326 77698 -8686 126872 433579 750109 906840 866751 732004
38179 732004 590822 422779 208812 69182 176671 518649 839937 881944 631882 285498
38169 285498 14274 -151963 -241613 -252831 -192475 -141209 -214616 -450022 -738975 -885415
38159 -885415 -779078 -542418 -443622 -587781 -749492 -634218 -283308 -63872 -222989 -607343
38149 -607343 -906692 -1028369 -1084231 -1100941 -941515 -541201 -84878 137749 24593 -237993
38139 -237993 -377149 -324332 -266009 -371680 -529802 -469586 -145020 143040 74300 -346231
38129 -346231 -838390 -1131046 -1109957 -807646 -394778 -111827 -62070 -107042 -77776 -15190
38119 -15190 -48349 -107975 20207 355553 647508 690380 532155 315022 102818 -39737
38109 -39737 3458 207692 312486 115238 -217656 -310987 -13410 467482 807793 807452 465870
38098 465870 -309 -267095 -221905 -116334 -178417 -161763 352532 1186991 1565668 1104780
38088 1104780 390347 201026 498544 687139 627055 734960 1109165 1262427 950217 650212
38078 650212 817479 1138797 1033218 565335 299656 427224 608580 641374 734511 1028244
38068 1028244 1311037 1386166 1355355 1356268 1321685 1180565 1032202 934793 752347 401556 63648
38057 63648 -19632 184205 529183 806277 771564 336902 -163235 -227293 117701 244649
38047 244649 -180234 -618488 -392315 310439 696054 462946 70486 -61199 -54351 -158338
38037 -158338 -317157 -364354 -287959 -98304 254833 631968 665809 211255 -391648 -711668
38027 -711668 -673854 -443247 -138194 91069 -26239 -531357 -971553 -871743 -386439 -111606
38017 -111606 -287292 -572388 -630936 -526874 -405085 -178201 204924 479267 395729 158418
38007 158418 168110 401513 420480 44053 -345401 -338562 -59671 76002 -14009 -36142 136158
37996 136158 234468 47674 -170923 -6211 530999 987174 1029863 792841 592593 508216
37986 508216 397928 210782 83277 126308 261386 325048 260766 149756 84352 61851
37976 61851 11402 -95795 -196729 -228147 -248936 -388902 -631594 -735988 -499849 -80704
37966 -80704 99049 -164209 -575944 -651175 -235016 392113 867714 1048393 968428 697226
37956 697226 353905 147453 240480 566231 857222 868702 563694 127023 -171268 -186039
37946 -186039 -11517 167840 332650 588232 843414 787096 369151 53950 250964 641837
37936 641837 522487 -184152 -741098 -585349 -53771 182666 36983 -76329 -12611 -73354
37926 -73354 -424904 -780767 -798205 -511745 -228963 -163045 -265391 -312699 -122748 228995
37916 228995 440905 342754 129331 64527 76673 -75017 -316371 -309850 -17455 166248
37906 166248 -20855 -328971 -361055 -59018 349989 658592 760855 659556 553715 666382
37896 666382 822718 526029 -292966 -954514 -840039 -234086 105432 -13178 -153894 -85526
37886 -85526 -36272 -104586 -71647 34549 -182714 -743678 -995409 -497588 251657 488602
37876 488602 233681 102765 316267 521087 501199 439816 425892 261331 -97569 -380460
37866 -380460 -452295 -501308 -617052 -617290 -498130 -597529 -1016540 -1313066 -1149999 -857855 -904010
37855 -904010 -1151973 -1190447 -1124532 -1395439 -1935804 -2168409 -1867626 -1407227 -1062069 -675117
37845 -675117 -200474 17830 -196813 -528341 -719327 -954912 -1323428 -1397431 -871362 -220409
37835 -220409 -126530 -513586 -756812 -659678 -580382 -675449 -679970 -485581 -326600 -271713 -101469
37824 -101469 135903 15614 -538377 -928369 -657931 -36778 285944 177182 -3433 -30377
37814 -30377 31965 155209 391348 622746 626505 408118 201560 139663 169666 275330 508617
37803 508617 771166 826058 615748 362522 241137 112819 -266446 -849540 -1264249 -1218418
37793 -1218418 -866444 -661918 -810751 -1004568 -854635 -477915 -354937 -612687 -840748
37784 -840748 -775348 -754205 -1151353 -1697626 -1855238 -1678639 -1733127 -2174231 -2485816 -2289953
37774 -2289953 -1904035 -1799307 -1903920 -1816509 -1443395 -1024750 -674863 -284080 155742 457705
37764 457705 514367 429616 330757 231035 108212 -41400 -242559 -476088 -572455 -356422
37754 -356422 74575 410984 519583 560756 634837 561728 207013 -175461 -208606 97582
37744 97582 387780 474673 500633 554721 470675 170871 -78036 -13706 213493 275214 180166
37733 180166 224217 473207 646133 565535 398948 331718 297363 214306 220688 419031 595547
37722 595547 499987 273981 268533 489938 575142 351877 83176 26458 48709 -104000 -375155
37711 -375155 -507432 -462710 -451406 -571985 -681284 -665068 -613454 -637227 -692012 -694401 -643589
37700 -643589 -488867 -56237 662346 1268045 1308350 864776 488738 488443 586010 429762
37690 429762 141470 84745 303123 505223 486799 268238 -86364 -467441 -621257 -422481
37680 -422481 -214087 -464869 -1044822 -1274783 -828967 -159669 191299 288978 496688 826691
37670 826691 1011451 999207 961861 924166 750665 444673 166355 11340 5412 194890
37660 194890 481463 527479 152589 -308560 -396406 -152518 23800 19113 50740 144116 87708
37649 87708 -67568 -487 274249 311286 -62875 -436525 -440806 -229071 -45750 216211
37639 216211 644863 912704 726641 368859 291767 403775 283451 -42366 -90225 327420
37629 327420 847110 1119727 1191675 1210795 1151898 1009270 936628 987754 957994 683077 315920
37618 315920 123810 142524 194482 162680 111829 173780 377137 564861 507284 191500 -55817
37607 -55817 88957 499260 710925 507639 159224 11615 92967 246154 393612 481151
37597 481151 389023 148697 72109 381007 822855 945504 678087 341893 141253 -9316
37587 -9316 -143527 -116786 62045 141602 79080 238588 823892 1389247 1344473 815155 533252
37576 533252 850440 1297260 1266469 756179 190352 -202083 -495676 -719916 -762490 -621939
37566 -621939 -488489 -504495 -610607 -678307 -655834 -537807 -331604 -141253 -175329 -530204
37556 -530204 -981804 -1130282 -832509 -408414 -270618 -370634 -242930 295378 761991 620661
37546 620661 75165 -192708 -12517 93277 -180047 -427801 -273372 -42018 -188563 -487482
37536 -487482 -428774 -123964 -100211 -345210 -333058 -18207 -16856 -586844 -1123223 -1008101
37526 -1008101 -402617 160928 475067 571271 410304 92845 -9033 236442 421737 226186
37516 226186 -29462 66054 265108 45585 -505822 -815290 -694496 -497375 -458780 -432218
37506 -432218 -288675 -73224 251749 746527 1165271 1155863 802175 499025 301670 -56694
37496 -56694 -485366 -524378 -162730 2750 -275158 -417274 50640 635965 541736 -166467
37486 -166467 -683622 -586298 -258053 -225368 -543160 -896332 -964131 -623682 -49248 359985
37476 359985 350048 88187 -110022 -231941 -491799 -881477 -1112667 -1021954 -753254 -484549
37466 -484549 -224450 36735 197052 193178 140107 212174 465546 826835 1172373 1394384
37456 1394384 1475110 1497358 1492637 1322954 867360 301459 -15433 22498 136253 50901
37446 50901 -166645 -287128 -282556 -331750 -535157 -782691 -883307 -722934 -340071 48707
37436 48707 159604 -75694 -361709 -318053 100538 603625 956289 1156541 1190261 888442
37426 888442 221190 -456337 -706011 -471465 -32499 396840 753321 893296 655672 219881
37416 219881 45936 296434 611739 646486 538920 594100 762696 763630 544094 273824
37406 273824 7000 -306245 -567371 -647087 -690111 -924080 -1194946 -1103937 -641156 -262960
37396 -262960 -236379 -313455 -218323 -67579 -75588 -178925 -222109 -237524 -267801 -163080 149739
37385 149739 412450 362751 147551 103614 268427 419904 484015 568785 652751 566097 287896
37374 287896 -5781 -203755 -336994 -392236 -286889 -64504 95536 122365 147298 301664
37364 301664 536229 668532 538711 159134 -212399 -249951 65024 373127 413555 415765
37354 415765 752091 1320418 1620817 1428254 1033867 756507 565723 345890 225810 379726
37344 379726 666387 736633 475460 160574 156030 535392 1033411 1339776 1412298 1461420
37334 1461420 1630522 1805022 1811477 1672802 1513132 1320022 1010966 668218 466774 389198
37324 389198 257932 61112 -11763 89683 157506 45226 -123625 -195877 -238961 -397128
37314 -397128 -643800 -820587 -819656 -625552 -281442 99849 388229 553914 629853 557462
37304 557462 248945 -176807 -449149 -501530 -533698 -638763 -653501 -519274 -476815 -668959
37294 -668959 -844431 -774770 -720462 -1082210 -1730782 -2105623 -1938672 -1489506 -1061005 -686883
37284 -686883 -385525 -330750 -562838 -803356 -779977 -556518 -362673 -264217 -189513 -142140
37274 -142140 -177143 -242701 -232095 -158148 -129335 -182350 -270214 -392676 -604876 -888870 -1124552
37263 -1124552 -1213966 -1165459 -1043332 -893653 -732014 -563677 -409849 -326557 -359801 -452657
37253 -452657 -463212 -346691 -260201 -379663 -645036 -808949 -731835 -503960 -272320 -99287
37243 -99287 -27758 -102986 -225908 -164133 114001 264521 -21241 -508614 -631752 -251370
37233 -251370 100754 -120057 -798937 -1332338 -1301637 -791229 -193480 83577 -154262 -688386
37223 -688386 -988678 -766521 -371121 -366005 -761413 -1005056 -759221 -311260 -79376 -72721
37213 -72721 -85787 -129691 -329146 -557610 -523877 -177310 243903 540255 681118 630543
37203 630543 316638 -159067 -497244 -502539 -298441 -165501 -234171 -374694 -352440 -110700
37193 -110700 75110 -158106 -752994 -1119851 -766964 36401 513251 299795 -176040 -303947
37183 -303947 12263 415851 600283 524738 284901 4283 -207235 -354246 -566075 -887285
37173 -887285 -1143449 -1150884 -971637 -803752 -690755 -509731 -201015 156240 467069 665479
37163 665479 675236 499243 323521 336069 426423 259424 -294344 -964407 -1383276 -1440874
37153 -1440874 -1272033 -1042668 -857004 -770831 -778140 -818903 -840821 -801092 -624418 -293395
37143 -293395 10315 35994 -203973 -416927 -431311 -406534 -509405 -616178 -563743 -496560
37133 -496560 -654890 -938354 -1022731 -870580 -779127 -893203 -1011588 -971138 -904298 -961576
37123 -961576 -1057439 -1082689 -1122914 -1238622 -1239787 -951029 -555123 -390075 -490173 -596468
37113 -596468 -563453 -473958 -364868 -138830 174775 324257 140478 -226335 -499837 -576785
37103 -576785 -510125 -314877 31878 426262 632704 506382 160507 -136047 -206500 -85691
37093 -85691 73867 144604 62890 -173193 -450240 -550003 -361031 -68575 25701 -108128
37083 -108128 -197782 -72479 113824 170241 162628 242400 368356 421050 446960 543835 618081
37072 618081 510686 263607 -8337 -398591 -1016110 -1565115 -1523881 -825540 -26059 320056
37062 320056 167321 -221035 -641026 -943084 -969831 -756390 -598521 -697429 -887250 -900182
37052 -900182 -744278 -621543 -604956 -596716 -514951 -353135 -126458 111174 266117 304372
37042 304372 266023 155092 -28668 -138802 -8969 220351 212318 -21513 -50584 303101
37032 303101 605821 424602 -56716 -404081 -575253 -734382 -728962 -330635 189688 354961
37022 354961 269569 462388 931189 1045820 579909 156155 311898 698402 684626 318102
37012 318102 128143 242926 286627 81501 -66287 128663 506902 696783 560411 277914
37002 277914 98780 103396 179366 192655 145955 115614 80973 -39085 -190496 -222811 -158270
36991 -158270 -188969 -320733 -286237 18135 262645 104132 -306667 -516796 -356942 -70951
36981 -70951 64895 954 -165866 -309407 -333210 -278734 -309169 -431243 -376053 7545 390351
36970 390351 324686 -109254 -382788 -232173 78684 244438 276898 268981 178101 17648
36960 17648 -80661 -197057 -661759 -1484826 -2079907 -1931384 -1294852 -831415 -738060 -694043
36950 -694043 -537127 -452454 -468576 -307353 80513 281754 940 -459797 -602688 -363203
36940 -363203 -37728 201578 381536 458576 329872 78925 -78216 -84977 -50681 -3336
36930 -3336 117069 256962 318368 411454 717023 1055494 948554 272997 -438721 -581852
36920 -581852 -171612 266412 350335 159729 -12504 -5353 114307 171410 83374 -32709
36910 -32709 -10795 118331 179220 152611 189721 255214 53151 -491930 -946863 -859587 -360737
36899 -360737 33896 85846 -39198 -211343 -504776 -891917 -1119985 -1017365 -691182 -329738
36889 -329738 -5883 262888 460486 639958 852617 963290 752840 273133 -127953 -243879
36879 -243879 -257350 -404526 -580529 -488095 -91350 276977 284773 -18328 -241995 -85755
36869 -85755 308075 533128 456530 370438 479889 501477 85311 -544208 -798211 -530486
36859 -530486 -193698 -141265 -215890 -168281 -60834 -34159 -32751 -13374 -115537 -375203 -566391
36848 -566391 -582951 -667347 -963334 -1156632 -933187 -528340 -397363 -538385 -583635 -421838
36838 -421838 -277059 -250497 -231401 -229419 -354213 -456418 -231178 252822 545080 446313
36828 446313 265900 307301 461898 493433 390899 231993 6557 -192947 -110615 252598
36818 252598 431434 77764 -441397 -451895 90484 499302 249494 -411012 -884580 -921948
36808 -921948 -662576 -254759 210529 509419 409958 20097 -300086 -449425 -697169 -1144963
36798 -1144963 -1419831 -1190507 -716045 -492163 -534237 -467773 -236554 -190630 -426245 -576680
36788 -576680 -427141 -234498 -200666 -137349 17560 -124747 -726493 -1180481 -878543 -202538
36778 -202538 -33400 -447956 -672617 -318407 128424 220756 213197 451334 701622 573746
36768 573746 207023 51922 221252 476367 661197 758945 675652 366316 90736 161718
36758 161718 455942 529270 260101 40303 192992 486676 470502 129232 -103847 7696
36748 7696 146491 -88951 -569368 -802775 -636423 -394413 -250634 70988 693591 1118069
36738 1118069 853524 254103 133544 627644 1037781 857531 379566 117356 146266 263487
36728 263487 346230 265715 -147846 -734807 -957955 -567885 -15708 134649 -73083 -196879
36718 -196879 -55658 200708 458400 684714 771102 690410 655042 779440 771156 341966
36708 341966 -246975 -485284 -336183 -203225 -247241 -219469 8072 205466 173343 -10747
36698 -10747 -229966 -466613 -606942 -444153 -6715 399195 589211 681920 792775 832181
36688 832181 730342 600738 544765 523715 537690 687013 923888 981967 712411 293413
36678 293413 -30968 -222853 -332781 -325966 -190481 -39324 46151 106360 121287 -35775
36668 -35775 -300640 -324634 71956 546654 619743 280690 -72726 -193858 -171469 -109881
36658 -109881 20834 151191 43990 -368082 -774868 -811301 -490964 -158528 -61424 -118937
36648 -118937 -120302 -17668 54589 -10956 -162299 -266774 -249549 -134846 -22746 -51041 -269755
36637 -269755 -480460 -345142 172195 592320 428018 -116220 -284983 276599 1026600 1201704
36627 1201704 730815 174270 -56852 -40953 11553 35823 -23278 -236910 -425389 -204031
36617 -204031 465531 1045748 1049498 693936 576759 836501 1057245 988723 893467 1024417
36607 1024417 1171573 1022461 680834 477514 454853 406417 312734 344778 466049 431965
36597 431965 242759 215242 467723 675738 535580 181305 -79531 -182540 -208067 -109395
36587 -109395 155514 403140 452506 428627 512096 528681 190673 -318617 -454364 -69477
36577 -69477 348046 347278 68044 -84003 -14776 68813 33879 -87616 -250034 -386701 -339995
36566 -339995 -33405 328769 437263 239172 -41173 -217829 -304037 -355889 -333660 -178707
36556 -178707 85726 371904 551890 463844 52558 -435229 -570827 -216405 232173 274704
36546 274704 -68818 -290563 -67026 362286 599274 600644 550231 437623 123452 -268257
36536 -268257 -426490 -348596 -362066 -544840 -536257 -146967 231035 163087 -188779 -378682
36526 -378682 -400306 -609598 -1026003 -1226078 -993324 -636030 -512828 -586063 -620149 -551047
36516 -551047 -466599 -405656 -340266 -238502 -53134 235010 517879 643941 629508 633505 702629
36505 702629 704308 528398 201846 -176388 -445347 -399729 -37237 286128 248465 42984
36495 42984 95277 344400 287398 -187158 -532844 -324052 175588 512916 668823 805372
36485 805372 777948 378824 -171404 -437302 -337188 -119042 81053 266629 304684 55120
36475 55120 -277089 -324745 -89150 80504 50727 78445 354105 703472 866085 810388
36465 810388 649332 457002 294461 249984 327435 396292 336602 166520 -9121 -111009
36455 -111009 -129031 -100899 -45589 80305 284002 406561 266924 -17612 -86697 165876
36445 165876 404830 356565 231881 354310 593872 548071 160071 -223779 -359357 -326099
36435 -326099 -278791 -298232 -455377 -709394 -781668 -460390 10468 205562 153367 292812
36425 292812 767399 1182374 1167409 803997 378460 77218 50164 378967 785738 741711
36415 741711 124937 -520291 -630886 -282061 33658 37378 -177196 -402380 -479129 -365097
36405 -365097 -244180 -386024 -713733 -749842 -231909 456994 766783 675324 558664 538147
36395 538147 376134 -20460 -392029 -493722 -378882 -235318 -172170 -237483 -428197 -596064
36385 -596064 -537604 -282857 -129212 -260849 -465266 -386757 3510 355258 364444 104572
36375 104572 -146224 -294919 -480945 -751916 -905257 -766303 -458054 -216857 -66210 101533
36365 101533 215029 87625 -220813 -404620 -332251 -197291 -172765 -180073 -110655 -30308 -39720
36354 -39720 -149819 -376116 -691774 -819296 -439165 233043 491497 45928 -504889 -483480
36344 -483480 -65856 77371 -207451 -492189 -583785 -785278 -1290293 -1850093 -2180561 -2264650
36334 -2264650 -2107071 -1600842 -829679 -145810 266170 595545 971500 1140399 856034
36325 856034 345343 61345 102341 158601 -30821 -399479 -696267 -728079 -490469 -198967
36315 -198967 -149111 -407895 -675949 -590264 -163007 187604 75615 -422744 -794983 -571624
36305 -571624 177774 856450 919634 399915 -241462 -689943 -984786 -1196904 -1224975 -1029504
36295 -1029504 -794403 -657674 -479907 -90413 393560 707831 774674 688160 490710 197084
36285 197084 -50785 -91187 49320 247301 476617 687381 646355 242708 -148051 -42693
36275 -42693 400903 491711 -15972 -549579 -585293 -409546 -582806 -1014001 -1136058 -815008
36265 -815008 -480756 -372047 -238248 72657 253262 29321 -383557 -620399 -662855 -688937
36255 -688937 -683436 -537114 -350008 -295523 -311957 -256175 -249110 -503703 -862789 -892818 -478359
36244 -478359 12485 233263 226026 179946 115379 -18130 -136111 -92006 151719 509955
36234 509955 810394 819976 437345 -79551 -295311 -100273 173494 226025 137985 117694
36224 117694 154368 120077 15821 -87084 -186140 -256719 -210088 -116472 -241213 -630407 -896590
36213 -896590 -711936 -306746 -131931 -201423 -178001 -8201 -20615 -378600 -835765 -1101276
36203 -1101276 -1104157 -839742 -316714 238874 475114 362568 253533 346994 400974 171031
36193 171031 -151134 -196261 70819 321570 215244 -355079 -1174178 -1721318 -1524491 -710714
36183 -710714 20202 188091 42394 23723 55110 -172336 -460935 -291941 265306 479269
36173 479269 -3893 -600465 -611852 -161908 132383 97706 71009 188437 182456 -73041
36163 -73041 -320900 -387566 -476037 -755166 -998708 -940469 -739480 -743858 -939693 -980759 -697096
36152 -697096 -254344 157901 473292 580195 349389 -82139 -362091 -387700 -438050 -676162
36142 -676162 -797560 -432695 287457 844193 911442 593752 174876 -120500 -145491 136636
36132 136636 559366 816008 684902 186145 -428650 -812038 -767823 -454458 -230036 -204151
36122 -204151 -97630 314128 796766 930715 684621 449820 514285 733526 784205 592374
36112 592374 411773 493614 715102 638927 74104 -530132 -556755 -77913 177295 -166004
36102 -166004 -632412 -685959 -501686 -478434 -442334 -3486 581463 654659 165305 -281991
36092 -281991 -374488 -384532 -464313 -370679 -56175 146675 151114 275055 532727 452792 -65250
36081 -65250 -402912 -172088 138027 -5155 -310614 -276587 -134407 -409539 -911106 -969958
36071 -969958 -494235 -42392 57238 -23536 -163304 -445054 -744539 -772515 -583159 -500465
36061 -500465 -505372 -245747 286321 643845 600988 421487 330464 228832 80053 73513 214895
36050 214895 235448 112838 203178 621957 979261 1016025 1019996 1249407 1404641 1133661
36040 1133661 685430 531531 603542 466041 97625 -72824 94300 187591 -154031 -761725
36030 -761725 -1213053 -1301300 -1076797 -656760 -185134 147564 213294 49232 -207345 -436865
36020 -436865 -558065 -506556 -265823 86581 393413 504428 393394 206375 142613 246028
36010 246028 349464 256958 -56253 -443011 -721020 -778100 -611711 -327374 -70652 69437
36000 69437 71118 -71554 -312575 -475055 -360918 -10524 272473 260326 71987 -9828
35990 -9828 87295 181275 130809 8763 -63224 -119612 -275969 -495138 -555936 -307580 112611
35979 112611 400370 406654 254391 130205 63452 -40432 -236229 -474300 -629679 -553796
35969 -553796 -212125 153976 150076 -330158 -888270 -1027612 -716060 -364747 -301371 -475314
35959 -475314 -675219 -817730 -959480 -1180494 -1516276 -1891566 -2093220 -1926347 -1432631 -869857
35949 -869857 -468429 -270742 -162907 18426 330902 581591 472606 38610 -243572 -26532
35939 -26532 398578 491537 220101 15400 53921 87580 31691 180947 633585 974718
35929 974718 845650 468427 278742 341016 471874 673894 1032273 1332059 1194008 585108
35919 585108 -100842 -491052 -562129 -527281 -553554 -590937 -414079 93666 669471 866485
35909 866485 607495 325850 412715 744326 936125 844337 595308 315648 77946 -41551
35899 -41551 -70095 -149273 -260138 -158277 202143 446604 277983 -54421 -131406 20302
35889 20302 85846 35591 88998 243573 310618 335577 506554 694588 583933 266101 200446
35878 200446 516183 832778 868377 751539 613374 375791 128409 202310 592776 783992
35868 783992 496847 182877 349900 752972 756573 272492 -175498 -217259 5130 224761
35858 224761 367453 409575 259548 -85186 -463256 -707761 -743079 -543339 -187761 58042
35848 58042 -44762 -361476 -464769 -159700 243363 309229 20318 -202639 6535 549587
35838 549587 978247 984263 718339 566973 646455 666746 374537 -21677 -65920 358799
35828 358799 880054 1110020 1064046 989145 941911 745824 329023 -93138 -236611 -39576
35818 -39576 322831 620751 700032 534150 268379 151525 282564 456111 412010 210741
35808 210741 149301 283603 314724 94046 -38918 284357 839596 1017006 619698 102284
35798 102284 -52811 119742 280038 256606 95165 -161836 -481826 -716481 -699382 -453785
35788 -453785 -146030 135643 399488 584352 576298 422145 332718 381724 376965 191874 83400
35777 83400 417311 1091483 1516460 1289888 663776 162158 -55907 -186161 -309763 -322121
35767 -322121 -281054 -396662 -600988 -551469 -223837 -76182 -364222 -704994 -684607 -520537
35757 -520537 -639234 -900063 -829441 -450725 -234110 -259164 -98713 346008 540679 131629
35747 131629 -459661 -624463 -364178 -124010 -121775 -225437 -311801 -394342 -480787 -557314 -644399
35736 -644399 -698920 -577100 -256681 32178 62749 -104645 -219017 -115102 175298 440325
35726 440325 379481 -105698 -665321 -812169 -536487 -281565 -232832 -78072 327188 562684
35716 562684 300273 -72493 3964 409008 599791 500527 501535 650111 501189 -111848
35706 -111848 -718172 -850658 -631363 -472964 -518793 -630667 -690724 -664999 -522380 -301237
35696 -301237 -155844 -173125 -221664 -118622 115893 298228 339644 334036 359227 310760 75724
35685 75724 -147618 66982 797873 1467520 1438639 852293 471072 652110 943125 860320
35675 860320 551358 347587 143331 -268147 -608217 -474004 -63064 94559 6234 165120
35665 165120 645874 916531 673126 259014 45302 -77036 -321523 -567390 -590002 -400640
35655 -400640 -135837 80711 19550 -509289 -1190965 -1320738 -679570 93056 332054 182314
35645 182314 212096 525826 741460 642641 376575 112555 -68767 -20918 312944 605820
35635 605820 403274 -274885 -914200 -1140095 -1069757 -963161 -839060 -600096 -306065 -111954
35625 -111954 -39759 27492 165730 322345 388802 313423 164737 91506 165454 250226 104665
35614 104665 -324830 -764956 -859051 -561928 -210802 -144792 -325522 -454593 -425199 -456208
35604 -456208 -714599 -1011062 -1032389 -731757 -313547 32861 183912 17180 -427322 -813179
35594 -813179 -826995 -577344 -396906 -333181 -183177 30877 49513 -139998 -248248 -189194
35584 -189194 -189100 -269390 -113717 330254 605423 419921 125500 137930 287564 221028 106707
35573 106707 353865 802274 793275 79748 -789368 -1089491 -629370 192143 783302 807033
35563 807033 451784 246688 459766 799938 894071 840217 974084 1272088 1388185 1188473
35553 1188473 841939 425127 -143955 -756880 -1102745 -1095452 -986039 -968535 -971777 -903079
35543 -903079 -786382 -585240 -214506 167798 218897 -70443 -229409 81887 558172 631776
35533 631776 227157 -162113 -122806 210614 422660 371020 280400 307071 247398 -139223
35523 -139223 -673109 -940714 -910563 -966787 -1225885 -1272423 -850796 -391085 -413269 -743399
35513 -743399 -840084 -644495 -514451 -481896 -235313 205500 471306 550674 833907 1301454
35503 1301454 1361102 783367 161381 40388 146018 -42645 -424832 -540600 -357822 -214652
35493 -214652 -186661 -66963 132932 181094 105578 224775 645724 1086839 1263608 1169230
35483 1169230 929686 639512 401007 315019 366137 452107 530461 608375 631349 544987 432242
35472 432242 418701 459387 377800 107376 -241584 -533320 -693966 -681519 -514317 -316638
35462 -316638 -202186 -116011 80377 351477 435014 122153 -435852 -768472 -517646 136583
35452 136583 594137 502983 191845 212277 545070 617568 142852 -455221 -628443 -369634
35442 -369634 -42501 160742 280200 317655 236178 119283 70063 53308 40096 142668
35432 142668 366374 415777 54392 -479390 -721724 -529659 -84631 486973 1108654 1475502
35422 1475502 1240645 518792 -179698 -581753 -863693 -1154625 -1212632 -795526 -81810 497229
35412 497229 686558 524879 193354 -98996 -182109 -12745 315603 652638 833801 734633
35402 734633 439095 272528 446989 730819 736913 500601 428032 632927 724615 430285
35392 430285 52133 -2449 138411 41622 -313411 -504971 -374226 -314354 -651413 -1083371
35382 -1083371 -1086970 -695252 -434753 -494880 -432358 84364 656437 703543 370180 336020
35372 336020 789659 1177234 1084090 794916 704286 685365 468269 259266 477413 1088022
35362 1088022 1646750 1864376 1758634 1429477 1081205 1088251 1609269 2278487 2678806 2917132
35352 2917132 3273658 3548111 3390966 3108263 3382321 4213072 4916300 5272751 5876746
35343 5876746 7101160 8504100 9661751 10874957 12509572 14208809 15360024 15907713
35335 15907713 16102118 15790998 14602146 12645818 10485149 8522664 6862752 5627334
35327 5627334 4921229 4547188 4169165 3725105 3362111 3071641 2728894 2383296 2163841
35318 2163841 1995983 1739454 1479335 1331848 1108502 587140 16525 -97714 306993
35309 306993 770584 930106 823878 561062 111278 -452892 -834406 -790682 -349091 287536
35299 287536 853814 1088008 962771 825247 1012195 1345005 1326714 830281 234766 -143505
35289 -143505 -359308 -487601 -368401 93806 677352 1105359 1342138 1461881 1438846 1248509
35279 1248509 1005538 838265 753409 723906 752780 760059 592605 272076 74261 224538
35269 224538 618075 930380 911113 537620 20051 -304390 -229795 116486 435899 589570
35259 589570 615530 516273 307491 212767 433016 701005 496585 -161951 -578057 -277967
35249 -277967 327829 510073 144798 -288130 -391511 -155303 240584 526195 368978 -279410
35239 -279410 -910962 -939281 -455929 -118477 -242022 -432497 -282260 -6983 -57440 -378199
35229 -378199 -479489 -167393 196339 234124 29079 -108704 -111296 -133569 -196356 -150683 6614
35218 6614 72590 -14800 -29107 179924 396414 341323 94710 -49807 -21874 30789 80411
35207 80411 202655 277752 114967 -97809 86600 671296 1072219 917815 578971 556885
35197 556885 706342 538320 56000 -260188 -236104 -234307 -509924 -801595 -776001 -528289
35187 -528289 -365458 -323808 -195842 76916 303474 313834 139791 -68129 -147209 40554
35177 40554 486635 898567 875044 368092 -143038 -125984 393561 869184 863119 429867
35167 429867 -138370 -651252 -950684 -793213 -127696 640496 989098 842488 525377 232435
35157 232435 -97458 -387800 -334831 130095 621676 748050 532680 228855 -17867 -125045
35147 -125045 35203 423772 703685 598658 257814 32438 19604 62787 84924 159281
35137 159281 305246 434516 480396 439271 338189 253767 242111 171359 -161303 -613767
35127 -613767 -685453 -165389 478796 692044 577135 643318 986493 1197786 1028235 665781
35117 665781 313604 -61713 -445239 -619735 -468492 -162263 75763 151748 -5146 -414852
35107 -414852 -796867 -670339 86530 988902 1435682 1285865 830128 393523 126894 27221
35097 27221 -12698 -99664 -207129 -243746 -258735 -385109 -546887 -481735 -169446 15983 -227505
35086 -227505 -701391 -953951 -826769 -552738 -393923 -375603 -362686 -266977 -160591 -215318
35076 -215318 -491297 -791997 -835610 -587399 -296308 -172984 -167281 -101398 114777 431655
35066 431655 673940 592487 94688 -536085 -857430 -762793 -546437 -426604 -290998 -43846
35056 -43846 107612 -36119 -301574 -380733 -281487 -242811 -299818 -246441 -13900 205266 269636
35045 269636 288490 399547 519700 468186 253367 76863 46400 29021 -109810 -221691
35035 -221691 -31592 414175 707234 619158 441590 537647 756930 651972 171726 -253684
35025 -253684 -303174 -67101 235118 438601 325280 -193940 -709927 -649647 -143230 7571
35015 7571 -498232 -920089 -554490 199558 476208 225066 116986 402984 653502 603574
35005 603574 512171 543426 441314 80039 -181334 -17524 360819 528150 388785 131668
34995 131668 -118477 -323517 -379329 -228350 -47102 -73727 -246566 -205648 265848 896035
34985 896035 1148390 831443 374423 333263 669070 782323 332794 -285673 -492711 -262381
34975 -262381 -12897 30425 -401 36266 132475 247510 280120 27339 -507265 -888848
34965 -888848 -708312 -160915 223106 304520 333284 342485 128446 -171345 -114551 303805
34955 303805 542321 340995 80094 63977 34297 -255687 -536282 -529960 -475517 -643870
34945 -643870 -763424 -504114 -185213 -351274 -856565 -1036922 -715856 -404496 -457832 -606199
34935 -606199 -473615 -95334 268873 460671 365930 -137950 -916042 -1458453 -1291585 -473977
34925 -473977 429070 836622 599504 48016 -352031 -412006 -289951 -189798 -145596 -150332
34915 -150332 -276939 -509692 -658568 -660431 -763830 -1120014 -1372061 -1048462 -283447 291036
34905 291036 391434 379520 597557 849192 810463 608689 604673 771311 691771 177312
34895 177312 -443075 -761349 -779038 -767507 -782414 -591336 -119356 290537 264315 -92764
34885 -92764 -335470 -285592 -198518 -274653 -336730 -172607 85876 186808 143564 108157 48122
34874 48122 -108003 -147471 186860 666049 717239 193930 -365398 -423495 -97279 96479
34864 96479 -59627 -294330 -273982 945 253320 269737 112617 -12439 -43917 -101100
34854 -101100 -216067 -220542 -38951 91064 -71272 -371987 -467220 -349533 -336673 -536502
34844 -536502 -663821 -471553 -70574 293655 531940 656565 653696 534512 345415 62433
34834 62433 -334003 -654211 -634445 -336003 -102809 -17608 244360 815656 1241671 1021553
34824 1021553 320110 -211996 -204659 157403 532203 766549 852244 814304 707929 569124
34814 569124 352933 45259 -197233 -174245 94005 357570 396980 206069 -62099 -245440
34804 -245440 -283870 -237067 -182348 -118965 -64032 -184877 -613170 -1112111 -1224162 -874962
34794 -874962 -534579 -576939 -771778 -699988 -406941 -259764 -340253 -414960 -416886 -503183 -632833
34783 -632833 -532433 -176882 89317 56945 -63412 -33322 49824 -1090 -110700 -84735
34773 -84735 70668 199340 230327 165560 -40744 -386105 -695280 -784691 -694633 -604297 -582037
34762 -582037 -570071 -551398 -571968 -634831 -706213 -783097 -833183 -739944 -468681 -234177 -308806
34751 -308806 -658482 -945602 -933945 -741632 -632136 -678652 -720771 -584250 -274974 21217
34741 21217 120823 54297 49118 213597 302480 -17634 -656949 -1070452 -847438 -174349 417469
34730 417469 617601 498034 270250 119988 188631 438033 550438 243445 -282950 -499741
34720 -499741 -224523 162967 316228 385803 617039 798057 540674 -35616 -364037 -181722
34710 -181722 179108 316554 208386 27663 -132495 -169956 72310 514636 731697 389243
34700 389243 -350581 -1032341 -1342280 -1189656 -610547 141229 601923 512075 133316 -84866
34690 -84866 -36001 68776 81167 -21529 -287606 -653689 -787524 -460002 17991 151651
34680 151651 -14951 -11227 251443 351915 138314 34832 318043 639522 632315 501061
34670 501061 557060 601909 334015 33074 183088 594498 595697 85750 -275788 -66399
34660 -66399 320619 358650 139348 78585 243603 377784 371140 335180 333431 340436 386484
34649 386484 502463 606689 650675 752353 956169 1010378 690671 245968 157534 461693
34639 461693 687121 551839 361447 519790 933057 1173507 1063012 814702 671436 653115
34629 653115 656628 608650 482142 286019 67394 -139195 -332074 -451024 -369976 -117266
34619 -117266 10129 -214798 -540606 -452851 142189 725851 807230 512841 306550 307534
34609 307534 218388 -106493 -369215 -242862 155719 423969 401148 312975 382241 496756
34599 496756 384447 10030 -364411 -500508 -421247 -298339 -246699 -310600 -512404 -766204
34589 -766204 -839574 -587179 -180850 73132 113696 122144 169877 132531 -10374 -82024 -22485
34578 -22485 -8273 -95518 -42193 264854 480863 241078 -276436 -610300 -682018 -750245 -778707
34567 -778707 -395538 401225 996943 893259 336858 -79262 -167200 -171191 -246751 -286874
34557 -286874 -211550 -115031 -84576 -74769 -3167 154636 366467 538325 540678 350792 135930
34546 135930 89171 213829 353686 370344 193053 -204852 -711565 -1024119 -899953 -481318
34536 -481318 -200555 -313393 -654472 -898208 -926738 -854339 -791790 -720993 -595083 -459552
34526 -459552 -412484 -473490 -561387 -616668 -663170 -684602 -546120 -204836 61751 -103554 -607461
34515 -607461 -883171 -573004 -21452 156774 -146822 -475877 -453172 -177423 41283 67487
34505 67487 -22548 -80805 29407 327314 612977 620061 338793 40106 -81160 -114437 -197989
34494 -197989 -263438 -173469 12245 82886 -67680 -358993 -653513 -864402 -966998 -974501
34484 -974501 -875578 -597351 -143392 228187 177354 -259521 -596063 -460212 -41915 247640
34474 247640 364028 543323 766509 750845 492065 366346 531000 618987 305366 -123842
34464 -123842 -118501 392884 954662 1197746 1172893 1073877 932008 685647 364621 97758
34454 97758 10956 128449 300349 277120 -30279 -420902 -646690 -676342 -561889 -218981
34444 -218981 354701 759434 518701 -227041 -755315 -640641 -253186 -188736 -525271 -904144
34434 -904144 -1081097 -1082112 -974307 -773485 -510519 -215429 67542 172433 -41872 -322326
34424 -322326 -154052 492727 929167 637202 39682 -104504 232087 484653 478714 553639
34414 553639 770329 766420 516754 491962 791741 809858 175944 -545235 -608215 -118400
34404 -118400 221705 102575 -173418 -278485 -191018 -28796 71807 -28304 -291994 -448771
34394 -448771 -366843 -314503 -561305 -897936 -898378 -532025 -170701 -83113 -250736 -586198 -973362
34383 -973362 -1143770 -885222 -399774 -146068 -279062 -497433 -482137 -260086 -86368 -139897
34373 -139897 -373371 -562137 -525288 -356345 -315854 -435594 -456845 -286492 -207195 -394919
34363 -394919 -545450 -326298 78117 279745 304317 440724 673293 756792 702417 682509
34353 682509 596993 287094 47368 282225 706616 593807 -118273 -679960 -648036 -442571
34343 -442571 -517973 -662296 -529553 -296201 -306199 -491471 -600894 -653471 -743669 -718474 -464904
34332 -464904 -235705 -276546 -368411 -142896 334076 659378 628011 373664 125435 70719
34322 70719 282745 572840 627902 466514 457681 699278 782673 465375 137510 205861 420687
34311 420687 324512 29412 -31533 123024 105980 -138486 -308706 -324073 -362976 -385998 -192820
34300 -192820 57958 -42395 -468144 -717190 -551582 -282838 -192251 -142576 52839 286300
34290 286300 380690 331714 185630 -2948 4594 463816 1153039 1432537 1018268 372424
34280 372424 93825 214655 354734 312580 204658 180243 271884 450213 629500 677355
34270 677355 560625 424962 425525 529970 552680 333074 -131794 -647724 -924830 -832329
34260 -832329 -549894 -366823 -374597 -473931 -591050 -698300 -698911 -519959 -278680 -140953 -69657
34249 -69657 55954 143093 -14508 -378770 -684524 -781486 -697081 -434680 -26735 279156
34239 279156 246881 25244 -64146 -45220 -176676 -393152 -366831 -123984 -45707 -193118
34229 -193118 -215921 -47630 -61689 -337049 -429051 -174191 -60310 -385149 -688922 -540857
$$ [...]
##END NTUPLES=NMR SPECTRUM
##END=
