##TITLE=31Pdec_SR26_oil
 CDCl3, 124 sc
 15.12.2020
##JCAMPDX= 6.0         $$ Bruker NMR JCAMP-DX V2.0
##DATA TYPE= NMR SPECTRUM
##DATA CLASS= NTUPLES
##ORIGIN= UXNMR, Bruker Analytische Messtechnik GmbH
##OWNER= root
$$ XWIN-NMR		Version 3.5
$$ Tue Dec 15 13:27:28 2020 Russian Standard Time (UT+4h)  she@DPX200
##.OBSERVE FREQUENCY= 81.013821
##.OBSERVE NUCLEUS= ^31P
##.ACQUISITION MODE= SIMULTANEOUS
##.ACQUISITION SCHEME= undefined
##.AVERAGES= 124
##.DIGITISER RES= 17
##SPECTROMETER/DATA SYSTEM= spect
##.PULSE SEQUENCE= zgpg30
##.SOLVENT NAME= DMSO
##.SHIFT REFERENCE= (INTERNAL, DMSO, 0, 182.463)
##AUDIT TRAIL= $$ (NUMBER, WHEN, WHO, WHERE, WHAT)
$$ ##TITLE= Audit trail, XWIN-NMR		Version 3.5
$$ ##JCAMPDX= 5.01
$$ ##ORIGIN= Bruker BioSpin GmbH
$$ ##OWNER= she
$$ F:/spectra/data/she/nmr/P31/1/pdata/1/auditp.txt
$$ ##AUDIT TRAIL=  $$ (NUMBER, WHEN, WHO, WHERE, WHAT)
(   1,<2020-12-15 13:23:51.12 +0400>,<she>,<DPX200>,
      <continue with go, POWCHK disabled, PULCHK disabled
       configuration hash MD5:
       00 E9 B6 7A A2 85 ED C7 34 08 36 98 17 FE 4E 26
       data hash MD5: 32K
       EE BB B9 14 EB F6 5E AF 4C E3 30 89 EA 7A D7 2E>)
(   2,<2020-12-15 13:26:25.46 +0400>,<she>,<DPX200>,
      <Start of raw data processing
       efp BC_mod = 2 LB = 1 FT_mod = 6 PKNL = 1 PHC0 = -2448.528 PHC1 = 22.4007 SI = 64K 
       data hash MD5: 64K
       83 C8 F8 74 03 8E 6F D1 D7 CD BC D3 3A B7 18 80>)
(   3,<2020-12-15 13:26:31.26 +0400>,<she>,<DPX200>,
      <abs ABSG = 5 
       data hash MD5: 64K
       84 D9 B1 20 94 4A 8F C6 EC 0D C1 6E 02 0C 3A 15>)
(   4,<2020-12-15 13:26:54.37 +0400>,<she>,<DPX200>,
      <pk PHC0 = 174.8492 PHC1 = -450.9999 
       data hash MD5: 64K
       BD C1 DF E6 29 A4 38 D2 BC C6 A6 23 2C EF 4D 2F>)
(   5,<2020-12-15 13:26:57.28 +0400>,<she>,<DPX200>,
      <abs ABSG = 5 
       data hash MD5: 64K
       A4 E4 BE 40 BF C6 38 C9 3D 5A 5D 42 ED 5A 75 A4>)
$$ ##END=
$$ 
$$ hash MD5
$$ 37 BC D4 4B 0E 0D 8B 5F 0C E6 F5 9C 05 71 0D 1A
##$RELAX= 
##$RELAX= 
##$RELAX= 
##$RELAX= 
##$RELAX= 
##$RELAX= 
##$RELAX= 
##$RELAX= 
$$ Bruker specific parameters
$$ --------------------------
##$DU= <F:/spectra>
##$EXPNO= 1
##$NAME= <P31>
##$PROCNO= 1
##$TYPE= <nmr>
##$USER= <she>
##$AMP= (0..31)
100 100 100 100 100 100 100 100 100 100 100 100 100 100 100 100 100 100 
100 100 100 100 100 100 100 100 100 100 100 100 100 100 
##$AQSEQ= 0
##$AQ_mod= 1
##$AUNM= <au_zg>
##$AUTOPOS= <>
##$BF1= 81.014009
##$BF2= 200.13
##$BF3= 200.13
##$BF4= 200.13
##$BF5= 200.13
##$BF6= 200.13
##$BF7= 200.13
##$BF8= 200.13
##$BYTORDA= 1
##$CFDGTYP= 0
##$CFRGTYP= 5
##$CHEMSTR= <none>
##$CNST= (0..31)
1 1 145 1 1 1 1 1 1 1 1 1 1 1 1 1 1 1 1 1 1 1 1 1 1 1 1 1 1 1 1 1 
##$CPDPRG= <waltz16>
##$CPDPRG1= <>
##$CPDPRG2= <waltz16>
##$CPDPRG3= <>
##$CPDPRG4= <mlev>
##$CPDPRG5= <mlev>
##$CPDPRG6= <mlev>
##$CPDPRG7= <mlev>
##$CPDPRG8= <mlev>
##$CPDPRGB= <>
##$CPDPRGT= <>
##$D= (0..31)
0 1 0 0 0 0 0 0 0 0 0 0.03 2e-05 3e-06 0 0 0 0 0 0 0 0 0 0 0 0 0 0 0 0 
0 0 
$$ [...]
##$SUBNAM3= <"">
##$SUBNAM4= <"">
##$SUBNAM5= <"">
##$SUBNAM6= <"">
##$SUBNAM7= <"">
##$SUBNAM8= <"">
##$SUBNAM9= <"">
##$SW= 369.568048894756
##$SWIBOX= (0..15)
0 1 3 0 0 0 0 0 0 0 0 0 0 0 0 0 
##$SW_h= 29940.119760479
##$TD= 32768
##$TD0= 1
##$TE= 0
##$TE2= 300
##$TE3= 300
##$TEG= 300
##$TL= (0..7)
0 120 53 12 22 120 120 120 
##$TP= (0..7)
150 150 150 150 150 150 150 150 
##$TP07= 0
##$TPNAME0= <>
##$TPNAME1= <>
##$TPNAME2= <>
##$TPNAME3= <>
##$TPNAME4= <>
##$TPNAME5= <>
##$TPNAME6= <>
##$TPNAME7= <>
##$TPOAL= (0..7)
0.5 0.5 0.5 0.5 0.5 0.5 0.5 0.5 
##$TPOFFS= (0..7)
0 0 0 0 0 0 0 0 
##$TUNHIN= 0
##$TUNHOUT= 0
##$TUNXOUT= 0
##$USERA1= <user>
##$USERA2= <user>
##$USERA3= <user>
##$USERA4= <user>
##$USERA5= <user>
##$V9= 5
##$VALIST= <valist>
##$VCLIST= <CCCCCCCCCCCCCCC>
##$VD= 0
##$VDLIST= <DDDDDDDDDDDDDDD>
##$VPLIST= <PPPPPPPPPPPPPPP>
##$VTLIST= <TTTTTTTTTTTTTTT>
##$WBST= 1024
##$WBSW= 4
##$XGAIN= (0..3)
0 0 0 0 
##$XL= 0
##$YL= 0
##$YMAX_a= 47865
##$YMIN_a= -26705
##$ZGOPTNS= <>
##$ZL1= 120
##$ZL2= 120
##$ZL3= 120
##$ZL4= 120
##$ABSF1= 182.463
##$ABSF2= -187.1042
##$ABSG= 5
##$ABSL= 3
##$ALPHA= 0
##$AQORDER= 0
##$ASSFAC= 0
##$ASSFACI= 0
##$ASSFACX= 0
##$ASSWID= 0
##$AUNMP= <proc_1d>
##$AZFE= 0.1
##$AZFW= 0.5
##$BCFW= 0
##$BC_mod= 2
##$BYTORDP= 0
##$COROFFS= 0
##$CY= -3
##$DATMOD= 1
##$DC= 0
##$DFILT= <>
##$DTYPP= 0
##$F1P= 0
##$F2P= 0
##$FCOR= 1
##$FTSIZE= 65536
##$FT_mod= 6
##$GAMMA= 0
##$GB= 0
##$INTBC= 1
##$INTSCL= 5.30512e-09
##$ISEN= 30
##$LB= 1
##$LEV0= 0
##$LPBIN= 0
##$MAXI= 10000
##$MC2= 0
##$MEAN= 0
##$ME_mod= 0
##$MI= 50
##$NCOEF= 0
##$NC_proc= -9
##$NLEV= 6
##$NOISF1= 182.463
##$NOISF2= 159.3651
##$NSP= 0
##$NTH_PI= 0
##$NZP= 0
##$OFFSET= 182.463
##$PC= 4
##$PHC0= -2273.679
##$PHC1= -428.5992
##$PH_mod= 1
##$PKNL= yes
##$PPARMOD= 0
##$PSCAL= 0
##$PSIGN= 0
##$REVERSE= no
##$SF= 81.014009
##$SI= 65536
##$SIGF1= 159.3651
##$SIGF2= -187.1042
##$SINO= 113.3802
##$SIOLD= 16384
##$SREGLST= <1H.CDCl3>
##$SSB= 0
##$STSI= 65536
##$STSR= 0
##$SW_p= 29940.119760479
##$SYMM= 0
##$S_DEV= 0
##$TDeff= 32768
##$TDoff= 0
##$TI= <>
##$TILT= no
##$TM1= 0
##$TM2= 0
##$TOPLEV= 0
##$USERP1= <user>
##$USERP2= <user>
##$USERP3= <user>
##$USERP4= <user>
##$USERP5= <user>
##$WDW= 1
##$XDIM= 65536
##$YMAX_p= 478879350
##$YMIN_p= -164316874
$$ End of Bruker specific parameters
$$ ---------------------------------
##NTUPLES= NMR SPECTRUM
##VAR_NAME=  FREQUENCY,     SPECTRUM/REAL,   SPECTRUM/IMAG
##SYMBOL=    X,             R,               I
##VAR_TYPE=  INDEPENDENT,   DEPENDENT,       DEPENDENT
##VAR_FORM=  AFFN,          ASDF,            ASDF
##VAR_DIM=   65536,         65536,           65536
##UNITS=     HZ,            ARBITRARY UNITS, ARBITRARY UNITS
##FACTOR=    0.456856943014862, 1,           1
##FIRST=     14782.0589164895, 0,            0
##LAST=      -15158.0608439895, 0,           0
##MIN=       -15158.0608439895, -164316874,  0
##MAX=       14782.0589164895, 478879350,    0
$$ Real data points
##PAGE= N=1
##DATA TABLE= (X++(R..R)), XYDATA
$$ [...]
44605D815568J4527759M392246p808587j508871J7171495K2416154P267141j0265627
$$ 4815568 19343327 23735573 15926986 14418115 31589610 54005764 61272905 51007278
44597E1007278j6529539j5259779j2243049o731986M7728K952936J674673J400007
$$ 51007278 34477739 19217960 6974911 242925 290653 3243589 4918262 6318269
44589F318269N371160J3707732K4132037K6666462Q166486k6180105m7650451
$$ 6318269 11689429 25397161 49529198 76195660 84362146 58182041 10531590
44582A0531590l6415049q830733N894378N466312Q061324J5712594J3750025L814011
$$ 10531590 -25883459 -34714192 -28819814 -23353502 -15292178 420416 14170441 17984452
44574A7984452M649714J5177644R805692j7079919l3403204j6136534J1458688
$$ 17984452 22634166 37811810 47617502 30537583 -2865621 -19002155 -7543467
44567g543467J5402969J783049J80181J1393689Q766287j2462994k4560119j2626899
$$ -7543467 7859502 9642551 9822732 21216421 29982708 17519714 -7040405 -19667304
44559a9667304K613920J136699n685723K537J0457380R298876K679260N807008
$$ -19667304 -17053384 -15916685 -21602408 -21599871 -11142491 -1843615 835645 6642653
44551F642653J0729090j021355j9246213j3263502J6976550L2519440J1362911
$$ 6642653 17371743 16350388 -2895825 -16159327 817223 33336663 44699574
44544D4699574j8479331k2754796j0891990j3839658l1856840l8000083k3200433
$$ 44699574 26220243 3465447 -7426543 -21266201 -53123041 -91123124 -114323557
44537a14323557l867653J1472879K8915852M0823115K6002935j1114046l2921285
$$ -114323557 -118191210 -106718331 -77802479 -36979364 -10976429 -22090475 -55011760
44530e5011760j7536890R713950J3275009m573002j4300887k704333J6510560
$$ -55011760 -72548650 -62834700 -49559691 -54132693 -68433580 -71137913 -54627353
44523e4627353K6867989K4114237J1465886n088866j8721530k6569625k7307028
$$ -54627353 -27759364 -3645127 7820759 2731893 -15989637 -42559262 -69866290
44516f9866290j2644836K3093692O0483547O4848893L0909457n401417j5783566
$$ -69866290 -82511126 -59417434 1066113 65915006 96824463 91423046 75639480
44509G5639480j4854907k4908474l3692001k0407174j99779j012593j1449524
$$ 75639480 60784573 35876099 2184098 -18223076 -18422855 -19435448 -30884972
44502c0884972J956002L2261821L5769041J415739l0093550k7162770m722072
$$ -30884972 -28928970 3332851 39101892 40517631 10424081 -16738689 -21460761
44495b1460761J3338837K7474562L8190899K7559780p607277l5086151k8355690
$$ -21460761 -8121924 19352638 57543537 85103317 77496040 42409889 14054199
44488A4054199m128428O844435K946850o15065m648384j6916046k7574566k2200489
$$ 14054199 9925771 16770206 19717056 19101991 14453607 -2462439 -30037005 -52237494
44480e2237494o215972P355728J9008462K8884606K1771023o089462k4900807
$$ -52237494 -58453466 -51097738 -32089276 -3204670 18566353 12476891 -12423916
44473a2423916r241394J8300585J7600253q489602k3717232j8405951j5498213
$$ -12423916 -21665310 -3364725 14235528 5745926 -17971306 -36377257 -51875470
44466e1875470j9671567p577094K3637525M1878832K9436158R499626N269513
$$ -51875470 -71547037 -79124131 -55486606 -13607774 15828384 25328010 30597523
44459C0597523N747512o284118k0796997j9829512q928469m954816p448297l557507
$$ 30597523 36345035 30060917 9263920 -10565592 -19494061 -24448877 -31897174 -35454681
44451c5454681Q954682K0507431K3164513J4447893j600162j0013307K522377
$$ -35454681 -26499999 -5992568 17171945 31619838 30019676 20006369 22528746
44444B2528746K2771253J9063992j3494635l7891683k2985661J3216214K9226110
$$ 22528746 45299999 64363991 50869356 12977673 -10007988 3208226 32434336
44437C2434336J3177836j1772053k2378524j3926739N715635K0529518J4449102
$$ 32434336 45612172 33840119 11461595 -2465144 3250491 23780009 38229111
44430C8229111p149065j6321167r03110J2994170L21903k0100953j4649247Q539273
$$ 38229111 31080046 14758879 13855769 26849939 27171842 7070889 -7578358 960915
44422I60915J2477610o630337j5422729l541292k47683j7271661k1385345Q909472
$$ 960915 13438525 6808188 -8614541 -12155833 -12403516 -29675177 -51060522 -42151050
44414d2151050L7799126K0940794k5050448m3077031j4566836K0893011K5684457
$$ -42151050 -4351924 16588870 -8461578 -51538609 -66105445 -45212434 -19527977
44407a9527977J0596719R591479K9882669M4104844K6696043j2583214l6205780
$$ -19527977 -8931258 660221 30542890 74647734 101343777 88760563 52554783
44400E2554783k1631943Q811003J2768884j7694684m4563981l4118546P17619
$$ 52554783 30922840 39733843 52502727 34808043 -9755938 -43874484 -43156865
44393d3156865K2834423J8566411L395151o445881n962946N213718J9003046J6606306
$$ -43156865 -20322442 -1756031 1639120 -4806761 -10769707 -5555989 13447057 30053363
44385C0053363p054949k5399370j3015358J2110150J1948020j0693154j4980443
$$ 30053363 22998414 -2400956 -15416314 -3306164 8641856 -2051298 -17031741
44378a7031741R187459J9911631r173464m0503404k5538078K1606152M3003797
$$ -17031741 -7844282 12067349 2893885 -37609519 -63147597 -41541445 1462352
44371A462352J5983449k3754073l4619798j3002730J7718793L5567164L0623091
$$ 1462352 17445801 -6308272 -40928070 -53930800 -36212007 -644843 29978248
44364B9978248P251745j5439550j7363570J880230K2097323K3038256J768506
$$ 29978248 37229993 21790443 4426873 6307103 28404426 51442682 53211188
44357E3211188k5722262l5367415j6437481J1508421J6231775l938640j3238378
$$ 53211188 27488926 -7878489 -24315970 -12807549 3424226 -514414 -13752792
44350a3752792J0175930L8627401L5567588J0249669k884804k509215j4361518
$$ -13752792 -3576862 35050539 70618127 80867796 77982992 75473777 61112259
44343F1112259l5179114l2750961n801852O831792q864111j6827019N924412K6813692
$$ 61112259 25933145 -6817816 -12619668 -5787876 -14651987 -31479006 -25554594 1259098
44335A259098J1855352j6642196j7137717O069103J8110495J1755704N880588
$$ 1259098 13114450 -3527746 -20665463 -14596360 3514135 15269839 21150427
44328B1150427J823189j2676918k5185406j0835090J9087240K5862291M320850
$$ 21150427 22973616 10296698 -14888708 -25723798 -6636558 19225733 23546583
44321B3546583q761925L477358J1350642q108314l0831172k5617332l384848N319632
$$ 23546583 14784658 18262016 29612658 21504344 -9326828 -34944160 -38329008 -33009376
44313c3009376J96300L653217J5045420Q917984j9010670l5666211j4877493K2402598
$$ -33009376 -32813076 -29159859 -14114439 -5196455 -24207125 -59873336 -74750829 -52348231
44305e2348231L3143671R934250r782645K033961K2770407J3305666j9918175
$$ -52348231 -19204560 -9270310 -19052955 -17018994 5751413 19057079 -861096
44298h61096l0075869P67819L4218618L4154899J7574971J6791914K1341930J189322
$$ -861096 -30936965 -30169146 4049472 38204371 55779342 72571256 93913186 95102508
44290I5102508l1292522l4135032n638339J0446917m769670k0205894j3903463
$$ 95102508 63809986 29674954 24036615 34483532 29713862 9507968 -4395495
44283d395495p694550j8849447k2575206L306800L2768907K9619537M543431m773521
$$ -4395495 -12090045 -30939492 -53514698 -50207898 -17438991 12180546 16723977 11950456
44275A1950456Q959694K2098368K1717031J2845216l003854k2998050k9201581
$$ 11950456 20910150 43008518 64725549 77570765 74566911 51568861 22367280
44268B2367280j3435317k579344k1515457m3622641k3369704K7915992M9907877
$$ 22367280 8931963 6352619 -15162838 -58785479 -82155183 -54239191 -4331314
44261d331314K2045722p371652J633817K2705529J2611697j9583048l1983737
$$ -4331314 17714408 10342756 11976573 34682102 47293799 27710751 -4272986
44254d272986j4992191K838213L194936l533609o183972q719969j3371976j1342918
$$ -4272986 -19265177 -16426964 -13232028 -16765637 -22949609 -31669578 -45041554 -56384472
44246e6384472R25051J2103608J1725895N441759O106689J4999864J9075972O677368
$$ -56384472 -55459421 -43355813 -31629918 -26188159 -20081470 -5081606 13994366 20671734
44238B0671734j6879957l1374382k1898733K712368J6574658N395317j5854986
$$ 20671734 3791777 -27582605 -49481338 -46768970 -30194312 -24798995 -40653981
44231d0653981j9614857K150032K9138489L6527035K1095710l12470j3236037
$$ -40653981 -60268838 -58118806 -28980317 7546718 28642428 28329958 15093921
44224A5093921j7702798j7520737r066724R125021K2514164J2739753j4700403
$$ 15093921 -2608877 -20129614 -29196338 -20071317 2442847 15182600 482197
44217D82197l1122829k0187681J798345J1504654R951781J2432864J8791379J4672681
$$ 482197 -30640632 -50828313 -49029968 -37525314 -27573533 -15140669 3650710 18323391
44209A8323391k372700j8162937k2237981j5148375L035276L1197127N2623591
$$ 18323391 15950691 -2212246 -24450227 -39598602 -36563326 -5366199 47257392
44202D7257392M4071710P560750k4475193k5755867m688720J1565716Q554045
$$ 47257392 91329102 98889852 74414659 48658792 43970072 55535788 64089833
44195F4089833q025459k3860306k6097702j2203864M046152N470526n017039p032480
$$ 64089833 56064374 32204068 6106366 -6097498 -2051346 3419180 -1597859 -8630339
44187h630339O232364J6718957J0041332l133258p445616o597612r384987q761003
$$ -8630339 -2397975 14320982 24362314 21229056 13783440 7185828 -2199159 -10960162
44179a0960162K955558J1664496J125429j3502062k228311L0676544M5601474
$$ -10960162 -8004604 3659892 4785321 -8716741 -10945052 19731492 65332966
44172F5332966K2996829r379672j9362018j4536934k0210521l2067677k2466818
$$ 65332966 88329795 78950123 59588105 45051171 24840650 -7227027 -29693845
44165b9693845J0397240L1071198J4316792j9159205l1273259j5833741J591508
$$ -29693845 -19296605 11774593 26091385 6932180 -24341079 -40174820 -38583312
44158c8583312N194673N219078J0299105R149314n888216j6966624m488049J9241085
$$ -38583312 -33388639 -28169561 -17870456 -8721142 -14609358 -31575982 -36064031 -16822946
44150a6822946K5589770J3252870P824666J6315242J3439956j4677755m1924596
$$ -16822946 8766824 22019694 29844360 46159602 59599558 44921803 2997207
44143B997207l8340911j2550843P203347J6526636K8751709L7221120K0396401
$$ 2997207 -35343704 -47894547 -40691200 -24164564 4587145 41808265 62204666
44136F2204666j5309822l3526767j8766587J463216O55147r010043n642972K56298
$$ 62204666 46894844 13368077 -5398510 -3935294 -3280147 -12290190 -17933162 -17676864
44128a7676864j4320151l6088643k5296927K2601330N9855856M6409918J364094
$$ -17676864 -31997015 -68085658 -93382585 -70781255 -10925399 35484519 36848613
44121C6848613k6295642j9685299j602437P705044J0116941Q729954j926843j6140795
$$ 36848613 10552971 -9132328 -10734765 -3029721 7087220 15817174 13890331 -2250464
44113b250464j3842283Q101309K3292298J2363368p575353j1343192m271938m697050
$$ -2250464 -16092747 -7991438 15300860 27664228 20088875 8745683 4473745 -223305
44105b23305n362430J0404713K4237284N12498m8272765o2365240j8695942L0264275
$$ -223305 -5585735 4818978 29056262 29568760 -18704005 -81069245 -99765187 -69500912
44097f9500912L0129264j248706j1148883P108356J7604511Q550472N108673J8088667
$$ -69500912 -39371648 -40620354 -51769237 -44660881 -27056370 -18505898 -13397225 4691442
44089D691442K5461460J2777596m848312j1783627j2207222j0827860j508871
$$ 4691442 30152902 42930498 38082186 26298559 14091337 3263477 1754606
44082A754606J2931482J5208762Q08167j2077047j1994490j1099709j9727423
$$ 1754606 14686088 29894850 30703017 18625970 6631480 -4468229 -24195652
44075b4195652k6651839j9836255o244306M342918J4755771K3936957J7691489
$$ -24195652 -50847491 -70683746 -76928052 -72585134 -57829363 -33892406 -16200917
44068a6200917m077320j3581016N778259K6704220J5600179j2846082j6102870
$$ -16200917 -20278237 -33859253 -28080994 -1376774 14223405 1377323 -14725547
44061a4725547Q207408J6215347j3793689m4921922l3078600J1630487L9853425
$$ -14725547 -6518139 9697208 -4096481 -49018403 -82097003 -70466516 -30613091
44054c0613091K5663670r290545l0040266k6155136j0879306L114731J5001356
$$ -30613091 -4949421 -14239966 -44280232 -70435368 -81314674 -78199943 -63198587
44047f3198587K5565849K7724568J5454125k482300r256682j839933N281123K876986
$$ -63198587 -37632738 -9908170 5545955 3063655 -6193027 -8032960 -2751837 125149
44039A25149J073958J1162372K4005324K0731481J84597j7336762j3123124J1115127
$$ 125149 1199107 12361479 36366803 57098284 57282881 39946119 26822995 37938122
44031C7938122L5335609L7247107J2378244j7299784k4524723j1265816o404394
$$ 37938122 73273731 110520838 122899082 105599298 81074575 69808759 63404365
44024F3404365k0861489k8436580j0125375Q288491m344274k7945352j8487317
$$ 63404365 42542876 14106296 3980921 12269412 7925138 -20020214 -38507531
44017c8507531J7936846L0426851O015601r118068R992896K1721605j0083498
$$ -38507531 -20570685 9856166 15871767 6753699 16746595 38468200 28384702
44010B8384702m6894075l2036365J5798609K8691136m123308k1782782R672567
$$ 28384702 -18509373 -50545738 -34747129 -6055993 -10179301 -31962083 -22289516
44003b2289516M5631399L4979044n139183k3998791j3330607n514631j3102726
$$ -22289516 23341883 58320927 53181744 29182953 15852346 10337715 -2765011
43996b765011j3912787M386105K1649747J7534141L20886j0515804j2254668j3830572
$$ -2765011 -16677798 -12291693 9358054 26892195 27213081 16697277 4442609 -9387963
43988i387963j5393168j0458741k469699j958602p619393n924077O906467J7137080
$$ -9387963 -24781131 -35239872 -37709571 -39668173 -47287566 -53211643 -46305176 -29168096
43980b9168096J4675513Q069724P218173M284065j0797554k5129263j6133264
$$ -29168096 -14492583 -6422859 795314 5079379 -5718175 -30847438 -46980702
43973d6980702J1935375K8830816J9798238K940078k664836j958680m047859j931937
$$ -46980702 -35045327 -6214511 13583727 16523805 13858969 11900289 7852430 5920493
43965E920493Q072446Q769718j0232903k5473843j0874472J7807375K4844292
$$ 5920493 13992939 22762657 12529754 -12944089 -23818561 -6011186 18833106
43958A8833106J1702312J1205186K5293756J5402997l0161176o2687215l7117366
$$ 18833106 30535418 41740604 67034360 82437357 52276181 -10411034 -47528400
43951d7528400K0037037M2614626R540501l5553262m4378694j5468886J6803700
$$ -47528400 -27491363 15123263 24663764 -10889498 -55268192 -70737078 -53933378
43944e3933378K3819132O240389j3298543j5017402p34479J3250473J8423983
$$ -53933378 -30114246 -23873857 -37172400 -52189802 -52924281 -39673808 -21249825
43937b1249825J8135242J1241747q456130l0608271k9038617J543190K9734839
$$ -21249825 -3114583 8127164 -328966 -30937237 -59975854 -58432664 -28697825
43930b8697825K7051025N825730l652196K552827N898942J58178o467419j5126577
$$ -28697825 -1646800 4178930 526734 3079561 8978503 9136681 2669262 -12457315
43922a2457315l1461265m0996185k1212222J9504036M4386188L6135435J6397856
$$ -12457315 -43918580 -84914765 -106126987 -86622951 -42236763 -6101328 10296528
43915A0296528R816885J3387838J2621316O734452L936616O621266J2303558J7638156
$$ 10296528 20113413 33501251 46122567 52857019 56793635 63414901 75718459 93356615
43907I3356615J5080459j607358k3778366l3527001k6354348j3940776l635465
$$ 93356615 108437074 106829716 83051350 49524349 23170001 9229225 5593760
43900E593760O602798J2345986M799851p669493n396166Q941725J0139849o723266
$$ 5593760 12196558 24542544 29342395 21672902 16276736 25218461 35358310 28635044
43892B8635044j4271288P80455J1532346m772667k5765052j8769552O660107J6873619
$$ 28635044 14363756 15144211 26676557 21903890 -3861162 -22630714 -15970607 903012
43884I03012Q131481M059484R112507M951372q313349o902808J3254881K2689847
$$ 903012 9034493 13093977 22206484 27157856 18844507 11941699 25196580 47886427
43876D7886427J818914k9074333l9152526k4944483l159160J5980941K9862134
$$ 47886427 49705341 20631008 -18521518 -43466001 -46625161 -30644220 -782086
43869g82086L0989785J3737468j0298384j9543309o764887J2637161J8616204
$$ -782086 30207699 43945167 33646783 14103474 7338587 19975748 38591952
43862C8591952Q120737l071434Q46039J5986678K0656742J66658l2562110m7381235
$$ 38591952 46712689 43641255 44487294 60473972 81130714 81297372 48735262 1354027
43854A354027k9680833J389033J1962320q185731l0407295j8502621K3185331
$$ 1354027 -28326806 -26937773 -14975453 -23161184 -53568479 -72071100 -48885769
43847d8885769M6800668J8860101l1302798m4528205q195732L0213408K9594363
$$ -48885769 -2085101 16775000 -14527798 -59056003 -67251735 -37038327 -7443964
43840g443964K306943j8084267k2229307j4847496R568245M6807849O1439081
$$ -7443964 -5137021 -23221288 -45450595 -60298091 -50729846 -3921997 57517084
43833E7517084K5760900l0472655m8210978j4300744K5778647L0682866O837777
$$ 57517084 83277984 52805329 4594351 -9706393 16072254 46755120 53592897
43826E3592897j4315363j4491937K183356J6792276J0067814j3570840k2552494
$$ 53592897 39277534 24785597 26968953 43761229 53829043 40258203 17705709
43819A7705709K52222K4820987J3275213k0368915k9969746j0075417j218356
$$ 17705709 17957931 42778918 56054131 35685216 5715470 -4359947 -5578303
43812e578303j9400546l1007874j2706472J1076547J3547275P256901J2975892
$$ -5578303 -24978849 -55986723 -68693195 -57616648 -44069373 -36812472 -23836580
43805b3836580K1448809J5509523K718209j147109K148034O001034J2838805J6174972
$$ -23836580 -2387771 13121752 15839961 14692852 16840886 22841920 35680725 51855697
43797E1855697k192615l6071461m7707539k1157292R741419J3650704P012625
$$ 51855697 49663082 13591621 -34115918 -55273210 -45531791 -31881087 -24868462
43790b4868462J5166150K4724797J4692587J670578Q271254J5889350r56534j9566134
$$ -24868462 -9702312 15022485 29715072 31385650 39656904 55546254 54589720 35023586
43782C5023586m356728K3790465J5243483k3784855l8836681j5788362L334252
$$ 35023586 30666858 54457323 69700806 45915951 7079270 -8709092 -5374840
43775e374840k005603k577737J6296405K4039303L130848j6209537r542494Q70694
$$ -5374840 -7380443 -9958180 6338225 30377528 33508376 17298839 7756345 8627039
43767H627039q711104j9538212p907768R039467L954231j2376139j2251428R29620
$$ 8627039 -84065 -19622277 -27530045 -18490578 -14536347 -26912486 -39163914 -38234294
43759c8234294M047331j786455M449961K3752260L3961791K3499686K701596j5816905
$$ -38234294 -34186963 -35973418 -31523457 -7771197 26190594 49690280 52391876 36574971
43751C6574971k6764181k5474672j1198386M728139R750989O665777O538987R757471
$$ 36574971 9810790 -15663882 -26862268 -22134129 -12383140 -5717363 821624 10579095
43743A0579095P146628l824488j5447512j9568122j3179860R57892J3231217J3434697
$$ 10579095 17725723 13901235 -1546277 -21114399 -34294259 -33336367 -20105150 -6670453
43735f670453L188600n927625r384151j2718390j4711233m866121J4473758K1439114
$$ -6670453 -3481853 -9409478 -18793629 -31512019 -46223252 -51089373 -36615615 -15176501
43727a5176501L043118k3490722l1120593j4500872R303949K1697921J5867409
$$ -15176501 -12133383 -35624105 -66744698 -81245570 -71941621 -50243700 -34376291
43720c4376291o20185j0686347n792986K66071q322739j8216018k895006K8869631
$$ -34376291 -34996476 -45682823 -51475809 -51209738 -59532477 -77748495 -80643501 -51773870
43712e1773870L6387539J0120930p955568J0594738L3541293J9148367j7804276
$$ -51773870 -15386331 -5265401 -13220969 -2626231 30915062 50063429 32259153
43705C2259153l2070869j6396070J72537O516688J6115815K6872356J9124728
$$ 32259153 188284 -16207786 -16035249 -9518561 6597254 33469610 52594338
43698E2594338m720743j7159102p331679O014015P111787m2399r248412j8082637
$$ 52594338 47873595 30714493 23382814 29396829 36508616 36466217 27217805 9135168
43690I135168j5759663N899890K9131035K7771959P573643l045266l93379n123143
$$ 9135168 -6624495 -724605 28406430 56178389 63752032 60706766 60313387 55190244
43682E5190244j4067334K78090L1324006L0554211j6598435n4204208l3238934
$$ 55190244 41122910 41401000 72725006 103279217 86680782 32476574 -762360
43675g62360J2650522J6789974k0711436l7827597o945942K9071380K7716323
$$ -762360 11888162 28678136 7966700 -29860897 -36806839 -7735459 19980864
43668A9980864O368979M522056J9031613J3882830j7924536l9772614k5287918
$$ 19980864 26349843 30871899 49903512 63786342 45861806 6089192 -19198726
43661a9198726L014407Q873954l625139j062368K1388469K9943429Q962122r719230
$$ -19198726 -16184319 -7310365 -10935504 -11997872 9390597 39334026 48296148 38576918
43653C8576918J315533J6404764j912403l6292394l7642805m317901J5197534
$$ 38576918 39892451 56297215 54384812 18092418 -19550387 -23868288 -8670754
43646h670754J521501q644869R047883K3888951N735002k0927760j7324419Q582571
$$ -8670754 -7149253 -15794122 -6746239 17142712 22877714 1949954 -15374465 -6791894
43638f791894K2716791K0610295J9197335J2845185j5109720m6751282m2698264
$$ -6791894 15924897 36535192 55732527 68577712 53467992 6716710 -35981554
43631c5981554j878311L2365007L1391933J1194943l539033j1238776j7925152
$$ -35981554 -37859865 -5494858 25897075 37092018 33552985 22314209 4389057
43624D389057j9931317j7192886j9979955k7906403k3084916J111647K3072491
$$ 4389057 -15542260 -32735146 -52715101 -80621504 -103706420 -102594773 -79522282
43617g9522282K0779237K054284q560088j934462J0932640J7589451J4465856
$$ -79522282 -58743045 -56688761 -65248849 -67183311 -56250671 -38661220 -24195364
43610b4195364M683669l806290k605490O924633J3022845Q697888M79745l516186
$$ -24195364 -19511695 -23317985 -25923475 -18998842 -5975997 2721891 3201636 -314550
43602c14550n344525r233285j0290346j653885J2010353J8196706J1998332P49614
$$ -314550 -5659075 -14892360 -25182706 -26836591 -14826238 3370468 15368800 16118414
43594A6118414n264701j374288J0169873K2197930K6714561K0516479O702008
$$ 16118414 10853713 9479425 19649298 41847228 68561789 89078268 95780276
43587I5780276r340987k2434442k6951353k0372816r648452p096962j5330511
$$ 95780276 86439289 64004847 37053494 16680678 7032226 -64736 -15395247
43580a5395247k1530342j2550319P148331J8432251Q844493j1829513j9572687
$$ -15395247 -36925589 -49475908 -42327577 -23895326 -15050833 -26880346 -46453033
43573d6453033j687006K6272118L5017042J6147047o039003n784619R837831J3295568
$$ -46453033 -48140039 -21867921 13149121 29296168 23257165 17472546 27310377 40605945
43565D0605945j855629j3205961o238843L810315j357892j3466037j2863088j122842
$$ 40605945 38750316 25544355 19305512 23115827 21757935 8291898 -4571190 -5694032
43557e694032K436277p774648j5083296n243542J4697295K6060973J7989854m655247
$$ -5694032 -3257755 -11032403 -26115699 -31359241 -16661946 9399027 27388881 22733634
43549B2733634k5510320k8275285j0646491J3015713K6674314K6588218J6783073
$$ 22733634 -2776686 -31051971 -41698462 -28682749 -2008435 24579783 41362856
43542D1362856M09850j4748869j3435974P611978K5400670J6682157o938221j4752436
$$ 41362856 41772706 27023837 13587863 21199841 46600511 63282668 56344447 41592011
43534D1592011n629032r184416l1802096l7899867o005826K9114935K4020643
$$ 41592011 35962979 26778563 -5023533 -42923400 -48929226 -19814291 4206352
43527D206352o565632j2183302J4617230K7914850J422934l1466911k9145532
$$ 4206352 -2359280 -14542582 74648 27989498 29412432 -2054479 -31200011
43520c1200011N46800J9914202J5066134J668320p941614j4454967j5273973n432813
$$ -31200011 -30653211 -10739009 4327125 5995445 -1946169 -16401136 -31675109 -37107922
43512c7107922N686276K042831j1391329r900113J4460606L6046444K8132626
$$ -37107922 -31421646 -29378815 -40770144 -50670257 -36209651 -163207 27969419
43505B7969419m86094j7727146j1728233m054334j4815627l0221261k0938774
$$ 27969419 27483325 9756179 -1972054 -6026388 -20842015 -51063276 -72002050
43498g2002050J2459703L4123215K1469020p61006M448392L0308753L4992000
$$ -72002050 -59542347 -25419132 -3950112 -4711118 -262726 30046027 65038027
43491F5038027M651166k5658758k4221202m581757L931122N19278J417856M922272
$$ 65038027 69689193 44030435 19809233 15227476 19158598 19677876 21095732 26018004
43483B6018004j479639j2441812j3402609q214746q750246o219738J4485046L8137916
$$ 26018004 24538365 12096553 -1306056 -9520802 -18271048 -24490786 -10005740 28132176
43475B8132176L2908245N53386k2147324j5407910L499369J5659798K0784162
$$ 28132176 61040421 61593807 39446483 24038573 27537942 43197740 63981902
43468F3981902J6978064j602574j8475349p202581J7615283P173732m3389033
$$ 63981902 80959966 79357392 60882043 53679462 71294745 78468477 35079444
43461C5079444p1848755l6154813K0017520L1709078M580437q865285L690789
$$ 35079444 -36769311 -72924124 -52906604 -21197526 -16617089 -25482374 -21791585
43454b1791585Q743302o783158k0335332k0880650k0577786j8572504M4210K5479807
$$ -21791585 -13048283 -19831441 -40166773 -61047423 -81625209 -100197713 -100153503 -74673696
43446g4673696K8270071R839437M991550K3990662L3976820J2635136j7984438
$$ -74673696 -46403625 -36564188 -31572638 -7581976 26394844 39029980 21045542
43439B1045542k8679842j9882027l600079J8194752L6839886K9984058m040521
$$ 21045542 -7634300 -27516327 -31116406 -12921654 23918232 53902290 49861769
43432D9861769l0232299k0471760O870081J4030618o185836k8803350l0998113
$$ 49861769 19629470 -842290 6027791 20058409 13872573 -14930777 -45928890
43425d5928890r552934K3429407M6745865M3858716K1848334L410974n963654
$$ -45928890 -55481824 -32052417 14693448 58552164 80400498 83811472 77847818
43418G7847818k1525054m2795612m3291981j3296184J6612246J8275698N747451
$$ 77847818 56322764 13527152 -29764829 -43061013 -26448767 -8173069 -2425618
43411b425618N154737R884640n80250j6799969j2623766Q527043J8011048Q525503
$$ -2425618 2729119 12613759 12033509 -4766460 -17390226 -8863183 9147865 17673368
43403A7673368J644776P895325J0857844k730472k2420334l1707395k7644175
$$ 17673368 19318144 27213469 38071313 35340841 12920507 -18786888 -46431063
43396d6431063j6355915k972060R580595K0787178L0863269L2894783J6049539
$$ -46431063 -62786978 -65759038 -56178443 -35391265 -4527996 28366787 44416326
43389D4416326j3254828k7245648j0121513J7582205K6369286J5420698J785225
$$ 44416326 31161498 3915850 -6205663 11376542 37745828 53166526 54951751
43382E4951751j1436183k8020993l4060090j4468447J4121369K1487348R447605
$$ 54951751 43515568 15494575 -18565515 -33033962 -18912593 2574755 12022360
43375A2022360M018548O824866m819098k8276426l0328231k093500K1913767J5869874
$$ 12022360 16040908 22865774 18046676 -10229750 -40557981 -42651481 -20737714 -4867840
43367d867840l175651j1783364j5159333k2600087k0622201R62864K1831227J9017887
$$ -4867840 -8043491 -19826855 -34986188 -57586275 -78208476 -77245612 -55414385 -36396498
43359c6396498K225893n016329j183852K054114O926350J9977468K9023853J7626610
$$ -36396498 -34170605 -39186934 -40370786 -38316672 -31390322 -11412854 17610999 35237609
43351C5237609o063404j8977144j4314712l169181N238057N946589o396481k3723671
$$ 35237609 29174205 10197061 -4117651 -7286832 -2048775 3897814 -2498667 -26222338
43343b6222338k0573369J1619735M0542410L1674223j616059j8703889j2015938
$$ -26222338 -46795707 -35175972 5366438 37040661 35424602 16720713 4704775
43336D704775q890354j7209399j1859590J6002159L5240545J9550472j2314291
$$ 4704775 -4185579 -21394978 -33254568 -17252409 17988136 37538608 25224317
43329B5224317k2955197m565869J8393909K2384701N292235j7691976k7770628
$$ 25224317 2269120 -2296749 16097160 38481861 43774096 26082120 -1688508
43322a688508j8412240k565302L247480J046487M589748J3372325J3757234O345996
$$ -1688508 -20100748 -22666050 -19418570 -18372083 -13782335 -410010 13347224 19693220
43314A9693220P078876J5666569J0685121j2587650k7939069j9075954o908689
$$ 19693220 26772096 42438665 53123786 40536136 12597067 -6478887 -13387576
43307a3387576j2648711j9917015m492997J9876855K2960972J0660145J3583966
$$ -13387576 -26036287 -45953302 -50446299 -30569444 -7608472 3051673 16635639
43300A6635639K8858905J9739296j9987877m6089180k7557579O914543J2660206
$$ 16635639 45494544 65233840 45245963 -843217 -28400796 -21486253 -8826047
43293h826047r253216k4255427j7472006k511279R680413J8671009J8369252L756032
$$ -8826047 -18079263 -42334690 -59806696 -62317975 -52637562 -33966553 -15597301 -11841269
43285a1841269r245224p19176J6625192R733189k0973074l4194368q076662K4437234
$$ -11841269 -21086493 -21805669 -5180477 4552712 -16420362 -50614730 -58691392 -34254158
43277c4254158K3744489J73811q404028L310981P062231p363777j7303687q020497
$$ -34254158 -10509669 -10335858 -18739886 -15428905 -8366674 -15730451 -33034138 -41054635
43269d1054635N080958O666257N743286J2972575J6844992L959357j3245743j2447571
$$ -41054635 -35973677 -29307420 -23564134 -10591559 6253433 10212790 -3032953 -15480524
43261a5480524M488908J5972818J3623730P845563J851270j5235742m1866103
$$ -15480524 -10991616 4981202 18604932 26450495 28301765 13066023 -28800080
43254b8800080n1520698k2773127K7363068N5348345L6694620p792515l3253142
$$ -28800080 -80320778 -103093905 -75730837 -20382492 16312128 8519613 -24733529
43247b4733529j6771559J8475093K8296311m75578l0597280j8444323K8075432
$$ -24733529 -41505088 -23029995 5266316 4790738 -25806542 -44250865 -16175433
43240a6175433N5545681L2345857j2852281l3569057k5030636j6070570j5946563
$$ -16175433 39370248 71716105 58863824 25294767 264131 -15806439 -31753002
43233c1753002n058690K0004887K9467745O374558j9236516j0255817K0882045
$$ -31753002 -36811692 -16806805 12660940 19035498 -201018 -10456835 10425210
43226A0425210K8084306j730966l0487875k2870952R016679K7673424J7454058
$$ 10425210 38509516 36778550 6290675 -16580277 -7563598 20109826 37563884
43219C7563884n035372j5751951n815066J3431095K0678399P138494r830561q356097
$$ 37563884 32528512 16776561 10961495 24392590 45070989 52209483 42378922 34022825
43211C4022825L612354k021375k5476524l1308804m086749K0504036Q389612j7227622
$$ 34022825 37635179 35613804 10137280 -21171524 -25258273 -4754237 3635375 -13592247
43203a3592247j1921045J8124770K7255956M964683j0949280k4135J0875580j041034
$$ -13592247 -25513292 -7388522 19867434 24832117 13882837 13858702 24734282 23693248
43195B3693248j5717978o795506J5841082K5465372J6120820o45614j5189453
$$ 23693248 7975270 1179764 17020846 42486218 58607038 57961424 42771971
43188D2771971j8629366m942468J1217464N288198j5048811j2468512J7426871
$$ 42771971 24142605 19200137 30417601 35705799 20656988 8188476 25615347
43181B5615347K8329580k610915k8126992l168367L6505115K6862660k2220633
$$ 25615347 53944927 51334012 23207020 20038653 56543768 83406428 61185795
43174F1185795m4543650k1794872N55850j175641O31200J7783125J8295855j0748116
$$ 61185795 16642145 -5152727 -4596877 -5772518 -5141318 12641807 30937662 20189546
43166B0189546l2666616k3764847j3042376k4955834l1900495n186823K8595664
$$ 20189546 -12477070 -36241917 -49284293 -74240127 -106140622 -111327445 -82731781
43159h2731781K8753328N860664r29731J2894602K2898847K5156944L3308837
$$ -82731781 -53978453 -48117789 -49047520 -36152918 -13254071 11902873 45211710
43152D5211710L8878564K0113957j4953094l4983326l2399715k6919258k3888177
$$ 45211710 84090274 104204231 89251137 54267811 21868096 -5051162 -28939339
43145b8939339p062856K2958417L8059144K0924621j1392685l1216351k8232067
$$ -28939339 -36002195 -13043778 25015366 45939987 34547302 3330951 -24901116
43138b4901116r216672J1972682K0895270J4410230O220888P822430J0770751
$$ -24901116 -34117788 -22145106 -1249836 13160394 19381282 27203712 37974463
43131C7974463L945178l185624K490573Q946748l745858k5163080k5805343l055802
$$ 37974463 41919641 38734017 41224590 50171338 46425480 21262400 -4542943 -7598745
43123g598745J7055416K2366332K3882628K1892802J564286l0377443m3110991
$$ -7598745 9456671 31823003 55705631 77598433 79162719 48785276 5674285
43116E674285k8698701j5411584j8408736j3742211J6080829M4218084L6737709
$$ 5674285 -23024416 -38436000 -56844736 -70586947 -54506118 -10288034 26449675
43109B6449675L263554j9399791j6772122k779195R471851J6841104J5198267
$$ 26449675 29713229 10313438 -6458684 -9237879 233972 17075076 32273343
43102C2273343J924287j4929354k4086839k1708949q220434J1775218K1702370
$$ 32273343 34197630 19268276 -4818563 -26527512 -34747946 -22972728 -1270358
43095a270358P232950j3942261n253922L2229172M9863329K0079771j9972838
$$ -1270358 5962592 -7979669 -13233591 18995581 68858910 88938681 68965843
43088F8965843k4798380o891062n526251j8575641j6988921p473618k1684611
$$ 68965843 44167463 37276401 31750150 13174509 -3814412 -11288030 -32972641
43081c2972641m8962901m0393061J1640228N3144547M5962295J7406068P748480
$$ -32972641 -81935542 -122328603 -110688375 -57543828 -11581533 5824535 13573015
43074A3573015J0247701l396721k8645789l6394815j9818787j060028L043850
$$ 13573015 23820716 20423995 -8221794 -44616609 -64435396 -65495424 -62451574
43067f2451574j285095j0836J0379529K0318333J7730913L527206n595604J907961
$$ -62451574 -63736669 -63747505 -53367976 -33049643 -15318730 -11791524 -17387128 -15479167
43059a5479167J4767182J6594188J2400591J5082598J4752691n932630l0195214
$$ -15479167 -711985 15882203 28282794 43365392 58118083 52185453 21990239
43052B1990239k1697438J4440090K9374817L386872k3665306j6934632K758545
$$ 21990239 292801 14732891 44107708 47494580 23829274 6894642 9653187
43045I653187L940639k047218O750611J3827233l805495k2660032o043032K7845639
$$ 9653187 13593826 11546608 18297219 32124452 28318957 5658925 -384107 27461532
43037B7461532K7397544j0911039l7519554k6362900m377108J926494P24164M077563
$$ 27461532 54859076 43948037 6428483 -19934417 -24311525 -22385031 -21660867 -17583304
43029a7583304O782769J0069116K6061659M3872375L1421820j0802364l6972731
$$ -17583304 -10800535 -731419 25330240 69202615 100624435 89822071 52849340
43022E2849340j9526248J0406627J2017512q500714j9405133j2998815k182398
$$ 52849340 33323092 43729719 55747231 47246517 27841384 14842569 12660171
43015A2660171R345623K1338643J9794467l315164k7010892k5936525n663755
$$ 12660171 22005794 43344437 63138904 59823740 32812848 6876323 1212568
43008A212568J0769599J6155104J3969498j434854k8854260m1257437j8167222
$$ 1212568 11982167 28137271 42106769 40671915 11817655 -29439782 -47607004
43001d7607004J5220263J8355025m592783j4850350l168937J279345j1527498
$$ -47607004 -32386741 -14031716 -18624499 -33474849 -36643786 -35364441 -46891939
42994d6891939j3441677R096035K6386405J3263898r088141p574654J2560412
$$ -46891939 -60333616 -51237581 -24851176 -11587278 -20675419 -28250073 -15689661
42987a5689661K1941174J3195946L096419m9334l051018o879342l393055P174127
$$ -15689661 6251513 19447459 22543878 22494544 19443526 12564184 9171129 16345256
42979A6345256J4043208J1989154N425084l049039j4984716k6706288k9017795
$$ 16345256 30388464 42377618 47802702 44753663 29768947 3062659 -25955136
42972b5955136j7964263R30706J7670125K1804270Q000720j3233205j7859375
$$ -25955136 -43919399 -42988693 -25318568 -3514298 4486422 -8746783 -26606158
42965b6606158M676924L1273740K8904503j457136k2726060r560611J8112805
$$ -26606158 -21929234 9344506 38249009 36791873 14065813 4505202 22618007
42958B2618007K1815150n992600l4695090l4150849n813688K5831992L9058972
$$ 22618007 44433157 38440557 3745467 -30405382 -36219070 -10387078 28671894
42951B8671894K6519333n571031l6925594l9741626l967044M2156718N3208578
$$ 28671894 55191227 49620196 12694602 -27047024 -31014068 11142650 64351228
42944F4351228J6650941k9808556m0761852j3258394J7084272K0969112Q76922
$$ 64351228 81002169 51193613 10431761 -2826633 14257639 35226751 36103673
42937C6103673k2866561l3478584k5118317n221453P673411K036545q856812j951892
$$ 36103673 13237112 -20241472 -45359789 -50581242 -42907831 -40871286 -49728098 -51679990
42929e1679990K0815247L1163506J4490023q083346j0460148K355026O944322
$$ -51679990 -30864743 298763 14788786 6705440 -3754708 -1399682 5544640
42922E544640j153530m072335P701660K0940179J9604729N387302p719050j1257553
$$ 5544640 4391110 318775 8020435 28960614 48565343 53952645 46233595 34976042
42914C4976042q845822q185319j0697335j0435237l739102L205650K396794k057366
$$ 34976042 26130220 17944901 7247566 -3187671 -6926773 -3721123 -1324329 -3381695
42906c381695J975431J4917823K1600333J2423990l079135j1253735j1562322
$$ -3381695 -1406264 13511559 35111892 47535882 44456747 33203012 21640690
42899B1640690r682255m928913L624476Q673502N339801J092890K112210O75385
$$ 21640690 11958435 7029522 10653998 19327500 24667301 25760191 27872401 28547786
42891B8547786q489387j2091607M94681J1725879q31437k3237523k0592552O540014
$$ 28547786 20058399 7966792 8461473 20187352 19355915 -3881608 -24474160 -17934146
42883a7934146J8549947o75439j6068151J679510K5571988J3232086k4134107
$$ -17934146 615801 -59638 -16127789 -14448279 11123709 24355795 221688
42876B21688l5308882m784829K5300019J6057575j7405759l1691191j0740748
$$ 221688 -35087194 -39872023 -14572004 1485571 -15920188 -47611379 -58352127
42869e8352127K1311501L2334371J4536881j0501090j3702569R113155K7322387
$$ -58352127 -37040626 -4706255 9830626 -670464 -14373033 -5259878 22062509
42862B2062509R902000l0724884m7943927j9554474K3852019M1001431K9189978
$$ 22062509 31964509 1239625 -46704302 -66258776 -42406757 -1405326 27784652
42855B7784652J2744154K501950n486045n262880J0106700K0337299k857517m4196591
$$ 27784652 40528806 43030756 37544711 32281831 42388531 62725830 59868313 15671722
42847A5671722n2144433j1650069K9093193K7379224L924362j303220L778261
$$ 15671722 -36472711 -48122780 -19029587 8349637 12273999 10970779 14749040
42840A4749040j1483766l2381502j6142730K8540617M2277175O969861k2774119
$$ 14749040 3265274 -29116228 -45258958 -16718341 25558834 32528695 9754576
42833I754576o600376J7753458q96864m2013818m6181560o731388K7882151L1756715
$$ 9754576 3154200 20907658 20010794 -22003024 -68184584 -74915972 -47033821 -15277106
42825a5277106K6283972K6388692J5108652j3243333k8881382j0286341J8961457
$$ -15277106 11006866 37395558 52504210 39260877 10379495 93154 19054611
42818A9054611K3136579K580215j5348280j7198676j1000522l712552M508513
$$ 19054611 42191190 44771405 29423125 12224449 1223927 -2488625 2019888
42811B019888P238022m992380k5204059l0225009q114460K3959625L7496503K4407761
$$ 2019888 9257910 4265530 -20938529 -51163538 -59277998 -35318373 2178130 26585891
42803B6585891L220211o262552n310219o642566j0483790n629643O212176O912455
$$ 26585891 29806102 23543550 18233331 11590765 1106975 -4522668 1689508 8601963
42795H601963q556029j7984954l509245J7895724J6466588q168391k9192636k9522866
$$ 8601963 45934 -17939020 -21448265 -3552541 12914047 4745656 -24446980 -53969846
42787e3969846j3818832Q941188K8524584K4990259j0931655m8847703m4186339
$$ -53969846 -67788678 -58847490 -30322906 -5332647 -16264302 -65112005 -109298344
42780a09298344P18852L4876422K9152666J2968041K0838332L6465795K1852125
$$ -109298344 -108579492 -73703070 -44550404 -31582363 -10744031 25721764 47573889
42773D7573889k0586923n0491235m4396706j7777074M462397J4436619J7281449
$$ 47573889 26986966 -23504269 -67900975 -85678049 -81215652 -66779033 -49497584
42766d9497584J9597679K4767992K8811406K2058841K931719j5245122j9310422
$$ -49497584 -29899905 -5131913 23679493 45738334 48670053 33424931 14114509
42759A4114509j1196505n54909P956732J2481404J1078164R509291J7666679K8681531
$$ 14114509 2918004 2363095 10319827 22801231 33879395 43388686 61055365 89736896
42751H9736896J9525355j3595954l9669404l2177718o939431K204367r184311
$$ 89736896 109262251 95666297 55996893 23819175 16879744 19084111 9899800
42744I899800j9036582j7651682j4490462j1253711K886895K6955614M2000112
$$ 9899800 -9136782 -26788464 -41278926 -52532637 -49645742 -22690128 19309984
42737A9309984L4440263J1306504q893680j0966480N432255J9561882P121723
$$ 19309984 53750247 65056751 56163071 45196591 50628846 70190728 77312451
42730G7312451k4179546l5389931j0598094J3223281j263130l2807832l3698177
$$ 77312451 53132905 17742974 7144880 20368161 19105031 -13702801 -47400978
42723d7400978k641835K0724629K3181306K7665165L7363004K5345492r972945
$$ -47400978 -50042813 -29318184 -6136878 21528287 58891291 84236783 74263838
42716G4263838l1098639k0502605n964686p192504m863799J1948671J5681474
$$ 74263838 43165199 22662594 16697908 9505404 4641605 16590276 32271750
42709C2271750q558022k6222254q767303J3726024L021666j8434362n203246K8794207
$$ 32271750 23713728 -2508526 -11275829 2450195 5471861 -12962501 -18165747 10628460
42701A0628460K7901716j4649931m4960681l0983380j259147J1224981J3483683
$$ 10628460 38530176 23880245 -21080436 -52063816 -53322963 -42097982 -28614299
42694b8614299J9771623J7595933l952877k2746923j2456026J5377815K6169910
$$ -28614299 -8842676 8753257 4800380 -17946543 -30402569 -15024754 11145156
42687A1145156R049978j3959094j9967166q525916M640521M754758r215264k1293771
$$ 11145156 20195134 6236040 -13731126 -22257042 -17616521 -12861763 -22077027 -43370798
42679d3370798j2819545J3244683K9574772J5621441j4192709k5304602m945128
$$ -43370798 -56190343 -42945660 -13370888 2250553 -11942156 -37246758 -42191886
42672d2191886K2270274K4965269K793601j5837593j1590437L208147P025649
$$ -42191886 -19921612 5043657 7837258 -8000335 -19590772 -16382625 -9356976
42665i356976K101882P056207K1471183K3140589O761985j987321J1421649J9671178
$$ -9356976 -7255094 -198887 21272296 44412885 51174870 49187549 60609198 80280376
42657H0280376n455786l9502020l2236308J6121512M7433693K4360559k0750556
$$ 80280376 74824590 35322570 3086262 19207774 66641467 91002026 70251470
42650G0251470l5833565j7240493P14444K930028M879456J3853319J3688953m186652
$$ 70251470 34417905 17177412 17891856 20821884 25701340 39554659 53243612 49056960
42642D9056960k0555920j5275252N50948j864216k7194050m5365735k8938669
$$ 49056960 28501040 13225788 13776736 11912520 -15281530 -60647265 -89585934
42635h9585934J0451672L5351742K8114110Q489492K755566J0909453J5440280
$$ -89585934 -79134262 -43782520 -15668410 -7178918 -4423352 6486101 21926381
42628B1926381R985446K037910n804315j7070431k5007278j5518271R033599K7017634
$$ 21926381 31911827 33949737 28145422 11074991 -13932287 -29450558 -20416959 6600675
42620F600675K5131063J2158809j752744j9871258m0011794m0450570o953418
$$ 6600675 31731738 43890547 42137803 22266545 -17745249 -58195819 -65149237
42613f5149237L6784604N0141020K5394183m256200q895338M540864R630481l898452
$$ -65149237 -28364633 21776387 47170570 42914370 34019032 38559896 48190377 44291925
42605D4291925k2743909k9299526j7603306N689006K6805889L2066359J7486471
$$ 44291925 21548016 -7751510 -25354816 -19665810 7140079 39206438 56692909
42598E6692909n496599j7311656p453745J4529319K6960379J6878857p489620
$$ 56692909 51196310 33884654 26430909 40960228 67920607 84799464 77309844
42591G7309844k6547580k9560839k1122086r811758P58808P513559N108924m319244
$$ 77309844 50762264 21201425 79339 -9732419 -8973611 -1460052 3648872 -670372
42583f70372o722465O505720K1173810J4972503j0106144k5800125j4172837Q343299
$$ -670372 -7392837 -887117 20286693 35259196 25153052 -647073 -14819910 -6476611
42575f476611J5012864N049891j452840J514285j782966j8008118k8116571j5120633
$$ -6476611 8536253 13586144 12133304 13647589 11864623 -6143495 -34260066 -49380699
42567d9380699P396586J3981850N387015M725193J7273253K0067571L37372j9387306
$$ -49380699 -41984113 -28002263 -22615248 -17890055 -616802 19450769 19788141 400835
42559D00835j3044113Q697269J4258206o86656p928087Q448795K7736515K4519928
$$ 400835 -12643278 -3946009 10312197 9625541 1697454 10146249 37882764 62402692
42551F2402692M737586p971981r160424j4740210k8092945k8200676L1954L7094335
$$ 62402692 67140278 59168297 50007873 35267663 7174718 -21025958 -20994004 16100331
42543A6100331M5587228J4239108k6269023l6561869j1348216J8700692K5219895
$$ 16100331 61687559 75926667 49657644 13095775 1747559 20448251 45668146
42536D5668146J1402449j090335l607328o292034j5821788k2289316j3821847
$$ 45668146 57070595 55980260 52372932 46080898 30259110 7969794 -5852053
42529e852053N198662J8537546J6804578N951340r85718K715756J0527764Q314097
$$ -5852053 -653391 17884155 34688733 40640073 39654355 42370111 52897875 61211972
42521F1211972r095326k7173717k5580539n164107R746630L440525q125170o70992
$$ 61211972 52116646 24942929 -637610 -5801717 3944913 7385438 -739732 -1410724
42513a410724J9678897K2030429l235771k6426177j9145998M566807Q654559j2293418
$$ -1410724 18268173 40298602 37062831 10636654 -8509344 -3942537 4712022 -7581396
42505g581396k6303147j1811314J3119363K1373865J4980970J2236466J2365216
$$ -7581396 -33884543 -45695857 -32576494 -11202629 3778341 16014807 28380023
42498B8380023J316049j3374921o555652J9564062K6806094m411735l8844620
$$ 28380023 29696072 16321151 9765499 29329561 56135655 51723920 12879300
42491A2879300l2449137L656239J9166126l064832k6706337j7863725J1645792
$$ 12879300 -19569837 -15913598 3252528 187696 -26518641 -44382366 -32736574
42484c2736574K9399216K3787020L878989j9513872l3181251k1119507J2066224
$$ -32736574 -3337358 20449662 24328651 4814779 -28366472 -49485979 -37419755
42477c7419755L1731049J2533025k2395547k8477196o18873K2170320J4532124
$$ -37419755 -5688706 6844319 -15551228 -44028424 -44647297 -22476977 -7944853
42470g944853l061751p11313J7958646K7130588J5965602m239895j8992560j9622146
$$ -7944853 -11006604 -11717917 6240729 33371317 49336919 45097024 26104464 6482318
42462F482318k045826K5913943M1229608K6911796m980353k5842718k4219780
$$ 6482318 4436492 30350435 71580043 98491839 93511486 67668768 43448988
42455D3448988j2877779m803692J06520K985454n59774q280523q635345R65697
$$ 43448988 30571209 25767517 25874037 28859491 28299717 20019194 11383849 12349546
42447A2349546P256028J843167m918581j900151M629512M596778L119624R407352
$$ 12349546 19605574 21448741 16530160 14630009 19259521 23856299 26975923 36383275
42439C6383275J7973723J9632257K0675210K9110830L1654956J2216803j2729124
$$ 36383275 54356998 73989255 94664465 123775295 155430251 167647054 154917930
42432A54917930j0785679J3282822J8212633r981694l3327026k1767551j446928
$$ 154917930 144132251 157415073 175627706 165646012 132318986 110551435 109104507
42425A09104507j0455078l4600934k9366259Q853378L7030078K8500421K472135
$$ 109104507 98649429 64048495 34682236 43535614 80565692 109066113 111538248
42418A11538248j3955665j8190422j7003202j0116094k818132q969882k5889800
$$ 111538248 97582583 79392161 62388959 52272865 49454733 40484851 14595051
42411A4595051k8840559p352967J3710434R133426q645234j0314592M579437J0581164
$$ 14595051 -14245508 -21598475 -7888041 1245385 -7399849 -17714441 -13135004 -2553840
42403b553840K94619m057500J0491191K2990990J0049011j4689841j6929865O915537
$$ -2553840 -2259221 -6316721 4174470 27165460 37214471 22524630 5594765 12510302
42395A2510302K1918067P053639j0584209K361089K8325053K1116411j8714277
$$ 12510302 34428369 41482008 30897799 33258888 61583941 82700352 63986075
42388F3986075l6089304l666105L2216373J9654337k1122567l2735571q090503
$$ 63986075 27896771 24230666 56447039 76101376 54978809 22243238 14152735
42381A4152735J0019509M100172k51289P881132O108845r874461r590502J6261848
$$ 14152735 24172244 28272416 28021127 35902259 42011104 32136643 22546141 38807989
42373C8807989L1158699J1264992j4529241j4200740k141778l206229m185843
$$ 38807989 69966688 81231680 66702439 52501699 50359921 47153692 42967849
42366D2967849J6411860M0595766L9254876K5027939K9333255M4750822M0130745
$$ 42967849 59379709 99975475 139230351 164258290 193591545 238342367 278473112
42359B78473112K1168866K3797743N0236351O1756243L9161866M285169k6031455
$$ 278473112 299641978 323439721 373676072 435432315 474594181 478879350 452847895
42352D52847895o1218669r7777840j02335605n8979686k729253J9711591K380087
$$ 452847895 391629226 293851386 191515781 132536095 129806842 149518433 151898520
42345A51898520k5636108l9367637l3446477j4355103M852234J1252655M971300
$$ 151898520 126262412 86894775 53448298 39093195 43945429 55198084 60169384
42338F0169384k055747m222101o966480j0961732q051777K041884P322902K026228
$$ 60169384 58113637 53891536 46925056 35963324 27911547 29953431 37276333 39302561
42330C9302561n172759o556772m901859m139703m539490q291450j4535486j0753352
$$ 39302561 34129802 27573030 22671171 18531468 13991978 5700528 -8834958 -19588310
42322a9588310J1024147L1565070K3042834q478066k6512212j4338463P196889
$$ -19588310 -8564163 23000907 46043741 37565675 11053463 -3285000 3911889
42315C911889J8563862K5661730L2123174K0998664j3359299m1567649l3873606
$$ 3911889 22475751 48137481 80260655 101259319 87900020 46332371 12458765
42308A2458765j298463K1033817J8396527M501197l334094L18386R097493Q611910
$$ 12458765 11160302 32194119 50590646 55091843 51757749 52076135 61173628 69785538
42300F9785538q911406k6951297j9022222J2343038L3439322K5205503M481632
$$ 69785538 60874132 33922835 14900613 27243651 60682973 85888476 90370108
42293I0370108j1546068k8404242m3162278k8854091J7598018M6345875J6811604
$$ 90370108 78824040 50419798 7257520 -21596571 -3998553 42347322 59158926
42286E9158926l5689817m3388851n24423L5745889L1989021J4297615J2772177
$$ 59158926 23469109 -19919742 -20444165 15301724 47290745 61588360 74360537
42279G4360537J8713735J3985489N571164Q869349K0395994K4827537J3664037
$$ 74360537 93074272 107059761 112630925 121500274 141896268 166723805 180387842
42272A80387842j1948229m0719655m9377471k1517411K5866565N4014998M6212216
$$ 180387842 168439613 127719958 78342487 56825076 82691641 136706639 182918855
42265A82918855K2339548P819907R557197K5061191M9464214O5786821N3590391
$$ 182918855 205258403 213078310 222635507 247696698 297160912 362947733 416538124
42258D16538124J8735811p960266j2801058j6051975l3079616m4810549k9351690
$$ 416538124 435273935 427313669 414512611 398460636 365381020 320570471 291218781
42251B91218781k475216J447068k2044997m4941254m8149089m0265751l3730402
$$ 291218781 288743565 290190633 268145636 223204382 175055293 134789542 101059140
42244A01059140k5413555r964361L927327M093291n704428r666453k073387N781530
$$ 101059140 75645585 65681224 69608551 73701842 67997414 58330961 56257574 62039104
42236F2039104M653533L138427J3893734K9979685L0581406J1075471r637175
$$ 62039104 66692637 69831064 83724798 113704483 144285889 155361360 145724185
42229A45724185j7398358j9611276k2499084j2372298J8507153M2948441K5960567
$$ 145724185 128325827 108714551 86215467 73843169 92350322 135298763 161259330
42222A61259330k2947542n3865877l7784973J01603J6841914J933959k0153027
$$ 161259330 138311788 84445911 46660938 46762541 63604455 65538414 45385387
42215D5385387k3958533p503917J1466997J6545043J0171329P815734J3461433
$$ 45385387 21426854 13922937 25389934 41934977 52106306 59922040 73383473
42208G3383473J2271390l867029j8554849j5281861n523766r671354k1294076
$$ 73383473 85654863 81787834 63232985 47951124 42427358 32756004 11461928
42201A1461928j7916193k01225R405492L865213k449685l119754m317115j423459
$$ 11461928 -6454265 -6655490 2750002 6615215 4165530 1045776 -3271339 -4694798
42193d694798J5161295K9981635J5654851j8512255k9828064m340466K2803034
$$ -4694798 10466497 40448132 56102983 37590728 7762664 3422198 26225232
42186B6225232K2474316P984452p79319r629142k2983318k1928067J761977K1157422
$$ 26225232 48699548 56684000 55904681 46275539 23292221 1364154 3126131 24283553
42178B4283553J2955048o906625j3661309j1906611j5689573j8371935j1423589
$$ 24283553 37238601 30331976 16670667 4764056 -10925517 -29297452 -40721041
42171d0721041o347160r465934l561601J6384462K1813351j763409k0816354o808805
$$ -40721041 -47068201 -56534135 -60095736 -43711274 -21897923 -23661332 -44477686 -51286491
42163e1286491J2743989K765729j4822377k48857L0556402L3317261J2461278
$$ -51286491 -38542502 -35776773 -50599150 -50848007 -20291605 13025656 25486934
42156B5486934N176647P849162j0273696l3247814j6208178K6216634L0596690
$$ 25486934 30663581 38512743 28239047 -5008767 -21216945 4999689 35596379
42149C5596379q320793k3674891J1113282L7634339J2864586k1704822j5761393
$$ 35596379 27275586 3600695 14713977 52348316 65212902 43508080 27746687
42142B7746687J0699934J5190298M996921P778832J4387783M053457r613731o657743
$$ 27746687 38446621 53636919 58633840 66412672 80800455 84853912 75240181 68582438
42134F8582438j815279j2440433j9630298o846390q36542k3272349l7574641k947989
$$ 68582438 66767159 54326726 34696428 27850038 27013496 3741147 -33833494 -36781483
42126c6781483M8384442N2771186J3071995j1998587m039023j562832k1761860
$$ -36781483 11602959 64374145 77446140 65447553 61408530 59845698 38083838
42119C8083838l2855339j6026923K793082P49797r285924j1242394j0816915j1922666
$$ 38083838 5228499 -10798424 -8005342 -7255545 -16541469 -27783863 -38600778 -50523444
42111e0523444l769352J3815937K3330945J9146727J4780055J3390156K569323
$$ -50523444 -54292796 -40476859 -17145914 2000813 16780868 30171024 32740347
42104C2740347j4386649j5367465K993302J6272637J0147905k699383j0668880
$$ 32740347 18353698 2986233 5979535 22252172 32400077 29700694 19031814
42097A9031814j6807478j8328336o707840N419260n193331k7043139k0426271
$$ 19031814 2224336 -16104000 -22811840 -17392580 -22585911 -49629050 -70055321
42090g0055321J8261956M2459960K4025724p352567j6258474j0070771p360897
$$ -70055321 -51793365 -9333405 14692319 7339752 -8918722 -18989493 -26350390
42083b6350390l00444J6231172J6769595j2388415l5638677j6920720K1035693
$$ -26350390 -26650834 -10419662 6349933 -6038482 -41677159 -58597879 -37562186
42076c7562186L1623720J4791861M402731N065014n167008k0568573j1819206
$$ -37562186 -5938466 8853395 13256126 18321140 13154132 -7414441 -19233647
42069a9233647J6542456K5151504L324369j4079761n377415O446752j004039j1824250
$$ -19233647 -2691191 22460313 25784682 11704921 6327506 12774258 11770219 -54031
42061e4031l633183J2999325J3616272j720444j2887888r310555L613736J6880410
$$ -54031 -3687214 9312111 22928383 21207939 8320051 -990504 2623232 19503642
42053A9503642K1298062Q571059j6515498l2668523k4045988r58122J1621181
$$ 19503642 40801704 49372763 32857265 188742 -23857246 -24815368 -13194187
42046a3194187K834347j4826638k2822450j6310633n467913J94523M674587J7135320
$$ -13194187 -10359840 -25186478 -48008928 -64319561 -69787474 -69592951 -64918364 -47783044
42038d7783044L2295891L1703271J0430520j1107819j3439664l664914l86952
$$ -47783044 -15487153 16216118 26646638 15538819 2099155 -1565759 -1952711
42031a952711n418576q403846p694743n140594Q234575L4650133M7413068J9729230
$$ -1952711 -7371287 -15775133 -23469876 -28610470 -20375895 14274238 61687306 81416536
42023H1416536k7243668m1622675j1122077J9920788J5383059o245467j0229729
$$ 81416536 54172868 12550193 1428116 21348904 36731963 30486496 20256767
42016B0256767Q78166O12901j5012923k4998480j8246226n652019K15770o94706
$$ 20256767 21134933 21747834 6734911 -18263569 -36509795 -42161814 -41946044 -42640750
42008d2640750j632379K810559J2882387K1091733J7702609L375941j0378582
$$ -42640750 -44273129 -41462570 -28580183 -7488450 10214159 13590100 3211518
42001C211518j6055766j5760205j0741809J37810Q563613J760202j3834790j3552127
$$ 3211518 -12844248 -28604453 -39346262 -39208452 -30644839 -28884637 -42719427 -56271554
41993e6271554R977184L1320485K6495550N638324m869125J739836J1933390J5076234
$$ -56271554 -46294370 -14973885 11521665 17159989 12290864 14030700 25964090 41040324
41985D1040324J0260601p43015j2580858j6736686j4184211j6772370k6191720
$$ 41040324 51300925 50557910 37977052 21240366 7056155 -9716215 -35907935
41978c5907935k6795535j1386379L682388M290552K47655K996931K577798r448535
$$ -35907935 -62703470 -74089849 -70407461 -66116909 -65869254 -62872323 -60294525 -69743060
41970f9743060j4560695M913504K8744111K4323685q99844q925047J1188400L1292960
$$ -69743060 -84303755 -79390251 -50646140 -26322455 -27222299 -36147346 -24958946 6334014
41962F334014L0019292J5339265k828139k7008963m8874805m4548650j0099232
$$ 6334014 36353306 51692571 48864432 21855469 -27019336 -71567986 -81667218
41955h1667218K3691322K9510011J6334222Q226186R119568O899546j520974q166033
$$ -81667218 -57975896 -28465885 -12131663 -3905477 5214091 12113637 10592663 2426630
41947B426630r631612r363195p564746r2922J2434591K0117718J0958141j4253399
$$ 2426630 -7204982 -16568177 -24132923 -24225845 -11791254 8326464 19284605 5031206
41939E031206l3938721k3551106J0684337K9773364R811833k1555625k0307942
$$ 5031206 -28907515 -52458621 -41774284 -12000920 -2189087 -23744712 -44052654
41932d4052654J2223641L3048673J9917212k909220o219468P413298J8269608
$$ -44052654 -31829013 1219660 21136872 18227652 12008184 19421482 37691090
41925C7691090J4932255m522925l2976542m8435181l3043385m203140K526973
$$ 37691090 52623345 48100420 15123878 -33311303 -66354688 -70557828 -68030855
41918f8030855j1418249n508690L3268398O1544900M1522659m669039l2926679
$$ -68030855 -79449104 -84957794 -51689396 9855504 51378163 46709124 13782445
41911A3782445l6204289l0294388j2383678K1692516M2778591K1342660j7895026
$$ 13782445 -22421844 -52716232 -65099910 -43407394 -628803 20713857 2818831
41904B818831k3759420N383261K2422401O755373j2122155j2384510r876855j4824274
$$ 2818831 -20940589 -15557328 6865073 13620446 1498291 -10886219 -20763074 -35587348
41896c5587348p611944J6955215K5078433k394712k8156960j1791282K1795478
$$ -35587348 -43199292 -26244077 -1165644 -3560356 -31717316 -43508598 -21713120
41889b1713120J5519728l1021300n6230987k4139731K7137667M2114796J9253119
$$ -21713120 -6193392 -37214692 -93445679 -117585410 -90447743 -48332947 -29079828
41882b9079828p30540L132949J2707886P939640m512656p625935r81173K128061
$$ -29079828 -29810368 -26677419 -13969533 -6029893 -10542549 -18168484 -19149657 -17021596
41874a7021596l080691o708480j81683J1077044J4674422N758530r299105k0614876
$$ -17021596 -20102287 -26810767 -26992450 -15915406 -1240984 4517546 -4781559 -25396435
41866b5396435k2346229j4036226J302923J8132789K8086459K2542695J359529
$$ -25396435 -47742664 -61778890 -60475967 -42343178 -14256719 8285976 9645505
41859I645505j9756359j8713857P999071L4366506K9956701m166480l5215846
$$ 9645505 -10110854 -28824711 -20825640 13540866 43497567 39331087 4115241
41852D115241l6186069j3181371Q269745J3592858Q720612O112015Q878485P893951
$$ 4115241 -32070828 -45252199 -36982454 -23389596 -14668984 -8556969 321516 8215467
41844H215467o045522k5283805k7001530k075387K4576896K1058016o211823j8201345
$$ 8215467 2169945 -23113860 -50115390 -52190777 -27613881 -6555865 -12767688 -30969033
41836c0969033J011462K1051115J1361923j4660562k3104411p479203J2147025
$$ -30969033 -29957571 -8906456 2455467 -12205095 -35309506 -42788709 -30641684
41829c0641684K3732401K9416457K5831267O774044j6705743k4640579j7683523
$$ -30641684 -6909283 22507174 48338441 55112485 38406742 13766163 -3917360
41822c917360j5426508k2955005k1768761l54311K5762929L3901332K0457147
$$ -3917360 -19343868 -42298873 -64067634 -64421945 -38659016 -4757684 15699463
41815A5699463p19754j5663195j9255458j4374975p270716n90022Q419576J9644373
$$ 15699463 14979709 -683486 -19938944 -34313919 -41584635 -42174657 -33755081 -14110708
41807a4110708K5778203K2072495J2357766j602799k4296172m8851844n1033014
$$ -14110708 11667495 33739990 46097756 44494957 20198785 -28653059 -79686073
41800g9686073j9663662J9742960L3430693K0377288K383207j2637897k7816302
$$ -79686073 -99349735 -79606775 -46176082 -25798794 -23415587 -36053484 -63869786
41793f3869786l0708363p960356J8851563J4353426j1748602j1351553K7037204
$$ -63869786 -94578149 -102538505 -83686942 -69333516 -81082118 -92433671 -65396467
41786f5396467N5659543L8773707L316972r005016j766577j642696q329258o619055
$$ -65396467 -9736924 29036783 32353755 23348739 21582162 19939466 11610208 4991153
41778D991153m822188j8480091l1131787j4943761J6632629K0088710j2086020
$$ 4991153 168965 -18311126 -49442913 -64386674 -47754045 -27665335 -39751355
41771c9751355l6155128j8628245J9490936L6130822K1887643J654349k892973
$$ -39751355 -75906483 -94534728 -75043792 -38912970 -17025327 -15370978 -18263951
41764a8263951N235710R114356j360182j9195776k7465495j7993796r97941Q236688
$$ -18263951 -13028241 -3913885 -5274067 -24469843 -51935338 -69929134 -70927075 -62690387
41756f2690387Q082594Q079077J1487606J0966346J182514j3370978k3496385
$$ -62690387 -54607793 -46528716 -35041110 -24074764 -22892250 -36263228 -59759613
41749e9759613k1396832l856499K1883795L7101225K7305936J234977j4629140
$$ -59759613 -81156445 -85012944 -63129149 -26027924 1278012 2512989 -12116151
41742a2116151n046419J5828218K0641763J855929j6989976q279040K2569408
$$ -12116151 -17162570 -1334352 19307411 21163340 4173364 -4105676 18463732
41735A8463732L7719494J2772067k8396477m1761633k0415613M86900j652778
$$ 18463732 56183226 68955293 40558816 -1202817 -21618430 -21131530 -22784308
41728b2784308o139494J2171266L8505048L8210627P052674k5079706l4606395
$$ -22784308 -28923802 -16752536 21752512 59963139 67015813 41936107 7329712
41721G329712k4361765n718157J5500961L1311873K9947067J1719437m704185
$$ 7329712 -17032053 -22750210 -7249249 24062624 54009691 65729128 61024943
41714F1024943o87818K1563275L9744600L1656406k802096l7583580m4817803
$$ 61024943 60337125 81900400 121645000 153301406 150499310 112915730 68097927
41707F8097927k7171452j5865727k8617868m2448595k4340226J9409050M5460575
$$ 68097927 40926475 25060748 -3557120 -46005715 -70345941 -50936891 -5476316
41700e476316K6326548j6329847l8354937k2441619Q000011K0582399J0829924
$$ -5476316 20850232 4520385 -33834552 -56276171 -48276160 -27693761 -16863837
41693a6863837J564446P762211J5323448N554441j1467188j0623559N784899Q496197
$$ -16863837 -15299391 -7537180 7786268 13340709 1873521 -8750038 -2965139 5531058
41685E531058j1255004k6041742j6570089k92409L825856Q160046K6618025L9698178
$$ 5531058 -5723946 -31765688 -48335777 -48628186 -44802330 -36642284 -10024259 29673919
41677B9673919K3636207o818438k0859678j8685864j8180835j2678637J2622735
$$ 29673919 53310126 46491688 25632010 6946146 -11234689 -23913326 -11290591
41670a1290591L4992991J7455027k4538535l3648727M209961L7222208K6679101
$$ -11290591 23702400 41157427 16618892 -17029835 -12819874 24402334 51081435
41663E1081435k1493q01946J8176161K2921216M376616k0708832l9490376m6168331
$$ 51081435 51059942 50257996 68434157 91355373 95731989 75023157 35532781 -10635550
41655a0635550l3597069n745190J6475932K0123483J4590483P741540q418007
$$ -10635550 -44232619 -49977809 -33501877 -13378394 1212089 8953629 535622
41648E35622l1188031l4120838n213393K6522186L0422455J7621584J4996599
$$ 535622 -30652409 -64773247 -69986640 -43464454 -13041999 4579585 19576184
41641A9576184J7571582L278021k0880120k7226773j3923200n043107p817355
$$ 19576184 37147766 40425787 19545667 -7681106 -21604306 -26647413 -34464768
41634c4464768o630545P85004j496804j1936116q079349J1233784J6088441n318280
$$ -34464768 -41095313 -40310309 -41807113 -53743229 -61822578 -50588794 -34500353 -39818633
41626c9818633k0742307k008954K7321174K4480224p715449k3936992k157470
$$ -39818633 -60560940 -62569894 -35248720 -10768496 -18483945 -42420937 -44578407
41619d4578407K6711970K5979316M487952q61928J8499907L0428043R982822k2436079
$$ -44578407 -17866437 8112879 12600831 11738903 30238810 60666853 70649675 48213596
41611D8213596k7945233l291548J4726922J166350k2385602j9462167Q439707
$$ 48213596 20268363 16976815 31703737 32870087 10484485 -8977682 -537975
41604e37975K2963465L146395k3099467j6498039J6303026K7048171p655157m8145857
$$ -537975 22425490 25571885 2472418 -14025621 2277405 29325576 21670419 -26475438
41596b6475438m1712967M299055L3275526K1186903N392462J6305716K5578183
$$ -26475438 -68188405 -63889350 -30613824 -9426921 -4034459 12271257 37849440
41589C7849440k00385l1169478j5294712L1911020M2915532J846563l2519950
$$ 37849440 37649055 6479577 -8815135 23095885 66011417 67857980 35338030
41582C5338030k1108423J340960n351025k1440627j1083187J3936878K0484951
$$ 35338030 14229607 15570567 10219542 -11221085 -22304272 -8367394 12117557
41575A2117557J0067077L888540Q23881o427261j368459K4355398L6137938M071437
$$ 12117557 22184634 26073174 26897055 20469794 19101335 43456733 79594671 83666108
41567H3666108l8320335l7982050n039702Q381592l362889K84562K2652094J9237533
$$ 83666108 45345773 7363723 2324021 10705613 7342724 7627286 30279380 49516913
41559D9516913j9467508m2917804j9697341J7326151K9441674K1755214R086747
$$ 49516913 30049405 -12868399 -32565740 -15239589 14202085 35957299 45044046
41552D5044046j4070054l9150038l1069427J3276334M1542527K0971911q151481
$$ 45044046 30973992 -8176046 -39245473 -25969139 15573388 36545299 28393818
41545B8393818J026553K5260940J5124544j9819788l0930639j2150138N55741
$$ 28393818 29420371 54681311 69805855 49986067 19055428 6905290 7461031
41538G461031j854314N149479K1044733J4745756j5685674l1261155j3219778
$$ 7461031 5606717 10756196 31800929 46546685 30861011 -400144 -13619922
41531a3619922J0010332J2557140O170733O861687M086026j3126487k8544076
$$ -13619922 -3609590 8947550 15118283 21979970 26065996 12939509 -15604567
41524a5604567k1506291K704797K3138397K6130567O966483k8259195n0735765
$$ -15604567 -37110858 -34406061 -11267664 14862903 21829386 -6429809 -57165574
41517e7165574k7335044L0224920O2355819L3410493j7190430k6340884R281998
$$ -57165574 -84500618 -54275698 8080121 41490614 24300184 -2040700 7241298
41510G241298L7607881K8012181K737636j0078520j4956265k5501324l3205880
$$ 7241298 44849179 72861360 75598996 65520476 50564211 25062887 -8142993
41503h142993k3189183k639941R666185J1355114J2458303J1425611m40389j2380189
$$ -8142993 -31332176 -33972117 -24305932 -12950818 -492515 10933096 10492707 -1887482
41495a887482L66708L4892073M8816022J0561090n3081332q3439502n7896014
$$ -1887482 -1520774 33371299 82187321 92748411 39667079 -43772423 -101668437
41488a01668437q091589K7102649L9627269L8141119K5302274O808625Q66212
$$ -101668437 -109760026 -82657377 -43030108 -4888989 20413285 27221910 28088122
41481B8088122J4721473K5410878Q172176k5014637l9994297k7676257j0541905
$$ 28088122 42809595 68220473 76392649 51378012 11383715 -16292542 -26834447
41474b6834447m147736n86559N661681M017342q586536j4660838k421354J3734243
$$ -26834447 -30982183 -31568742 -25907061 -21889719 -30476255 -45137093 -47558447 -33824204
41466c3824204J5255316O350460K629394O513842J0329621J1449720Q166611o069827
$$ -33824204 -18568888 -12218428 -9589034 -3075192 7254429 18704149 26870760 20800933
41458B0800933k5788518k5473116O983021L9957879L1124099j3322956m3421004
$$ 20800933 -4987585 -30460701 -23477680 16480199 47604298 34281342 -9139662
41451i139662l0995088Q97523K0662391K6926044K8639658J7617174j1902149
$$ -9139662 -40134750 -39237227 -18574836 8351208 36990866 54608040 42705891
41444D2705891l6820446k9068328L333786K5814200K2938854J0270550L121513
$$ 42705891 5885445 -23182883 -19849097 5965103 28903957 39174507 42296020
41437D2296020k056141j2103666k3340283k8653223k3985490o577545J8436923
$$ 42296020 40239879 28136213 4795930 -23857293 -47842783 -54420328 -35983405
41430c5983405L1548799J8104965o628377j3639764j940839K252903q426976j0222351
$$ -35983405 -4434606 13670359 7041982 -6597782 -8538621 -6285718 -14712694 -24935045
41422b4935045N671675J0895280j1301756k8269733o321039K7409906J8379122
$$ -24935045 -19263370 -8368090 -19669846 -47939579 -54260618 -26850712 -8471590
41415h471590l0167652n5000523k1134871L2235561M9983911K8973791N611611
$$ -8471590 -38639242 -93639765 -114774636 -82539075 -32555164 -3581373 2030238
41408B030238K708497J3587766K2044696J6573375m356212k6022898k7455488
$$ 2030238 4738735 18326501 40371197 56944572 52588360 26565462 -890026
41401h90026q880869M637082k860185j7973386k3217226k1603081j9879244r853963
$$ -890026 -9770895 -5133813 -7993998 -25967384 -49184610 -70787691 -90666935 -100520898
41393a00520898J1008174K1441426P261772p179456Q214432L7991198M0723124
$$ -100520898 -89512724 -68071298 -60809526 -67988982 -59774550 -21783352 18939772
41386A8939772J3614323m034260N452883J3565586k075528k0504337j6258785
$$ 18939772 32554095 28519835 33972718 47538304 45462776 24958439 8699654
41379H699654l782344j1849278l3871669l7098440j3113671J1102072J3795219
$$ 8699654 4917310 -6931968 -40803637 -77902077 -91015748 -79913676 -66118457
41372f6118457O171851J1160704K8929196L5284136J2663033k3748518l7525551
$$ -66118457 -59946606 -48785902 -19856706 15427430 28090463 4341945 -33183606
41365c3183606j2464389K4720352L5058144J5784488m27222N444727J4735036
$$ -33183606 -45647995 -20927643 14130501 29914989 29487767 34932494 49667530
41358D9667530N316625j3938418k0399850j1137990J108237J1307208K0055361
$$ 49667530 54984155 41045737 20645887 9507897 10616134 21923342 41978703
41351D1978703J9341124L089012j5623641j9540284j3024620j1852552j4860912
$$ 41978703 61319827 64408839 48785198 29244914 16220294 4367742 -10493170
41344a0493170j0091280k654684p665429j7669109q986760J5641020K3589957
$$ -10493170 -20584450 -23239134 -30904563 -48573672 -57560432 -41919412 -18329455
41337a8329455K353202j7909990r019311J4587111K1355175P625731o421362j0108501
$$ -18329455 -15976253 -33886243 -42905554 -28318443 -6963268 662463 -5758899 -15867400
41329a5867400p784836j858345P456135J2428738O650768k352880m341389j574551
$$ -15867400 -23652236 -25510581 -18054446 -5625708 1025060 -1327820 -5669209 -7243760
41321g243760J171123Q631266J9553183J5259204j1681096l2060500j5292871
$$ -7243760 -6072637 2558629 22111812 37371016 25689920 -6370580 -21663451
41314b1663451J9108281K2380797j2449167l9519262k7378406J139454J1855644
$$ -21663451 -2555170 19825627 7376460 -32142802 -59521208 -58381754 -46526110
41307d6526110O891690O389618J1712789J4311426J8737435K7904317K3714682
$$ -46526110 -39634420 -33244802 -21532013 -7220587 11516848 39421165 63135847
41300F3135847o410709l7333694l3995731l626680J3927072N089407m324875J144402
$$ 63135847 56725138 19391444 -14604287 -18230967 -4303895 785512 -3539363 -2394961
41292b394961J770877j6532994k9813398j1217885K3777127L8272916K7857231
$$ -2394961 -624084 -17157078 -46970476 -58188361 -34411234 3861682 31718913
41285C1718913K0680517K6033027J7409000k1166336o0384628o0758240k6143438
$$ 31718913 52399430 78432457 95841457 74675121 14290493 -46467747 -72611185
41278g2611185M778136J3066710J5602137K4744977K4930000N647595j0490139
$$ -72611185 -67833049 -54766339 -39164202 -14419225 10510775 16158370 5668231
41271E668231m437K0277200J7110741n583783j4046338j364036M661504m691699
$$ 5668231 5663794 25940994 43051735 37467952 23421614 22057578 26719082 22027383
41263B2027383k415384J9844458K5555530p269898l8959643k3561313J6458452
$$ 22027383 19611999 39456457 65011987 57742089 18782446 -4778867 11679585
41256A1679585K1466631j4214596l5855657j1891622K6619407L9920025K8427588
$$ 11679585 33146216 18931620 -16924037 -28815659 -2196252 37723773 66151361
41249F6151361J0847109q294743k6847112l1142651j8362519j0026072k0216572
$$ 66151361 76998470 68703727 41856615 10713964 -7648555 -17674627 -37891199
41242c7891199k9139459j1082020K5775715M9458109M4530243K3483344M095520
$$ -37891199 -67030658 -78112678 -52336963 -2878854 41651389 65134733 69230253
41235F9230253q778917k0529196l4070517l9308009j9627582K0287321M2561083
$$ 69230253 60451336 39922140 5851623 -33456386 -53083968 -32796647 9764436
41228I764436J7542845k6983525l3380160M714976L1518938J5105242l871196
$$ 9764436 27307281 323756 -33056404 -28341428 3177510 18282752 14411556
41221A4411556J6794580M5294606K3785226l5559108o2574126k8913823K0039196
$$ 14411556 31206136 76500742 100285968 64726860 2152734 -26761089 -6721893
41214f721893L6315932K2301979J891102j6159605k7881923k3385309o864378
$$ -6721893 29594039 51896018 53787120 37627515 9745592 -13639717 -20504095
41207b0504095J93893q187452j2478914l347893K298509l361624p5095K1616712
$$ -20504095 -20310202 -28497654 -40976568 -44324461 -42025952 -45387576 -45462671 -23845959
41199b3845959L3740491J3331279j4631122j2637098J0541251J6479150O0356
$$ -23845959 9894532 23225811 8594689 -4042409 6498842 22977992 23038348
41192B3038348q470896j577077p070438l1476469l5915999M243740M9505939M3574751
$$ 23038348 14567452 12990375 5919937 -25556532 -61472531 -57228791 -7722852 35851899
41184C5851899p261928m1425135k4607140J2069854K3640070Q047305o538862
$$ 35851899 28589971 -12835164 -37442304 -25372450 -1732380 6314925 -223937
41177b23937o213934J793326J1817110K2169414K1457113k38125k6273696k6050388
$$ -223937 -6437871 -4644545 7172565 29341979 50799092 50560967 24287271 -1763117
41169a763117J101730J9669604O987806j5051691j4699705L807408J3032783P082584
$$ -1763117 -661387 19008217 25996023 10944332 -3755373 52035 13084818 20167402
41161B0167402N688957J7995945K8286871K0813968j050203k4652987m0704510
$$ 20167402 25856359 43852304 72139175 92953143 91902940 67249953 26545443
41154B6545443m2052196k4760153L777138K8107507L8998237L6055758J9032623
$$ 26545443 -15506753 -40266906 -36489768 -8382261 30615976 66671734 85704357
41147H5704357r081028l1338401k7460177n41270K1518953J8013206k348875j6165292
$$ 85704357 76623329 45284928 17824751 17283481 38802434 56815640 54466765 38301473
41139C8301473j1630522M076237J3811310M579168j7030758k4147959R68636L6867628
$$ 38301473 26670951 30747188 44558498 49137666 32106908 7958949 8927585 45795213
41131D5795213M1818994P569466k6864558k5334545J441515J6994363P159196
$$ 45795213 87614207 95183673 68319115 42984570 44426085 61420448 68579644
41124F8579644j2169006k3487102k2768565j1517677O422420J9664266J6048858
$$ 68579644 56410638 32923536 10154971 -1362706 5059714 24723980 40772838
41117D0772838k220522j9416292k3260419j4060621J583791J7589781K8313500
$$ 40772838 38552316 19136024 -4124395 -18185016 -16601225 988556 29302056
41110B9302056K8705650J7342178k103068k1289764k9352860k0834912m644072
$$ 29302056 58007706 75349884 73246816 51957052 22604192 1769280 -2874792
41103b874792J690095p785439j8832613j5086300M95786J0346020N487492m676890
$$ -2874792 -1184697 -8970136 -27802749 -42889049 -42393263 -32047243 -26559751 -31236641
41095c1236641o493193P53854N863906J961666l536040j0087P410247Q24105k2763185
$$ -31236641 -37729834 -36975980 -31112074 -29150408 -32686448 -32696535 -25286288 -24462183 -47225368
41086d7225368l8674940k3936297Q158481K2547915R754515l872159J528223J0370649
$$ -47225368 -85900308 -109836605 -101678124 -79130209 -69375694 -73247853 -71719630 -61348981
41078f1348981j72938k1188637k3278165J63618K2159012J7680864m510322j3989088
$$ -61348981 -61521919 -82710556 -105988721 -105825103 -83666091 -65985227 -70495549 -84484637
41070h4484637K994656K6688174K8928155R082593o250220m58251J1502859Q315586
$$ -84484637 -81489981 -54801807 -25873652 -16791059 -23041279 -23499530 -11996671 -3681085
41062c681085o184871j3588616j0383567n473082R83703J0671801Q844425j5342037
$$ -3681085 -9865956 -23454572 -33838139 -39311221 -38327518 -27655717 -18811292 -34153329
41054c4153329l6949120k1760165J6900323L1209953J2738876L214718J8302294
$$ -34153329 -71102449 -92862614 -75962291 -44752338 -32013462 -28798744 -10496450
41047a0496450J7585199k0076899m7864959k4363894J2862180P471638j8639491
$$ -10496450 7088749 -12988150 -60853109 -85217003 -72354823 -64883185 -83522676
41040h3522676p51137N5568843P5137866K9604605k0505902k0893815K724594
$$ -83522676 -84273813 -28704970 46432896 76037501 55531599 34637784 37362378
41033C7362378L05436k2175487k2367692P219896L1325534K5818238O376476J197622
$$ 37362378 37667814 15492327 -6875365 344531 31670065 57488303 63864779 65062401
41025F5062401J4206471K2416634O121792k2468066k9974990o492325J6359918
$$ 65062401 79268872 101685506 107807298 85339232 55364242 48871917 65231835
41018F5231835Q040147j7742251k8273612k3350421k5030835k8014497p015242
$$ 65231835 73271982 55529731 27256119 3905698 -21125137 -49139634 -56154876
41011e6154876K7687893L3398150M271080j2897674P845865L0157148J6255182
$$ -56154876 -28466983 4931167 9202247 -3695427 4150438 34307586 50562768
41004E0562768j3677278j9424091l033708O916465N732599O060310K952861j2173764
$$ 50562768 36885490 17461399 14427691 21344156 27076755 33137065 36089926 23916162
40996B3916162j9267654N088390L9910837M0089905J590525l2669851l3471544
$$ 23916162 4648508 9736898 49647735 89737640 91328165 58658314 25186770
40989B5186770j6153370o202759o650884q851624r565642p388897j179711K638538
$$ 25186770 9033400 2830641 -3820243 -12671867 -22237509 -29626406 -30806117 -28167579
40981b8167579k198588o913806N45706J1743919R170249q77921M767694K4094858
$$ -28167579 -30366167 -37279973 -36734267 -24990348 -15820099 -16698020 -11930326 12164532
40973A2164532K6116952j134239k8160200k5285407j790011J4758870J7171594
$$ 12164532 38281484 37147245 8987045 -16298362 -18088373 -3329503 13842091
40966A3842091J4611083O190790j5303348l9784941m4065202k2162373M895597
$$ 13842091 28453174 34643964 19340616 -20444325 -64509527 -86671900 -81776303
40959h1776303J4410427O790849m1912N500541J6793148K0308405J3544570O062815
$$ -81776303 -67365876 -60575027 -60616939 -55116398 -38323250 -18014845 -4470275 1592540
40951A592540L082045k817609j7261370k9479679k3565689n00006K2302009L0693594
$$ 1592540 4674585 1856976 -15404394 -44884073 -68449762 -68949768 -46647759 -15954165
40943a5954165K2547745K139568j9602935k3724182j052897K8786388L5264475
$$ -15954165 6593580 8733148 -10869787 -34593969 -35646866 -6860478 28403997
40936B8403997J5465102m734765r153885o774768m025249Q982670L0508401L4148486
$$ 28403997 43869099 39134334 29980449 23205681 19180432 28163102 58671503 92819989
40928I2819989O576232k4871102k9431111j8555733k2741950l7588420l1032039
$$ 92819989 99396221 74525119 45094008 26538275 3796325 -33792095 -64824134
40921f4824134L93596K1790535J1980994r381776j7589511j4092064o944100R624750
$$ -64824134 -64430538 -42640003 -30659009 -40040785 -57630296 -71722360 -78666460 -69041710
40913f9041710L4029191M1234450J6033431j5151478j5993020P245037J6607098
$$ -69041710 -35012519 6221931 22255362 7103884 -8889136 -1644099 14962999
40906A4962999Q91922j1214017j690010O645195j1161475l7345164l1972996J0425495
$$ 14962999 15854921 4640904 2950894 9596089 -1565386 -38910550 -70883546 -60458051
40898f0458051M9506533M7348147J1042541k0745704k3119700n592294Q973513
$$ -60458051 -10951518 36396629 47439170 26693466 3573766 -2018528 6954985
40891F954985J2516975J1932815R926181M74653j5388083k3934565j7411528p038738
$$ 6954985 19471960 31404775 41330956 41805609 26417526 2482961 -14928567 -21967305
40883b1967305n645408p170507N56461R844701J153010k3087756l4343468j4549053
$$ -21967305 -27612713 -34783220 -34226759 -24382058 -23229048 -46316804 -80660272 -95209325
40875i5209325K0277779M1235402L7111505J6792343l461485p123875J1232493
$$ -95209325 -74931546 -33696144 3415361 20207704 16746219 9622344 20854837
40868B0854837L1152043K1134297j7651650m2130155k2132564J4135899J7673134
$$ 20854837 52006880 73141177 55489527 13359372 -8773192 5362707 23035841
40861B3035841j1428158k6694994m679465K5549372L0327913J4425722j246704
$$ 23035841 11607683 -15087311 -19766776 5782596 36110509 50536231 49289527
40854D9289527j5660906l4882723m3163391j9851723K0419217L6101951J3928217
$$ 49289527 33628621 -1254102 -44417493 -64269216 -43849999 -7748048 6180169
40847F180169r997990K26813K8566241K9570962m342878k8722862j0582888K1364598
$$ 6180169 -3817821 -3591008 24975233 54546195 50203317 21480455 10897567 32262165
40839C2262165J6854314k1444960m0932033j6406772J6034636J8047893M292242
$$ 32262165 49116479 27671519 -13260514 -29667286 -13632650 4415243 8707485
40832H707485Q664346K4668401K0159219m859173j9023205j2829923q345483j3802237
$$ 8707485 17371831 42040232 62199451 57340278 38317073 25487150 17141667 3339430
40824C339430j0733122M440564P096909j0599127j9348094o81736J8520214R011502
$$ 3339430 -7393692 -2953128 4143781 -6455346 -25803440 -26485176 -7964962 1046540
40816A046540j1683812q866272J0704634J0312535j4523959k5626210L64279L6303690
$$ 1046540 -10637272 -19503544 -8798910 1513625 -13010334 -38636544 -38272265 -1968575
40808a968575M0931856J0529903k2519481l2368815k4031598j5095292p564416
$$ -1968575 38963281 49493184 26973703 -5395112 -29426710 -44522002 -52086418
40801e2086418R172947L0469822L1246719J436051k9311770k5784422K710956
$$ -52086418 -42913471 -12443649 18803070 20239121 -9072649 -34857071 -32146115
40794c2146115J5511443Q82004j1845423n712993k322098j7107645k5922126m933588
$$ -32146115 -16634672 -15752668 -27598091 -33311084 -35633182 -52740827 -78662953 -83596541
40786h3596541K5759802L1925634J6169433M387353j77715j1450018k2056519
$$ -83596541 -57836739 -25911105 -9741672 -5354319 -5532034 -16982052 -39038571
40779c9038571j0821879J5747527K7377163J6368784N854757Q435927R369482
$$ -39038571 -49860450 -34112923 -6735760 9633024 15487781 23923708 33293190
40772C3293190j605621j1486522q381905p60763o48450o148880r998035r923141
$$ 33293190 31687569 20201047 11819142 11058379 10409929 4261049 -5736986 -15660127
40764a5660127m457578O397949J2909697M555209j0111108j0770235L845777J1649370
$$ -15660127 -20117705 -13719756 -810059 3745150 -6365958 -17136193 -13290416 -1641046
40756a641046k37462j6711554j6764954L49687J8944835K5363057J6966654K334376
$$ -1641046 -1878508 -18590062 -35355016 -35005329 -16060494 9302563 26269217 28603593
40748B8603593m906183r38789K079702m427598p380685P863050K6097742J7629095
$$ 28603593 23697410 22758621 24838323 20410725 13030040 20893090 46990832 64619927
40740F4619927j3993586k8481935l460464L1642081L2854719l012241l7524667
$$ 64619927 50626341 22144406 18683942 50326023 83180742 80168501 42643834
40733D2643834l7765663j0660911R691342K801407j4534072j0720094J6922029
$$ 42643834 4878171 -5782740 3908602 6710009 -7824063 -18544157 -1622128
40726a622128L7595765L2020252J8239676J5323498P791784k2918819n3869814
$$ -1622128 35973637 67993889 86233565 101557063 109348847 86430028 32560214
40719C2560214m9440506k1188727j1244454k1227039j0288013L0437834N5201081
$$ 32560214 -16880292 -38069019 -49313473 -70540512 -80828525 -50390691 4810390
40712D810390L3257905o384955k3813395k0581857j6854209j3312781m912885
$$ 4810390 38068295 31683340 7869945 -12711912 -29566121 -42878902 -47791787
40705d7791787j200539n342905j720972J1521815J0111984j0659610j5224724
$$ -47791787 -48992326 -54335231 -56056203 -44534388 -34422404 -45082014 -60306738
40698f0306738J4367746L7847705J6442301k0447111j9286441J1968585J9184241
$$ -60306738 -45938992 -8091287 8351014 -12096097 -31382538 -19413953 -229712
40691b29712r860200l0048517j2151520J8648282K6489698Q455700j4827761k2940115
$$ -229712 -10089912 -40138429 -52289949 -33641667 -7151969 1303731 -13524030 -36464145
40683c6464145o209878K2368845K9856604N162920j3535159J0030731M4753199
$$ -36464145 -42674023 -20305178 9551426 14714346 1179187 11209918 55963117
40676E5963117K8975992l0373144n6315910j4449138L2796257J7582703l6986169
$$ 55963117 84939109 54565965 -1749945 -16199083 16597174 34179877 -2806292
40669b806292n7663236k4833936J5195213K5189452J5482239Q852554P772047
$$ -2806292 -60469528 -85303464 -70108251 -44918799 -29436560 -20584006 -12811959
40662a2811959O013786M265708K349473n023780j5100453j4948936j545629R163525
$$ -12811959 -6798173 -2532465 -182992 -5206772 -20307225 -35256161 -36801790 -27638265
40654b7638265L905764p638493p309193L165212M378660r606161j9125994p283940
$$ -27638265 -23732501 -31370994 -38680187 -35514975 -31136315 -40742476 -59868470 -67152410
40646f7152410J2536117J3960149l459433j2449739K693940K4124379K6429333
$$ -67152410 -54616293 -40656144 -44115577 -56565316 -53871376 -29746997 -3317664
40639c317664R287691p456816r904825K90152J2798563J4277984l247512k8875424
$$ -3317664 5970027 -1486789 -11391614 -11101462 1697101 15975085 12727573 -16147851
40631a6147851l7742976k0455738L630461J4014347J5333845K0052053K0729626
$$ -16147851 -53890827 -74346565 -70716104 -56701757 -41367912 -21315859 -586233
40624e86233L336213k2006415l0164198j6796518M6023J1950519K6917852M1519409
$$ -586233 2749980 -19256435 -49420633 -66217151 -66171128 -54220609 -27302757 14216652
40616A4216652L4231454j416394l7544409m1532909j4287986J3188374J5552095
$$ 14216652 48448106 47031712 9487303 -32045606 -46333592 -33145218 -17593123
40609a7593123l117583j8649549j4735316r4477M559183m453090p799724Q977395
$$ -17593123 -20710706 -39360255 -54095571 -54190048 -49630865 -54083955 -61883679 -52906284
40601e2906284L3732258M3946895L3931680J4140560n706263j9291662k0453271
$$ -52906284 -19174026 24772869 58704549 72845109 67138846 47847184 27393913
40594B7393913j2361112r674108j7139980j8913992m967073Q622444O383483J718179
$$ 27393913 15032801 5358693 -11781287 -30695279 -35662352 -27039908 -20656425 -18938246
40586a8938246J1310831J9716086M418941j8307743j4381760Q771909R911721
$$ -18938246 -7627415 12088671 16507612 -1800131 -16181891 -7409982 2501739
40579B501739j7613681l2260739j0357603J8165769J9856107O268508O950042
$$ 2501739 -15111942 -47372681 -57730284 -39564515 -19708408 -13439900 -6489858
40572f489858K1688752K6486722J0388464j4239753k7534400j7675841P051545
$$ -6489858 15198894 41685616 52074080 37834327 10299927 -7375914 -324369
40565c24369J8606503j82228k5714762k0438677R931533K0352041n349181k8725674
$$ -324369 18282134 18099906 -7614856 -28053533 -18122000 2230041 -3119140 -31844814
40557c1844814j5302573J7779104L5017806L0361948J5980886o335857l2521257
$$ -31844814 -47147387 -29368283 5649523 36011471 51992357 45656500 13135243
40550A3135243m0419384j8888844O381785O302720r013453j0201659M269852J1664083
$$ 13135243 -27284141 -46172985 -39791200 -33488480 -42501933 -52703592 -48433740 -36769657
40542c6769657M551807l157769l801193l572372n489571n241846j551908L679852
$$ -36769657 -32217850 -35375619 -39176812 -42749184 -48238755 -53480601 -55032509 -51352657
40534e1352657R984500J3113778O320580m526938l797663O949455P792638k131968
$$ -51352657 -41368157 -28254379 -21933799 -26460737 -30258400 -23308945 -15516307 -17648275
40526a7648275L734008L0579420L9026457K530339m1499679l8265834P226633
$$ -17648275 -13914267 16665153 55691610 58221949 16722270 -21543564 -14316931
40519a4316931M1237705L5089539O385943k2636630m4520176m8479319k4615610
$$ -14316931 26920774 62010313 68396256 45759626 1239450 -47239869 -71855479
40512g1855479J0956222K8785816K4830630J7293284J0488228l671031j3861759
$$ -71855479 -60899257 -32113441 -7282811 10010473 20498701 16827670 2965911
40505B965911N87866K7679140L1354178O363958j4606412j3925022q404613p909792
$$ 2965911 3553777 31232917 62587095 68951053 54344641 40419619 32015006 24105214
40497B4105214J539790J8662060J4753487j6720005l8002825k2613371J815676
$$ 24105214 25645004 44307064 59060551 42340546 4337721 -18275650 -16459974
40490a6459974j259556j9283934j5703035Q882207K2046856J4871398J1367051
$$ -16459974 -17719530 -37003464 -52706499 -43824292 -21777436 -6906038 4461013
40483D461013K2835409K8398436J0371837j6950902k7505924j6809441k277479
$$ 4461013 27296422 55694858 66066695 49115793 21609869 4800428 2522949
40476B522949J568650k713643m080048K045609J0576352J5453711J5525201J0160196
$$ 2522949 4091599 1377956 -2702092 -656483 9919869 25373580 40898781 51058977
40468E1058977l321843k1120453k9161052j9062169k907183J202646n528967p311624
$$ 51058977 47737134 26616681 -2544371 -21606540 -24513723 -23311077 -28840044 -36151668
40460c6151668p94721K147434q29421K590804J3664735J4573552j566789j3291817
$$ -36151668 -36946389 -34798955 -35628376 -33037572 -19372837 -4799285 -6366074 -19657891
40452a9657891j560641J7648645J3892657j2867910l1544355k3794560o765812
$$ -19657891 -21218532 -3569887 10322770 -2545140 -34089495 -57884055 -64649867
40445f4649867m495558j3999732j4617024j996985O063561p32879p252286M391800
$$ -64649867 -69145425 -83145157 -97762181 -99759166 -93695605 -94428484 -101680770 -97288970
40437i7288970K6214004L4298905K0809289j265597k0254681l1311404k3412646
$$ -97288970 -71074966 -36776061 -15966772 -17232369 -37487050 -68798454 -92211100
40430i2211100J0114979M4837231M2828155Q483463r684249Q096269J9281372
$$ -92211100 -82096121 -37258890 5569265 14052728 4368479 12464748 31746120
40423C1746120r888953m1597407k4072132K0716887K9272691k048350j6778457
$$ 31746120 21857167 -19740240 -43812372 -23095485 6177206 4128856 -12649601
40416a2649601M367369J7539083j096104j5314948J871204K0091674Q382075j1848605
$$ -12649601 -8282232 9256851 8160747 -7154201 -5282997 14808677 23190752 11342147
40408A1342147j0805259k539234r952423j6860819j716960J4684514N275957q322122
$$ 11342147 536888 -2002346 -11954769 -28815588 -30532548 -15848034 -10572077 -18894199
40400a8894199Q645077L5908384K5413365j5148149k8515302J251639K4355260
$$ -18894199 -10249122 25659262 51072627 35924478 7409176 8660815 33016075
40393C3016075N620587k4502358k3801543M26904J5098802J4183630J3712820
$$ 33016075 38636662 14134304 -9667239 -9240335 5858467 20042097 33754917
40386C3754917J4447480L483865j5295905k1058223o652420J0526102J1465541
$$ 33754917 48202397 51686262 36390357 15332134 8679714 19205816 30671357
40379C0671357l505473j9297941k2577136j1621399L550316Q783041j467863j6563492
$$ 30671357 27165884 7867943 -14709193 -26330592 -22780276 -13997235 -15465098 -32028590
40371c2028590j8375739n43386K3010950L2356755K3347520J0100178M884477
$$ -32028590 -50404329 -50947715 -27936765 4419990 27767510 37867688 42752165
40364D2752165K962027o695542k1741927k7480705j5971611M800411K0606723
$$ 42752165 45714192 39018650 17276723 -10203982 -26175593 -21375182 -768459
40357g68459K2285024Q893184j1440730k4201284k0386265n611723Q388173J6768841
$$ -768459 21516565 30409749 18969019 -5232265 -25618530 -31230253 -22842080 -6073239
40349f073239J8819081J1082695m292251j3496788r213174n186202j3830346k1124222
$$ -6073239 12745842 23828537 19536286 6039498 -3173676 -8359878 -22190224 -43314446
40341d3314446q937095R411153Q415442l965208M09087J5649810Q255065j8839297
$$ -43314446 -52251541 -42840388 -34424946 -38390154 -37981067 -22331257 -14076192 -32915489
40333c2915489k1701970J0252382K9674124P341424j9321768j0820864Q308721
$$ -32915489 -54617459 -44365077 -14690953 -7349529 -26671297 -37492161 -29183440
40326b9183440n109459l8495504m5905201j8619803J5294265L9938749N3158565
$$ -29183440 -34292899 -72788403 -118693604 -137313407 -122019142 -82080393 -28921828
40319b8921828M1032661R59878k8361692j2600227J8011961R540635k7278340
$$ -28921828 12110833 13070711 -15290981 -27891208 -9879247 -338612 -27616952
40312b7616952l1450321R195471L8405282K0114419j3463693j9793319M27131
$$ -27616952 -59067273 -49871802 -11466520 8647899 -4815794 -24609113 -24181982
40305b4181982K7516565N2477889O0606293L1102758k1276197m5242598k0988588
$$ -24181982 3334583 55812472 116418765 147521523 126245326 81002728 60014140
40298F0014140Q339097J483056k1442310j8582738N887317J3887055n771421k6737661
$$ 60014140 68353237 69836293 48393983 29811245 35698562 49585617 43814196 17076535
40290A7076535k6715244r690157R405928K0074543J8681463R790305J570028n825521
$$ 17076535 -9638709 -19328866 -9922938 10151605 28833068 38623373 40193401 34367880
40282C4367880j6666768k2402570q391807J5996119J9711832m840338k5320220
$$ 34367880 17701112 -4701458 -13093265 2902854 22614686 17774348 -7545872
40275g545872j6146327L816138L906744j0281459j0703780N992543J5393113L189695
$$ -7545872 -23692199 -19876061 -15969317 -26250776 -36954556 -30962013 -15568900 -12379205
40267a2379205j9430973l5724210l7633050k1892266Q352729L6234931M1426406
$$ -12379205 -31810178 -67534388 -105167438 -127059704 -118706975 -82472044 -41045638
40260d1045638K2707384J105076l400515O666480J1377698q94574j6749931j3877878
$$ -41045638 -18338254 -17233178 -20633693 -13967213 -2589515 -3484089 -20234020 -34111898
40252c4111898O211147J6611363M318131q724761k427574N214121j0009014k8452370
$$ -34111898 -27900751 -11289388 -6971257 -15696018 -18123592 -12909471 -22918485 -51370855
40244e1370855j2170230K7416445L8181843P776104j6690464l963083J7139833
$$ -51370855 -63541085 -36124640 2057203 9833307 -6857157 -10820240 6319593
40237F319593J2315400o451990j3834813j3814884j5708924o144679J8222326
$$ 6319593 18634993 12183003 -1651810 -15466694 -31175618 -37320297 -19097971
40230a9097971K5890800j200084k7018598j2315251K2841432L2868964J6745788
$$ -19097971 6792829 5592745 -21425853 -33741104 -10899672 21969292 38715080
40223C8715080N790971M341060n050255j4429841k745890J5579580Q009075j6418371
$$ 38715080 44506051 48847111 43796856 29367015 26621125 42200705 50209780 33791409
40215C3791409j7625507P348457J8778416o10616k4107359k9383051k1776859
$$ 33791409 16165902 23514359 42292775 41682159 17574800 -11808251 -33585110
40208c3585110m826869K4592627M5352248K6161776j8265268l4126813o195923
$$ -33585110 -38411979 -13819352 31532896 57694672 39429404 5302591 -893332
40201h93332J9843551J0557849r081482p304020L523734p47283j2424744j4654624
$$ -893332 18950219 29508068 20426586 13122566 16646300 15899017 3474273 -11180351
40193a1180351j4585241k0856285j7767118N092536K4306976J6740645j631516
$$ -11180351 -25765592 -46621877 -64388995 -59296459 -34989483 -18248838 -19880354
40186a9880354k688113J0722365J9520408K2809763K4878675J1647525k2659485
$$ -19880354 -22568467 -11846102 7674306 30484069 55362744 67010269 44350784
40179D4350784m6095068k7002422J4227637L2322541K2194440J3002043Q753177
$$ 44350784 -1744284 -28746706 -14519069 17803472 39997912 52999955 61753132
40172F1753132j3660684m7652278n1626367j4343510K0074946J4151846j2650315
$$ 61753132 48092448 440170 -51186197 -65529707 -45454761 -31302915 -43953230
40165d3953230k0287511m540057J0714006J4665841J3344535O803893q734449
$$ -43953230 -64240741 -68780798 -58066792 -43400951 -30056416 -23252523 -31986972
40158c1986972k2745497j9273689k064288R366434Q254265O539550J0786331J1160713
$$ -31986972 -54732469 -74006158 -76070446 -66704012 -58449747 -51910197 -41123866 -29963153
40150b9963153J816431l920420P498633K4995462K4173019K743774j2858027m583900
$$ -29963153 -28146722 -32067142 -24568509 426953 24599972 27343746 14485719 9901819
40142I901819Q225919n353378l9621672n3344244k4302037J9225634L5669220
$$ 9901819 18127738 12774360 -26847312 -80191556 -104493593 -85267959 -49598739
40135d9598739K1162151L324719k152116k090003K09329J0132302J7967966K313709
$$ -49598739 -28436588 -25111869 -27263985 -29353988 -29144659 -19012357 -1044391 1269318
40127A269318l0067770l8234392k984786L6868822L4335156J506515j0135240
$$ 1269318 -28798452 -67032844 -70017630 -33148808 1186348 2692863 -7442377
40120g442377J3085982L2052124J9681285k626486r156510j1422276k8494090
$$ -7442377 5643605 37695729 57377014 54750528 45594018 34171742 5677652
40113E677652m5999588l8184026j1225332Q294095J3678455J5401443J2286039
$$ 5677652 -40321936 -78505962 -89731294 -81437199 -67758744 -52357301 -40071262
40106d0071262q6516n028575J2033682K6710746P353367k3991163j7065389J9749809
$$ -40071262 -40157778 -45186353 -33152671 -6441925 911442 -23079721 -40145110 -20395301
40098b0395301K2762936k1541068m4637855m884202L9489591K2002641k4243602
$$ -20395301 2367635 -19173433 -63811288 -68695490 -29205899 -7203258 -31446860
40091c1446860k2245421K4956761M6633641K0165909o907865o116943j395975
$$ -31446860 -53692281 -28735520 17898121 38064030 31156165 25039222 23643247
$$ [...]
##END NTUPLES=NMR SPECTRUM
##END=
