##TITLE=31Pdec_SR26
 d6, 124 sc
 17.12.2020
##JCAMPDX= 6.0         $$ Bruker NMR JCAMP-DX V2.0
##DATA TYPE= NMR SPECTRUM
##DATA CLASS= NTUPLES
##ORIGIN= UXNMR, Bruker Analytische Messtechnik GmbH
##OWNER= root
$$ XWIN-NMR		Version 3.5
$$ Thu Dec 17 12:04:58 2020 Russian Standard Time (UT+4h)  she@DPX200
##.OBSERVE FREQUENCY= 81.013821
##.OBSERVE NUCLEUS= ^31P
##.ACQUISITION MODE= SIMULTANEOUS
##.ACQUISITION SCHEME= undefined
##.AVERAGES= 124
##.DIGITISER RES= 17
##SPECTROMETER/DATA SYSTEM= spect
##.PULSE SEQUENCE= zgpg30
##.SOLVENT NAME= DMSO
##.SHIFT REFERENCE= (INTERNAL, DMSO, 0, 182.463)
##AUDIT TRAIL= $$ (NUMBER, WHEN, WHO, WHERE, WHAT)
$$ ##TITLE= Audit trail, XWIN-NMR		Version 3.5
$$ ##JCAMPDX= 5.01
$$ ##ORIGIN= Bruker BioSpin GmbH
$$ ##OWNER= she
$$ F:/spectra/data/she/nmr/P31/1/pdata/1/auditp.txt
$$ ##AUDIT TRAIL=  $$ (NUMBER, WHEN, WHO, WHERE, WHAT)
(   1,<2020-12-17 12:03:25.59 +0400>,<she>,<DPX200>,
      <continue with go, POWCHK disabled, PULCHK disabled
       configuration hash MD5:
       00 E9 B6 7A A2 85 ED C7 34 08 36 98 17 FE 4E 26
       data hash MD5: 32K
       79 E0 7A 38 AF BA 05 DB 19 EE EE 1D 9D 39 A7 B1>)
(   2,<2020-12-17 12:03:40.43 +0400>,<she>,<DPX200>,
      <Start of raw data processing
       efp BC_mod = 2 LB = 1 FT_mod = 6 PKNL = 1 PHC0 = -2458.981 PHC1 = 65.80075 SI = 64K 
       data hash MD5: 64K
       B8 7D FF 9F 92 ED B8 96 B8 9D 02 E3 E8 3A F8 2F>)
(   3,<2020-12-17 12:04:21.42 +0400>,<she>,<DPX200>,
      <pk PHC0 = 80.27864 PHC1 = -242.4 
       data hash MD5: 64K
       EE 94 45 95 31 37 7A A3 3E C0 8E 2F 45 B5 A6 B3>)
(   4,<2020-12-17 12:04:25.06 +0400>,<she>,<DPX200>,
      <abs ABSG = 5 
       data hash MD5: 64K
       7C 30 B6 5E B4 B7 A4 7A 6C AA AB 7D AF CB AD AE>)
$$ ##END=
$$ 
$$ hash MD5
$$ 12 CE 2E 65 25 16 68 12 2B F8 A8 A9 36 2F 38 6E
##$RELAX= 
##$RELAX= 
##$RELAX= 
##$RELAX= 
##$RELAX= 
##$RELAX= 
##$RELAX= 
##$RELAX= 
$$ Bruker specific parameters
$$ --------------------------
##$DU= <F:/spectra>
##$EXPNO= 1
##$NAME= <P31>
##$PROCNO= 1
##$TYPE= <nmr>
##$USER= <she>
##$AMP= (0..31)
100 100 100 100 100 100 100 100 100 100 100 100 100 100 100 100 100 100 
100 100 100 100 100 100 100 100 100 100 100 100 100 100 
##$AQSEQ= 0
##$AQ_mod= 1
##$AUNM= <au_zg>
##$AUTOPOS= <>
##$BF1= 81.014009
##$BF2= 200.13
##$BF3= 200.13
##$BF4= 200.13
##$BF5= 200.13
##$BF6= 200.13
##$BF7= 200.13
##$BF8= 200.13
##$BYTORDA= 1
##$CFDGTYP= 0
##$CFRGTYP= 5
##$CHEMSTR= <none>
##$CNST= (0..31)
1 1 145 1 1 1 1 1 1 1 1 1 1 1 1 1 1 1 1 1 1 1 1 1 1 1 1 1 1 1 1 1 
##$CPDPRG= <waltz16>
##$CPDPRG1= <>
##$CPDPRG2= <waltz16>
##$CPDPRG3= <>
##$CPDPRG4= <mlev>
##$CPDPRG5= <mlev>
##$CPDPRG6= <mlev>
##$CPDPRG7= <mlev>
##$CPDPRG8= <mlev>
##$CPDPRGB= <>
##$CPDPRGT= <>
##$D= (0..31)
0 1 0 0 0 0 0 0 0 0 0 0.03 2e-05 3e-06 0 0 0 0 0 0 0 0 0 0 0 0 0 0 0 0 
0 0 
##$DATE= 1608192012
##$DBL= (0..7)
120 120 120 11 120 120 24 19 
##$DBP= (0..7)
150 150 150 150 150 150 150 150 
##$DBP07= 0
##$DBPNAM0= <>
##$DBPNAM1= <>
##$DBPNAM2= <>
$$ [...]
##$SUBNAM3= <"">
##$SUBNAM4= <"">
##$SUBNAM5= <"">
##$SUBNAM6= <"">
##$SUBNAM7= <"">
##$SUBNAM8= <"">
##$SUBNAM9= <"">
##$SW= 369.568048894756
##$SWIBOX= (0..15)
0 1 3 0 0 0 0 0 0 0 0 0 0 0 0 0 
##$SW_h= 29940.119760479
##$TD= 32768
##$TD0= 1
##$TE= 0
##$TE2= 300
##$TE3= 300
##$TEG= 300
##$TL= (0..7)
0 120 53 12 22 120 120 120 
##$TP= (0..7)
150 150 150 150 150 150 150 150 
##$TP07= 0
##$TPNAME0= <>
##$TPNAME1= <>
##$TPNAME2= <>
##$TPNAME3= <>
##$TPNAME4= <>
##$TPNAME5= <>
##$TPNAME6= <>
##$TPNAME7= <>
##$TPOAL= (0..7)
0.5 0.5 0.5 0.5 0.5 0.5 0.5 0.5 
##$TPOFFS= (0..7)
0 0 0 0 0 0 0 0 
##$TUNHIN= 0
##$TUNHOUT= 0
##$TUNXOUT= 0
##$USERA1= <user>
##$USERA2= <user>
##$USERA3= <user>
##$USERA4= <user>
##$USERA5= <user>
##$V9= 5
##$VALIST= <valist>
##$VCLIST= <CCCCCCCCCCCCCCC>
##$VD= 0
##$VDLIST= <DDDDDDDDDDDDDDD>
##$VPLIST= <PPPPPPPPPPPPPPP>
##$VTLIST= <TTTTTTTTTTTTTTT>
##$WBST= 1024
##$WBSW= 4
##$XGAIN= (0..3)
0 0 0 0 
##$XL= 0
##$YL= 0
##$YMAX_a= 40844
##$YMIN_a= -43414
##$ZGOPTNS= <>
##$ZL1= 120
##$ZL2= 120
##$ZL3= 120
##$ZL4= 120
##$ABSF1= 182.463
##$ABSF2= -187.1042
##$ABSG= 5
##$ABSL= 3
##$ALPHA= 0
##$AQORDER= 0
##$ASSFAC= 0
##$ASSFACI= 0
##$ASSFACX= 0
##$ASSWID= 0
##$AUNMP= <proc_1d>
##$AZFE= 0.1
##$AZFW= 0.5
##$BCFW= 0
##$BC_mod= 2
##$BYTORDP= 0
##$COROFFS= 0
##$CY= -3
##$DATMOD= 1
##$DC= 0
##$DFILT= <>
##$DTYPP= 0
##$F1P= 0
##$F2P= 0
##$FCOR= 1
##$FTSIZE= 65536
##$FT_mod= 6
##$GAMMA= 0
##$GB= 0
##$INTBC= 1
##$INTSCL= 5.30512e-09
##$ISEN= 30
##$LB= 1
##$LEV0= 0
##$LPBIN= 0
##$MAXI= 10000
##$MC2= 0
##$MEAN= 0
##$ME_mod= 0
##$MI= 50
##$NCOEF= 0
##$NC_proc= -9
##$NLEV= 6
##$NOISF1= 182.463
##$NOISF2= 159.3651
##$NSP= 0
##$NTH_PI= 0
##$NZP= 0
##$OFFSET= 182.463
##$PC= 4
##$PHC0= -2378.702
##$PHC1= -176.5992
##$PH_mod= 1
##$PKNL= yes
##$PPARMOD= 0
##$PSCAL= 0
##$PSIGN= 0
##$REVERSE= no
##$SF= 81.014009
##$SI= 65536
##$SIGF1= 159.3651
##$SIGF2= -187.1042
##$SINO= 113.3802
##$SIOLD= 16384
##$SREGLST= <1H.CDCl3>
##$SSB= 0
##$STSI= 65536
##$STSR= 0
##$SW_p= 29940.119760479
##$SYMM= 0
##$S_DEV= 0
##$TDeff= 32768
##$TDoff= 0
##$TI= <>
##$TILT= no
##$TM1= 0
##$TM2= 0
##$TOPLEV= 0
##$USERP1= <user>
##$USERP2= <user>
##$USERP3= <user>
##$USERP4= <user>
##$USERP5= <user>
##$WDW= 1
##$XDIM= 65536
##$YMAX_p= 531480651
##$YMIN_p= -188460430
$$ End of Bruker specific parameters
$$ ---------------------------------
##NTUPLES= NMR SPECTRUM
##VAR_NAME=  FREQUENCY,     SPECTRUM/REAL,   SPECTRUM/IMAG
##SYMBOL=    X,             R,               I
##VAR_TYPE=  INDEPENDENT,   DEPENDENT,       DEPENDENT
##VAR_FORM=  AFFN,          ASDF,            ASDF
##VAR_DIM=   65536,         65536,           65536
##UNITS=     HZ,            ARBITRARY UNITS, ARBITRARY UNITS
##FACTOR=    0.456856943014862, 1,           1
##FIRST=     14782.0589164895, 0,            0
##LAST=      -15158.0608439895, 0,           0
##MIN=       -15158.0608439895, -188460430,  0
##MAX=       14782.0589164895, 531480651,    0
$$ Real data points
##PAGE= N=1
##DATA TABLE= (X++(R..R)), XYDATA
$$ [...]
45191F8319997l304269q415928q409243m752084n871455j0336138n968885O059777
45183B7321772Q245393k588894o652974M100606J0294954J825807M46281J9731907
45175F2724852L0671290K812861m0720096n0220519k0462582O480729N656280
45168c057185m874728o066567n432645j0324593q650655N843192J6754003J2092059
45160c717119M598136O356130N555469r504638k2851426j3357056Q806773J5636762
45152h476969L282408o844736n635472o444945j4070508j1483969R655641K7458013
45144a2560537J8386936n852991j2043485Q257562K7476377K0639148l428776
45137D0874234k0159243k4201289k8581571l4757475k5377084O228584L6631120
$$ plain form
45191 68319997 65015728 56599800 48190557 43438473 37567018 27230880 21261995 27321772
45183 27321772 35567165 32978271 26325297 30425903 40720857 42546664 42992945 62724852
45175 62724852 93396142 96209003 55488907 5268388 -15194194 -8713465 -3057185
45168 -3057185 -7931913 -13998480 -19431125 -29755718 -38406373 -32563181 -15809178 -3717119
45160 -3717119 881017 7237147 12792616 3287978 -19563448 -32920504 -24113731 -8476969
45152 -8476969 -5194561 -12039297 -17674769 -24119714 -38190222 -49674191 -40018550 -12560537
45144 -12560537 5826399 -26592 -12070077 -3812515 23663862 44303010 40874234
45137 40874234 20714991 -3486298 -32067869 -66825344 -92202428 -85973844 -49342724
45130d9342724L7832920J4016954m190492l77711J0245734Q712236O01043L053854
45122B0551814J3675912J1144707j2218383l4506745k9801649j081497K2943929
45115i291912K0747972j777268k3182099k8354945j6099299M520023J8157640
45108c5279888J2025112q480922j8412175n99102K8113210L3588305R240751j3547983
45100F647308q423384R713036Q342336j4445468k8651385j7759220j270647k612686
45092d8460110j4143681j2286563L338042R425734j490524m948935J7950261M4787348
45084e828428L8520165L428280j6609612k524181J0600963q799074l2077150j2285618
45076b5574655L4015061M0714480p737126m6077182k3239989K2085411K3770335
$$ plain form
45130 -49342724 -11509804 2507150 -1683342 -2061053 8184681 16896917 17497960 20551814
45122 20551814 34227726 45372433 33154050 -1352695 -31154344 -32235841 -9291912
45115 -9291912 11456060 9678792 -13503307 -41858252 -57957551 -53437528 -35279888
45108 -35279888 -23254776 -31735698 -50147873 -50746975 -22633765 10954540 20195291 6647308
45100 6647308 -1776076 7936960 16279296 1833828 -26817557 -44576777 -45847424 -48460110
45092 -48460110 -62603791 -74890354 -71552312 -62126578 -63617102 -68566037 -50615776 -5828428
45084 -5828428 32691737 36120017 19510405 16986224 27587187 18788113 -13289037 -25574655
45076 -25574655 8440406 49154886 41417760 -4659422 -27899411 -5814000 17956335
45069A7956335j1247455k1214894J0638694L6407779K4820565M124749N717119
45062F7202892J3087856l396571l4518847m7784438l4610547j3163865L056415
45055e0127105J5240176K5904309L3799815L5911126K4130372p357827m1344979
45048C6155887m3841720q282890K5523930J9264888j3187983k9182567j7991421
45041c1541876o499640j0339397j3515476j577685J4002782J6444907Q420410
45034b4605975L779401P645639J4362072J6039308P173640j0946128k6660495
45027a3212538k6800509j1788962M983411J3092267J3041947R717319O303858
45020d663207L419330k514295j5650311k8751938k4716517j764679J5157157O417594
$$ plain form
45069 17956335 6708880 -14506014 -3867320 32540459 57361024 61485773 67202892
45062 67202892 80290748 76894177 42375330 -5409108 -40019655 -53183520 -50127105
45055 -50127105 -34886929 -8982620 24817195 60728321 84858693 77500866 36155887
45048 36155887 -7685833 -15968723 9555207 28820095 15632112 -13550455 -31541876
45041 -31541876 -38041516 -48380913 -61896389 -63474074 -49471292 -33026385 -24605975
45034 -24605975 -20826574 -13180935 1181137 17220445 24394085 13447957 -13212538
45027 -13212538 -40013047 -51802009 -46818598 -33726331 -20684384 -10967065 -4663207
45020 -4663207 -1243877 -3758172 -19408483 -48160421 -72876938 -74641617 -59484460 -53066866
45012e3066866j0300818m615622J8196975K4054574L786283j3361544o562406
45005d1869424Q068656Q494740k070886j1132940j8541539k3222919j1175714
44998i1450026K0656909M5834696L6979015K053695k6303748k8086968q775842
44991d9092269J2506297J5004518q005194l2996131k5013329J3354702L6810739
44984c7430667K0455318j897451P908389L0158162K1944818r698037k1732767
44977I707765q919420n381332j4235403J571893M4522761N9781501J6694168l8245362
44969F5496571m7858773k1625205l628787P77070J4569126K9918278J7441754
44962E5090034j3460657j9439600O183857J8232894q498351l6454762k2274074
$$ plain form
45012 -53066866 -63367684 -67983306 -49786331 -25731757 -21945474 -35307018 -41869424
45005 -41869424 -33800768 -25306028 -27376914 -38509854 -57051393 -80274312 -91450026
44998 -91450026 -70793117 -24958421 12020594 14074289 -12229459 -40316427 -49092269
44991 -49092269 -36585972 -21581454 -29586648 -62582779 -87596108 -74241406 -37430667
44984 -37430667 -16975349 -18872800 -10964411 19193751 41138569 31440532 9707765
44977 9707765 788345 -4592987 -18828390 -17256497 27266264 87047765 103741933 65496571
44969 65496571 17637798 -3987407 -7616194 -6839124 7730002 37648280 55090034
44962 55090034 41629377 22189777 28373634 46606528 38108177 1653415 -20620659
44955b0620659J6188072K6032689l885598k9553486j5454642J8948873K9476359
44948B1131608N296924k2685436k5803450r680650L928035R912078J6763825K0091070
44940A8954004M856641k2471967l0161140m592907K3514536J8260518j0679711
44933b320026k2771421m277440J7659023J8773099P348870K281415N343256P970100
44925C0006876P667299M214904o174630j9706215k0662384k584613J6313799J3945040
44917B3020076o709609k3767875k5207486j6280963l420217J1241470K0061794
44910b1062810J3494905j640004m332776J1237551K3186408J2151205p623363
44903B5411116o620249J4950450K3170975k156932l6067908m0108079j2788597
$$ plain form
44955 -20620659 -4432587 21600102 17714504 -11838982 -27293624 -8344751 21131608
44948 21131608 26428532 3743096 -22060354 -31741004 -27812969 -17900891 -1137066 18954004
44940 18954004 23810645 1338678 -28822462 -33415369 -9900833 8359685 -2320026
44933 -2320026 -25091447 -29368887 -11709864 7063235 14412105 16693520 22036776 30006876
44925 30006876 37674175 41889079 35714449 16008234 -4654150 -7238763 9075036 23020076
44917 23020076 16310467 -7457408 -32664894 -48945857 -52366074 -41124604 -21062810
44910 -21062810 -7567905 -9207909 -13540685 -2303134 20883274 33034479 25411116
44903 25411116 18790867 33741317 56912292 54755360 18687452 -21420627 -34209224
44896c4209224J2166599J3194875L581121K745010O890774J749569j0712150j5990874
44888b0584300j0004246k183322Q95283J036188l3052j616860J495114J2490163
44880a8505032K2092973J8438585O334459J677556O655231P211152k623054j1801252
44872B9480618j2516398j1057185j1157188n723732M004993Q99648k0064067l3629414
44864e9762725j5354983K1238889M1177848L3422173J6799907O522360j86930
44857D3856539o494901r230299j2381472k3349283l1312871j4859517K0002537
44850c3769267L5987620J4557203j3890813j1778338J2623719K1028752K349324
44843B7108200j5884133j1275962N673808J2906777M698119r423218j7722138
$$ plain form
44896 -34209224 -22042625 -8847750 -5266629 -2521619 4369155 6118724 -4593426 -20584300
44888 -20584300 -30588546 -32771868 -31876585 -30840397 -30873449 -32490309 -30995195 -18505032
44880 -18505032 3587941 22026526 28360985 30038541 36693772 43904924 41281870 29480618
44872 29480618 16964220 5907035 -5250153 -10973885 -6968892 -6069244 -26133311 -59762725
44864 -59762725 -75117708 -53878819 -12700971 20721202 37521109 44043469 43856539
44857 43856539 37361638 28131339 15749867 -7599416 -38912287 -53771804 -33769267
44850 -33769267 2218353 16775556 2884743 -8893595 3730124 24758876 27108200
44843 27108200 11224067 -51895 5621913 18528690 23226809 13803591 -3918547
44836c918547j1632989Q165435K5520248K1912718R32103j3646299q696249M458890
44828B3095310J1926856J4078303J1663687l248510k6051955k9520902P80252
44821B723041L5064417L1856436m939813l1241844k3860953n079674L8609p82446
44813C777773Q542996J7217643K310510l2157299n3987168m0067472j027432L1728341
44805f3662108L5588535J4336228q674290j5415879r940324n342116j089462J0447751
44797d3751665J9031027M074320k7395615l9134307j6835568P161416K871528
44790i3978864j0102731M052735L7617339N1980367L8329788K3820023K0048416
44783G1767073P960531j9469578l8779830l3261448j5541886L00714J6675968
$$ plain form
44836 -3918547 -15551536 -7386101 18134147 40046865 40978968 27332669 18636420 23095310
44828 23095310 35022166 49100469 60764156 57515646 31463691 1942789 2723041
44821 2723041 37787458 69643894 64704081 33462237 9601284 4521610 4560219 3777773
44813 3777773 12320769 29538412 31848922 -308377 -54295545 -94363017 -95390449 -63662108
44805 -63662108 -28073573 -13737345 -22411635 -37827514 -47767838 -53109954 -54199416 -43751665
44797 -43751665 -24720638 -20646318 -48041933 -87176240 -104011808 -96850392 -93978864
44790 -93978864 -104081595 -100028860 -62411521 -10431154 27898634 51718657 71767073
44783 71767073 79727604 60258026 21478196 -11783252 -27325138 -27024424 -10348456
44776a0348456K7590620J1095384l0018328n1972379k5315267J7902673K5829204
44769c5236549k346188k2563184j1302440J1680234K2704098K1962112J7337730
44762B235813Q384411m162648j1753819q906893R50853J2141729J8546055J2622130
44754C0057631l616120j2612967l236212Q399184J341028j4104035j0568982Q908599
44746D568126J1557077j0544305k2085192J107733K9725951K0811736j9435605
44739A5705521m3478592k5563071J0032905K4524748Q414723j4438133j4899037
44732c9700936J1151541L4781505K1849165k3402142n3661265l2498261J7444960
44725f4035433M2182216K5893284M103466N555420J4351905N887959r936433j0502102
$$ plain form
44776 -10348456 17242164 28337548 -1680780 -53653159 -78968426 -61065753 -35236549
44769 -35236549 -37582737 -60145921 -71448361 -59768127 -37064029 -15101917 2235813
44762 2235813 10620224 6457576 -5296243 -14203136 -13252283 -1110554 17435501 30057631
44754 30057631 26441511 13828544 10592332 18991516 20332544 6228509 -4340473 4568126
44746 4568126 16125203 5580898 -16504294 -15396561 14329390 35141126 15705521
44739 15705521 -27773071 -53336142 -43303237 -18778489 -10363766 -24801899 -39700936
44732 -39700936 -28549395 6232110 28081275 4679133 -48982132 -81480393 -64035433
44725 -64035433 -21853217 4040067 8143533 13698953 28050858 33938817 24002384 13500282
44717A3500282m546339j6481263l5160426k1888319K3134965M5800279J3566967
44710A7926146l0089038k4344444K0016454L7587825N261014l0125806k9704137
44703c3471986j6866688k5986501l8336011j2693223M1958481P0746563M6327231
44696C1677866m75254k7790092k8292788j8581412j0280219o052362n941690m892768
44688g0628719K953306J0053199J361481j7682776j8227003J2738372M6963959
44681c2468181M8328982K0504625r33490J132966P314465k179320j6394133j3164384
44673A2141530M436987J1239066l282387k0159972j8303870j746837J1096224
44666d579259J3851370J2738697Q362488l571022j5074533j0774716N884559J2414637
$$ plain form
44717 13500282 8953943 -7527320 -42687746 -64576065 -41441100 4359179 17926146
44710 17926146 -12162892 -36507336 -16490882 21096943 26357957 -3767849 -33471986
44703 -33471986 -50338674 -76325175 -114661186 -127354409 -85395928 -14649365 31677866
44696 31677866 31202612 3412520 -24880268 -43461680 -53741899 -59794261 -65735951 -70628719
44688 -70628719 -67675413 -57622214 -56260733 -73943509 -92170512 -79432140 -32468181
44681 -32468181 15860801 36365426 35431936 36564902 43879367 41700047 25305914 12141530
44673 12141530 16578517 27817583 24535196 4375224 -13928646 -15675483 -4579259
44666 -4579259 9272111 22010808 30373296 26802274 11727741 953025 6837584 19252221
44658A9252221J471714o102682M864543J8403193J4027805p10252p359264r285275
44650C4562003j9453149k8654130j8403767J126218M54809k1541999l2326771
44643h4236786j3918868J3469459K4900830K0889888J3622657P586015N627423
44636a2059382J2383931K0334867J2914818q170513j9362034q932102O855005
44629C964590J1014347O806920J095132q936262k0038513j8980872q289128r440326
44621d2804112k4485079k3603970Q050008M0233627M0504300K0346368R112081
44614B7353223P600274J143742m799687m73722k798502k7647648m7046561k1899790
44606f8568671L0608156N2105267K5785117m828586p073213p21234j1573831k6903402
$$ plain form
44658 19252221 20723935 14621253 19485796 37888989 51916794 51206542 43847278 34562003
44650 34562003 15108854 -13545276 -31949043 -30822825 -30368016 -51910015 -84236786
44643 -84236786 -98155654 -84686195 -59785365 -38895477 -25272820 -17686805 -12059382
44636 -12059382 324549 20659416 33574234 25403721 6041687 -2890415 3964590
44629 3964590 14978937 21785857 22880989 13944727 -6093786 -25074658 -33363786 -42804112
44621 -42804112 -67289191 -90893161 -82843153 -42609526 -2105226 18241142 27353223
44614 27353223 34953497 36097239 31297552 30823830 28025328 377680 -46668881 -68568671
44606 -68568671 -37960515 14144752 39929869 35101283 28028070 27306836 15733005 -11170397
44598a1170397k3053173n218764P462315J3368116K0519047K5196334K0276630
44591D7380108J1339388O755702L872041r53828k346950M70959m883291k3187897
44583C8446232l5967257k4390714K097976J7440767J2627797J748868j508039
44576A0495630J326286J688948m336275j4361365k2776487k3076442j0477319
44569f1517024J3862759L8404290M4004419K1477683j1137718k3459398j2644290
44562H990721r002180k6228839l0678264Q734523O0551713O6000754K5668388
44555A04036816j717211Q884762J6110844r110890l0977577j3792593J0445558
44548H3879709o465750m4596817m5143909n914033J6620098j398442j9618129
$$ plain form
44598 -11170397 -34223570 -39442334 -31980019 -18611903 1907144 27103478 47380108
44591 47380108 58719496 65475198 69347239 68393411 66046461 66517420 61634129 38446232
44583 38446232 2478975 -21911739 -19813763 -2372996 10254801 12003669 10495630
44576 10495630 11821916 13510864 9174589 -5186776 -27963263 -51039705 -61517024
44569 -61517024 -47654265 -9249975 34754444 56232127 45094409 21635011 8990721
44562 8990721 -11459 -26240298 -56918562 -48184039 12367674 78368428 104036816
44555 104036816 102319605 111204367 127315211 118204321 87226744 73434151 83879709
44548 83879709 77413959 32817142 -12326767 -18240800 -1620702 -3019144 -22637273
44541b2637273n897510J4468727P251588j5841428k2462288r432016M655370J4585739
44533c5309091K4786652K6293149R303654j0450998q827448P080177O877676j4204884
44525E548887k5722545j0742112O310784J04142j2954211k546463K0843438J6956323
44517b201757j9247502m2072110j8552990K4661182M1215429K7086816J3081488
44510B3970556J2688106J2393058O375885M562996M651872r594797l4217511m0755362
44502a9925197j8976591M184230M673132m929365j173830J2614144J7074730Q911896
44494B453149q4750m385748n727770l281318O64130k587002j0083288k198173
44486b5230770K4350614L6206577M180270m7175914o2403501k5117172K2894019
$$ plain form
44541 -22637273 -28534783 -14066056 -6814468 -22655896 -45118184 -54550200 -49894830 -35309091
44533 -35309091 -10522439 15770710 25074364 14623366 5795918 12876095 19753771 5548887
44525 5548887 -20173658 -30915770 -24604986 -24500844 -37455055 -40001518 -19158080 -2201757
44517 -2201757 -21449259 -63521369 -82074359 -57413177 -16197748 10889068 23970556
44510 23970556 36658662 49051720 55427605 59990601 64642473 55047676 20830165 -19925197
44502 -19925197 -38901788 -34717558 -30044426 -34973791 -36147621 -23533477 -6458747 2453149
44494 2453149 2368399 -2017349 -7745119 -11026437 -10362307 -12949309 -23032597 -25230770
44486 -25230770 -880156 35326421 39506691 -7669223 -70072724 -95189896 -72295877
44479g2295877L4931549Q561890k2704763k8215553n542233K0691969K3779711
44472d0793307N507012n903222L589966J2972412L075322p963941L689507J9923592
44464e902659O830532k1981594j8803095J8909664L6313729N119779l1663319
44457a1176963k9153550q864254j3817411l0652297j2747878L5246817N5945531
44450a5220005K6783628m804778N473502L4118164L2031044J438468j2854093
44443F6965930K235355Q820687j7828312m6264213l6371647k491443P889762j3727458
44435c0771339k7479614j0449571J0198061O203811o678883j264516J2216383
44428d8025668O570239j2075101j4771704j41467P316520N318042J6295826L7959222
$$ plain form
44479 -72295877 -37364328 -28802438 -51507201 -79722754 -85264987 -64573018 -40793307
44472 -40793307 -35286295 -41189517 -37599551 -24627139 -21551817 -29515758 -25826251 -5902659
44464 -5902659 927873 -21053721 -39856816 -20947152 15366577 20486356 -11176963
44457 -11176963 -40330513 -49194767 -63012178 -93664475 -106412353 -71165536 -15220005
44450 -15220005 11563623 6758845 12232347 46350511 78381555 79820023 66965930
44443 66965930 69201285 78021972 60193660 13929447 -22442200 -24933643 -17043881 -30771339
44435 -30771339 -58250953 -68700524 -58502463 -52298652 -58977535 -60242051 -48025668
44428 -48025668 -41455429 -53530530 -68302234 -68443701 -61127181 -55809139 -39513313 -1554091
44420a554091L6720761M535882k0373673j1935811L456502m982169j8545272l473485
44412a6151356K4596157J8486629k4653718n0739932k1647004L3102996N5035816
44405A8029588K6664018j5298392k7066840l172772K4419410K4018639l442559
44398D4151092k9910914l3531668j8681517k906795M424878M413601L35517k658434
44390c4364240L496402K0272663L5627776L5566114K0368111K689166p674439
44383G5981553j1455299j5335781k4208928l5051686l6551674k0540021M140580
44376f3021256J6865210Q018934j0200606j8368881q286805J3323612K9861930
44369c1807862K4592138p79710j7545129J255658M0078724N1056250J4625326
$$ plain form
44420 -1554091 35166670 39702552 19328879 7393068 10849570 5867401 -12677871 -16151356
44412 -16151356 8444801 26931430 2277712 -48462220 -70109224 -37006228 18029588
44405 18029588 44693606 29395214 2328374 -844398 23575012 47593651 44151092
44398 44151092 14240178 -19291490 -37973007 -40879802 -36454924 -32041323 -31705806 -34364240
44390 -34364240 -30867838 -10595175 25032601 60598715 80966826 83655992 75981553
44383 75981553 64526254 49190473 24981545 -10070141 -46621815 -67161836 -63021256
44376 -63021256 -46156046 -38137112 -48337718 -66706599 -74993404 -61669792 -31807862
44369 -31807862 -7215724 -7995434 -25540563 -24284905 15793819 66850069 81475395
44362H1475395l1812242m0987040j2725042J4484062J3709585q502859k9570757
44355a3928898l1431030j1171334J3898742J9576003M278206p048655O39810J0718322
44347a4468834N713302j934888N489855J5428881N996124j2112430j1437943K532318
44339d793615k067346k6260124l0969179K450062L8126170L3845999j394179k2323008
44331a3385220o119463K5743663L9242009K4289182k083167j8731526j9894139
44324B9061339j2273499q21499J1345087J2174066r520392l7185743l3869345
44317d1089986P535864M5240523M2504005J6724427M691170L339221j2973783
44310F5971441l4523254k7837693O41030P327106j6829928l0549622j1187458
$$ plain form
44362 81475395 49663153 8676113 -4048929 10435133 24144718 15641859 -13928898
44355 -13928898 -45359928 -56531262 -42632520 -23056517 -18778311 -25826966 -25187156 -14468834
44347 -14468834 -8755532 -10690420 -5200565 10228316 16224440 4112010 -7325933 -4793615
44339 -4793615 -6860961 -33121085 -64090264 -61640202 -23514032 10331967 8937788 -13385220
44331 -13385220 -19504683 6238980 45480989 69770171 67687004 48955478 29061339
44324 29061339 16787840 15966341 27311428 39485494 29965102 -7220641 -41089986
44317 -41089986 -33554122 11686401 54190406 70914833 75606003 78945224 65971441
44310 65971441 31448187 3610494 4251524 11578630 -5251298 -35800920 -46988378
44303d6988378J1450856J0044285O26050L386515O914433N57460J403184J7223935
44295D618340K1346666j173544j9727393p568156J1753182P831828m158351p29584
44287A2192988j591127k7863038m4343570j1714973L1062433J6138985l5997591
44280f2115893l7541491K4389782N9299262J4149589m3948635l3954270K1554050
44273e8167606M6170054K4007907j846673r445867j1467268j0079810K667313
44266a8161950J2417794J807340j0402510J265254J5052374p417744m7378433
44259e2817875m8282762p803041J6187740K074511k328524L1403510N7910757
44252c655684L5520535k22136K246103K0827852l58636m9054560n7229530q797110
$$ plain form
44303 -46988378 -35537522 -25493237 -24867187 -21480672 -14566239 -14008779 -12605595 4618340
44295 4618340 25965006 24791462 5064069 -2504087 9249095 17080923 12922572 12192988
44287 12192988 10601861 -17261177 -61604747 -73319720 -42257287 -26118302 -62115893
44280 -62115893 -99657384 -75267602 -15968340 -1818751 -45767386 -79721656 -58167606
44273 -58167606 -11997552 12010355 10163682 717815 -10749453 -20829263 -18161950
44266 -18161950 -5744156 -3936816 -14339326 -13074072 1978302 -5439442 -52817875
44259 -52817875 -101100637 -108903678 -92715938 -90641427 -92969951 -61566441 -3655684
44252 -3655684 31864851 31642715 33888818 54716670 54358034 5303474 -51926056 -60723166
44244f0723166L5549049L0675175J720227j2883354j6756736k4375401k2115351
44237f8909557J655810K2635295J5485114l684577o248317J504789j596773o041205
44229d5199421R273949K7435972J2489117k6560262m0528611j4356030J0304466
44222f7140820N72429k2103310k2720694l017149J4279825K2661492K6671002
44215e0797225K2140235P496836k885964N87949N502104J449445J448552J5578397
44207E20329K3947583O110961j8959691j6442755J0677566K5912953J2747089
44200D4514035r149052k0339007k2642516k1344719j5979092j3222918k1222859
44193g9386128k6446835n021745L5464127N4709270L2191645n300811k2334257
$$ plain form
44244 -60723166 -25174117 5501058 7221285 -5662069 -22418805 -46794206 -68909557
44237 -68909557 -67253747 -44618452 -29133338 -32817915 -39066232 -37561443 -39158216 -45199421
44229 -45199421 -35925472 -8489500 3999617 -22560645 -63089256 -77445286 -67140820
44222 -67140820 -66568391 -88671701 -111392395 -114409544 -100129719 -77468227 -50797225
44215 -50797225 -28656990 -21160154 -24046118 -23458169 -17956065 -16506620 -15058068 520329
44207 520329 24467912 30578873 11619182 -4823573 5853993 31766946 44514035
44200 44514035 35364983 15025976 -7616540 -28961259 -44940351 -58163269 -79386128
44193 -79386128 -105832963 -110854708 -75390581 -20681311 11510334 6209523 -16124734
44186a6124734j6645708o864749j523175Q29329j017470m825804q04226J1132540
44178c5843997J5507124O536807N53122O963724P866112j1568518l2029282k6251036
44170f8265944r94125J5656421J6355486J3562168P547020r913912k5751577j6773500
44162f8577963R246830K0978761J5545954K2323653M4320456M0627229p877475
44155G6587445n5153298m9264259o800048J3883209l924064k3270138j7776436
44148f5717589k341482N496035J3274694K6793349K8789173O693419k1052844
44141h065245k8523144j5944666Q9545J5185438L3271105M4593599L3079227M015668
44133G7701527j7353195j7856760r883277q808708j2407637r861555M05732J0565132
$$ plain form
44186 -16124734 -32770442 -39635191 -41158366 -40329037 -41346507 -46172311 -46976537 -35843997
44178 -35843997 -20336873 -13800066 -13246944 -6283220 1582892 -9985626 -42014908 -68265944
44170 -68265944 -69260069 -53603648 -37248162 -23685994 -16138974 -26052886 -51804463 -68577963
44162 -68577963 -59331133 -38352372 -22806418 -482765 43837691 84464920 76587445
44155 76587445 21434147 -27830112 -34630160 -20746951 -24671015 -47941153 -65717589
44148 -65717589 -68059071 -62563036 -49288342 -22494993 6294180 12987599 -8065245
44141 -8065245 -36588389 -52533055 -52443510 -37258072 -3986967 40606632 73685859 77701527
44133 77701527 60348332 42491572 32608295 23799587 11391950 1530395 1936127 12501259
44125A2501259J4176171J0007983n61978j3896547k3426104k2490777r075614
44118c2765607J0760251K3783388J9451490L624836l838694O327812J6834594
44111D4178070N751955j9396204k8012438j0090208O549755m951344l0082845
44104c6053259l0988226J038977L1855101K7547579m589676k8818927k5598580
44097f5607011q734336J460734N668492J5388107K6986009K6191056J6321164
44090A7674215J7145338K7726912J7943107k2498446n2457490l1055286J6427300
44083i094350K8732102j406424j9299931J601410J8139658o603918l7987861k6089387
44075e2008701J2018815K2927917N193931M133430K7459701L1425152l87964k5050049
$$ plain form
44125 12501259 26677430 36685413 36123435 22226888 -1199216 -23689993 -32765607
44118 -32765607 -22005356 1778032 21229522 24854358 21015664 27343476 44178070
44111 44178070 49930025 30533821 2521383 -7568825 -1019070 -5970414 -36053259
44104 -36053259 -67041485 -66002508 -34147407 -6599828 -11189504 -40008431 -65607011
44097 -65607011 -74341347 -72880613 -67212121 -51824014 -24838005 1353051 17674215
44090 17674215 34819553 62546465 80489572 57991126 5533636 -25521650 -9094350
44083 -9094350 19637752 18231328 -1068603 532807 18672465 12068547 -25919314 -52008701
44075 -52008701 -39989886 -17061969 -11868038 -7734608 19725093 51150245 50762281 25712232
44067B5712232r857541J6900466J6070512k508110o900129J921188K072027m553719
44059C8856926r94585M957014q738305l2693426l1263515J668220K7764647J7792262
44051A7349238r005834j7051428l330546Q779746J0130930J3128620K1187672
44044D1188398J7629346m891798k4110269j6458736N244489O895913j5033198
44037A0464145k4394221Q26477L2064763L0697011M918715n944143O943102J3401028
44029F8976877k884017k1351303k4186291k2951676k8053346k3872447J076902
44022e3245301K4896534K1069830k208926j7747949j7718472j0052904O374088
44015d8633100L1877685M4335639K2284319j5659017k7428441l065006K5748482
$$ plain form
44067 25712232 15854691 32755157 48825669 46317559 39417430 41338618 43410645 38856926
44059 38856926 37862341 42819355 34081050 1387624 -29875891 -28207671 -443024 17349238
44051 17349238 8343404 -8708024 -12038570 -3258824 6872106 20000726 41188398
44044 41188398 58817744 53925946 29815677 13356941 18601430 25497343 10464145
44037 10464145 -13930076 -13103599 18961164 49658175 54576890 48632747 55575849 68976877
44029 68976877 66092860 44741557 20555266 -2396410 -30449756 -54322203 -53245301
44022 -53245301 -28348767 -7278937 -9487863 -27235812 -44954284 -55007188 -48633100
44015 -48633100 -16755415 27580224 49864543 34205526 6777085 3712079 29460561
44008B9460561L2075948K0890496P496746l160425j0144086j3378991k0407425
44001D2832824l3714893l2859258J158443M3299448M3278535l634669m2369202
43994A7991228l2139570J096913J0909655l948513j3350950r812672r880146j5991427
43986e5125482j4796040p100294n466742n318415Q620503K7712290K5383533K423421
43978b3667226q046772P264184J7317666n133331l7824577l9362408q274224J9217733
43970g8508955K3225397K0541528K7692076L2561564J7706455p401424j7551876
43963A8264765o643672P467922J0665656P585973O091655K715267p833460j9600775
43955A8713331k1941915j2556169L723721K1483569L1685854K1993089o523717
$$ plain form
44008 29460561 61536509 82427005 89923751 86763326 76619240 63240249 42832824
44001 42832824 9117931 -23741327 -22582884 20716564 63995099 60360430 17991228
43994 17991228 -14148342 -13051429 -2141774 -6090287 -19441237 -29253909 -39134055 -55125482
43986 -55125482 -69921522 -77021816 -82488558 -87806973 -79186470 -51474180 -26090647 -23667226
43978 -23667226 -31713998 -24449814 -7132148 -12265479 -50090056 -89452464 -97726688 -78508955
43970 -78508955 -55283558 -34742030 -7049954 25511610 43218065 35816641 18264765
43963 18264765 11621093 19089015 29754671 37340644 43432299 46147566 38314106 18713331
43955 18713331 -3228584 -15784753 -12061032 9422537 41108391 63101480 56577763
43948E6577763l0630015k8953603r785958K181024J906540M975796J4213721J2391935
43940B2877203m812940j5150313l592113J2231725Q501617j0430333k3097786
43933a3472940k1472626j1638358J457875R909817p64792k6971033l4128615J248547
43925i5832125M8231214N5943897K5205777N054368J6017259K2276776m316383
43918G2580783l5692111l2384846m681428P007678o979981k0346819j5888449
43911c6385173k206903J0585040K1631296K5297812J3233286n685568j0688326
43904A5781464l7335L769314j2936131l3992677l4281026r262022K2981576L9782948
43896h193889L1151936Q468507m608936n68585j729389k7796594n6245624m3606698
$$ plain form
43948 56577763 25947748 -3005855 -12791813 -10610789 -8704249 -3728453 10485268 22877203
43940 22877203 18064263 2913950 -678163 11553562 20055179 9624846 -13472940
43933 -13472940 -34945566 -46583924 -45126049 -35216232 -35981024 -62952057 -97080672 -95832125
43925 -95832125 -47600911 8342986 33548763 38603131 54620390 76897166 72580783
43918 72580783 36888672 4503826 -177602 6830076 -149905 -20496724 -36385173
43911 -36385173 -38592076 -28007036 -6375740 18922072 32155358 26469790 15781464
43904 15781464 15744129 19513443 6577312 -27415365 -61696391 -70958413 -47976837 -8193889
43896 -8193889 22958047 31426554 26817618 26249033 24519644 -3276950 -59522574 -103129272
43888a03129272J1085195N5802788N0521396J3157538j6447725k8092129l1068386
43881d8170595k0518388R264872L5182813K9129146M165527j447751J6440388
43874B4046012K4279541R247278j408198P582760R504810j7365180m5908572l6106069
43866b6127618N588717L4956762K6842753m169834l1778688m1033072k8132809
43859f3853789q57961K1240187K4615849J7532476J4220354J1430359q58164j4262641
43851I206670j1724502J581504K756246j2249530k1098008r329930R609751J6337720
43843a4910079R267229j881856j0912114j5168318j2414782l693789Q913233K6413807
43835a4386669M3682143M2544817J3507126k0370786k6267601o913647M991298
$$ plain form
43888 -103129272 -92044077 -36241289 14280107 27437645 10989920 -17102209 -48170595
43881 -48170595 -68688983 -59424111 -24241298 4887848 9053375 7605624 24046012
43874 24046012 48325553 57572831 56164633 63747393 73252203 55887023 9978451 -26127618
43866 -26127618 -20538901 14417861 41260614 37090780 5312092 -35720980 -63853789
43859 -63853789 -64711750 -43471563 -18855714 -1323238 12897116 24327475 23469311 9206670
43851 9206670 -2517832 -936328 1819918 -10429612 -31527620 -40857550 -31247799 -14910079
43843 -14910079 -5642850 -7524706 -18436820 -33605138 -46019920 -49713709 -40800476 -14386669
43835 -14386669 29295474 71840291 85347417 64976631 38709030 31795383 36786681
43828C6786681j965462o479282k65811n037780k6854909l3665369o266548K3256417
43820b0492063J8515459n498813j2962745p335515j4381995k4154434l733723
43813g0043829L8150432N3048306K4885033q179212j4828168q141901o631909
43806H258752k361945Q559263M141439k3688350m0496461j6652027K1192821K4635966
43798a6410542n481858k1453082K550901L8570454M5850684J8328565j6298106
43791D5657016k9123000j5704989L226946O319163j809444P87083J5271513J4753424
43783C9377712j0979585k9058367q839304K7020641L2522190O373223j1026047
43776D5390463l904605J148051r575848j0363116J4376371L3438111J3255185
$$ plain form
43828 36786681 34821219 28341937 28076126 23038346 -3816563 -37481932 -43748480 -20492063
43820 -20492063 -1976604 -7475417 -20438162 -27773677 -42155672 -66310106 -70043829
43813 -70043829 -31893397 21154909 46039942 37860730 23032562 14890661 8258752
43806 8258752 5896807 14456070 18597509 -5090841 -45587302 -62239329 -41046508 -16410542
43798 -16410542 -21892400 -43345482 -40794581 -2224127 43626557 61955122 45657016
43791 45657016 16534016 829027 4055973 10375136 8565692 9352775 24624288 39377712
43783 39377712 28398127 -660240 -9499544 17521097 50043287 56416510 45390463
43776 45390463 41485858 42633909 33058061 22694945 37071316 70509427 83764612
43769H3764612k7422730m0879245j3508330K3624744L7319280K0181675j4950961
43762F8129045m3916633m1584837p441428K3943219K0211973o770815j9519534
43755f949010q316115L342360L456017O782687J9214349K1553903M096576j2499578
43747C0681189j0986040o054627j4836355k2016037n286476K0534757K0641369
43740A2677780m252207j5193140Q016991L8428075M1614004J8186892q474910
43733I1003485k6453717l7731424l9328806k3669695M169514K5236480K6176266
43726A9402103J2529241N43970l35040M592042L799990n010520j1353859o586501
43718A7581426L015012M657932l976713j5411447k5508395l3233551l0531391
$$ plain form
43769 83764612 56341882 15462637 1954307 25579051 62898331 83080006 68129045
43762 68129045 24212412 -17372425 -24813853 -870634 19341339 12570524 -6949010
43755 -6949010 -15265125 -11922765 -8466748 -1684061 17530288 39084191 43180767 30681189
43747 30681189 19695149 13640522 -1195833 -23211870 -28498346 -7963589 12677780
43740 12677780 8425573 -6767567 1249424 39677499 81291503 99478395 91003485
43733 91003485 64549768 26818344 -12510462 -36180157 -32010643 -6774163 19402103
43726 19402103 31931344 32475314 32140274 36732316 40532306 35521786 24167927 17581426
43718 17581426 20596438 25254370 21277657 5866210 -19642185 -52875736 -83407127
43711h3407127r074562K1308805L6904181K6796365K135834k1638480l4864322
43704f1839306k6897614N514821L7606479L3161214m927085k9168831j1493128
43697e8043450J6500717J3928621p331943q446763J0103976J3772296m448816
43690b3965362j4974115m550923O698662Q059543J4900376K9572333K6731843
43683D2472357k328495k6410012j8825024N389330J9782001K3980382K5115902
43676F9176441J2209017j8040303l5695945j6149068J4276689J1611516j9033970
43669A8354377l1893951j0581341J2743231J1861230O40937R67160R345729J1914907
43661B3352279Q295438M300640o76111n599623l389608L830625J158681j5128914
$$ plain form
43711 -83407127 -92481689 -71172884 -34268703 -7472338 -5336504 -26974984 -61839306
43704 -61839306 -88736920 -83222099 -45615620 -12454406 -17381491 -46550322 -58043450
43697 -58043450 -41542733 -27614112 -34946055 -43392818 -33288842 -19516546 -23965362
43690 -23965362 -38939477 -43490400 -36791738 -28732195 -13831819 15740514 42472357
43683 42472357 40143862 13733850 -5091174 298156 20080157 44060539 69176441
43676 69176441 81385458 63345155 27649210 11500142 25776831 37388347 18354377
43669 18354377 -13539574 -24120915 -11377684 483546 1124483 2091643 11437372 23352279
43661 23352279 31647717 35948357 35272246 29672623 26283015 30113640 31272321 16143407
43653A6143407k5187944j1642268J3590289K3554883J0226827q945108j4528429
43646C211657m647939P327950P631012m841267j7489245j7561008n957494O671827
43638b5654507J4407822J8170502J6348099O105268n435297n401439N133708Q492718
43630C2166874n743952k4495821k6652685q042861J5082124K2721019Q403914
43623A3438612j4895419k5358262j4866499R88908L863598j130187N167892K2897373
43615i893984K9341966J2366202j1093280j8359167p338301R185011K1074557
43608B5283004K3182880J3594052l17072n460389j011549r92370j2162524k3938905
43600A8177127k7744886k8533901k6580250q524502K6089302M7966618L1368440
$$ plain form
43653 16143407 -9044537 -20686805 -7096516 16458367 26685194 17740086 3211657
43646 3211657 -1436282 5891668 13522680 8681413 -8807832 -26368840 -32326334 -25654507
43638 -25654507 -11246685 6923817 23271916 29377184 23941887 18540448 23674156 32166874
43630 32166874 26422922 1927101 -24725584 -32768445 -17686321 5034698 13438612
43623 13438612 -1456807 -26815069 -41681568 -40692660 -36829062 -37959249 -32791357 -9893984
43615 -9893984 19447982 31814184 20720904 2361737 -4976564 4208447 25283004
43608 25283004 48465884 62059936 61742864 56282475 55270926 54278556 42116032 18177127
43600 18177127 -9567759 -38101660 -64681910 -73206412 -47117110 849508 32217948
43593C2217948o878002k5137269q238245J9241991K7612643J2090683j0528435
43586D0381314k0986270j3715220k053205k900982j2396166j0219778N937421
43579a5952886J1883118l318213j4240596J136683K2812077K1067979N913925
43572B9302087N645633J3299238J150974k0891443j4417861J8468189L0333493
43565F2890310N281750j3754125J937875J8807092K064519k1286380r345439J8096992
43557F4692594P804589l7377864n6373553k0858292K3378303K4389438n876859
43550b21644j7233827O678131L2987322K9511118L494069j6446235j9681945j8599662
43542D87327j9682824j1272163R832791J9088529m404381l7234955l4050493Q160126
$$ plain form
43593 32217948 25339946 202677 -8035568 11206423 38819066 50909749 40381314
43586 40381314 19395044 5679824 3626619 725637 -11670529 -21890307 -15952886
43579 -15952886 -4069768 -7387981 -21628577 -20491894 2320183 23388162 29302087
43572 29302087 34947720 48246958 49397932 28506489 14088628 32556817 62890310
43565 62890310 68172060 54417935 56355810 75162902 77227421 55941041 46595602 64692594
43557 64692594 72497183 35119319 -21254234 -42112526 -18734223 5655215 -221644
43550 -221644 -17455471 -10777340 22209982 51721100 55215169 38768934 19086989 487327
43542 487327 -19195497 -30467660 -20634869 -1546340 -5950721 -43185676 -77236169 -69076043
43534f9076043M1384305L2224294K976043j0823625j0891694j5961877j8897354
43527d9065951j644419K3365343K6023219O635598m187562O997007K0452606J6833184
43519D5409025p78367k1144491l5940451l4027785r601163J9892029K7223018
43512h968185J1381955j137560N633016J9263318K2194530J1336364q401560k8248847
43504B3053031l1397472q833310J8058999J6847988r985624k6316422j4936162
43497c3508972K132494M836483K998518P649935P196139o226815j5173051o176099
43489c6271368M058317k649494j3346266p282252P530261R405914j376461r440449
43481d9371798j2058379j3049237m092827J8813021L4249560K1984874j143187
$$ plain form
43534 -69076043 -27691738 4532556 7508599 -3315026 -14206720 -30168597 -49065951
43527 -49065951 -50710370 -27345027 -1321808 5313790 1126228 8123235 28575841 45409025
43519 45409025 44630658 23486167 -12454284 -46482069 -56083232 -36191203 -8968185
43512 -8968185 2413770 1276210 6909226 26172544 48367074 59703438 51301878 23053031
43504 23053031 -8344441 -17177751 881248 17729236 7743612 -18572810 -33508972
43497 -33508972 -31376478 -26539995 -23541477 -15891542 -8695403 -14922218 -30095269 -36271368
43489 -36271368 -32213051 -34862545 -48208811 -55491063 -47960802 -38554888 -39931349 -49371798
43481 -49371798 -61430177 -74479414 -78572241 -59759220 -25509660 -3524786 -4667973
43474d667973m331614Q949597J0762356k237294q472244n561695j2569871k6324090
43466d4452828j9212765R533721K2606684K086883k0126670j2792341P377719
43459e4979597Q338968m078757k98480K1382102L2076744J7035525n447402j2547374
43451A481729l854996N522347N756379L82101j279959K657368K160600j0913680
43443A911889k6090230k2832251J724839K6295272L1225769J7941383j545500
43436B8631171j8496535k4024838j0435516J1783698J5432031q797976l2792001
43429c8699966k3460193J5621827N1214504N9275337M0912143J0227335j5041419
43422A00049568j9151653m228631N408611p179837k5070087k0983198K69821Q560131
$$ plain form
43474 -4667973 -8999587 -49990 10712366 8475072 2828 -5558867 -18128738 -44452828
43466 -44452828 -63665593 -54131872 -31525188 -29438305 -49564975 -62357316 -54979597
43459 -54979597 -46640629 -50719386 -51017866 -29635764 2440980 19476505 14029103 1481729
43451 1481729 -2373267 3149080 8905459 9287560 8007601 10664969 12825569 1911889
43443 1911889 -24178341 -47010592 -45285753 -18990481 12235288 30176671 28631171
43436 28631171 10134636 -13890202 -24325718 -12542020 2890011 -5907965 -38699966
43429 -38699966 -62160159 -46538332 4676172 63951509 104863652 115090987 100049568
43422 100049568 80897915 76669284 82077895 74898058 49827971 28844773 29114594 37674725
43414C7674725m793783j5329359n738245Q313764M553920j3756929k6368046k3103362
43406c8547315r409610N358563J3962913J2541830M815440K44106K563986N332129
43398c137958K167209m584814p406515K56758K0439843M4340254N1772417K9792405
43390A33639599q276154l5721068m3325290m1710167l5503708j8221322M462313
43383d4655797J2780744L400963l425430J649620L278939l333468L343759K7403939
43375D43269L1062770q233199m6511753k9187276K2077412L7386543N317066j4010840
43367a656008J0103631L3060905J5772377j1669034q701152N959041m282564k3535147
43359A5052049j4151846J0508852P793866j5893454j3900954J7568331K9962433
$$ plain form
43414 37674725 32880942 17551583 11813338 20127102 24681022 10924093 -15443953 -38547315
43406 -38547315 -47956925 -42598362 -28635449 -16093619 -11278179 -11034073 -8470087 -3137958
43398 -3137958 -970749 -5555563 -12962078 -12705320 7734523 52074777 103847194 133639599
43390 133639599 125363445 89642377 46317087 4606920 -30896788 -49118110 -44655797
43383 -44655797 -31875053 -28474090 -31899520 -30249900 -26970961 -30304429 -26960670 443269
43375 443269 31506039 23272840 -23238913 -52426189 -30348777 7037766 12354832 -1656008
43367 -1656008 8447623 41508528 57280905 45611871 36910719 42869760 38587196 15052049
43359 15052049 900203 11409055 19202921 3309467 -10591487 6976844 36939277
43352C6939277L884128k0675199j3187068L207472J028742o392950J044110J1758285
43344A7606797R053083J201609l585849j6884540l5572221k6645537J7113376
43337c7713282M5066119J7803027k5829189k3992101J3326860K5111724k705595
43330A1067563k4874885j6984133l676113j381820O422045K2919670K2315224
43323A5807551j92973j2390951j23132Q812292r81610k214260K1013519L4650084
43315F4380520R116674k5513947k2630022J0577916K9976770K1476074P925783
43308I5309768J932352o993724k2406647l1882860k8179780j6087819j604963
43301i913673Q166595M195477q161677o762974J4096993K6347135P686497k0301541
$$ plain form
43352 36939277 40823405 20148206 6961138 10168610 11197352 4804402 5848512 17606797
43344 17606797 26659880 27861489 24275640 7391100 -28181121 -54826658 -37713282
43337 -37713282 7352837 25155864 -673325 -24665426 -11338566 13773158 11067563
43330 11067563 -13807322 -30791455 -34467568 -35849388 -29427343 -6507673 15807551
43323 15807551 15614578 3223627 3100495 11912787 10931177 8716917 29730436 64380520
43315 64380520 73497194 47983247 25353225 35931141 65907911 87383985 95309768
43308 95309768 97242120 90248396 67841749 35958889 7779109 -8308710 -9913673
43301 -9913673 -1747078 2448399 -5713278 -12476252 1620741 27967876 35654373 15352832
43293A5352832k1703856K029113J9276554J3546136o528380k8394548l9204984
43286d5627133k4710127O600032J7934623n041612k1847626M214092M0528779
43279b7948972L0466547j5373950l4938066j2154542Q359509N089105P646061
43272c8854308K6566674K4437360j3734142m1543443k0111540K2457443L8297416
43265b484540K4854555O595583q732477j8039108m682348K7600918L7018158J682820
43257F3813561l6989840l2384228k453812O990403j624174M318994J6335207k705025
43249A5301086m3035774n0855974j2708207K2763505K2014528J0995286J9508048
43242a6017502L0171469J6461283n231180j282762K2717371K9429248N637891
$$ plain form
43293 15352832 -6351024 -4321911 14954643 28500779 21972399 -6422149 -45627133
43286 -45627133 -70337260 -63737228 -45802605 -50844217 -72691843 -68477751 -27948972
43279 -27948972 2517575 -12856375 -47794441 -59948983 -51589474 -46500369 -38854308
43272 -38854308 -12287634 12149726 -1584416 -43127859 -63239399 -40781956 -2484540
43265 -2484540 22370015 28965598 20233121 2194013 -2488335 25112583 62130741 63813561
43257 63813561 26823721 -5560507 -8014319 -1023916 -2648090 1670904 18006111 15301086
43249 15301086 -27734688 -78590662 -91298869 -68535364 -46520836 -35525550 -16017502
43242 -16017502 14153967 30615250 25384070 24101308 46818679 76247927 81885818
43235H1885818k1581006k5708578j2448052k358364M55595P606209K0754660K3227828
43227G1834110L599217k3596056l4095424k5463965j5676951j2283510m871156
43220d0553735P983049R790184m154699j2937741k880646R403651P528002M669341
43212b1152594J5734630K3495941O537221j7692029j7012456J220999K513435
43205f354853j5279768k0138246l269921Q072391K163026J551942J6543743K3760191
43197G048505J1002613J776393Q926340L851159l2212274o0019476l1629673L1873375
43189e9383038O1218977L2643144n557692p746963R106319J610897l2630239n4036343
43181e4774938l7521767k904892J4839255P297271n940587p670621j116100J657094
$$ plain form
43235 81885818 60304812 34596234 22148182 19789818 20245413 27851622 48606282 71834110
43227 71834110 75433327 51837271 17741847 -7722118 -23399069 -35682579 -40553735
43220 -40553735 -32570686 -22780502 -26935201 -39872942 -42753588 -33349937 -25821935 -21152594
43212 -21152594 -5417964 18077977 24615198 6923169 -10089287 -8868288 -6354853
43205 -6354853 -21634621 -41772867 -45042788 -36970397 -34807371 -33255429 -16711686 7048505
43197 7048505 18051118 19827511 28753851 32605010 392736 -59626740 -91256413 -59383038
43189 -59383038 1835939 34479083 28921391 21174428 30280747 31891644 -738595 -54774938
43181 -54774938 -92296705 -95201597 -80362342 -73065071 -79005658 -86676279 -87792379 -86135285
43173h6135285k307450n476094j47469J3778974K6852293K5218906N546164j4720042
43165c7390003j3779641N604779J8762815J4769945Q957873J0474141L120916
43158A0520825k1234331l4941093j1573793K6401377L3675651P116254j3409850
43151c444960o944544N398147M784449L552754J4870574K5346081J7953764j67528
43143F1348737j1696350j4825167j9057169k6713392l0689512k3827049o173072
43136g1632974J0341150Q430377j1364722k2412572m801366K4155932L5503843
43129c1780332L1398264L0721843K5824678l308458l9020340m0953679j3197551
43122d0315575l076770k3284632l0839805j520650L0792061L4993367K8339318
$$ plain form
43173 -86135285 -88442735 -93918829 -94066298 -80287324 -53435031 -28216125 -22669961 -37390003
43165 -37390003 -51169644 -45564865 -26802050 -12032105 -3074232 7399909 10520825
43158 10520825 -10713506 -45654599 -57228392 -30827015 2848636 9964890 -3444960
43151 -3444960 -10389504 -4991357 -206908 3345846 18216420 43562501 61516265 61348737
43143 61348737 49652387 34827220 15770051 -10943341 -41632853 -65459902 -71632974
43136 -71632974 -61291824 -52861447 -64226169 -86638741 -91440107 -67284175 -31780332
43129 -31780332 -382068 30339775 56164453 52855995 13835655 -27118024 -40315575
43122 -40315575 -43392345 -66676977 -97516782 -99037432 -68245371 -33252004 -4912686
43115d912686K8695477J4963619k3650953m8318031k8855217J269059p41917j6455611
43107g8006260n047746K1847699K4346703O528092L008329J3596208J1764723
43100a962252J816734P385828J7159751L764694j5337694j407178K8640248J8811033
43092E8871164l1042996n7060261k8495524J3431088K9077551K8342835K4967060
43085C8090917O525747k1884151k2933558R803768K6394246m493369m2259495
43078a0755895l6428408p04728J8321450J2370046O619124R006458P078861j025855
43070D481053p487809j2983532j7050717p738995J4562940K4423424Q908655n156555
43062A958464Q728890L1596443K7986459K079606j1871153m028318K217189p630424
$$ plain form
43115 -4912686 23782791 38746410 15095457 -33222574 -62077791 -60808732 -61550649 -78006260
43107 -78006260 -83054006 -61206307 -36859604 -30331512 -27323183 -13726975 -1962252
43100 -1962252 -145518 7240310 24400061 28164755 12827061 11419883 40060131 58871164
43092 58871164 27828168 -29232093 -57727617 -44296529 -15218978 13123857 38090917
43085 38090917 44616664 22732513 -201045 9602723 35996969 31503600 -10755895
43078 -10755895 -47184303 -47889031 -29567581 -17197535 -10578411 -1571953 5506908 4481053
43070 4481053 -3006756 -15990288 -33041005 -40780000 -26217060 -1793636 7115019 1958464
43062 1958464 10687354 42283797 70270256 72349862 60478709 56450391 58667580 51037156
43054E1037156j9508105j6172750q35570Q283419l150411k9110305m1966829k0697443
43046g2120838J6749095L1334694J8063574J1474819K4621076K3634503j0908572
43039D2848351l9162608j9959116J9894775K4965000k833303j3126374R136483
43032B1763208K5702584J2693629n948082m529181Q390322J6223189K0907201
43025I5202870K5617036K0232237K249842j0543114m587698R878223J5983702
43018A54033098J0842103m68544j5132783k7259956k7116091j4836945k817845
43011G7243037J783780M720849J0508952J4421253J4000992J5426794K2466357
43004A60572014L0720419L8075554M9351638O4350398P1288832N9795811L5023264
$$ plain form
43054 51037156 31529051 15356301 14520731 22804150 19653739 -9456566 -51423395 -72120838
43046 -72120838 -55371743 -24037049 -5973475 5501344 30122420 53756923 42848351
43039 42848351 3685743 -16273373 3621402 28586402 25753099 12626725 21763208
43032 21763208 47465792 60159421 54211339 49682158 58072480 74295669 95202870
43025 95202870 120819906 141052143 143301985 132758871 128171173 138049396 154033098
43018 154033098 164875201 164406657 149273874 122013918 94897827 80060882 77243037
43011 77243037 79026817 83747666 94256618 108677871 122678863 138105657 160572014
43004 160572014 191292433 229367987 278719625 343070023 414358855 474154666 509177930
42997E09177930J3196971M855830M249920m207150k6329564m7107386m8181798
42990D05654753l5028668l0798535m0451090m2862301k7891815j5771220k1734328
42983A91116796k7197541j3030141J067103j4619647m6848865n4101640k7474949
42976H911116J039155R733366R755692J3049621J2582384L169360o888986j3293092
42968C8058616j9823004j9968639r32940K8557946M1072566K7340934N001913
42961I9307392j3008050k9385210l6820879j6281805K5225272M7144938K6125921
42954A02307579r584695j6707186J0112410L9421309M2973727K0880220k203720
42947A87199644J702464L5662706P0097769P7108134O5052369N5502294L7974591
$$ plain form
42997 509177930 522374901 527230731 531480651 527273501 500943937 453836551 405654753
42990 405654753 370626085 339827550 299376460 256514159 228622344 212851124 191116796
42983 191116796 163919255 150889114 151956217 137336570 90487705 36386065 8911116
42976 8911116 9950271 19683637 29439329 42488950 55071334 58240694 51351708 38058616
42968 38058616 18235612 -1733027 -2665967 25891979 66964545 94305479 99307392
42961 99307392 86299342 56914132 20093253 3811448 29036720 76181658 102307579
42954 102307579 92722884 76015698 86128108 125549417 168523144 189403364 187199644
42947 187199644 188902108 224564814 294662583 371770717 436823086 492325380 530299971
42940E30299971j1758234p1605334q3322201l6263633Q715518K767597k9420700
42933C09412984m1967298l7457205m2940578n1455078l6131494k644397J6770663
42926A13587597J0718424n469875k0358907l1340553l0376648j4224944K258078
42919B4793172P825651J3335620K4097593J8340427j3971659l7317495j8553800
42912A8549509J3399545O400007l1034823m0540409m252893L2144018L2439348
42905B7104302J2943907l51142q846173j6459368j0411699R951379K0109663Q443717
42897D2484586l388281J364727O670841l201566j1908458M13637K0054537J9824001
42889G2314024J45571j5696922j5559668n748340N334061J1474529N998681p947719
$$ plain form
42940 530299971 518541737 446936403 363614202 327350569 336066087 338833684 309412984
42933 309412984 267445686 229988481 187047903 135592825 99461331 96816934 113587597
42926 113587597 124306021 118836146 98477239 67136686 36760038 22535094 24793172
42919 24793172 32618823 45954443 70052036 88392463 74420804 37103309 18549509
42912 18549509 31949054 38349061 7314238 -33226171 -37479064 -5335046 27104302
42905 27104302 40048209 39697067 30850894 14391526 3979827 13931206 34040869 42484586
42897 42484586 39096305 40461032 47131873 43930307 32021849 32435486 52490023 72314024
42889 72314024 72459595 56762673 41203005 35454665 40788726 52263255 58261936 50314217
42881E0314217j3560084k201276J0736288O836998q585782j6441946j1395996
42874A5702419l384081J029339L368140M537463M154092L438506o47427j4997945
42866A3200506l3460712l2850532k061682L4999886M4826103K6167567O539265
42859E7360401J121215k168660j4683353k6349551k2382126n307702J0370741
42852b039035J5420693R414650l159700j1301908j993305K1454761L3746427J6382483
42844G7925066j2623388j8087759K221138J1255521j2482031l8901570k9016736
42837a9709759N405976J9470984L930327n132776R776114J8074580l832351k7310690
42829F72405j5356816J6322363K2166135n518673l1181028k9772452r164561J5460693
$$ plain form
42881 50314217 36754133 34552857 45289145 52126143 43540361 27098415 15702419
42874 15702419 12318338 13347677 16715817 21253280 25407372 28845878 28198451 13200506
42866 13200506 -20260206 -53110738 -55172420 -20172534 24653569 50821136 57360401
42859 57360401 58481616 56312956 41629603 15280052 -7102074 -12409776 -2039035
42852 -2039035 13381658 22796308 19636608 8334700 6341395 27796156 61542583 77925066
42844 77925066 65301678 47213919 49435057 60690578 48208547 9306977 -19709759
42837 -19709759 -14303783 5167201 9097528 3964752 13740866 31815446 27983095 672405
42829 672405 -14684411 1637952 23804087 18285414 -12895614 -42668066 -51832627 -36371934
42821c6371934L3469417K8953373l096720l1519890j9206417J8860428K9210810
42814B0299067k016482k9630876k1848554m749972r035386j6739029J551009L0343734
42806c1826489L3612583J3776108L217399R456287J0112519j964127o957184M600562
42798C4027658J3888199K252001k3244278m0081091l2508112j986751L1739869
42791a5912505M1528505J8714527j3152937k2890699o971223J2105256J7223327
42784C0644251J0639845L34463r575631j3780265p066711N171572R457430J746480
42776B7571434o087707j665839J1406617J6962672N559819j2316403j7102549
42769B4328044o295688n85813j4072363k8929571j9091653P879280J9419889P683610
$$ plain form
42821 -36371934 -2902517 26050856 22954136 -8565754 -27772171 -8911743 20299067
42814 20299067 18282585 -11348291 -33196845 -37946817 -46982203 -63721232 -62170223 -31826489
42806 -31826489 1786094 15562202 18779601 28235888 38348407 36384280 29427096 34027658
42798 34027658 47915857 50167858 26923580 -13157511 -45665623 -47652374 -15912505
42791 -15912505 25616000 44330527 31177590 8286891 1315668 13420924 30644251
42784 30644251 41284096 41618559 32042928 18262663 11195952 16367524 25824954 27571434
42776 27571434 21483727 19817888 31224505 48187177 53746996 41430593 24328044
42769 24328044 18032356 17446543 3374180 -25555391 -44647044 -36767764 -17347875 -9664265
42761i664265o96422Q930944J6312157M170663j2534287j4951207r794827r128820
42753b7356064p439598o04112P7349m877457O076435L1378875L0746278j0667628
42745A7334078m2154287j9407137K0022895J3427289k3985572k4192356K1177765
42738c7777325N0482952L3621127Q143132K637039l410374k2088329k6673845
42731D934377o763748P078796L391628J4152169M5406787M6487821o411596n5007702
42723E3268532m3112425m843210m723393l2192840k8593536R441396L0358906
42716b0396570J8178201Q404831J4318631P017211k0928175l4671429j8176259
42709d6253559k007307p766056j2465527N092109K3559587J5732852n646892j0358796
$$ plain form
42761 -9664265 -10360687 -1429743 14882414 19053077 6518790 -8432417 -18227244 -27356064
42753 -27356064 -34795662 -35399774 -35322425 -40199882 -34123447 -2744572 28001706 17334078
42745 17334078 -24820209 -44227346 -24204451 -10777162 -34762734 -58955090 -37777325
42738 -37777325 12705627 46326754 54469886 57106925 53696551 31608222 4934377
42731 4934377 -1829371 5249425 8641053 22793222 68200009 114687830 108276234 53268532
42723 53268532 10156107 5312897 589504 -31603336 -60196872 -50755476 -20396570
42716 -20396570 -2218369 6186462 20505093 27522304 6594129 -28077300 -46253559
42709 -46253559 -48260866 -56026922 -68492449 -63400340 -39840753 -24107901 -29754793 -40113589
42701d0113589L709331J5918995J6601642J0113659j873936j6810611k1767851
42694c4222360q763833Q216500R695180k657182j1874092j0831640n027534L179104
42686e2285857J4682133K1080904J1247551p306241j1030656Q213636K7446599
42679A2048069J9494234j1661370l4785245k8915234n185626J1810946J3583667
42672b3610559J0319020J1220351J4280062J3970440Q049169l842738j8129447
42665A2256298k3265137r605231J4302668K7646864K2882965J1883042L109908
42658E9211377r223423k4348785k3576672K395607K9727129K7270402j594593
42651E9861042k4826865k6030830k0760493k5626230l0910855j5285298K1066203
$$ plain form
42701 -40113589 -36404258 -20485263 -3883621 6230038 4356102 -12454509 -34222360
42694 -34222360 -42986193 -34769693 -25074513 -27731695 -39605787 -50437427 -55464961 -52285857
42686 -52285857 -37603724 -16522820 -5275269 -12581510 -23612166 -15398530 12048069
42679 12048069 31542303 19880933 -14904312 -43819546 -49005172 -37194226 -23610559
42672 -23610559 -13291539 -2071188 12208874 26179314 34228483 30385745 12256298
42665 12256298 -11008839 -20614070 -6311402 21335462 44218427 56101469 59211377
42658 59211377 49987954 25639169 2062497 4458104 34185233 61455635 59861042
42651 59861042 35034177 9003347 -11757146 -37383376 -68294231 -83579529 -62513326
42644f2513326M9417718M1276380J766910l1981927l1620326j0064269J2452o296763
42636e0003151m067366J5178454K6464341J3619621k226142J357159J1039538
42629A1362454N411221m177966M413284J9397446J1971225j2394911j9992571
42622A5990182k634813J3124053J1256724M529422L974657L780236J352640J250968
42614E2624069l719711k2775190l7060622j7300200K2868188L2887485k343932
42607B5180087l7083342l1227876l436354Q288359M797938J1191904K7552582
42600E263298K8991900N172626k5195595l5592601j6185207J4728652K1951927
42593h65000o223399l1240108q314227M2217650N0651591k846016n3175848m0585412
$$ plain form
42644 -62513326 -13095608 28180772 29947682 -2034245 -33654571 -43718840 -43706388 -50003151
42636 -50003151 -54070517 -38892063 -12427722 1191899 -1034243 322916 11362454
42629 11362454 16773675 12595709 17008993 36406439 48377664 35982753 15990182
42622 15990182 13355369 26479422 37736146 42265568 46240225 50020461 51373101 52624069
42614 52624069 48904358 26129168 -10931454 -28231654 -5363466 27524019 25180087
42607 25180087 -11903255 -43131131 -46567485 -38279126 -33481188 -22289284 5263298
42600 5263298 34255198 39427824 14232229 -21360372 -37545579 -22816927 -865000
42593 -865000 -7088399 -38328507 -46642734 -4425084 46226507 43380491 -9795357 -50380769
42585e0380769J0096845L7326323K8898847J4341796M131314j1402218k3376118
42578I636020j5231994K36180n78024q774102j597901R221842m173927k8792528
42570d0054434k3858335J1278317L3147997K2081140N873716P172491J3041220
42563B8682112J0180863Q973848J5926006J7470393O773342m682244j4219290
42556F9105030l3731883n6035100n0539010j0049910K9498408L5575990J8704272
42549B527797P764213J0464318J5900711J4929764L291272j6165959k5862003
42542A2850113j1051680J0596710P399012j3575353j1547412J8849237K9797185
42535D3317812m549466m0853194l0711785O576842J9433423K753321p506959L65653
$$ plain form
42585 -50380769 -40283924 -2957601 25941246 40283042 44414356 33012138 9636020
42578 9636020 -5595974 -5359794 -5937818 -14711920 -16309821 -7087979 -11261906 -40054434
42570 -40054434 -63912769 -52634452 -19486455 2594685 8468401 15640892 28682112
42563 28682112 38862975 47836823 63762829 81233222 88006564 83324320 69105030
42556 69105030 35373147 -20661953 -71200963 -81250873 -51752465 -16176475 2527797
42549 2527797 10292010 20756328 36657039 51586803 54878075 38712116 12850113
42542 12850113 1798433 12395143 19794155 6218802 -5328610 13520627 43317812
42535 43317812 38768346 -2084848 -32796633 -26219791 -6786368 -4033047 -11540006 -11174353
42527a1174353L988682m804523p642510K622043J0156934Q056766J0145786K2314334
42519C3663159K7669217J1318953j6821629l3289283k6429092o580795N423668
42512e045802J721266j921733J0336163K4064595J1762503j8160945k4618964
42505a862917J517776J6774413n821045k9490420j4861197J0956276J33840l0896024
42497e3549298k6957288J1054108K6648241K521074j4603735K717540K0053590
42490c2115768P770094p675984M785334K5038615J9043952l415429j0743942l478680
42482g91808m342203j1791823m211996J7369355K6579083J1825650q009106j1258823
42474A5368329J900103J5596932J7022244P155984k089002l118091l688380j3416405
$$ plain form
42527 -11174353 -7185671 -11990194 -19632704 -17010661 -6853727 1203039 11348825 33663159
42519 33663159 61332376 72651329 55829700 22540417 -3888675 -10469470 -5045802
42512 -5045802 -3324536 -5246269 5089894 29154489 40916992 22756047 -1862917
42505 -1862917 -345141 16429272 10608227 -18882193 -33743390 -22787114 -22653274 -53549298
42497 -53549298 -80506586 -69452478 -42804237 -40283163 -54886898 -52169358 -32115768
42490 -32115768 -24345674 -32021658 -27236324 -2197709 16846243 13430814 2686872 -791808
42482 -791808 -5134011 -16925834 -21137830 -3768475 22810608 34636258 26627152 15368329
42474 15368329 17268432 32865364 49887608 57043592 54954590 51836499 48148119 34731714
42466C4731714k3178651j6281915J267794O405134k755779m150968O095111M429743
42458F562183j2819198j2910418J6354974L2608831J319135m0231476l1892625
42451d1008594J6559211L8216250R446808j9930045q000457J9283872J5869843
42444C0436888j4350692l0184747j6044064K421745K366258m374021N970748K9085169
42436E327284L3792115O127126k4732409k2348133M604124J4005606n432909j7789622
42428f446818j043686J5610580M252599j0116268N871776K8312035J1044174l2186295
42420A5298097m4102403j6783516l79799j1893164p238951L0955672M8320842
42413A4176778O526908m2695471l0687512K3047203M4765179J8839165l522529
$$ plain form
42466 34731714 11553063 -4728852 -3461058 2944076 188297 -3962671 2132440 6562183
42458 6562183 -6257015 -19167433 -2812459 29796372 31115507 -9115969 -41008594
42451 -41008594 -24449383 13766867 23213675 3283630 -4716827 14567045 30436888
42444 30436888 16086196 -14098551 -30142615 -27720870 -25354612 -29728633 -23757885 5327284
42436 5327284 39119399 45246525 20514116 -1834017 2770107 16775713 11342804 -6446818
42428 -6446818 -7490504 8120076 12372675 2256407 8128183 36440218 47484392 15298097
42420 15298097 -28804306 -45587822 -45967621 -57860785 -65099736 -34144064 14176778
42413 14176778 20703686 -21991785 -52679297 -29632094 15133085 33972250 30449721
42406C0449721K326326K870459k2374746m0552706k2077342R215885J4982511
42399b5159892m67512n216744Q072593J7103834Q355569o393786j1544373o599127
42391b1849438o09304J99772m013081q352689o468439L026708J2634270J3049167
42383a2383034N918921M997983J9175938L6014651L1495668J172016k8125082
42376E8267061k9728009j2684634p046552j7169988j6431584N195203J8752442
42369h46061R25643k5394229k4807555m943076j819859j8488280j8651721J4010059
42361h0015079M6882597M3671030J1349015j5711581j8538977l364620J5527490
42354b00125K5277610J7674149j221088j1491570j648381J5436398J8801883N421399
$$ plain form
42406 30449721 32776047 35646506 13271760 -27280946 -49358288 -40142403 -25159892
42399 -25159892 -25627404 -30844148 -22771555 -5667721 2687848 -3705938 -15250311 -21849438
42391 -21849438 -22458742 -22258970 -26272051 -34624740 -41093179 -38066471 -25432201 -12383034
42383 -12383034 -6464113 -1466130 17709808 53724459 85220127 86392143 58267061
42376 58267061 28539052 15854418 8807866 -8362122 -24793706 -19598503 -846061
42369 -846061 79582 -25314647 -50122202 -55065278 -56885137 -75373417 -94025138 -80015079
42361 -80015079 -33132482 10538548 21887563 6175982 -12362995 -15727615 -200125
42354 -200125 25077485 42751634 41530546 30038976 28390595 43826993 62628876 68050275
42346F8050275r610058j3743222q628478l861528n900784j2238794j4110631p040057
42338g083277K399379N272770K809364K057154K356034k583483j1479882j7159191
42330b3411132j9183789k0536761j4983240M089038K4159865K4398717O881200
42323a8586102n481627l744260n33461n92698O165925J5893795R082536j0557000
42315h352892j1895093J1194151K1823186k99450k1127723q873927J0397626l20230
42307g454352k0116107n421372K9117613L0112577l775118j8267240N119789K0724979
42299C0040769o30504k4213636j4083678Q835228Q471748p431010r822353P47270
42291h086166M549070J568321M446519R785201P739915M635023P609916L391089
$$ plain form
42346 68050275 58440217 44696995 36068517 32206989 26306205 14067411 -43220 -7083277
42338 -7083277 -4683898 588872 3398236 5455390 7811424 5227941 -6251941 -23411132
42330 -23411132 -42594921 -63131682 -78114922 -74025884 -49866019 -25467302 -18586102
42323 -18586102 -24067729 -27811989 -28345450 -28938148 -22772223 -6878428 2204108 -8352892
42315 -8352892 -20247985 -9053834 12769352 12469902 -8657821 -17531748 -7134122 -7454352
42307 -7454352 -27570459 -32991831 -3874218 26238359 22463241 4196001 9315790 30040769
42299 30040769 29410265 5196629 -8887049 -51821 8419927 988917 -8833436 -8086166
42291 -8086166 -3537096 -1968775 2477744 12262945 20002860 24637883 32247799 35638888
42283C5638888j7970640l4135914j8006300J6988269L1893679J5923406n569423
42276B4761965j2769253j1099892r052794l452747Q176438J9795732K4763367
42269D1122816J9011053N66840k0691087k2857648m97864J7461882K461631k9632654
42261F944969l7377901j2463405J0975219P805818p144344q416232M499286J3922178
42253b1254412J0206736K82776r27380J5604497L8872577M1474976J1736359k3422341
42245G2573788k7718997m063503R720241o159326l0120924l3959829j7406486
42238c7135036Q81404Q046815M262791n30324O539114K4257485L0585182J2138062
42230D9045493p170264L138075K5453500J1038556m2090273p3773040m4375814
$$ plain form
42283 35638888 17668248 -16467666 -34473966 -17485697 14407982 30331388 24761965
42276 24761965 11992712 892820 -8159974 -11612721 -3436283 16359449 41122816
42269 41122816 60133869 60700709 40009622 17151974 16654110 34115992 36577623 6944969
42261 6944969 -30432932 -42896337 -31921118 -24115300 -31259644 -39675876 -35176590 -21254412
42253 -21254412 -11047676 -10764900 -11692280 3912217 42784794 84259770 95996129 72573788
42245 72573788 44854791 40791288 50511529 44352203 14231279 -19728550 -37135036
42238 -37135036 -36253632 -28206817 -23944026 -24474350 -17935236 6322249 36907431 49045493
42230 49045493 41875229 45013304 70466804 81505360 39415087 -34357953 -78733767
42223g8733767R416025L1737300K2994519J8274592K0391050N002520k1503641
42216G578598k1778211J1215006L6345451K1437200j3984017k9976159j7054094
42209f216226K362381Q764784L975049n72608j325136m895585j4645354j9358146
42201c1910841m523585K2590591L3050323J2464198j5388905j7915372K159666
42194E26075J2478017k628658k2966028k2615911j449821J9839334K3712356R036173
42186A5931537j0564158j7416997n354146J3917050K4842648K5283865K2379668
42179F9019467J6802996L560807j4309724k6391466k8969068k6152789j7589704
42172b4029481R76159K3132165L1795848J9184397k903642j6893625j5850471
$$ plain form
42223 -78733767 -69317742 -37580442 -14585923 3688669 24079719 29082239 7578598
42216 7578598 -14199613 -2984607 33360844 54798044 40814027 10837868 -6216226
42209 -6216226 -3853845 4910939 8885988 8313380 6988244 2092659 -12552695 -31910841
42201 -31910841 -36434426 -13843835 19206488 31670686 16281781 -1633591 526075
42194 526075 13004092 10375434 -12590594 -35206505 -36656326 -16816992 6895364 15931537
42186 15931537 5367379 -12049618 -17403764 -3486714 21355934 46639799 69019467
42179 69019467 85822463 89383270 75073546 48682080 19713012 -6439777 -24029481
42172 -24029481 -23053322 78843 31874691 51059088 48155446 31261821 15411350
42165A5411350m783640N184176K609448j3945311k8855398k3085605J508214K1613305
42157b4343461K0850752Q798442M854694J1793035J5470300P097166m716742o680595
42149C3123591R21243N177763n96143o371000k42916J1021654Q417887j0960532
42141D0491547k5669955j7746464K404497J0529865P20278r999127p058152L006800
42133c320711K141427j5108556k9701238j5525010K5034542N1511716K9675606
42126D4707776j8696177l7833934j3370494R050860m280962k3667895q434438
42119e2525264K3323149K4540569k080484r549151J4757246L0291633J0950994
42112C9708692j7507757k4070234j4335803m762048Q264705K8121754L6006604
$$ plain form
42165 15411350 10627710 15811886 18421334 4476023 -24379375 -47464980 -45956766 -24343461
42157 -24343461 -3492709 5305733 10160427 21953462 37423762 44520928 39804186 33123591
42149 33123591 34044834 39222597 38626454 32255454 32012538 43034192 51452079 40491547
42141 40491547 14821592 -2924872 -520375 10009490 10729768 730641 -6327511 -3320711
42133 -3320711 -1179284 -16287840 -45989078 -61514088 -36479546 15032170 44707776
42126 44707776 26011599 -11822335 -25192829 -16141969 -20422931 -44090826 -52525264
42119 -52525264 -29202115 -4661546 -6742030 -16291181 -1533935 28757698 39708692
42112 39708692 22200935 -1869299 -16205102 -20967150 -12702445 15419309 51425913
42105E1425913J6550542j4692275l1161782k5404573l701546K7349754N1556612
42098G1922645M4481947O083638k8574597l3084493k3932090k8274138l9280871
42091c0657959l2453556r272612P513772J1601324J5014221J8590068J1155018
42084h509724k712638k302130J6789048L1620978K1041985p909611k8729985k3489771
42076d201848q38473J1299866l840734k7871349k6769230K583044K5717493J9392448
42068d528783K301571J8378N182393r76073r397483Q44816K1221601K3544662
42060C8211082M443883j2321030j4163590r882349m720229M015432P548693p130672
42052F001220k8664597k9192927m552477J9858827K5987830J9848064J0240843
$$ plain form
42105 51425913 67976455 53284180 22122398 -3282175 -6983721 20366033 71922645
42098 71922645 116404592 122488230 93913633 60829140 36897050 8622912 -30657959
42091 -30657959 -63111515 -72384127 -64870355 -53269031 -38254810 -19664742 -8509724
42084 -8509724 -11222362 -13524492 3264556 34885534 55927519 48017908 19287923 -4201848
42076 -4201848 -5040321 6259545 2418811 -25452538 -52221768 -49638724 -23921231 -4528783
42068 -4528783 -2227212 -2208834 2973559 1997486 -7399997 -6555181 14666420 38211082
42060 38211082 42654965 30333935 16170345 6287996 1567767 5583199 13131892 6001220
42052 6001220 -22663377 -51856304 -56408781 -36549954 -10562124 9285940 19526783
42045A9526783j242647p195201m93115M807965j0065372k9901061k0272139J3677414
42037c1157373K5723781k31853k1440844k928364K8081376K7891437K698220j0678941
42029A7957439n820847n480671j3917951j2877008k70972M699192l912387j0616243
42021c0239448p568863m088314l447933L902560J7944026K3262828J3853574L994536
42013A7612966N158534Q837915K817228q384270j0501568J54328J1421241P645655
42005C4762029j4085878l6542253l5261527p166080J9468910J7271567k730345
41998b4283577n284758J7424147L2467912J4273583j6715617k3088562l025736
41991h232608J1336810K827907j0086377p257839J669493m485982k2668830k8352820
$$ plain form
42045 19526783 18284136 11088935 10595820 15403785 5338413 -24562648 -44834787 -31157373
42037 -31157373 -5433592 -5665445 -27106289 -30034653 -1953277 25938160 28636380 17957439
42029 17957439 12136592 6655921 -7262030 -20139038 -20410010 -15710818 -19623205 -30239448
42021 -30239448 -37808311 -41896625 -45344558 -41441998 -23497972 -235144 13618430 17612966
42013 17612966 22771500 31609415 34426643 26042373 15540805 15695133 27116374 34762029
42005 34762029 20676151 -15866102 -51127629 -58293709 -38824799 -21553232 -24283577
41998 -24283577 -29568335 -12144188 20323724 34597307 17881690 -5206872 -8232608
41991 -8232608 3104202 5932109 -4154268 -11412107 -9742614 -14228596 -36897426 -65250246
41983f5250246j0954459J1768401J8853560J1728868O715229J1554375J9209880
41976C625608J9927470J0673245m291218j4703174r653430R650371K5052292J9569261
41968E9850425o5926j0057666j259567P512146m017570k6328940k9239402k858468
41960f464968K4454062K0083843q143117j9704210K562008K5605248J2831519
41953E1224385k0131599k7032331j218494J4811210k702006k2411163j1289280
41946a8749278J2459099J3240528m628577j3913976j5949040k8039823l4472678
41939i0053745m130240M5287972N5706314J1995416l2231805k9491701M297560
41932c8620229K7688272K8115748J4085174r695238l1069575k6446631L011750
$$ plain form
41983 -65250246 -76204705 -64436304 -45582744 -33853876 -27138647 -15584272 3625608
41976 3625608 23553078 34226323 29935105 15231931 5578501 15228872 40281164 59850425
41968 59850425 59784499 49726833 48467266 55979412 51961842 25632902 -3606500 -6464968
41960 -6464968 17989094 38072937 29929820 10225610 12787618 38392866 51224385
41953 51224385 31092786 4060455 2841961 17653171 14951165 -7459998 -18749278
41946 -18749278 -6290179 6950349 2321772 -11592204 -27541244 -55581067 -90053745
41939 -90053745 -94183985 -48896013 6810301 18805717 -13426088 -42917789 -38620229
41932 -38620229 -10931957 17183791 31268965 21573727 -9495848 -35942479 -32930729
41925c2930729K0133620N008247j0192597Q095112L7806604L3821839l113800
41918E8628296l0124813k2561532M659615K6711753K9145499Q235617k1023028
41911E3671407k8510594o305961J3308084M287759j0328512K481991K5482966
41904E4087140J6090640k1709403m0608491k1841816M380526J2686647J0636802
41897A3722045O382017o797756k1320296j2039174K0672985L9637837K1158636
41890F1416294j2362893k6806663j8035752m569409r90575j0623999k5083302
41883c7056299k4689084N3235K6626241K5735861O111279J370304J4194517J4663475
41875B7009529l037615r974486R29153j191296k4904009l1828730j553960K7421357
$$ plain form
41925 -32930729 -12797109 -7788862 -17981459 -9886347 27920257 61742096 58628296
41918 58628296 28503483 5941951 10601566 37313319 66458818 74694435 53671407
41911 53671407 25160813 18854852 32162936 36450695 26122183 28604174 54087140
41904 54087140 70177780 48468377 7859886 -13981930 -9601404 3085243 13722045
41897 13722045 20104062 13306306 -8013990 -20053164 619821 40257658 61416294
41890 61416294 49053401 22246738 4210986 -358423 -1348998 -11972997 -37056299
41883 -37056299 -61745383 -61692148 -35065907 -9330046 -3218767 -1848463 12346054 27009529
41875 27009529 23971914 13997428 14926581 13735285 -11168724 -42997454 -44551414 -17130057
41867a7130057J8603450n075578p624842k491303j7497074l2065019r286784L1692416
41859d0874791L7806237O646153j1535396L773643J6835265J706871j7546425
41852c188443j2502200O112913J5194630J7186081K4618774K9419504J4800824
41845I1642083j3206579k8274141j6305644O846032J1998268j1556565m1041204
41838A02250m1391919n388687L4916577M3962733K0597905q848482k3490569k0663568
41830b03760p497786L982650K416873p860231q214484N155563J1046983p12975
41822a887167o319827J2237809K8284162R018188k5480545k7658319L133876K1806958
41814A3135135J1174266R89734N963074O32464k3425990k8214004R128889M8124782
$$ plain form
41867 -17130057 1473393 -3602185 -11227027 -13718330 -31215404 -63280423 -72567207 -40874791
41859 -40874791 -3068554 3577599 -7957797 -4184154 12651111 14357982 -3188443
41852 -3188443 -15690643 -9577730 5616900 22802981 47421755 76841259 91642083
41845 91642083 78435504 50161363 33855719 40701751 52700019 41143454 102250
41838 102250 -41289669 -46678356 -11761779 32200954 52798859 43950377 20459808 -203760
41830 -203760 -7701546 -3718896 -1302023 -9162254 -17376738 -12221175 -1174192 -1887167
41822 -1887167 -8206994 4030815 32314977 41333165 15852620 -11805699 -8671823 13135135
41814 13135135 24309401 25299135 31262209 31894673 8468683 -19745321 -10616432 37508350
41806C7508350L9455923l124058k7903939k0151780q230790p946607n168280O802400
41798A1241219J0988619l249741k0707206k1168515l172101J8702152K7699024
41791B0333451J5044822j0898996k6376101j6506271L864978Q130624n516156
41784a1923649j3539355m025830O611856K204932o477881O21765J9479557K5170692
41776A8122087O908381j6497860k1091109n620822J2827576K1419040J8396919
41769C4464212M158296j8286826l4308037k6725038m05697J7243537J0180371
41762a3679182n027835l820895J2663518K3319280J6666334j169234j9716699
41755I235287k8992816j9349527N117604K0130103Q142655j3993975j5188133
$$ plain form
41806 37508350 76964273 73840215 45936276 25784496 17553706 9607099 4438819 11241219
41798 11241219 22229838 18980097 -1727109 -22895624 -26067725 -7365573 20333451
41791 20333451 35378273 24479277 -1896824 -18403095 -14538117 -6407493 -11923649
41784 -11923649 -25463004 -29488834 -22876978 -20672046 -27149927 -26528162 -7048605 18122087
41776 18122087 25030468 8532608 -12558501 -18179323 -5351747 16067293 34464212
41769 34464212 38622508 20335682 -13972355 -40697393 -41103090 -23859553 -13679182
41762 -13679182 -18707017 -22527912 -9864394 13454886 30121220 28951986 9235287
41755 9235287 -19757529 -39107056 -33989452 -13859349 -5716694 -19710669 -34898802
41748c4898802O793745K4583403K0460570L764122r063303r717689M492625K6005431
41740C2420102L2811041J1863344j8109886l1174385l1898401l8167856l9067691
41733h1323732j2116626K4747105K8631000L77936j4793000j303061Q989983L997952
41725d2792443J2487987L6874191L3351879o783612k4846749R509600L7519815
41718E5320668O296492l8293594k7679923J4705674K0410063n396032p182635
41711A8180713R671676n877987l9264578k3124456L5086126M6700686j4904301
41704B6467879o6380122m5504524L476626K1711542K5610464M6106712N4415788
41697F5904365J8237836k6768364l2057533j6283346k2676818l6635298j5779801
$$ plain form
41748 -34898802 -28105057 -3521654 16938916 20703038 11639735 1922046 6414671 32420102
41740 32420102 65231143 77094487 58984601 27810216 -4088185 -42256041 -81323732
41733 -81323732 -93440358 -68693253 -40062253 -39684317 -54477317 -55780378 -46790395 -42792443
41725 -42792443 -30304456 6569735 39921614 33138002 8291253 17800853 55320668
41718 55320668 61617160 23323566 -4356357 10349317 30759380 25363348 18180713
41711 18180713 27852389 21974402 -17290176 -40414632 -5328506 41372180 26467879
41704 26467879 -39912243 -85416767 -81940141 -60228599 -34618135 11488577 65904365
41697 65904365 84142201 57373837 25316304 9032958 -13643860 -50279158 -66058959
41690f6058959K7774173M4177026K5524064O322029q25537j1298155k0875996
41683D738645p671483K2696077M0477540L5344002J7865812r282567m0743124
41676F3424902m6850035j0197566L0749403K4258375k0065845m8033571l9289352
41669d6003689j7619013K871688K4001196K7505281l093131l0970220n571327
41662d8879215M6772806M7406861j0035805m0526023J677081N2427902L9420117
41655H8263724j4763119m3852132l5790990k1760451j0920267N147142J4088390
41648a9587703L220141n568003J0428085K8667697J5466130j5475824k5811984
41641h661461j4734728j0124784j3178298j904644J9596853K4323755J1071718
$$ plain form
41690 -66058959 -38284786 5892240 31416304 37738333 36912796 25614641 4738645
41683 4738645 -2932838 19763239 60240779 95584781 113450593 104168026 63424902
41676 63424902 16574867 6377301 37126704 61385079 41319234 -6714337 -46003689
41669 -46003689 -63622702 -60751014 -36749818 -9244537 -12337668 -43307888 -48879215
41662 -48879215 -2106409 45300452 35264647 -5261376 -3584295 48843607 88263724
41655 88263724 73500605 29648473 -6142517 -27902968 -38823235 -33676093 -19587703
41648 -19587703 -16367562 -21935565 -11507480 17160217 32626347 17150523 -8661461
41641 -8661461 -23396189 -33520973 -46699271 -48603915 -29007062 -4683307 6388411
41634F388411M699292Q831390J713798j8144759k3187368j304345K4790189L0755763
41626C4542371J6592556l854125j5487497o278591J6485585K1479934p117063
41619E6363170l6557742k7001983N677307J2491212j0360894j7545745Q314144
41612h620531L0115921K0694808J976286k537027p146258k6648653m0286506k6601881
41604e9053841k092593P866471R287504J9039453K9282319K5017465J5535596
41597D4882374J6228680J8045685O301048q096599p820314k502209j0342105k2211479
41589C4485081j8459208p326583r775315j7496394n565267K0205540K9539508
41582B5607362J8508012J1989630J3623408k007029l6580631n0848521k1496121
$$ plain form
41634 6388411 11087703 19919093 21632891 3488132 -19699236 -21003581 3786608 34542371
41626 34542371 51134927 47280802 31793305 25514714 42000299 63480233 56363170
41619 56363170 19805428 -7196555 -1519248 10971964 611070 -16934675 -8620531
41612 -8620531 21495390 42190198 44166484 41629457 34483199 7834546 -32451960 -59053841
41604 -59053841 -61146434 -53279963 -43992459 -24953006 4329313 29346778 44882374
41597 44882374 61111054 79156739 85457787 77361188 69540874 67038665 56696560 34485081
41589 34485081 16025873 8699290 -1076025 -18572419 -24137686 -3932146 25607362
41582 25607362 44115374 56105004 69728412 67721383 31140752 -19707769 -41203890
41575d1203890J9547469K8281935N178706j6745947j9444070r171116O532444
41568b7024469K4635858L6635227L4399066K2741523J1247373p60757j7012877
41561H4860944k8772431k2739304k012316J4157673J1193536q219491k8502026
41554A9966585l1299851r358647J9842685K4196634m534668l0866463j4544165
41547b6597890L3539839N7828632K6569347k7368882m8195955k4705751L674947
41540e255713K640626j7108617k2478452m331995J4815049J5311996N601599N642262
41532e163245J6022527J7393007p38882k3656450k9265385j4224221M603540J0193571
41524b4835538L57625j4494643k2262373j8180464o775378N141608J7176377L1955095
$$ plain form
41575 -41203890 -21656421 6625514 11804220 -4941727 -24385797 -33556913 -27024469
41568 -27024469 -2388611 34246616 68645682 91387205 102634578 101873821 84860944
41561 84860944 56088513 33349209 31336893 45494566 56688102 48468611 19966585
41554 19966585 -11333266 -20691913 -849228 23347406 18812738 -12053725 -26597890
41547 -26597890 6941949 64770581 91339928 63971046 15775091 -8930660 -5255713
41540 -5255713 -2615087 -19723704 -42202156 -46534151 -31719102 -16407106 -10805507 -5163245
41532 -5163245 10859282 28252289 27513407 3856957 -25408428 -39632649 -35029109 -24835538
41524 -24835538 -24477913 -38972556 -61234929 -79415393 -86190771 -81049163 -63872786 -31917691
41516c1917691M2229708L2380980J801472k2721671j4278987J6782806L0483138
41509E4759755O644528k9087049l7760434j3114802J6828503K5153446R724894
41502C3148841j3148085k5460223j9649834m291047L809002K86247L984J3928227
41494a1372888K8829039K5516206Q587222k603219n891399j3610181k2032579
41487G422201j5266197r21819m502899j9836736q571405L1276608M3887508j409880
41479C2077381n0316104l8328677J0711215K5430336J045725m705689J9325862
41472d759951K0171252j3817326j9119851L2474589P0040701L0140562l7128985
41465G8000991m2397139Q304564L3668211M802224k9535701l5782796l3667001
$$ plain form
41516 -31917691 10312017 42692997 44494469 21772798 7493811 24276617 54759755
41509 54759755 61404283 32317234 -5443200 -18558002 -1729499 23423947 33148841
41502 33148841 20000756 -5459467 -25109301 -29400348 -25591346 -25305099 -25301115 -11372888
41494 -11372888 17456151 42972357 51559579 48956360 43064961 29454780 7422201
41487 7422201 -7843996 -8765815 -13268714 -33105450 -41676855 -10400247 33487261 32077381
41479 32077381 -18238723 -56567400 -45856185 -20425849 -19380124 -24085813 -4759951
41472 -4759951 15411301 1593975 -17525876 14948713 84989414 115129976 78000991
41465 78000991 35603852 43908416 77576627 82378851 52843150 17060354 -16606647
41458a6606647l4839672j6840837K0653262L5070388N653781k8666960k5760163
41451f1336848L526786K3410962K4454223J9100281J2808065O034691N087330
41444C3085490J0622687J3037931J2490296K1334288L5235065K9495941q52598
41437A54449100k6377675k6941148k0916392k9189088l8699082k7979301m219530
41430a9873116J2328563J9145836K0748045R874372j2767303k2436218m767603
41423B252576J4908288R819823j515781J4291367M4859518M5990374R111778k8106088
41415A11611855l8053518l0548190k0771849p580928P697209J3236852Q103499
41408D3694930N530098P311879L44474j4842245j8622992m056807J0655632J0972933
$$ plain form
41458 -16606647 -51446319 -68287156 -47633894 -12563506 -6909725 -35576685 -61336848
41451 -61336848 -57810062 -34399100 -9944877 9155404 21963469 27998160 33085490
41444 33085490 43708177 56746108 69236404 90570692 125805757 155301698 154449100
41437 154449100 128071425 101130277 80213885 51024797 12325715 -15653586 -19873116
41430 -19873116 -7544553 11601283 32349328 42223700 29456397 7020179 2252576
41423 2252576 17160864 26980687 25464906 39756273 84615791 130606165 139717943 111611855
41415 111611855 73558337 43010147 22238298 14657370 22354579 35591431 43694930
41408 43694930 49225028 56536907 56881381 42039136 23416144 19359337 30014969 40987902
41400D0987902L887124k577293j3821319k9741148l2810327j1528500J8429252
41393b7174309L0344729J4931891j4223316l4236463k9540556o268209J0994593
41386e5171640R705762R001177K7918675M5049247K5105240j7770252k8562524
41379A5275685O270439L2365865Q241290l0848219k7805075J0842994L0666938
41372D5009917J0765630j8152058k8967542k6053783j6954816J864518K1109067
41365a1379067J5925613j6616184m3232113l4599879j218930K5358856L0998748
41358c4762956K3911290J4455177O910683M932985J0441278J7290004J4611612
41351E7790073j788295k3402794l4230002k4472852l049770P814750j955437j5601304
$$ plain form
41400 40987902 44875026 42297733 28476414 -1264734 -34075061 -45603561 -27174309
41393 -27174309 3170420 18102311 3878995 -30357468 -59898024 -66166233 -55171640
41386 -55171640 -45465878 -36464701 -8546026 36503221 61608461 43838209 15275685
41379 15275685 21546124 53911989 62153279 31305060 3499985 14342979 45009917
41372 45009917 55775547 37623489 8655947 -17397836 -34352652 -32488134 -11379067
41365 -11379067 4546546 -12069638 -55301751 -89901630 -91120560 -65761704 -34762956
41358 -34762956 -10851666 3603511 10514194 15447179 25888457 43178461 57790073
41351 57790073 56001778 32598984 -1631018 -26103870 -29153640 -21338890 -23294327 -38895631
41343c8895631j2338289P37889r38540j7356840j7827414J2023237M1202442L3058056
41335c35090k183561k1773251r677746Q245200R420160M212906Q265935J1783608
41327G958161j246591j9961379j9394679k35258R747589l732068k1132988j7139531
41319f5136744P047292K9477895L4408386K3478895P137742n844071j2670435
41312A7898960j4794487j1515966P69005J6602122J6933001p023782l0475461
41305a1606608j9871575J6941458L3768057R283636k2807353k5276128r179047
41298b8747560n951868j3664041q747199N919746P271277j252654P256857L2675958
41290e239484M2090981K1577963m803736j7509848k4663514k9360744j3711561
$$ plain form
41343 -38895631 -51233920 -50496031 -51434571 -68791411 -86618825 -74595588 -33393146 -335090
41335 -335090 -2518651 -24291902 -33969648 -25724448 -16304288 -12091382 -3825447 7958161
41327 7958161 6711570 -13249809 -32644488 -32879746 -23132157 -26864225 -47997213 -65136744
41319 -65136744 -58089452 -28611557 5796829 29275724 36413466 30569395 17898960
41312 17898960 3104473 -8411493 -7642488 8959634 25892635 18868853 -11606608
41305 -11606608 -31478183 -14536725 19231332 28514968 5707615 -19568513 -28747560
41298 -28747560 -34699428 -48363469 -57110668 -51190922 -43919645 -45172299 -37915442 -5239484
41290 -5239484 36851497 58429460 53625724 36115876 11452362 -17908382 -31619943
41283c1619943K2710072M4261556K6681778n898696j9327890j7652846k2091299
41276b937268k6985067j3779117Q303145J3690582K963733r19301P434918J2352693
41268A24318R005426O998816M699063q643858k5763139k7216007j4982685r006947
41260f4785013q863685O064913L1807605L3484433K85031k8051982j4992162J9470396
41252b5580464K8869967M913077j9571114k1810497j1288184k383452N803304
41245d1047363J5253074J7488783Q351443m40840K969244J2497792J3329072L097354
41237C1498559p472714j1221724r607044k584265J1863371K4555697J7602029
41230E4633909q976038k6886619j3225602J4719472K0398932j42153j3537463
$$ plain form
41283 -31619943 -8909871 35351685 62033463 56134767 36806877 19154031 -2937268
41276 -2937268 -29922335 -43701452 -35398307 -21707725 -18743992 -19663293 -12228375 124318
41268 124318 9129744 16128560 20827623 12183765 -13579374 -40795381 -55778066 -64785013
41260 -64785013 -73648698 -67583785 -35776180 -2291747 -2006716 -30058698 -45050860 -25580464
41252 -25580464 3289503 8202580 -11368534 -33179031 -44467215 -46850667 -41047363
41245 -41047363 -25794289 -8305506 45937 -394903 2574341 15072133 28401205 31498559
41237 31498559 24025845 12804121 3197077 612812 12476183 37031880 54633909
41230 54633909 45657871 18771252 5545650 20265122 40664054 40521901 26984438
41223B6984438Q8905J9504960J8386191L711245k136028J860463R10183o192512
41215F3117845q457355o036467q525344j4229686j2821596n657951l124291m897288
41207f32133l251660k159922j0285288j7790911o442883J5889824J9019283l942927
41199i596617k1749512r396114J5202201J7380319n952752k3158936q041047K9234630
41191a6077828N1110951L0192363j8726295m8258400k9815423J1103481K7458948
41184F987797J1480782k663900M692409J2912710K083766j2749551j0070069M27930
41176A3101874m043806j9537139k1825360m944877J2093163J5005993R534613
41169f15539N995118N372963L857012m68604p887823j6410864k0844461j8133391
$$ plain form
41223 26984438 27073343 46578303 64964494 68675739 66539711 68400174 69310357 63117845
41215 63117845 54660490 48624023 40098679 25868993 13047397 7389446 4265155 -632133
41207 -632133 -3883793 -6043715 -16329003 -34119914 -40562797 -24672973 -5653690 -9596617
41199 -9596617 -31346129 -40742243 -25540042 -8159723 -14112475 -37271411 -45312458 -16077828
41191 -16077828 35033123 65225486 46499191 -1759209 -31574632 -20471151 6987797
41184 6987797 18468579 15804679 20497088 33409798 35493564 22744013 12673944 13101874
41176 13101874 9058068 -10479071 -32304431 -37249308 -25156145 -10150152 -615539
41169 -615539 5379579 10752542 14609554 14140950 6253127 -10157737 -31002198 -49135589
41161d9135589j1619264n636425j8862O068955J0633555J3010463J4839786J4411757
41153g445624Q920634L533439N306733O720334o379430k6004565k4876696P78127
41145c9447048J7252263J545006k1474397j7604504K486015L518480j3633579
41138f7357764j3485888J3362812L2819652K0492302l332657q521454L460377
41131b2562620J2388628J1422679O081461j839897r425237n581571J1009297J7951942
41123A9444682n017284m1808408n2571138k1076836K6164642N0168539L7481054
41116A2785251O942004j1979869o538692P682650N217033j4625338k2006293K270449
41108b0252805L2575143K9367979j940300j5701403M701136J9083333o131052
$$ plain form
41161 -49135589 -60754853 -66391278 -66410140 -60341185 -49707630 -36697167 -21857381 -7445624
41153 -7445624 1475010 5008449 10315182 17035516 10656086 -15348479 -40225175 -39447048
41145 -39447048 -22194785 -20649779 -42124176 -59728680 -57242665 -53724185 -67357764
41138 -67357764 -80843652 -67480840 -34661188 -14168886 -17501543 -26022997 -22562620
41131 -22562620 -10173992 1248687 7330148 5490251 -3934986 -9516557 1492740 19444682
41123 19444682 14427398 -27381010 -79952148 -101028984 -74864342 -24695803 12785251
41116 12785251 19727255 7747386 1208694 8891344 14108377 -516961 -22523254 -20252805
41108 -20252805 12322338 41690317 39750017 24048614 28749750 47833083 41702031
41101D1702031l9782563k9589871J5995473L7244981J1064537k0088308j8704846
41094b158566l977033p240248j7167274p683027J0206705R617049K14848J0363088
41086g824458K8754162J7537924j7306418k5302523O552699K6342657k239957
41079B6514086m0749299l5100254L997407K4198039R998537p723940p302885J090767
41071b5077542M336469L030799L0734j152195Q661452K7005455K8681916N85855
41063D6102943k6436262j7174591Q915852M183519k7645723l3416131Q57379K3037529
41055b1575485J142453k0249649P129866N1328029M6756145k067366k7555491
41048C4908502l673196J9810376J656531k7929276k0997003J1500697K0380130
$$ plain form
41101 41702031 1919468 -27670403 -11674930 25570051 36634588 16546280 -2158566
41094 -2158566 -6135599 -13375847 -30543121 -38226148 -28019443 -18402394 -18187546 -7824458
41086 -7824458 20929704 38467628 21161210 -4141313 2411386 28754043 26514086
41079 26514086 -14235213 -49335467 -45338060 -21140021 -11141484 -18865424 -26168309 -25077542
41071 -25077542 -20741073 -17710274 -17679540 -18831735 -10170283 16835172 45517088 46102943
41063 46102943 19666681 2492090 11407942 15591461 -12054262 -45470393 -44613014 -21575485
41055 -21575485 -20433032 -40682681 -33552815 17775214 64531359 62463993 34908502
41048 34908502 31235306 51045682 52702213 24772937 3775934 15276631 35656761
41041C5656761m403122k2624945q727315J2443855Q067185j4798836k5566906
41034a9953323j5258471q35092N212160M851339j583652j6263120k7290513j6336102
41026h7456774J0499068K3491926J1528662p35742O664114J6647905P070508p368482
41018a9658815J419440K3193934J9936674j3678702l8180754k5887580L043643
41011d9812160J5436267Q987148K819552M268009N551182K055716k852737n026441
41003a8573464j770420N897478Q421289k763516j6580600j0750187J2867766K2244711
40995a006943p2484k6088548j9378263J1228379K3609482L088523j8476749r940565
40987c7037168J8080340L3109308K4195521P269264l714396j0609348j5480406
$$ plain form
41041 35656761 31253639 8628694 -98621 12345234 20412419 5613583 -19953323
41034 -19953323 -35211794 -36046886 -30834726 -25983387 -27567039 -43830159 -71120672 -87456774
41026 -87456774 -76957706 -53465780 -41937118 -42672860 -36008746 -19360841 -12290333 -19658815
41018 -19658815 -18239375 4954559 24891233 11212531 -26968223 -52855803 -49812160
41011 -49812160 -34375893 -25388745 -22569193 -18301184 -12750002 -10694286 -13547023 -18573464
41003 -18573464 -20343884 -14446406 -6025117 -8788633 -25369233 -36119420 -23251654 -1006943
40995 -1006943 -1079427 -27167975 -46546238 -35317859 -11708377 -8619854 -27096603 -37037168
40987 -37037168 -18956828 14152480 38348001 45617265 41902869 31293521 15813115
40980A5813115j0510948N501909J3871412k258696k7505548k7895834M22907J9906162
40972a2655521L954911k1567679j5271330J6283299K7079150J305778k2444477
40965b3315869p883923K8887048M5482489K8161206j90625j3440041n102947J3343885
40957F5941223K2546891J0152256j5275593l2936424l5737120l2711905k3428017
40950d1448689L975537L8146634L9688531l565577m3641547l0441925J6361273
40943b0925763L5409293J2963730m581749R556974K1606297k172417l6641172
40936A5215193l6065609n153362R679224r433104k9785558k0745257M594822J5253225
40928e6440426O508186k383570j498755J118332N93786M228263J5102976K2717262
$$ plain form
40980 15813115 5302167 10804076 24675488 22416792 -5088756 -32984590 -32561683 -12655521
40972 -12655521 -8700610 -30268289 -45539619 -29256320 -2177170 -871392 -23315869
40965 -23315869 -31199792 -2312744 43169745 71330951 71140326 57700285 52597338 65941223
40957 65941223 88488114 98640370 83364777 50428353 14691233 -18020672 -41448689
40950 -41448689 -37473152 673482 40362013 36796436 -6845111 -37287036 -20925763
40943 -20925763 14483530 27447260 22865511 32422485 54028782 51856365 15215193
40936 15215193 -20850416 -26003778 -16324554 -25757658 -55543216 -76288473 -71693651 -56440426
40928 -56440426 -49932240 -52315810 -53814565 -52696233 -52102447 -47874184 -32771208 -10053946
40920a0053946J7780068M619557q739318k1123172k9610067k3390662k90369K1752455
40912d9055454K7180337K7004516L8724993M9844016L0416597j6881663m9612980
40905E7620362l9188305o445530J0717513M044360p531969r857567m487514J799460
40897F670810L674332M32651l75952P086308J1614000j542267j9829326j4160738
40889f430182J1704105J7789245q844822k6814019o172702J7537024m42523l5315162
40881c6989036k7800314J8887853M0753269J2081197j9163538j0852659J3226993
40874i856235J1573206q896507j1134808J2839063L4852133L1459830Q123335
40867F8960017j2205823j1832404M574969J1705685o859397l2408126l2847246
$$ plain form
40920 -10053946 7726122 12345679 3606361 -17516811 -47126878 -70517540 -70807909 -49055454
40912 -49055454 -21875117 5129399 43854392 93698408 124115005 107233342 57620362
40905 57620362 18432057 11986527 22704040 26748400 19216431 9358864 4871350 6670810
40897 6670810 10345142 10777793 10401841 17488149 29102149 27559882 7730556 -6430182
40889 -6430182 5273923 23063168 14218346 -12595673 -18768375 -1231351 -1673874 -36989036
40881 -36989036 -64789350 -45901497 -5148228 6932969 -12230569 -23083228 -9856235
40874 -9856235 1716971 -7179536 -18314344 -5475281 29376852 60836682 68960017
40867 68960017 56754194 44921790 49496759 61202444 54343047 21934921 -10912325
40860a0912325q652080Q531652M185729l132506j30637J385997m170666K0765
40852a2874071J8394863K4615043K906908k0991073j8035270O34050Q385659P327035
40844A0363144J3567765J8143976J269970k6202932l3219767j4760658N745410
40837b5093092J5408500K0696247K1306311R369875n612987m730688N211824j695530
40829C4860460k3885993k8073577k896093J7943975N348395k1460163k5243265
40822d3406261l476657J5272211J4253798L036090m278825m260985P08898P155877
40814a4995854J0506252R630259Q617805Q105443K765371n073001j179856J8078178
40806C6454597L0316339J3394566j9033697l0226516q908755J6564211J8332531
$$ plain form
40860 -10912325 -19564405 -11032753 -6847024 -9979530 -10110167 -8724170 -12894836 -12874071
40852 -12874071 5520792 30135835 33042743 12051670 -5983600 -5349550 3036109 10363144
40844 10363144 23930909 42074885 43344855 17141923 -16077844 -30838502 -25093092
40837 -25093092 -9684592 11011655 32317966 41687841 36074854 31344166 36555990 34860460
40829 34860460 10974467 -17099110 -19995203 -2051228 3297167 -18162996 -43406261
40822 -43406261 -46882918 -31610707 -17356909 -14320819 -18599644 -22860629 -22151731 -14995854
40814 -14995854 -4489602 5140657 13758462 21863905 24629276 19556275 18376419 36454597
40806 36454597 66770936 80165502 61131805 30905289 21996534 38560745 56893276
40799E6893276K734506p751129q616742j1540917j9198542k1807608j5493212
40792b4780368o821996J53349N608433L827091j0154339k2632791j2107872J5514482
40784e1394011K6912706R465340o367467N492564K1804186N917814k9030118l5629180
40776e2828166n836538J6505356M054610j6798811j4199295L023282J1698954
40769e4380608J2572492J3510134M975304j4670641j6866398J5327562M5778092
40762F245937K9975463j4871953l2855650j3274008J545028p415395q923796J3814816
40754b5759558K5898214r03819l5001004k9654590P243302K8557452J6840855
40747a2779148n99167L48171J1277166J3379065N027257m93451O247626J7705004
$$ plain form
40799 56893276 59627782 51876653 43259911 31718994 12520452 -9287156 -24780368
40792 -24780368 -31602364 -31449015 -25840582 -22013491 -32167830 -54800621 -66908493 -51394011
40784 -51394011 -24481305 -15015965 -21383432 -15890868 5913318 11831132 -17198986 -52828166
40776 -52828166 -58664704 -42159348 -38104738 -54903549 -69102844 -66079562 -54380608
40769 -54380608 -41808116 -28297982 -23322678 -37993319 -54859717 -39532155 6245937
40762 6245937 36221400 21349447 -11506203 -24780211 -23235183 -30650578 -39574374 -25759558
40754 -25759558 138656 -765163 -35766167 -65420757 -58177455 -29620003 -12779148
40747 -12779148 -13378315 -13030144 -1752978 11626087 16653344 16159893 22407519 40112523
40739D0112523J3293039j5697310m3922739l3885523J0822736L8606054J6389427
40732B5718207k0525401j6746834K1569567L4574176l510571m6323829l9429407
40725d4674092R227436M5386941L6284641n24324k8107159k9839457j5987599
40718b8233613k477150P848198K0233873K9562436K0562232o916223k7168543
40711A3411210j8907692L843700J0683083k741968j4302417j2912300r530298
40704c0456682r993043n415026M316604N281382l267379m123119M827634L359985
40696c5469644j0397698o660802K4215490M1345993J1207270l2365934l2190917
40689d0316242O179471K4488301K413155j6543995N97002K6835436K3716708l59203
$$ plain form
40739 40112523 53405562 37708252 -6214487 -40100010 -29277274 9328780 25718207
40732 25718207 5192806 -11554028 10015539 44589715 41079144 -5244685 -44674092
40725 -44674092 -35446656 9940285 46224926 45700602 17593443 -12246014 -28233613
40718 -28233613 -30710763 -22862565 -2628692 26933744 47495976 40579753 13411210
40711 13411210 -5496482 -1652782 9030301 6288333 -8014084 -20926384 -30456682
40704 -30456682 -40449725 -45864751 -41548147 -36266765 -39534144 -43657263 -38829629 -35469644
40696 -35469644 -45867342 -52528144 -28312654 13033339 24240609 -8125325 -40316242
40689 -40316242 -34136771 -9648470 -7235315 -23779310 -23182308 3653128 27369836 27010633
40681B7010633j1550749l881891R42861p567141j7974691j9121394j2597602n290966
40673e0030940j921166k044395J451522J3916258K6555047K4730769J0757016
$$ plain form
40681 27010633 15459884 11577993 12520854 4953713 -13020978 -32142372 -44739974 -50030940
40673 -50030940 -51952106 -53996501 -52544979 -38628721 -12073674 12657095 23414111
$$ [...]
##END NTUPLES=NMR SPECTRUM
##END=
