##TITLE=31Pdec_SR22_rm2
 , 24 sc
 30.10.2020
##JCAMPDX= 6.0         $$ Bruker NMR JCAMP-DX V2.0
##DATA TYPE= NMR SPECTRUM
##DATA CLASS= NTUPLES
##ORIGIN= UXNMR, Bruker Analytische Messtechnik GmbH
##OWNER= root
$$ XWIN-NMR		Version 3.5
$$ Fri Oct 30 11:33:23 2020 Russian Standard Time (UT+4h)  she@DPX200
##.OBSERVE FREQUENCY= 81.013821
##.OBSERVE NUCLEUS= ^31P
##.ACQUISITION MODE= SIMULTANEOUS
##.ACQUISITION SCHEME= undefined
##.AVERAGES= 24
##.DIGITISER RES= 17
##SPECTROMETER/DATA SYSTEM= spect
##.PULSE SEQUENCE= zgpg30
##.SOLVENT NAME= Pyr
##.SHIFT REFERENCE= (INTERNAL, Pyr, 0, 182.463)
##AUDIT TRAIL= $$ (NUMBER, WHEN, WHO, WHERE, WHAT)
$$ ##TITLE= Audit trail, XWIN-NMR		Version 3.5
$$ ##JCAMPDX= 5.01
$$ ##ORIGIN= Bruker BioSpin GmbH
$$ ##OWNER= she
$$ F:/spectra/data/she/nmr/P31/1/pdata/1/auditp.txt
$$ ##AUDIT TRAIL=  $$ (NUMBER, WHEN, WHO, WHERE, WHAT)
(   1,<2020-10-30 11:32:20.62 +0400>,<she>,<DPX200>,
      <created by zg, POWCHK disabled, PULCHK disabled
       configuration hash MD5:
       00 E9 B6 7A A2 85 ED C7 34 08 36 98 17 FE 4E 26
       data hash MD5: 32K
       DF F6 2B B3 C0 06 41 B6 00 E1 E4 6B C1 A7 FA 88>)
(   2,<2020-10-30 11:32:23.59 +0400>,<she>,<DPX200>,
      <Start of raw data processing
       efp BC_mod = 2 LB = 1 FT_mod = 6 PKNL = 1 PHC0 = -2411.464 PHC1 = 144.8008 SI = 64K 
       data hash MD5: 64K
       5C 31 D5 FC 49 FA 76 4C 99 96 27 CF A6 18 6C 5A>)
(   3,<2020-10-30 11:32:44.39 +0400>,<she>,<DPX200>,
      <pk PHC0 = -6.284703 PHC1 = -5.6 
       data hash MD5: 64K
       20 B5 4B D8 C7 B6 55 10 AD FE 4B A7 A2 7B 28 7F>)
(   4,<2020-10-30 11:32:47.53 +0400>,<she>,<DPX200>,
      <abs ABSG = 5 
       data hash MD5: 64K
       63 59 A2 D1 99 FB 51 E2 0C 77 57 56 68 0E 40 90>)
$$ ##END=
$$ 
$$ hash MD5
$$ 7B F0 1D D5 5E E9 76 CA F8 20 26 AD 7F D8 FA 9A
##$RELAX= 
##$RELAX= 
##$RELAX= 
##$RELAX= 
##$RELAX= 
##$RELAX= 
##$RELAX= 
##$RELAX= 
$$ Bruker specific parameters
$$ --------------------------
##$DU= <F:/spectra>
##$EXPNO= 1
##$NAME= <P31>
##$PROCNO= 1
##$TYPE= <nmr>
##$USER= <she>
##$AMP= (0..31)
100 100 100 100 100 100 100 100 100 100 100 100 100 100 100 100 100 100 
100 100 100 100 100 100 100 100 100 100 100 100 100 100 
##$AQSEQ= 0
##$AQ_mod= 1
##$AUNM= <au_zg>
##$AUTOPOS= <>
##$BF1= 81.014009
##$BF2= 200.13
##$BF3= 200.13
##$BF4= 200.13
##$BF5= 200.13
##$BF6= 200.13
##$BF7= 200.13
##$BF8= 200.13
##$BYTORDA= 1
##$CFDGTYP= 0
##$CFRGTYP= 5
##$CHEMSTR= <none>
##$CNST= (0..31)
1 1 145 1 1 1 1 1 1 1 1 1 1 1 1 1 1 1 1 1 1 1 1 1 1 1 1 1 1 1 1 1 
##$CPDPRG= <waltz16>
##$CPDPRG1= <>
##$CPDPRG2= <waltz16>
##$CPDPRG3= <>
##$CPDPRG4= <mlev>
##$CPDPRG5= <mlev>
##$CPDPRG6= <mlev>
##$CPDPRG7= <mlev>
##$CPDPRG8= <mlev>
##$CPDPRGB= <>
##$CPDPRGT= <>
##$D= (0..31)
0 1 0 0 0 0 0 0 0 0 0 0.03 2e-05 3e-06 0 0 0 0 0 0 0 0 0 0 0 0 0 0 0 0 
0 0 
##$DATE= 1604043140
##$DBL= (0..7)
120 120 120 11 120 120 24 19 
##$DBP= (0..7)
150 150 150 150 150 150 150 150 
##$DBP07= 0
##$DBPNAM0= <>
##$DBPNAM1= <>
##$DBPNAM2= <>
$$ [...]
##$SUBNAM3= <"">
##$SUBNAM4= <"">
##$SUBNAM5= <"">
##$SUBNAM6= <"">
##$SUBNAM7= <"">
##$SUBNAM8= <"">
##$SUBNAM9= <"">
##$SW= 369.568048894756
##$SWIBOX= (0..15)
0 1 3 0 0 0 0 0 0 0 0 0 0 0 0 0 
##$SW_h= 29940.119760479
##$TD= 32768
##$TD0= 1
##$TE= 0
##$TE2= 300
##$TE3= 300
##$TEG= 300
##$TL= (0..7)
0 120 53 12 22 120 120 120 
##$TP= (0..7)
150 150 150 150 150 150 150 150 
##$TP07= 0
##$TPNAME0= <>
##$TPNAME1= <>
##$TPNAME2= <>
##$TPNAME3= <>
##$TPNAME4= <>
##$TPNAME5= <>
##$TPNAME6= <>
##$TPNAME7= <>
##$TPOAL= (0..7)
0.5 0.5 0.5 0.5 0.5 0.5 0.5 0.5 
##$TPOFFS= (0..7)
0 0 0 0 0 0 0 0 
##$TUNHIN= 0
##$TUNHOUT= 0
##$TUNXOUT= 0
##$USERA1= <user>
##$USERA2= <user>
##$USERA3= <user>
##$USERA4= <user>
##$USERA5= <user>
##$V9= 5
##$VALIST= <valist>
##$VCLIST= <CCCCCCCCCCCCCCC>
##$VD= 0
##$VDLIST= <DDDDDDDDDDDDDDD>
##$VPLIST= <PPPPPPPPPPPPPPP>
##$VTLIST= <TTTTTTTTTTTTTTT>
##$WBST= 1024
##$WBSW= 4
##$XGAIN= (0..3)
0 0 0 0 
##$XL= 0
##$YL= 0
##$YMAX_a= 36705
##$YMIN_a= -24746
##$ZGOPTNS= <>
##$ZL1= 120
##$ZL2= 120
##$ZL3= 120
##$ZL4= 120
##$ABSF1= 182.463
##$ABSF2= -187.1042
##$ABSG= 5
##$ABSL= 3
##$ALPHA= 0
##$AQORDER= 0
##$ASSFAC= 0
##$ASSFACI= 0
##$ASSFACX= 0
##$ASSWID= 0
##$AUNMP= <proc_1d>
##$AZFE= 0.1
##$AZFW= 0.5
##$BCFW= 0
##$BC_mod= 2
##$BYTORDP= 0
##$COROFFS= 0
##$CY= -3
##$DATMOD= 1
##$DC= 0
##$DFILT= <>
##$DTYPP= 0
##$F1P= 0
##$F2P= 0
##$FCOR= 1
##$FTSIZE= 65536
##$FT_mod= 6
##$GAMMA= 0
##$GB= 0
##$INTBC= 1
##$INTSCL= 5.30512e-09
##$ISEN= 30
##$LB= 1
##$LEV0= 0
##$LPBIN= 0
##$MAXI= 10000
##$MC2= 0
##$MEAN= 0
##$ME_mod= 0
##$MI= 50
##$NCOEF= 0
##$NC_proc= -6
##$NLEV= 6
##$NOISF1= 182.463
##$NOISF2= 159.3651
##$NSP= 0
##$NTH_PI= 0
##$NZP= 0
##$OFFSET= 182.463
##$PC= 4
##$PHC0= -2417.749
##$PHC1= 139.2008
##$PH_mod= 1
##$PKNL= yes
##$PPARMOD= 0
##$PSCAL= 0
##$PSIGN= 0
##$REVERSE= no
##$SF= 81.014009
##$SI= 65536
##$SIGF1= 159.3651
##$SIGF2= -187.1042
##$SINO= 113.3802
##$SIOLD= 16384
##$SREGLST= <1H.CDCl3>
##$SSB= 0
##$STSI= 65536
##$STSR= 0
##$SW_p= 29940.119760479
##$SYMM= 0
##$S_DEV= 0
##$TDeff= 32768
##$TDoff= 0
##$TI= <>
##$TILT= no
##$TM1= 0
##$TM2= 0
##$TOPLEV= 0
##$USERP1= <user>
##$USERP2= <user>
##$USERP3= <user>
##$USERP4= <user>
##$USERP5= <user>
##$WDW= 1
##$XDIM= 65536
##$YMAX_p= 444107351
##$YMIN_p= -8917287
$$ End of Bruker specific parameters
$$ ---------------------------------
##NTUPLES= NMR SPECTRUM
##VAR_NAME=  FREQUENCY,     SPECTRUM/REAL,   SPECTRUM/IMAG
##SYMBOL=    X,             R,               I
##VAR_TYPE=  INDEPENDENT,   DEPENDENT,       DEPENDENT
##VAR_FORM=  AFFN,          ASDF,            ASDF
##VAR_DIM=   65536,         65536,           65536
##UNITS=     HZ,            ARBITRARY UNITS, ARBITRARY UNITS
##FACTOR=    0.456856943014862, 1,           1
##FIRST=     14782.0589164895, 0,            0
##LAST=      -15158.0608439895, 0,           0
##MIN=       -15158.0608439895, -8917287,    0
##MAX=       14782.0589164895, 444107351,    0
$$ Real data points
##PAGE= N=1
##DATA TABLE= (X++(R..R)), XYDATA
$$ [...]
41661E11753J128744o7506r73582m77913O71057N05279q46597q64287J105851
$$ 511753 1640497 1572991 599409 121496 792553 1297832 451235 -413052 692799
41652F92799K046534j46895k803939k128298J123930K906681J740103l4990m53415
$$ 692799 2739333 2592438 -211501 -2339799 -1215869 1690812 3430915 3395925 2942510
41643B942510j75393k68683m68169l55014k72579m44138o34435q90655j281868
$$ 2942510 2767117 2498434 2030265 1675251 1402672 958534 324099 -566556 -1848424
41634a848424j081606K71236J711332J747144P89755M58088R31056J020928N49473
$$ -1848424 -2930030 -2658794 -947462 799682 1589437 2047525 2978581 3999509 4548982
41625D548982L81198K91146p04427j881169j376492M35528R42354o25337j896043
$$ 4548982 4930180 5221326 4516899 2635730 1259238 1694766 2637120 2011783 115740
41616A15740j179529J61914N57255P56643J642692J913813L07718j636262j503888
$$ 115740 -1063789 -901875 -344620 412023 2054715 3968528 4276246 2639984 1136096
41607A136096M19977J679021R91862p13981j931866j755048j77701J511263J552746
$$ 1136096 1556073 3235094 4226956 3512975 1581109 -173939 -351640 1159623 2712369
41598B712369M6669q21874o4732L82861j029611k388110j144207J483288K088570
$$ 2712369 2759038 1937164 1872432 2255293 1225682 -1162428 -2306635 -823347 1265223
41589A265223K60635j121702o12602Q7810l90580j022180q41235p20160j247515
$$ 1265223 1525858 404156 -208446 -120636 -511216 -1533396 -2374631 -3094791 -4342306
41580d342306j134191N39902K300788K324874J150092N52224P37662M70163n94743
$$ -4342306 -5476497 -4936595 -2635807 -310933 839159 1391383 2129045 2599208 2004465
41571B004465j389481j105416j31239O43045N98730l19973j322091j140483M61241
$$ 2004465 614984 -490432 -621671 21374 620104 300131 -1021960 -2162443 -1701202
41562a701202J908669J504811l32503j537705j050214L8979K28056m16021n88681
$$ -1701202 207467 1712278 1379775 -157930 -1208144 -1169165 -941109 -1357130 -1945811
41553a945811L89409J621270J613046N1260j597254j584603o311J171499O09167
$$ -1945811 -1556402 64868 1677914 1729174 131920 -1452683 -1458994 -287495 321672
41544C21672n58593k66989J505512K599432J676910P8542l8525J549393L257652
$$ 321672 -236921 -503910 1001602 3601034 5277944 5356486 5317961 6867354 10125006
41535A0125006L924658L668197K723541Q05965j928051m275643n046932m232678
$$ 10125006 14049664 17717861 20441402 21247367 19319316 15043673 9996741 5764063
41527E764063k657460j006863K97324Q16421M11664m38258j190956j781783k106854
$$ 5764063 3106603 2099740 2397064 3213485 3625149 3186891 1995935 214152 -1892702
41518a892702j540426J41729J744506J662562j04173j856564k135055r48159P86758
$$ -1892702 -3433128 -3291399 -1546893 115669 11496 -1845068 -3980123 -4928282 -4141524
41509d141524K022996J904626M84375q32705p59040j9708l21502j422385j202157
$$ -4141524 -2118528 -213902 270473 -562232 -1321272 -1340980 -1662482 -3084867 -4287024
41500d287024Q52178K466420K004613Q60676P38803O80810p82358k250256j313833
$$ -4287024 -3434846 -968426 1036187 1896863 2635666 3316476 2534118 283862 -1029971
41491a029971J112071J611272o63091k853287k768671j450334m94203L75462J623039
$$ -1029971 82100 1693372 1030281 -1823006 -4591677 -6042011 -6536214 -6160752 -4537713
41482d537713K210972J424225N31518P51288J078840O6590j491759j707034n36227
$$ -4537713 -2326741 -902516 -370998 380290 1459130 1525720 33961 -1673073 -2209300
41473b209300M45611O30738P63232J051559Q29713J48116j4353N78103R50076
$$ -2209300 -1763689 -1132951 -369719 681840 1511553 1659669 1645316 2223419 3173495
41464C173495N07663k5300L56927J784174L503513M266824K929845k34783k951541
$$ 3173495 3681158 3655858 4012785 5796959 9300472 13567296 16497141 16262358 13310817
41455A3310817l017082j101718r6704j346768l024771k920503j356096j74017
$$ 13310817 10293735 9192017 9095313 7748545 4723774 1803271 447175 273158
41447B73158N879K5621L56335O02298O78168J045095J552417J259408r5866j394592
$$ 273158 279037 304658 660993 1263291 1941459 2986554 4538971 5798379 5702513 4307921
41437D307921j539371q50507l51149k28846Q4718N98663N90724j19249o99254
$$ 4307921 2768550 1918043 1566894 1338048 1422766 2021429 2612153 2492904 1793650
41428A793650n70972l39584p49679j330579j030135J21052J023383J131508R74420
$$ 1793650 1222678 883094 133415 -1197164 -2227299 -2106247 -1082864 48644 1023064
41419A023064Q67563K84925q82986j497725o09966R15661J331130K80961r12201
$$ 1023064 1890627 2175552 1292566 -205159 -815125 100536 1431666 1712627 800426
41410H00426j175331q33193n88702l35203L76335J274313J568451J098178N92377
$$ 800426 -374905 -1208098 -1796800 -2132003 -1755668 -481355 1087096 2185274 2777651
41401B777651N61054M58122m85117j820717k133903j006017J70823J03760m91774
$$ 2777651 3338705 3796827 3311710 1490993 -642910 -1648927 -1478104 -1374344 -1866118
41392a866118j59996P24455N24423n54205k26995K118219L674506J982246j274355
$$ -1866118 -2026114 -1301659 -777236 -1331441 -1558436 559783 4234289 6216535 4942180
41383D942180k504438j126494K63541O9180o30245o50777l85593k86194J08049
$$ 4942180 2437742 1311248 1574789 1643969 1013724 362947 -22646 -308840 -200791
41374b00791P11317M04439r25878j592074n56299Q55439R94021K60767k785K03614
$$ -200791 510526 914965 -10913 -1602987 -2159286 -1303847 -309826 -49059 -51844 151770
41364A51770k169m95578l66754M19215R87424R09532M91421K0230l39985l10674
$$ 151770 149601 -345977 -712731 -293516 693908 1603440 2094861 2115091 1775106 1464432
41354A464432O503n9023o65136r57830n01215j58121m03467q362J896217L537416
$$ 1464432 1470935 1411912 746776 -211054 -712269 -870390 -1273857 -1282219 613998 4151414
41344D151414K519058m26549k089222j139937M81545Q52597M49214M41399O22814
$$ 4151414 6670472 6243923 4154701 3014764 3496309 4348906 4798120 5239519 5862333
41335E862333K57417m37216q33599r19728q81643n68461j09889j58649q27051
$$ 5862333 6119750 5682534 4848935 3929207 3047564 2479103 2369214 2210565 1383514
41326A383514j245123q06135l7663K74040j8339p64132j730738k124401j116908
$$ 1383514 138391 -667744 -705407 -431367 -449706 -1213838 -2944576 -5068977 -6185885
41317f185885O53090J402710O32821j37003K34505R04499Q17158N22940Q80743
$$ -6185885 -5532795 -4130085 -3497264 -3634267 -3399762 -2495263 -1678105 -1155165 -274422
41308b74422J281717P31899k99931o39770k10955K76754O17561P95609K97936
$$ -274422 1007295 1739194 1439263 799493 588538 865292 1482853 2278462 2576398
41299B576398r10419j679837j294029o78814n86975o8489J386722J913083J36298
$$ 2576398 1665979 -13858 -1307887 -1986701 -2573676 -2642165 -1255443 657640 793938
41290G93938j548453l0006L083773L144714l96153k853835j407484R04398N09478
$$ 793938 -754515 -784521 2299252 5443966 5047813 2193978 786494 1690892 2200370
41281B200370j104238m27112K054507K762393P61348j087232o78027O46402O72538
$$ 2200370 1096132 669020 2723527 5485920 6247268 5160036 4482009 5128411 5800949
41272E800949n70772j360440p65305L82813O62319k60184j273991j304461p71276
$$ 5800949 5230177 3869737 3104432 3487245 4149564 3889380 2615389 1310928 539652
41263E39652o96006o79172N63427K426809K351995l77715k857108k296300K22746
$$ 539652 -156354 -835526 -272099 2154710 4506705 4128990 1271882 -1024418 -801672
41254h01672J758742J665599J269020P52009o27534j931846j360806M04446P85662
$$ -801672 957070 2622669 3891689 4643698 4016164 2084318 723512 1127958 1913620
41245A913620m63408p71248P37718J485012k75067k342614j939606J33861J223796
$$ 1913620 1450212 678964 1416682 2901694 2626627 284013 -1655593 -1521732 -297936
41236b97936R14505O55089N71083l54428j480680r15230J085368J869935L20665
$$ -297936 616569 1271658 1842741 1488313 7633 -907597 177771 2047706 2368371
41227B368371j347498r19840O83775J222612N55489K58618O89719N92066m60409
$$ 2368371 1020873 101033 784808 2007420 2562909 2821527 3511246 4103312 3642903
41218C642903j214336q74565m54999j002221j682591r70329R14334K146823J708918
$$ 3642903 2428567 1554002 1099003 96782 -1585809 -2556138 -1641804 505019 2213937
41209B213937M32038m36210n82186k98443J38043L37977k5865m52215O6474J420858
$$ 2213937 2645975 2209765 1627579 1329136 1467179 1805156 1779291 1327076 1393550 2814408
41199B814408K066363J062461n27171j189526r78556q13379o27853K40001J299884
$$ 2814408 4880771 5943232 5416061 4226535 3247979 2434600 1806747 2046748 3346632
41190C346632J250979P9726o97204j77263P79040R15065Q1593r82089j536760
$$ 3346632 4597611 4677337 3980133 3802870 4581910 5496975 5578568 4596479 3059719
41181C059719j241385l57218L34350M13746M07726P37475O06767q00255k428523
$$ 3059719 1818334 1461116 1795466 2209212 2616938 3354413 3961180 3160925 732402
41172G32402k324976m64582J113642J159606M33598j92672q51734j276176l87080
$$ 732402 -1592574 -2057156 -943514 216092 649690 457018 -394716 -1670892 -2057972
41163b057972J592689K510161J205706n38056n52713N88776P34226o13972j954459
$$ -2057972 -465283 2044878 3250584 2712528 2159815 2748591 3482817 2868845 914386
41154I14386j947445m65738J771037L307008K614851N4996j804916j310371l4190
$$ 914386 -1033059 -1498797 272240 3579248 6194099 6249095 4444179 3133808 3099618
41145C099618k43688j341426j176871P0904J96168j116194j634581k97318J089071
$$ 3099618 2855930 1514504 337633 408537 604705 -511489 -2146070 -2443388 -1354317
41136a354317Q25071k46421n06332K5009L76331L96563N43649P99002Q28350O03963
$$ -1354317 -529246 -775667 -1281999 -1256990 -880659 -484096 59553 858555 1686905 2290868
41126B290868K30218k12743l34426J93658P18165J62254j213675j868248j208785
$$ 2290868 2521086 2308343 1973917 2167575 2885740 3047994 1834319 -33929 -1242714
41117a242714m20873m92132p73816k99644O97614J440262J662375J239668k7656
$$ -1242714 -1663587 -2155719 -2929535 -3229179 -2531565 -1091303 571072 1810740 1783084
41108A783084j399682j270685O02019K104274J314024q72104j979843j086294
$$ 1783084 383402 -887283 -285264 1819010 3133034 2260930 281087 -805207
41100h05207N61105J442211J078767o2706r51614p30761J88092M96121L4248J44011
$$ -805207 -244102 1198109 2276876 2214170 1262556 531795 719887 1216008 1250256 1394267
41090A394267J052416P59400j644538l351637j337378K595233L637622P22528
$$ 1394267 2446683 3206083 1561545 -1790092 -3127470 -532237 3105385 3827913
41082C827913k004085j250783J140728J675635K70633n59225J59674J083732J093409
$$ 3827913 1823828 573045 1713773 3389408 3660041 3100816 3260490 4344222 5437631
41073E437631L98880n72342j584632k015404j382186l94873j76654n48925m08498
$$ 5437631 5836511 5264169 3679537 1664133 281947 -112926 -289580 -838505 -1247003
41064a247003K86539L94271l67147p51788P5374J184109J233278K32699q22614
$$ -1247003 -960464 -566193 -933340 -1685128 -1609754 -425645 807633 1040332 217718
41055B17718j287001j048127j07871J105077J570611Q18585j53392j03665O33434
$$ 217718 -1069283 -2117410 -2225281 -1120204 450407 1268992 1115600 1011935 1645369
41046A645369O95569j14395n67822j57068j0107q78905j515513l88018J740604
$$ 1645369 2340938 2226543 1658721 1501653 1491546 612641 -902872 -1290890 449714
41037D49714K500218J029790j022665j840138j450894q05736l7634J206821K318588
$$ 449714 2949932 3979722 2957057 1116919 -333975 -1139711 -1177345 29476 2348064
41028B348064J992664J11240j664573j748034m94027M34001K52238j94847K4396
$$ 2348064 4340728 4451968 2787395 1039361 545334 979335 1231573 1036726 1061122
41019A061122M65620M3799j196035j938515j284596J98358J371940J745520J374004
$$ 1061122 1526742 1570541 374506 -1564009 -2848605 -2650247 -1278307 467213 1841217
41010A841217K88756j188871k051352j481524m0942Q01290L75719n61657r16315
$$ 1841217 2129973 941102 -1110250 -2591774 -2632716 -1831426 -1455707 -2017364 -2933679
41001b933679l71955O10009J332693J314251O54366j479j97986k19256n23679
$$ -2933679 -3305634 -2695625 -1362932 -48681 605685 604206 406220 186964 -336715
40992c36715r61305j100052r29252n54157K98631J546091K087373J151866j32193
$$ -336715 -1298020 -2398072 -3327324 -3881481 -3582850 -2036759 50614 1202480 1070287
40983A070287p9384Q94506Q00171o89555j600989p41443O68399J278506J440807
$$ 1070287 990903 1885409 2685580 1996025 395036 -346407 321992 1600498 3041305
40974C041305J574649P91476j156760k373562j319388N81418R64089k9531n71301
$$ 3041305 4615954 5407430 4250670 1877108 557720 1139138 2103227 2073696 1502395
40965A502395l75706n90054j134554q12092J63070L16250l95515n23369J27702
$$ 1502395 1126689 536635 -597919 -1410011 -1246941 -930691 -1326206 -1849575 -1721873
40956a721873K64467j15202M76492J777180J361892j194899k681683q42648J895786
$$ -1721873 -1457406 -1572608 -1096116 681064 2042956 848057 -1833626 -2676274 -780488
40947g80488J914774k84426j269317r200J177112P08653k36641k64751J72179
$$ -780488 1134286 849860 -419457 -428657 748455 1457108 1220467 955716 1127895
40938A127895J89701M9342K55332M73967L57137L31372O39234N74969l54867j332496
$$ 1127895 1317596 1366938 1622270 2096237 2453374 2784746 3423980 3998949 3644082 2311586
40928B311586j326200o54237l66476n08679j92823P29633J253133P28263j78928
$$ 2311586 985386 331149 -35327 -544006 -736829 -7196 1245937 1974200 1795272
40919A795272n03825k43757n7286k35523n57119p87247p49421k29655N88884R35152
$$ 1795272 1291447 1047690 990404 754881 197762 -589485 -1338906 -1568561 -979677 -44525
40909d4525M39356k365O33652J620335J061565j273167l027998k107425N12653
$$ -44525 394831 392466 1026118 2646453 3708018 2434851 -593147 -2700572 -2187919
40900b187919J988333J060351q79688j891263j481156m68264J64054M1010l61908
$$ -2187919 -199586 860765 -18923 -1910186 -3391342 -3859606 -3695552 -3654542 -4016450
40891d016450j52301Q68375J723329J461486N18731Q2587L72776N45620K00656
$$ -4016450 -4168751 -3300376 -1577047 -115561 403170 485757 858533 1404153 1604809
40882A604809j21551p3832n5138k78266k32296M01384J014868Q42861M6130m26678
$$ 1604809 1483258 1409426 1354288 1076022 843726 1245110 2259978 3102839 3148969 2722291
40872B722291J49159J572138K785160K651960J026967r22574j757579j103806
$$ 2722291 2871450 4443588 7228748 9880708 10907675 9985101 8227522 7123716
40864G123716J93858R76126O89883q1677J32127K090762M368735M906081M457697
$$ 7123716 7317574 8293700 8983583 8901906 9034033 11124795 15493530 20399611 24857308
40855B4857308O227101J0485226J2042521O250899l923092j0613288j0438098
$$ 24857308 31084409 41569635 53612156 59863055 55939963 45326675 34888577
40848C4888577p308647n639561n048638l388531j195231l60526q45589j322216
$$ 34888577 27579930 21940369 16891731 13503200 12307969 11947443 11101854 9779638
40840I779638j403413j207078l65957P24516M70524j334386k457054j608399o26860
$$ 9779638 8376225 7169147 6803190 7527706 7998230 6663844 4206790 2598391 1971531
40831A971531j101282j349400L39905J916909P53310j328646n77019K276713K829863
$$ 1971531 870249 -479151 -139246 1777663 2530973 1202327 625308 2902021 5731884
40822E731884J2475k443609k164850j180770j334299r37003J511453L689225K642134
$$ 5731884 5744359 3300750 1135900 -44870 -1379169 -2316172 -804719 2884506 5526640
40813E526640o02908k577853k118259r13857k72973R4354L69660k2491r80839
$$ 5526640 4923732 2345879 227620 -686237 -959210 -864856 -495196 -517687 -1498526
40804a498526j236131j8765J584449J675125j46979k024361j862754M5822J347796
$$ -1498526 -2734657 -2753422 -1168973 506152 359173 -1665188 -3527942 -3482120 -2134324
40795b134324Q52031O2783N10206J119248J67665j359087j027307R54759J834115
$$ -2134324 -1282293 -1219510 -709304 409944 577609 -781478 -1808785 -854026 980089
40786I80089O42851n00852r9756N46104M4005p74255p65212n12422q01267r48631
$$ 980089 1622940 1122088 1022332 1568436 1612441 838186 72974 -439448 -1240715 -2189346
40776b189346l13137K37515r053j46714M96046P61999k07682r43001M9084J406628
$$ -2189346 -2502483 -2264968 -2274021 -2420735 -1924689 -1162690 -1370372 -2313373 -2264289 -857661
40766h57661Q64370r49079j355141K30159J626967J374190M72722K11713L11177
$$ -857661 6709 -942370 -2297511 -2067352 -440385 933805 1406527 1618240 1929417
40757A929417J9128m67447n53793k12858L04446R99892J782462K083178J343388
$$ 1929417 1948545 1481098 927305 714447 1018893 2018785 3801247 5884425 7227813
40748G227813k44397j732708k189796j470596j46147J331939K969524M523778
$$ 7227813 6983416 5250708 3060912 1590316 1444169 2776108 5745632 10269410
40740A0269410N350432N734576P165130R615313R709809M379656l981075r239132
$$ 10269410 15619842 21354418 28519548 38134861 47844670 52224326 48243251 39004119
40732C9004119q872054o282632m912694l975687k051846q80882k078661l224275
$$ 39004119 30132065 23849433 18936739 14961052 12909206 12028324 9949663 6725388
40724F725388j441521J323050J104227j487252k256471l48191P39071o51898j878108
$$ 6725388 5283867 6606917 7711144 6223892 3967421 3619230 4358301 3706403 1828295
40715A828295r45173L14631q6014r45553m80955M55634J49554r73687j308622
$$ 1828295 883122 1197753 1111739 166186 -314769 140865 290419 -683268 -1991890
40706a991890o27035J13686M14224L18488j27159n09690k31869K92735J8130o51741
$$ -1991890 -2618925 -2505239 -2091015 -1772527 -1899686 -2409376 -2641245 -2348510 -2330380 -2982121
40696b982121j9528J891272K629461R21144j085474r23835O14885J064779P3648
$$ -2982121 -3001649 -1110377 1519084 2440228 1354754 430919 1045804 2110583 2184231
40687B184231o58802m11958j55071m39552n33911O7123O90488N30751j74831m74330
$$ 2184231 1525429 1113471 958400 518848 -15063 52060 742548 1273299 1098468 624138
40677F24138O7990P04082K76590j136949j861696o91316J187720J635186O02672
$$ 624138 692128 1396210 1672800 535851 -1325845 -2017161 -829441 805745 1408417
40668A408417K3826O53425J046775K05430q10107q57309m44238l28801p6661O84721
$$ 1408417 1432243 2085668 3132443 3337873 2527766 1670457 1226219 897418 820757 1505478
40658A505478J096248N14242k29530k91734j55850k56264J64971J343286J752595
$$ 1505478 2601726 3115968 2886438 2594704 2438854 2182590 2347561 3690847 5443442
40649E443442L89161j163332r62573K83086O00644J552q0594K47012l96412j735239
$$ 5443442 5832603 4669271 3706698 3989784 4590428 4591980 4511386 4758398 4361986 2626747
40639B626747j790495k3059J716610J935604J356416J308559J677343J308106
$$ 2626747 836252 813193 2529803 4465407 5821823 7130382 8807725 10115831
40631A0115831k71945k057321k309865l61552K095295K425887M17631r80544N72905
$$ 10115831 9843886 7786565 5476700 5115148 7210443 9636330 10053961 9073417 9646322
40622I646322L552084M656602L115062J125208Q81612K927882O402263Q811284
$$ 9646322 13198406 17855008 20970070 22095278 22976890 25904772 32307035 41118319
40614D1118319O709593n63009q346453j0813628p650811l848621k883223l320300
$$ 41118319 47827912 47264903 38918450 28104822 20454011 16605390 13722167 10401867
40606A0401867k742658j561358j214851j297507o68792L05839N46110J02094k83204
$$ 10401867 7659209 6097851 4883000 3585493 2916701 3222540 3768650 3870744 3587540
40597C587540m47593n09291l19983j02813m61522j003763m16934J196358J735042
$$ 3587540 3139947 2630656 2310673 2207860 1746338 742575 325641 1521999 3257041
40588C257041J17921j699797j353753N18622J283073j5435j622729j418068Q65085
$$ 3257041 3374962 1675165 321412 840034 2123107 2107672 484943 -933125 -68040
40579f8040L500319M168078K051230r64711k044426p80158M49453N6508n71991
$$ -68040 3432279 7600357 9651587 8686876 6642450 5862292 6311745 6368253 5796262
40570E796262L48881J994956K328912J234870K43120m4211k60781n37973l85056
$$ 5796262 6145143 8140099 10469011 11703881 11947001 11902790 11642009 11104036 10718980
40561A0718980o3888l24446q08900k59211J589672L535901M340778L724825K285332
$$ 10718980 10655092 10330646 9521746 9262535 10852207 14388108 18728886 22453711 24739043
40552B4739043J344946K184139M194690M617027J729724k395404m180547l026019
$$ 24739043 26083989 28268128 32462818 37079845 38809569 36414165 32233618 29207599
40544B9207599j420001r72018p99041L7990J034232J808624K921101M400318N653739
$$ 29207599 27787598 26815580 26016539 26054529 27088761 28897385 31818486 36218804 41872543
40535D1872543P504320J1522566J5866539J4778308N143508q178049j6661613
$$ 41872543 49376863 60899429 76765968 91544276 96687784 88509735 71848122
40528G1848122j6968151j2816469q856935o105235l792618k293173k288074k956047
$$ 71848122 54879971 42063502 33206567 27101332 23308714 21015541 18727467 15771420
40520A5771420k922548k095500j285948q34261o58470q19970j052387o16565L78069
$$ 15771420 12848872 10753372 9467424 8633163 7974693 7154723 6102336 5485771 5863840
40511E863840N47519o55833j561071o71219O33441L3636j747132j676344P73657
$$ 5863840 6411359 5755526 4194455 3523236 4156677 4190313 2443181 766837 1540494
40502A540494K535679J653038K15766P60216K147967J595540q00552k408590k105504
$$ 1540494 4076173 5729211 5944977 6705193 8853160 10448700 9648148 7239558 5134054
40493E134054j228228p73070k54809M68244N84571K6095k18690L1445j60415q40631
$$ 5134054 3905826 3132756 2877947 3346191 3930762 3956857 3738167 3769612 3609197 2768566
40483B768566p86744K35135P83217J77428k16198P82005K266473K729017K045686
$$ 2768566 1981822 2216957 3000174 3177602 2961404 3743409 6009882 8738899 10784585
40474A0784585R34817k19646j021741r08587k58846k13676o14205N3131J711338
$$ 10784585 11719402 11499756 10478015 9569428 9310582 9096906 8482701 8535832 10247170
40465A0247170J968087j43962k066991j491170q845l07274j650419j435461J13556
$$ 10247170 12215257 12071295 10004304 8513134 8504289 8197015 6546596 5111135 5224691
40456E224691M49350p52561j230730k99341J76354n59428q94139j61326m1887
$$ 5224691 5674041 4921480 3690750 3391409 3567763 3008335 2114196 1952870 1910983
40447A910983j298485j971704n96895J172602J138509j51519p21966k78744P6199
$$ 1910983 612498 -1359206 -1956101 -783499 355010 203491 -518475 -797219 -721020
40438g21020J78504P88005J743467J898181Q50737m84239j104501r81421q67446
$$ -721020 -542516 245489 1988956 3887137 4737874 4253635 3149134 2167713 1300267
40429A300267j339817j907031j271292Q63923K631248J961366l90575j486332
$$ 1300267 -39550 -1946581 -3217873 -2353950 277298 2238664 1848089 361757
40421C61757j86470J393952J181197m680j97846O85479J205553P55814q426m77373
$$ 361757 175287 1569239 2750436 2745756 2547910 3233389 4438942 5194756 5186330 4708957
40411D708957n66056l78890l16640q92136j695226j444706P7420J194343N19107
$$ 4708957 4142901 3764011 3447371 2555235 860009 -584697 -507277 687066 1206173
40402A206173r91912j366318j96254J252811J787812J112415l22566j357808r32601
$$ 1206173 214261 -1152057 -1348311 -95500 1692312 2804727 2482161 1124353 191752
40393A91752K58333J29930j712072k782022j155357J433926K013992O49460j50849
$$ 191752 450085 580015 -1132057 -3914079 -5069436 -3635510 -1621518 -972058 -1122907
40384a122907N17596J145673P50360L3615n11294j254345j832650j139337N16739
$$ -1122907 -605311 540362 1290722 1324337 813043 -441302 -2273952 -3413289 -2896550
40375b896550J283509N21943j59797N46510J748751J951619J134338K66187j08979
$$ -2896550 -1613041 -1091098 -1250895 -704385 1044366 2995985 4130323 4396510 4287531
40366D287531L4176N50934R10462N16515l33900p40764o13619o01581n47171M00162
$$ 4287531 4321707 4872641 5783103 6299618 5965718 5224954 4611335 4009754 3462583 3862745
40356C862745J870346K337793J659201J502890K310684K038749m94405l017999
$$ 3862745 5733091 8070884 9730085 11232975 13543659 15582408 15088003 12070004
40348A2070004k756517n15543O32632j63724r45759m64556L59818P78657J515285
$$ 12070004 9313487 8797944 9430576 9266852 8321093 7856537 8216355 8995012 10510297
40339A0510297K786973L124347J663879J72870J028299L967754O674840Q322502
$$ 10510297 13297270 16421617 18085496 18258366 19286665 23254419 29929259 38251761
40331C8251761J0444892J3518881J4487054R678564j77647r723444j4209330j3547603
$$ 38251761 48696653 62215534 76702588 86381152 86203505 76480061 62270731 48723128
40323D8723128j0608666p331212m157079j946667j856581l265782l930013k761755
$$ 48723128 38114462 30783250 26626171 24679504 22822923 19557141 15627128 12865373
40315A2865373r36251J35956L49914M305q99402j772955j553998n12326k27787
$$ 12865373 11929122 12065078 12414992 12419297 11519895 9746940 8192942 7680616 7452829
40306G452829r20686q38137M97122P93020j266588l046702j596153J405032J792501
$$ 7452829 6532143 5694006 6191128 6984148 5717560 2670858 1074705 2479737 4272238
40297D272238p91291k425584q25165J799237K620815J752222N65664p20966j934643
$$ 4272238 3480947 1055363 230198 2029435 4650250 6402472 6968136 6247170 4312527
40288D312527j729905L34820K128301J497520o48844j737536j052162J7334M22095
$$ 4312527 2582622 2917442 5045743 6543263 5894419 4156883 3104721 3122055 3544150
40279C544150K05661o04484j867959k390372j072246J002464J487771L2480j128514
$$ 3544150 3749811 3145327 1277368 -1113004 -2185250 -1182786 304985 337465 -791049
40270g91049l16853J473828K335991J890344R83749J00505p00069r67254k58280
$$ -791049 -1107902 365926 2701917 4592261 5576010 5676515 4976446 4009192 3750912
40261C750912Q34565J075713J16515j049647j350434q81081o06316j039603j562791
$$ 3750912 4585477 5661190 5777705 4728058 3377624 2496543 1890227 850624 -712167
40252g12167j204535O1397J145247J074498N2997r18290j079519k94407J031448
$$ -712167 -1916702 -1855305 -710058 364440 417437 -500853 -1580372 -1874779 -843331
40243h43331J897493J242575o13656j678651n96626J250237J414935j83850j339031
$$ -843331 1054162 2296737 1683081 4430 -592196 658041 2072976 1889126 550095
40234E50095j017024n11024o41411l04074R30462J225360m84035j968291q56656
$$ 550095 -466929 -977953 -1619364 -1923438 -992976 232384 -251651 -2219942 -3076598
40225c076598J329468J417992k58038n56013R93164J345491p56168k466659j424051
$$ -3076598 -1747130 -329138 -587176 -1143189 -150025 1195466 439298 -2027361 -3451412
40216c451412O49039J090735K83801o170L6043n92666j055578j20410J056961
$$ -3451412 -2802373 -1711638 -1427837 -1434007 -1397964 -1990630 -3046208 -3166618 -2109657
40207b109657N82121p24694n69727Q11088J083418m2781m11218O13756J051348
$$ -2109657 -1527536 -2252230 -2821957 -2010869 -927451 -970232 -1381450 -767694 283654
40198B83654n4741r44937k98597O23665M61501q222K37529M49502k19526q35468
$$ 283654 228913 -716024 -1014621 -390956 70545 62323 299852 749354 529828 -305640
40188c05640l69893K64808k05339j084458q99572J03510N59472K71675R2243J65088
$$ -305640 -675533 -410725 -616064 -1700522 -2600094 -2496584 -1937112 -1665437 -1573194 -1408106
40178a408106J1876j25950L77620J232977J610922J358377P00156m80560j783047
$$ -1408106 -1396230 -1522180 -1144560 88417 1699339 3057716 3757872 3277312 1494265
40169A494265j749161J39733J885778J372085m36581q86888L36404J026399J15320
$$ 1494265 -254896 -115163 1770615 3142700 2706119 1819231 2155635 3182034 3297354
40160C297354j028129j234844j036327r13495l01558P38940Q50910m73840j678417
$$ 3297354 2269225 1034381 -1946 -915441 -1216999 -478059 372851 -100989 -1779406
40151a779406j207329M81447J883920K200832J347679m19107j976477j770337
$$ -1779406 -2986735 -2505288 -621368 1579464 2927143 2508036 531559 -1238778
40143a238778J52717J676537J195560l91951j228117r03853k16896M20009J025303
$$ -1238778 -1086061 590476 1786036 1394085 165968 -737885 -954781 -534772 490531
40134D90531J242950P32316p0773m76545l70149O6189P09066J008659J73375j418553
$$ 490531 1733481 2465797 2395024 1918479 1548330 1614519 2323585 3332244 3505619 2087066
40124B087066k123736j248318j50019p7537k64667M25375J302771J112004L86252
$$ 2087066 -36670 -1284988 -1435007 -1512544 -1777211 -1351836 -49065 1062939 1449191
40115A449191M41338Q11051K2470j445343j449532L84705J820382J219553l48854
$$ 1449191 1890529 2701580 2724050 1278707 -170825 213880 2034262 3253815 2904961
40106B904961j024972n41958J93128N09233P3770j173999k286861j653455Q98225
$$ 2904961 1879989 1338031 1531159 2040392 2114162 940163 -1346698 -3000153 -2101928
40097b101928L255079L291848J295219p31538j439592q93620K85607J338349J316979
$$ -2101928 1153151 4444999 5740218 5008680 3569088 2675468 2961075 4299424 5616403
40088E616403j54057k020551k607361j470443J66575R21697O21245o827m45013
$$ 5616403 5462346 3441795 834434 -636009 -469434 452263 1073508 1066681 621668
40079F21668p58596j085947j239730r80411m33238Q8342O08855J413291K310774
$$ 621668 -136928 -1222875 -2462605 -3443016 -3876254 -3787912 -3179057 -1765766 545008
40070E45008K470853J417587j35763r40779n38529M42540J057325P14555n57204
$$ 545008 3015861 4433448 4297685 3356906 2818377 3260917 4318242 5032797 4475593
40061D475593j949738k287769j219413K44075Q93594O15624k8297p89353j369215
$$ 4475593 2525855 238086 -981327 -737252 156342 771966 743669 -45684 -1414899
40052a414899q83540Q78144K236257J434876n90349j239522q6766N35566o79557
$$ -1414899 -2298439 -1420295 815962 2250838 1660489 420967 334201 869767 190210
40043A90210j967283j392058K43455R62078M60679k81893q65464j183250n15172
$$ 190210 -1777073 -3169131 -2925676 -1963598 -1502919 -1784812 -2650276 -3833526 -4348698
40034d348698J175839K080098P44182j349321j561060J04854J225120O75647k12673
$$ -4348698 -3172859 -1092761 -348579 -1697900 -3258960 -3154106 -1928986 -1253339 -1466012
40025a466012k66606N3338J85496L93093N92017J33916o57137n52525L98537O73716
$$ -1466012 -1732618 -1679280 -1493784 -1100691 -508674 -374758 -1031895 -1584420 -1185883 -512167
40015e12167m1379p0794J305093K218479J012833j162003k242643k100453j650946
$$ -512167 -553546 -624340 680753 2899232 3912065 2750062 507419 -1593034 -3243980
40006c243980o81814J202627K687403K262391Q67493N89623J276577J015132l26816
$$ -3243980 -3925794 -2723167 -35764 2226627 3094120 3683743 4960320 5975452 5648636
39997E648636q73896k66361m66138k149598l059458j524593O47740P98557p13949
$$ 5648636 4774740 4508379 4042241 1892643 -1166815 -2691408 -2043668 -1245111 -1959060
39988a959060j435619n51785M49219L65586l70897q59146p36272J093R89825J375402
$$ -1959060 -3394679 -3946464 -3497245 -3131659 -3502556 -4361702 -5097974 -5096881 -4107056 -2731654
39978b731654P58546Q1285M54791J352387J281381J31874o37258l16172J06287
$$ -2731654 -1973108 -1891823 -1437032 -84645 1196736 1328610 691352 375180 481467
39969D81467j75475m22226K42901J256474J557073J253204J156123J204239N95841
$$ 481467 305992 -116234 126667 1383141 2940214 4193418 5349541 6553780 7149621
39960G149621p06949j717525j704729q57531L34058J449524J800805P84313r72515
$$ 7149621 6442672 4725147 3020418 2162887 2496945 3946469 5747274 6531587 5559072
39951E559072j754003q00973N02525M44570n68028p13256K31773K97829j504165
$$ 5559072 3805069 3004096 3506621 3951191 3383163 2669907 2901680 3199509 1695344
39942A695344l009114j617135J623020K875057O79624j914828j517245J064761
$$ 1695344 -1313770 -2930905 -1307885 1567172 2246796 331968 -1185277 -120516
39934a20516K285492Q06682j236603j692192q93390j60392K83515P37669P16307
$$ -120516 2164976 2971658 1735055 42863 -850527 -1010919 -727404 10265 726572
39925G26572l09164j520300j494569j98748Q49118N36797n17289q84319r4904
$$ 726572 417408 -1102892 -2597461 -2796209 -1947091 -1410294 -1927583 -2811902 -2906806
39916b906806Q88724R19189J26540k52434L25755P11791k99507j762697j444200
$$ -2906806 -2018082 -1098893 -972353 -1224787 -899032 -187241 -486748 -2249445 -3693645
39907c693645R05285K713408J870602m88003j723515j158973k71203j01586j91163
$$ -3693645 -2788360 -74952 1795650 1307647 -415868 -1574841 -1846044 -1947630 -2138793
39898b138793N7577M99819Q96121J242613J304313Q30323K34713L0524k69289
$$ -2138793 -2081216 -1581397 -685276 557337 1861650 2691973 2926686 2957210 2687921
39889B687921j400971k564305j964590N07220K639277K599858J025820k73482
$$ 2687921 1286950 -1277355 -3241945 -2734725 -95448 2504410 3530230 3256748
39881C256748n28197j37887L62491N78339K56976l19554o49136j021443k081116
$$ 3256748 2728551 2590664 2953155 3531494 3788470 3468916 2819780 1798337 -282779
39872b82779l047684k055760Q20421K687551J534901p27278r36658P93770J603840
$$ -282779 -3330463 -5386223 -4565802 -1878251 -343350 -1070628 -2007286 -1213516 390324
39863C90324L24696j157631j048688J45012J067805J263995P99221k64425j290827
$$ 390324 715020 -442611 -1491299 -1346287 -278482 985513 1784734 1520309 229482
39854B29482j296971l84181K35896N6865j85569j25425l24347o82939p9308J493239
$$ 229482 -1067489 -1451670 -1215774 -1158909 -1344478 -1469903 -1794250 -2477189 -2556497 -1063258
39844a063258K189893R68206o36777q67104l42117n38425j075230o86549J42659
$$ -1063258 1126635 2094841 1458064 590960 248843 -289582 -1364812 -2051361 -1908702
39835a908702m1210q25012m22419J131287J813797R12341K7393J71369K45919
$$ -1908702 -1949912 -2774924 -3197343 -2066056 -252259 660082 687475 858844 1104763
39826A104763n99521j302066q87026j82980q2313O9366P09476N46005j132252
$$ 1104763 505242 -796824 -1683850 -1866830 -1949143 -1879777 -1170301 -624296 -1756548
39817a756548k347948j192838O90974M30260j174784o23762K453499M222260K401992
$$ -1756548 -4104496 -5297334 -4606360 -4176100 -5350884 -5974646 -3521147 701113 3103105
39808C103105m08080r96270r3506j78810j179229j341360o82156m11196n9828
$$ 3103105 2695025 1698755 1605249 1426439 247210 -1094150 -1776306 -2187502 -2247330
39799b247330J506274K880939J520014j589089k366621L09733K510476R88570
$$ -2247330 -741056 2139883 3659897 2070808 -295813 13920 2524396 3512966
39791C512966k071752k556958k89169J610134J633619R38289K71548q80426k020479
$$ 3512966 1441214 -1115744 -1404913 205221 1838840 2777129 3048677 2168251 147772
39782A47772j530607M20298J368150N5691j627796j506358j47428N11437J43420
$$ 147772 -1382835 -962537 405613 461304 -1166492 -2672850 -2820278 -2308841 -2165421
39773b165421j47275l4305j04812k27207L81899J436216J574613M73669m24495
$$ -2165421 -2312696 -2347001 -2451813 -2679020 -2297121 -860905 713708 1187377 762882
39764G62882K4186R64568P97695n89073j820860j891226j089972j88937M25033
$$ 762882 787068 1751636 2549331 1960258 139398 -1751828 -2841800 -3030737 -2605704
39755b605704O67405N56451M12342O72895J159721J093109K83040l22547O920
$$ -2605704 -1938299 -1381848 -969506 -296611 863110 1956219 2239259 1916712 1923632
39746A923632M57060k29214j630123j983410p67431N03716O12753L27430P52095
$$ 1923632 2380692 2151478 521355 -1462055 -2229486 -1725770 -1113017 -785587 -33492
39737c3492J284030O97510o16535j207086q93106p83553j140342j032816k72390
$$ -33492 1250538 1948048 1331513 124427 -768679 -1552232 -2692574 -3725390 -3997780
39728c997780J17149j78281j01491P99728J374348Q13087R5544L24545R48827
$$ -3997780 -3880631 -4058912 -4160403 -3360675 -1986327 -1173240 -1077696 -753151 195676
39719A95676R61647O58373P22636O56936j96125r87400n78494K89553Q7651p20341
$$ 195676 1157323 1815696 2538332 3195268 2999143 2011743 1433249 1722802 1810453 1090112
39709A090112k64193J437840K169478R53646m86759n93090k09086o60028j351324
$$ 1090112 825919 2263759 4433237 5386883 4900124 4307034 4097948 3437920 2086596
39700B086596r26521L81611J195265J017271L97222l06229j027272j366256j048530
$$ 2086596 1160075 1541686 2736951 3754222 4151444 3845215 2817943 1451687 403157
39691D03157n58274k96058K43945J308730J701929L29092j623957j865963j97143
$$ 403157 -155117 -451175 -207230 1101500 2803429 3132521 1508564 -357399 -554542
39682e54542J273357J222976O10100O31723R47977P89877L85681K42949J18393
$$ -554542 718815 1941791 2551891 3183614 4131591 4921468 5307149 5550098 5668491
39673E668491k78113m90512k30146k16647j013571j765793j322203j11994L78003
$$ 5668491 5390378 4899866 4669720 4453073 3439502 1673709 351506 239512 617515
39664F17515k21630p41372l00509N08161O16857l7009m70294J59275J525821K277608
$$ 617515 395885 -345487 -645996 -137835 479022 442013 -28281 130994 1656815 3934423
39654C934423J362361p23693k339283k432096j384591r6464R22092J280377O61917
$$ 3934423 5296784 4573091 2233808 -198288 -1582879 -1679343 -757251 523126 1185043
39645A185043k84964j83828R48544J044990j092771l346860k776589J15637J958631
$$ 1185043 900079 716251 1664795 2709785 1617014 -1729846 -4506435 -4390798 -2432167
39636b432167J226675j08677j09782M26680J0452q26758n55262Q58996K053982
$$ -2432167 -1205492 -1314169 -1423951 -997271 -986819 -1813577 -2368839 -1509843 544139
39627E44139K100580J044581o36669k063716k178620r44660L38923P07876O38109
$$ 544139 2644719 3689300 3052631 988915 -1189705 -2134365 -1795442 -1087566 -449457
39618d49457P09349L95755o41363j300600o57402J72760l95666j691842j593223
$$ -449457 259892 655647 14284 -1286316 -1943718 -1770958 -2166624 -3858466 -5451689
39609e451689K56943J925590J889101O26155n49516p80400K14368J840698K434581
$$ -5451689 -5194746 -3269156 -1380055 -753900 -1303416 -2083816 -1869448 -28750 2405831
39600B405831Q60996j604065k449871j078632O86833J269334Q64703J66892o07973
$$ 2405831 3266827 1662762 -787109 -1865741 -1178908 90426 955129 1122021 514048
39591E14048r81820k70521R53275J058867k49146j247154o73245N65095R94030
$$ 514048 -467772 -738293 214982 1273849 1024703 -222451 -895696 -330601 663429
39582F63429N16315q7189l39116l9808O66868P32662o86711k163559j232120J531578
$$ 663429 1179744 1092555 753439 713631 1380499 2113161 1426450 -737109 -1969229 -437651
39572d37651K358726k22025k580308j197112J850219K083925m52594j615407R6029
$$ -437651 1921075 1699050 -881258 -2078370 -228151 1855774 1403180 -212227 -116198
39563a16198J523363K56801j780825j813462k96498O10618N43668O10319Q64099
$$ -116198 1407165 1663966 -116859 -1930321 -2226819 -1616201 -1072533 -462214 401885
39554D01885L30225r30211j567460p85068P00879J614994J319324J06442j139154
$$ 401885 732110 -198101 -1765561 -2550629 -1849750 -234756 1084568 1191010 51856
39545E1856j601387j219246o64614m92786n40216k96932M15518J297976J864438
$$ 51856 -1549531 -2768777 -3433391 -3926177 -4466393 -4763325 -4347807 -3049831 -1185393
39536a185393J788597J185924N69183L10321K20154j10591p22636j317877j651296
$$ -1185393 603204 1789128 2358311 2668632 2888786 2778195 2055559 737682 -913614
39527i13614j580977j000035o0342Q21468J453527J951313K120298J465550K18335
$$ -913614 -2494591 -3494626 -3554968 -2733500 -1279973 671340 2791638 4257188 4475523
39518D475523n11242k35194J56357j11694m87292l59230l90685j218226j873454
$$ 4475523 3964281 3729087 3885444 3773750 3286458 2927228 2536543 1318317 -555137
39509e55137j192910M8221L01816j36688K01988J095319P76856r72365k095283
$$ -555137 -1748047 -1699826 -1398010 -1534698 -1332710 -237391 539465 -432900 -2528183
39500b528183j101864J103420K612331K269174O3298k596732l251684j003482
$$ -2528183 -3630047 -2526627 85704 2354878 2418176 -178556 -3430240 -4433722
39492d433722J547279J298275p76581r88363J203043K332125O92203r47885j37101
$$ -4433722 -2886443 -1588168 -2364749 -3353112 -2150069 182056 874259 -73626 -210727
39483b10727J395322J155946k6018k94101l98953j672409k628616j280680Q43795
$$ -210727 1184595 2340541 2314523 2020422 1621469 -50940 -2679556 -3960236 -3116441
39474c116441Q68372m49338L7784K244407K723716M21549j508325p36300R55266
$$ -3116441 -2248069 -2697407 -2659623 -415216 2308500 2730049 1221724 485424 1440690
39465A440690J101185L13130M44914J167351Q01555o27316j416064q89947l13699
$$ 1440690 2541875 2855005 3299919 4467270 5268825 4641509 3225445 2335498 2021799
39456B021799q76862j907591j710612J30382J909271J735037P1636o83135N00233
$$ 2021799 1144937 -762654 -2473266 -2342884 -433613 1301424 1373060 689925 1190158
39447A190158J684508P20652j521190k300801p88000J079304J434610N78195o1861
$$ 1190158 2874666 3595318 2074128 -226673 -1014673 64631 1499241 2077436 2015575
39438B015575J35230N41712K03429r04913j423458o8529K192997K738273P93730
$$ 2015575 2150805 2692517 2895946 1991033 567575 499046 2692043 5430316 6224046
39429F224046j304244j579413j175417j691502j855221J51349K621669K322021
$$ 6224046 4919802 3340389 2164972 473470 -1381751 -1230402 1391267 3713288
39421C713288j62406j083599M31246J143458o17649k106942q38803J372027J543045
$$ 3713288 3550882 2467283 2898529 4041987 3424338 1317396 478593 1850620 3393665
39412C393665O3795o06520L4836M27369j90237r81019j036437k90877N49554K84483
$$ 3393665 3457460 2850940 2885776 3313145 3122908 2141889 1105452 814575 1364129 1648612
39402A648612j527953l165715k300007M21821J583128q7810j531125L0007K660117
$$ 1648612 120659 -3045056 -5345063 -4923242 -3340114 -3427924 -4959049 -4929042 -2268925
39393b268925K575033k22312k180276j314104P10829J535583Q68303m3670j41509
$$ -2268925 306108 83796 -2096480 -3410584 -2699755 -1164172 -295869 -339539 -481048
39384d81048N83673J129434N31721o59902q10670K87957P37769n40869j806303
$$ -481048 102625 1232059 1763780 1103878 293208 581165 1318934 778065 -1028238
39375a028238j081186P17513J320313O23622K93258O00844K12858j026994j523811
$$ -1028238 -2109424 -1391911 -71598 552024 845282 1446126 1658984 631990 -891821
39366h91821n10275P47826R06882K54730r4933L23572J087248J456527J045592
$$ -891821 -1402096 -654270 252612 507342 412409 735981 1823229 3279756 4325348
39357D325348L02252M1198K12900j24791j208711k038257k021756j773264j497787
$$ 4325348 4627600 4668798 4881698 4756907 3548196 1509939 -511817 -2285081 -3782868
39348c782868l38422J482902J886285Q4983j406929j73804K379187L205893J979526
$$ -3782868 -4121290 -2638388 -752103 -667120 -2074049 -2247853 131334 3337227 5316753
39339E316753N50841m57048j429833j485981J05419J299364j48365k298039j411522
$$ 5316753 5867594 5410546 3980713 2494732 2600151 3899515 3751150 1453111 41589
39330D1589J721903K530431j4867j806870m90971J040263J68827j058843p2621
$$ 41589 1763492 4293923 4279056 2472186 1981215 3021478 3190305 2131462 2058841
39321B058841J568968J166891n03878j101033p71539q31020n64723J032974K133695
$$ 2058841 3627809 4794700 4290822 3189789 2418250 1587230 1022507 2055481 4189176
39312D189176N09688k188823k442787l36097Q62668K30962K54950J904683K568619
$$ 4189176 4698864 2510041 67254 -268843 593825 824787 1079737 2984420 5553039
39303E553039L98412k414207k756218q27175Q40499J114286Q81328P20653O8179
$$ 5553039 5951451 3537244 781026 -46149 794350 1908636 2789964 3510617 3578796
39294C578796j172876j810301r38262M94594O64834p33927j988691j564401J5193
$$ 3578796 2405920 595619 -342643 151951 816785 82858 -1905833 -3470234 -3455041
39285c455041J157272J310582J004465M03393o42410j374945p57705N64914Q25845
$$ -3455041 -2297769 -987187 17278 420671 -221739 -1596684 -2354389 -1789475 -963630
39276i63630j8397r5568J096921J592475L49645o96116J19492J093952j21052
$$ -963630 -982027 -1077595 19326 1611801 1961446 1265330 1384822 2478774 2357722
39267B357722k342030k392310L7417K065812J949206R26782M54949J73562n58331
$$ 2357722 15692 -2376618 -2339201 -273389 1675817 2602599 3057548 3231110 2672779
39258B672779j176863j066663p47972q76885j075663o39351K85705R12447P69028
$$ 2672779 1495916 429253 -318719 -1195604 -2271267 -2910618 -2624913 -1712466 -943438
39249i43438N6872n99583o00940R3569Q45769J007827N70749m6269m67318l80112
$$ -943438 -886566 -1486149 -2087089 -1993520 -1147751 -139924 430825 384556 -82762 -462874
39239d62874L36013J163805J306774Q39328O45169Q38046L96135j006619k086323
$$ -462874 -126861 1036944 2343718 3183046 3828215 4666261 5062396 4055777 1969454
39230A969454j751590n71786N06070J508398K354975J977253N0504j787282k103341
$$ 1969454 217864 -353922 152148 1660546 4015521 5992774 6043278 4255996 2152655
39221B152655j698351j756266j537161m2633J525232J493735O68326Q76371J673229
$$ 2152655 454304 -1301962 -2839123 -2881756 -1356524 137211 805537 1681908 3355137
39212C355137J373744L65303K34005M09111q46677k633341k367871m09553K25648
$$ 3355137 4728881 5094184 5328189 5737300 4890623 2257282 -110589 -520142 -294494
39203b94494r38492j065655P61778J795087O00730l26785Q99675K157915J155951
$$ -294494 -1232986 -2298641 -1536863 258224 858954 532169 1431844 3589759 4745710
39194D745710n51029m58641N84675K31088j163514j398346j69920R10602J097532
$$ 4745710 4194681 3736040 4320715 4551803 3388289 1989943 1820023 2730625 3828157
39185C828157Q86306M78410m3053N2866Q70195R78736m01289j656090j183291
$$ 3828157 4714463 5192873 5149820 5202686 6072881 7051617 6650328 4994238 3810947
39176C810947q4290k47548j174400j197486n94397p61719j265153n73418Q82675
$$ 3810947 3726657 3479109 2304709 1107223 512826 -248893 -1514046 -2087464 -1204789
39167a204789J209979K94402j50787L49648N18752n3374k55710L02740O50812
$$ -1204789 5190 299592 148805 498453 1017205 963831 708121 1010861 1661673
39158A661673M06194L14227M89966P8089r27021j334735o71761J57898M49374
$$ 1661673 2067867 2382094 2872060 2950149 2023128 688393 16632 174530 623904
39149F23904M27955K19715l75690r24511o69466R5282L91016K12435K95466M77744
$$ 623904 1051859 1271574 895884 -28627 -698093 -602811 -211795 640 296106 773850
39139G73850N7407m75093p9183O52171K09352r73484q87032N81908J235642K30550
$$ 773850 831257 356164 276981 929152 1138504 165020 -722012 -140104 1095538 1326088
39129A326088o02670j17793K14172p71303j610965p51419P09085R56008M03665
$$ 1326088 723418 605625 819797 48494 -1562471 -2313890 -1604805 -648797 -245132
39120b45132M67831Q16898K38486p33138m77855Q93645J587933Q83841o3454k71640
$$ -245132 222699 1039597 1278083 544945 67090 960735 2548668 3432509 3369055 3097415
39110C097415j56721m43722j133832j832978k135355j566333l9667J578981K211718
$$ 3097415 2940694 2496972 1363140 -469838 -2605193 -4171526 -4211193 -2632212 -420494
39101d20494J887605J506720J325408O44379p77029j895658j526165J51214J731677
$$ -420494 1467111 2973831 4299239 4943618 4166589 2270931 744766 895980 2627657
39092B627657K070569J247647O7827r66519j778224k018989j091150P05401J824537
$$ 2627657 4698226 5945873 6013700 5047181 3268957 1249968 158818 864219 2688756
39083B688756J169876l55963j056127p92296q00162j363215j322127j63378J037102
$$ 2688756 3858632 3502669 2446542 1654246 854084 -509131 -1831258 -1994636 -957534
39074i57534J344152J131513Q03425r6527j484618j939876o81232Q65604J007008
$$ -957534 386618 1518131 2321556 2225029 740411 -1199465 -1880697 -1015093 -8085
39065h085L14473N44516J716562K068050O92412j370874k664984k590244j208875
$$ -8085 306388 850904 2567466 4635516 5327928 3957054 1292070 -1298174 -2507049
39056b507049Q34116K082509J326295p29822j950579j306493N8773O62516N14514
$$ -2507049 -1672933 409576 1735871 1006049 -944530 -2251023 -2192250 -1529734 -1015220
39047a015220M64372O31538M45275j94830p12281p18655l96365m991L90726O04646
$$ -1015220 -550848 80690 525965 331135 -381146 -1099801 -1496166 -1501157 -1110431 -505785
39037e05785L67132m5252J29899Q94346R54287n42077k132880j436522J360160
$$ -505785 -138653 -183905 -54006 840340 1794627 1252550 -880330 -2316852 -956692
39028i56692L107334J696813j095388k206767j374194o51954q04973o20460M31906
$$ -956692 2150642 3847455 2752067 545300 -828894 -1480848 -2285821 -2906281 -2474375
39019b474375J300096J419892J511304J796817J447386M19577j25836O4398j94388
$$ -2474375 -1174279 245613 1756917 3553734 5001120 5420697 5294861 5359259 5164871
39010E164871j129832j172161M11929K036754K162681J236908Q0442j540755l253699
$$ 5164871 4035039 2862878 3274807 5311561 7474242 8711150 8791592 7250837 3997138
39001C997138l210122q34930J491537J599357O20770P62273J748936J923329J340739
$$ 3997138 787016 -47914 1443623 3042980 3663750 4426023 6174959 8098288 9439027
38992I439027J185532J373081J214942J231845J901897K048449J044146R61358
$$ 9439027 10624559 11997640 13212582 14444427 16346324 18394773 19438919 20400277
38984B0400277L545614O719100P508921O888147P924134J0644173J3055190J5924473
$$ 20400277 23945891 30664991 38173912 45062059 52986193 63630366 76685556 92610029
38976I2610029K1764680L0331345M0391951N3857942O9993952P5921483N4132919
$$ 92610029 114374709 144706054 185098005 238955947 308949899 384871382 439004301
38969D39004301N103050m5672168p0883114o7183221n1853222l9519902l1307697
$$ 439004301 444107351 398435183 327552069 260368848 208515626 168995724 137688027
38962A37688027k3912539j7995344j4774276j2064086q119253n126785n475165
$$ 137688027 113775488 95780144 81005868 68941782 60822529 55695744 50220579
38955E0220579p590976q255174o741235m412219k219361o50359m91183j695581
$$ 50220579 42629603 34374429 27633194 23220975 21001614 20351255 19860072 18164491
38947A8164491k666604k169236r24946j54228K50378Q38443J035206m9281j899846
$$ 18164491 15497887 13328651 12403705 12249477 12499855 13338298 14373504 14324223 12424377
38938A2424377k982720k543974j145510K24102Q22345L37929p98310j483508r87601
$$ 12424377 9441657 6897683 5752173 5976275 6798620 7136549 6338239 4854731 3867130
38929C867130J30203O46026J97846k91588N0170O32726k0707k056131l412344
$$ 3867130 3997333 4643359 4841205 4549617 4599787 5232513 5211806 3155675 -256669
38920b56669k129986Q45726K556421J781463K73473k03518j51752n60854p92809
$$ -256669 -2386655 -1540929 1015492 2796955 3070428 2866910 2715158 2154304 1361495
38911A361495n6591N79902j20022j049499m05900J055499J183434K72508N88698
$$ 1361495 1304904 1884806 1764784 715285 309385 1364884 2548318 2820826 3409524
38902C409524K038470J746164j115636l311151k119571O83624J622323L33291
$$ 3409524 5447994 7194158 6078522 2767371 647800 1331424 2953747 3287038
38894C287038q34035p09064k79227l40890m27378j50322Q2516o30n2590J41946
$$ 3287038 2453003 1743939 1464712 1123822 696444 546122 628638 628008 575418 717364
38884G17364K30715j44935q22642j251007r45924J4105Q21149O53139k86843r23575
$$ 717364 948079 803144 -19498 -1270505 -2216429 -2202324 -1381175 -728036 -1014879 -1938454
38874a938454o20609K55204J133274J776613J881408J154139J15828k24676P9761
$$ -1938454 -2559063 -2303859 -1170585 606028 2487436 3641575 3757403 3532727 3612488
38865C612488j59054j247197j831553j007864R2274N5305n49396j66478J170166
$$ 3612488 3453434 2206237 374684 -633180 -540906 -485601 -1034997 -1201475 -31309
38856c1309J836385R56015n98764j532189j415381o49687N1682J91256M7986L80194
$$ -31309 1805076 2761091 2162327 630138 -785243 -1434930 -1383248 -1191992 -1144006 -763812
38846g63812J072232Q46713p61207k003507r53623J547551K688471J411156l84832
$$ -763812 308420 1155133 393926 -1609581 -2563204 -1015653 1672818 3083974 2699142
38837B699142p76799k98049n05423j339282j375347k32077P29600M02240m08177
$$ 2699142 1922343 1624294 1118871 -220411 -1595758 -1827835 -1098235 -695995 -1104172
38828a104172j18214J244905J808900L48743j799925k227025n17649J286702J418668
$$ -1104172 -1222386 22519 1831419 2180162 380237 -1846788 -2364437 -1077735 340933
38819C40933M21333j03054K12823L90147k37156j141115j265847j51273J414556
$$ 340933 762266 659212 872035 1262182 1025026 -116089 -1381936 -1533209 -118653
38810a18653J826636L83712j410834j365602L63268J275295K19168p74274K42939
$$ -118653 1707983 2091695 680861 -684741 -321473 953822 1172990 398716 641655
38801F41655J852589J478260m24469j140154n2444P41991K59473L4456Q77396
$$ 641655 2494244 3972504 3548035 2407881 2355437 3097428 3356901 3391357 4268753
38792D268753J092329n04810k157135j798151l38772m2357q54535q39692L27941
$$ 4268753 5361082 4856272 2699137 900986 562214 519857 -334678 -1174370 -846429
38783h46429Q57146n5596r26058n28536J49899k82049j200100q92806P31328J917030
$$ -846429 10717 -44879 -970937 -1499473 -1349574 -1631623 -2831723 -3724529 -2993201 -1076171
38773a076171J543625N05859J48281L59456J05243p07405r67910M0899J626665
$$ -1076171 467454 973313 1121594 1481050 1586293 878888 -89022 -48123 1578542
38764A578542K483874J905555Q7937k056447l184290k459609o49161M71569K60767
$$ 1578542 4062416 5967971 6055908 3999461 815171 -1644438 -2293599 -1822030 -1561263
38755a561263j12497L14259P57984K16780n59993j81918J011034J451508Q68691
$$ -1561263 -1673760 -1359501 -601517 -384737 -944730 -1126648 -115614 1335894 2204585
38746B204585M51735N30505M4343j294887k174136j760539r86784q10449o26893
$$ 2204585 2656320 3186825 3231168 1936281 -237855 -1998394 -2985178 -3795627 -4422520
38737d422520M08488J619917J704898O92544j84518j91847K66712M82609K55142
$$ -4422520 -4014032 -2394115 -689217 3327 -181191 -373038 -106326 376283 631425
38728F31425j7386J66389N80331K00805j236331k045915n25526K017964K324567
$$ 631425 614039 780428 1360759 1561564 325233 -1720682 -2246208 -228244 2096323
38719B096323j59850k076941r46974J200303J145470n61220q74862P01762J630191
$$ 2096323 1936473 -140468 -1087442 112861 1258331 697111 -177751 524011 2154202
38710B154202O64493m85203l81328K913m98400j092027n54224O30308J109543
$$ 2154202 2818695 2333492 1952164 1955077 1456677 364650 -189574 440734 1550277
38701A550277O42733L6012j70161J3728M53492Q41136P59619L50054K73608N34980
$$ 1550277 2193010 2229022 2058861 2072589 2526081 3367217 4126836 4476890 4750498 5285478
38691E285478J66922j254512k557100k273726n01496J261139J762400R38326l51161
$$ 5285478 5452400 4197888 1640788 -632938 -1134434 126705 1889105 2827431 2476270
38682B476270r88096m26103O34716Q14292k62727j342647j096071K21264J239396
$$ 2476270 1488174 1062071 1696787 2511079 2248352 905705 -190366 30898 1270294
38673A270294J151201L09026m79520o59323k26949J93120j02266q95572j114359
$$ 1270294 2421495 2730521 2251001 1591678 1364729 1557849 1455583 560011 -554348
38664e54348l28532N35454O37968N39983J014190J311796J80036j705028k157107
$$ -554348 -882880 -347426 290542 830525 1844715 3156511 3336547 1631519 -525588
38655e25588o39647P76764M71234l37957K82889J693688J570533l07836j403582
$$ -525588 -1165235 -388471 82763 -255194 27695 1721383 3291916 2984080 1580498
38646A580498j16857J770969J618510m51528k089041k081583j305418n61471M65633
$$ 1580498 1463641 3234610 4853120 4401592 2312551 230968 -1074450 -1635921 -1170288
38637a170288J595802J457306l85638k062047j694289o9460O66820K49643K49442
$$ -1170288 425514 1882820 1497182 -564865 -2259154 -2328614 -1661794 -1412151 -1162709
38628a162709J061457J146158k59242j638571j381435M4390J199732J656105J641064
$$ -1162709 -101252 1044906 785664 -852907 -2234342 -2189952 -990220 665885 2306949
38619B306949Q84379o31380j605054q47700O20678O59195q49696j687269m92911
$$ 2306949 3191328 2559948 954894 107194 727872 1387067 537371 -1149898 -1642809
38610a642809J354253J828752R02110K6063n1680K76422O12032Q14699L95781
$$ -1642809 -288556 1540196 2442306 2468369 2416689 2693111 3305143 4119842 4515623
38601D515623j024946k560626k621203j073992K92605J77717m16124J07331J269469
$$ 4515623 3490677 930051 -1691152 -2765144 -2472539 -2294822 -2710946 -2603615 -1334146
38592a334146J214735j77588q07448M74148J968432J589106j41271j128205p93491
$$ -1334146 -119411 -296999 -1104447 -630299 1338133 2927239 2785968 1657763 864272
38583H64272k90153j55675K02050O87072K83073q57210j070516J49700R72683
$$ 864272 574119 418444 620494 1307566 1590639 733429 -337087 -187387 785296
38574G85296M5746j114606l34927J734637K399059O83417j613457k545607j960681
$$ 785296 831042 -283564 -618491 1116146 3515205 4198622 2585165 39558 -1921123
38565a921123o59413P46338J636096J365096J34430r69568j243732r49857m68747
$$ -1921123 -2580536 -1834198 -198102 1166994 1301424 331856 -911876 -1861733 -2330480
38556b330480J76876P37696P53131N07774Q53406J615796J436774n1299j199032
$$ -2330480 -2153604 -1415908 -662777 -155003 698403 2314199 3750973 3699674 2500642
38547B500642o46158M80693K30871j090759j369969M3170J467002J601715J224414
$$ 2500642 1854484 2335177 2566048 1475289 105320 148490 1615492 3217207 4441621
38538D441621J326248J257076J84755q11793j7696K041941L015331K216516J797393
$$ 4441621 5767869 7024945 7209700 6397907 6380211 8422152 11437483 13653999 15451392
38529A5451392L557871O129310O712493M620268J525650j200811l566014n402016
$$ 15451392 19009263 25138573 31851066 36471334 37996984 36796173 33230159 27828143
38521B7828143n680588m193335k522959k200196k728027k531737j298851k38730
$$ 27828143 22147555 17954220 15431261 13231065 10503038 7971301 6672450 6433720
38513F433720k60849r44673j381055j243129q29668n51417n35649m90838q378
$$ 6433720 6172871 5228198 3847143 2604014 1774346 1222929 687280 196442 188064
38504A88064Q29654J397110J291826P63424J24393o45681j243753p76147R50211
$$ 188064 1017718 2414828 3706654 4470078 4594471 3948790 2705037 1928890 2879101
38495B879101K447767K024487L9435j432885j213167k66785j45501j054323j834078
$$ 2879101 5326868 7351355 7390790 5957905 4744738 4477953 4332452 3278129 1444051
38486A444051j348501L29645J839084J772102L09438q22080n03256L69155M24563
$$ 1444051 95550 425195 2264279 4036381 4345819 3523739 3020483 3389638 3814201
38477C814201j00041j03275L04745J42879m92315o74009n57094r95209j406104
$$ 3814201 3714160 3610885 3915630 4058509 3566194 2892185 2335091 1339882 -66222
38468f6222m33800J092739O62282j697562k673527o13887J675267J252910m88104
$$ -66222 -500022 592717 1254999 -442563 -3116090 -3729977 -2054710 -801800 -1289904
38459a289904n52434O34025M84163q12988n47868J584342K584949Q46229j427094
$$ -1289904 -1842338 -1208313 -724150 -1537138 -2085006 -500664 2084285 2930514 1503420
38450A503420j649969j99382R54268R49783J30573r32939j433352p16181N23860
$$ 1503420 -146549 -345931 608337 1558120 1688693 755754 -677598 -1393779 -869919
38441h69919Q21686K49527M36819J687030K129813P47382q74547j205630j102905
$$ -869919 -48233 201294 638113 2325143 4454956 5202338 4327791 3122161 2019256
38432B019256j695301j882631k44892K021488K572429J320674l7211r94568k099674
$$ 2019256 323955 -1558676 -1803568 217920 2790349 4111023 4073812 3079244 979570
38423I79570k514781p34983K226951L312652J628055m64043j158770j378090j993554
$$ 979570 -1535211 -2270194 -43243 3269409 4897464 4433421 3274651 1896561 -96993
38414i6993j687159M59658K503160K176000L21203o54767n67804j080743k273862
$$ -96993 -1784152 -1324494 1178666 3354666 3675869 3021102 2453298 1372555 -901307
38405i01307k366323q31135P26822J167279J062117Q52130j1080j220141j042481
$$ -901307 -3267630 -4098765 -3371943 -2204664 -1142547 -290417 -301497 -1521638 -2564119
38396b564119J064905K992984K660668P95154n05783p48040q37686r27798m55916
$$ -2564119 -1499214 1493770 4154438 4949592 4443809 3695769 2858083 1930285 1474369
38387A474369K44350L08170K3181L36556R11139N56054n23861r48708o98216j159502
$$ 1474369 1718719 2026889 2050070 2386626 3297765 3853819 3329958 2381250 1683034 523532
38377E23532k215664j754529Q61864L148804K874987J107201O3983k57933j055991
$$ 523532 -1692132 -3446661 -2584797 564007 3438994 4546195 4610178 4352245 3296254
38368C296254j773248q83182J073089J874258R16907j78627k94444K1364K55641
$$ 3296254 1523006 639824 1712913 3587171 4504078 4325451 4031007 4052371 4308012
38359D308012O19434P03592l73598j883613j688054N86782K539846K255887P86209
$$ 4308012 4927446 5631038 5257440 3373827 1685773 2272555 4812401 7068288 7854497
38350G854497J25476L89126N17838L95031N57516P44292L27831m20396p62699
$$ 7854497 7979973 8369099 8886937 9281968 9839484 10583776 10911607 10491211 9728512
38341I728512o09299k12385M49096J022315N58453r37074j881627j349855o55503
$$ 9728512 9119213 8906828 9355924 10378239 10936692 9999618 8117991 6768136 6112633
38332F112633j084120j423535L6526K124435K113739k5126j515031j006666j40309
$$ 6112633 5028513 3604978 3641504 5765939 7879678 7854552 6339521 5332855 5192546
38323E192546k92565m76758L14034J015520M02974o67136p15399p0103m0983n13729
$$ 5192546 4899981 4423223 4737257 5752777 6155751 5488615 4773216 4703113 4662130 4148401
38313D148401j73765J170854K039780J236901o17079j803099j344353j7874M54231
$$ 4148401 3974636 5145490 7185270 8422171 7805092 6001993 4657640 4639766 5093997
38304E093997n81130j758848j415517M6502P02985j335m50212N66745K029079
$$ 5093997 4512867 2754019 1338502 1385004 2087989 2086654 1636442 2203187 4232266
38295D232266K360194J584136O57062k32357j382324k415674k666437k169115
$$ 4232266 6592460 8176596 8833658 8601301 7218977 4803303 2136866 -32249
38287c2249j300485j47115Q92126Q80023j59320o15621M27626J404989N29496
$$ -32249 -1332734 -1479849 -587723 292300 132980 -482641 -55015 1349974 1879470
38278A879470j153664j171411N16850J511928P49656j93386R9N10506K89290j61492
$$ 1879470 725806 -445605 71245 1583173 2332829 2139443 2139542 2650048 2939338 2777846
38268B777846j08925r5148p97463j536098j198864Q4979J189816J352924O29061
$$ 2777846 2668921 2573773 1776310 240212 -958652 -873673 316143 1669067 2298128
38259B298128l99703r08128n18660L9301j39828n03819K56940J683406J660359
$$ 2298128 1898425 990297 471637 510938 371110 -132709 124231 1807637 3467996
38250C467996j62805j184120L99707K544954K195131k13465j578952p41610L26857
$$ 3467996 3305191 2121071 2520778 5065732 7260863 7047398 5468446 4726836 5053693
38241E053693q6738j186225j268591K49785K899263N618761O627005M459041O181
$$ 5053693 4966955 3780730 2512139 2761924 5661187 11279948 17906953 22365994 22372175
38232B2372175l705786m647853l738092k951731k575413j466221O13462K213541
$$ 22372175 18666389 14018536 10280444 7328713 4753300 3287079 3900541 6114082
38224F114082J864283j77590k135748k474832j312002m9646K57093j91315o64131
$$ 6114082 7978365 7800775 5665027 3190195 1878193 1828547 2085640 1894325 1230194
38215A230194q45545o79831j8705R04347J301665Q75270L29108Q3604m87051j456717
$$ 1230194 384649 -295182 -313887 590460 1892125 2767395 3096503 3180107 2693056 1236339
38205A236339j354230M43816J651704j9887k779756k743877K37902K287545J484052
$$ 1236339 -117891 325925 1977629 1957742 -822014 -3565891 -3327989 -1040444 443608
38196D43608L14103Q15895J185236l58579j799407p09172J279755J088236o89476
$$ 443608 757711 1573606 2758842 2400263 600856 -108316 1171439 2259675 1570199
38187A570199j149963j44589P3894n92107q7558J443259J488849k30840r87838
$$ 1570199 420236 275647 349541 -242566 -330124 1113135 2601984 2371144 1383306
38178A383306K59496J201649M54411j98371M68903P06451o83619j652878m47011
$$ 1383306 1642802 2844451 3298862 3100491 3569394 4275845 3592226 1939348 1492337
38169A492337R70367J24684j643680j446828K86558P98733k13096m24384Q41085
$$ 1492337 2462704 2587388 943708 -503120 -216562 582171 369075 -55309 785776
38160G85776J561937N71536p24805q74536l16657m0346j44344m14091q59457j182219
$$ 785776 2347713 2919249 2194444 1319908 1003251 962905 818561 404470 -454987 -1637206
38150a637206r19289k95857J93197Q21266J871398K314912J099980n98097o41761
$$ -1637206 -2556495 -2852352 -2659155 -1837889 33509 2348421 3448401 2850304 2208543
38141B208543O34388P53391q43903j784952o78406O37615K17392r82134j066969
$$ 2208543 2842931 3596322 2752419 967467 289061 926676 1144068 161934 -905035
38132i05035k29116K54528M38751R16534R17602l98357j670588r04538J146980
$$ -905035 -1134151 -879623 -440872 475662 1393264 994907 -675681 -1580219 -433239
38123d33239J742359K93438q10602m6123J048051O90975k59267q1244O31206j03589
$$ -433239 1309120 1602558 791956 745833 1793884 2484859 2225592 2144348 2775554 2671965
38113B671965k061385k582545n10566J678783J156603j146000j763015L23515
$$ 2671965 610580 -1971965 -2482531 -803748 352855 -793145 -2556160 -2232645
38105b232645K255315J581064k16216k97506R59775O49337j788405l285422j597974
$$ -2232645 22670 1603734 1387518 1090012 2049787 2699124 910719 -2374703 -3972677
38096c972677J358782K247148P36913p00961m81448N31137Q58287K19021n95801
$$ -3972677 -2613895 -366747 370166 -330795 -812243 -281106 577181 796202 200401
38087B00401o08407N95503K213529K556174Q84115j361089k092703j092384J2535
$$ 200401 -408006 187497 2401026 4957200 5841315 4480226 2387523 1295139 1307674
38078A307674P4268m35718o57120n39129l97417j40260M78282J233707J476085
$$ 1307674 1381942 946224 289104 -250025 -647442 -787702 -309420 924287 2400372
38069B400372P49694o11234j453447p81680Q95594J716875N84517j307469j839729
$$ 2400372 3150066 2538832 1085385 303705 1199299 2916174 3500691 2193222 353493
38060C53493n49964R98822J262247K83472p60610q63583L553Q85124P20974m08013
$$ 353493 -196471 802351 2064598 2348070 1587460 723877 727430 1612554 2333528 1925515
38050A925515j255331r98735k27744J80868K72647K62155l33785j482750j632178
$$ 1925515 670184 -328551 -556295 -375427 -102780 159375 -174410 -1657160 -3289338
38041c289338K09271K170922J601283q72951j917978l20512J415563J078042k40542
$$ -3289338 -3080067 -909145 692138 -180813 -2098791 -2419303 -1003740 74302 -166240
38032a66240n12980J21564M48652N34750R33005R42036j66373j211358o38993
$$ -166240 -679220 -557656 -109004 425746 1358751 2300787 2134414 923056 284063
38023B84063O79876M84488j308414k339735j293791M33586J103926Q42715O06128
$$ 284063 963939 1448427 140013 -2199722 -3493513 -3059927 -1956001 -1113286 -507158
38014e07158M46159l5872n14182m28728j02954k81957p90167o52688L40211J052796
$$ -507158 -60999 -96871 -611053 -1039781 -1142735 -1424692 -2214859 -2867547 -2527336 -1474540
38004a474540M99622n87304n09683J041562K262482J485897n08747j498778q31839
$$ -1474540 -974918 -1562222 -2071905 -1030343 1232139 2718036 2209289 710511 -121328
37995a21328o6095m12360j027833o31716M46528R76235O70801R0709n99619j457839
$$ -121328 -187423 -599783 -1627616 -2259332 -1812804 -836569 -165768 -75059 -674678 -2132517
37985b132517j844604j080808J95074O39920J02222l09371n872M79540P16652
$$ -2132517 -3977121 -5057929 -4862855 -4222935 -4120713 -4430084 -4435956 -3956416 -3239764
37976c239764R17198J031096N68393k78764n08836J58238O73625K12642o01968
$$ -3239764 -2322566 -1291470 -723077 -1001841 -1510677 -1352439 -678814 -466172 -1068140
37967a068140p40220k00282L90739Q83917J365064J319431J57661j497183k057582
$$ -1068140 -1808360 -2008642 -1617903 -733986 631078 1950509 2108170 610987 -1446595
37958a446595q43989R37829J576691Q65757J53180M45663J169408J223318O17726
$$ -1446595 -2290584 -1352755 223936 1089693 1242873 1688536 2857944 4081262 4698988
37949D698988J56127j48990r89060j955298j449096P76334K511923J903122R1819
$$ 4698988 4855115 4706125 3717065 1761767 312671 1089005 3600928 5504050 5595869
37940E595869o75639m51021q49844j690252j178206N46601J032430m80205j455922
$$ 5595869 4920230 4469209 3619365 1929113 750907 1297508 2329938 1849733 393811
37931C93811K0864K106428J993908L2629j225862q68448k08086k60723p71517
$$ 393811 414675 2521103 4515011 4547640 3321778 2453330 2245244 1984521 1213004
37922A213004j365627j788410j315361L02663J623270J073189n22269r20918J45809
$$ 1213004 -152623 -1941033 -3256394 -2953731 -1330461 -257272 -779541 -1700459 -1554650
37913a554650P37997P0263k58242P85949J711100R11196o88988j129462l89237
$$ -1554650 -816653 -746390 -1004632 -218683 1492417 2403613 1714625 585163 195926
37904A95926n6880o70733j120260n65522M68165J077027J049830P56988O59905
$$ 195926 139046 -531687 -1651947 -2217469 -1749304 -672277 377553 1134541 1794446
37895A794446R98477J443859J200716K4528j119819j142162l40021M2892l63053
$$ 1794446 2792923 4236782 5437498 5462026 4342207 3200045 2860024 2902916 2539863
37886B539863p02288m39581j23944k07875j97123K80351M75331l66019j485707
$$ 2539863 1837575 1397994 1274050 1066175 869052 1149403 1624734 1258715 -226992
37877b26992j443342k54104N50400J35238n58433m00588L47120Q06167R45542
$$ -226992 -1670334 -1924438 -1374038 -1238800 -1797233 -2197821 -1850701 -1044534 -98992
37868i8992J212142J278335M31468r21961j404006n83697L23602J79580n34874
$$ -98992 1113150 2391485 2822953 1900992 496986 -86711 236891 416471 -118403
37859a18403n93761K03834R57580J016086N98266J34033l28411q79642j331689
$$ -118403 -712164 -508330 449250 1465336 2063602 2197635 1869224 989582 -342107
37850c42107j317246p46739o1918J16523k37949l29227M74868J536632J527001
$$ -342107 -1659353 -2406092 -2468010 -2351487 -2589436 -2918663 -2443795 -907163 619838
37841F19838K40175r76361r93248k83072R7556J17980M05401Q10033N07760n79283
$$ 619838 860013 -116348 -1109596 -1392668 -1295112 -1177132 -771731 38302 546062 -33221
37831c3221j488792j445645o08511M49591J273072J519267J166729P70708Q12532
$$ -33221 -1522013 -2967658 -3576169 -3126578 -1853506 -334239 832490 1603198 2415730
37822B415730Q50991J42291r78101j383801r01158n54682p60853o12099L60007
$$ 2415730 3266721 3409012 2430911 1047110 145952 -408730 -1169583 -1781682 -1421675
37813a421675J025982L85349n93656l05763R47636J324132J68418j160713j392581
$$ -1421675 -395693 -10344 -604000 -909763 37873 1362005 1530423 369710 -1022871
37804a022871q75728m87809k23189L01904Q01961P49278L44927J59008J33002
$$ -1022871 -1898599 -2386408 -2609597 -2307693 -1505732 -756454 -411527 -252519 -119517
37795a19517j58982m71140j35501N99946N73169n26949j389194q60231K66658
$$ -119517 -278499 -749639 -885140 -285194 287975 -238974 -1628168 -2488399 -2221741
37786b221741L51849n88128q12054N30724J964083J590072l79930j925704j701463
$$ -2221741 -1869892 -2458020 -3270074 -2739350 -775267 814805 434875 -1490829 -3192292
37777c192292l71678M91952J69382p17733j061094l97184O83038J178585P10659
$$ -3192292 -3563970 -3072018 -2902636 -3620369 -4681463 -5078647 -4395609 -3217024 -2506365
37768b506365k03276q33918q87138n01670o4085o0140n40523o88434K99991J756257
$$ -2506365 -2709641 -3543559 -4430697 -4932367 -4996452 -5056592 -5597115 -6285549 -5985558 -4229301
37758d229301J999216O71784n73311m52408J92061J41309n6176O03749J252946
$$ -4229301 -2230085 -1558301 -2131612 -2584020 -2391959 -2250650 -2306826 -1703077 -450131
37749d50131L75843j237281j266481M19066J336675J80143j356174j433711n51987
$$ -450131 -74288 -1311569 -2578050 -2158984 -822309 -642166 -1998340 -3432051 -3984038
37740c984038J1608K53328N15378K75699n46073o14237Q12451K254680K108250
$$ -3984038 -3972430 -3719102 -3203724 -2928025 -3474098 -4088335 -3275884 -1021204 1087046
37731A087046J080500P29693Q37653K78117o23859q68263r86675k004952k902162
$$ 1087046 2167546 2897239 3734892 4013009 3389150 2520887 1534212 -470740 -3372902
37722c372902j816455N40631J515103O15389Q5747R26216J327346J12826j085235
$$ -3372902 -5189357 -4648726 -3133623 -2518234 -2432487 -1506271 -178925 -66099 -1151334
37713a151334o75596L17033M45328M91172J629191K576613J217287j760045l352088
$$ -1151334 -1826930 -1509897 -1064569 -573397 1055794 3632407 4849694 3089649 -262439
37704b62439k197093n847J034967O13494j51586j60016Q75819K068765J826801
$$ -262439 -2459532 -2465379 -1430412 -816918 -968504 -1128520 -252701 1816064 3642865
37695C642865l07640k495985k479387m66667J201734J259720Q30623J170466J673292
$$ 3642865 3335225 839240 -1640147 -2106814 -905080 354640 1185263 2355729 4029021
37686D029021J068171m90671j642068j547018n07098P08142J349192Q86924l99830
$$ 4029021 5097192 4606521 2964453 1417435 910337 1618479 2967671 3854595 3454765
37677C454765j231520o07502P06368Q25481q76198k815218l104953j775288l78822
$$ 3454765 2223245 1615743 2322111 3147592 2271394 -543824 -3648777 -5424065 -5802887
37668e802887J76446M22714R98261J563788J489069Q29347J1997q12270j404809
$$ -5802887 -5626441 -5203727 -4205466 -2641678 -1152609 -323262 -311265 -1123535 -2528344
37659b528344j049267M90430K009743J998458O50370l62803j88825K66111m1126
$$ -2528344 -3577611 -3087181 -1077438 921020 1571390 1208587 1019762 1285873 1244747
37650A244747q37865j211855q59732j41705M03935K51764o45689j363604r32547
$$ 1244747 406882 -804973 -1664705 -1806410 -1402475 -1150711 -1796400 -3160004 -4092551
37641d092551N4589M2246r45201j012037N71487J864425J174458k17729j74963
$$ -4092551 -4037962 -3995716 -4940917 -5952954 -5381467 -3517042 -2342584 -2560313 -2735276
37632b735276Q53356Q76425r4365k50832O06878O92040m40280q90884L64825J613716
$$ -2735276 -1881920 -1005495 -1099860 -1350692 -743814 -51774 -492054 -1382938 -1018113 595603
37622E95603J055906n69198j424360j112880l60450N09230J297090J233880Q1385
$$ 595603 1651509 1082311 -342049 -1454929 -1815379 -1306149 -9059 1224821 1306206
37613A306206r26796o54816K17907M21601J71122M08660P34940M2287j136426
$$ 1306206 379410 -275406 -57499 364102 535224 943884 1678824 1721111 584685
37604E84685j001949N99877J601123O98089p48787p91130M04218J131967O24459
$$ 584685 -417264 182613 1783736 2481825 1733038 941908 1346126 2478093 3102552
37595C102552k91037o83090n72936m27485l62254j54274K75988O26160M30390
$$ 3102552 2811515 2128425 1555489 1128004 765750 611476 887464 1513624 1944014
37586A944014m50062j510553j907475j209461J90966J444417J947446J687742
$$ 1944014 1493952 -16601 -1924076 -3133537 -2942571 -1498154 449292 2137034
37578B137034J030812K63924o01878j519867k023766j538136k43582P48888M96337
$$ 2137034 3167846 3431770 2829892 1310025 -713741 -2251877 -2495459 -1746571 -1250234
37569a250234o69231j480067j048042M22861J955996K434011J263756r16739k355380
$$ -1250234 -1919465 -3399532 -4447574 -4024713 -2068717 365294 1629050 712311 -1643069
37560a643069j778825Q3873J284857J032496M19105N20287Q22633L42446n06973
$$ -1643069 -3421894 -3338021 -2053164 -1020668 -601563 -81276 741357 1083803 576830
37551E76830m13108O94886J289806L76666j055794j441331q01235m85974r61530
$$ 576830 163722 858608 2148414 2525080 1469286 27955 -773280 -1259254 -2220784
37542b220784j008966L94022K242468K524817Q58229q96412r59038K25758Q24907
$$ -2220784 -3229750 -2835728 -593260 1931557 2789786 1893374 934336 1160094 1985001
37533A985001R4368q96998r76746l75154j00535m62707q99252r77932q39475o34705
$$ 1985001 2079369 1182371 205625 -169529 -270064 -732771 -1632023 -2609955 -3449430 -4084135
37523d084135k18449L20812M32100n8976l11757N32677J823676J827236M4086
$$ -4084135 -4302584 -3981772 -3549672 -3608648 -3920405 -3387728 -1564052 263184 307270
37514C07270j758046j612584J11595J287247R23506K51600O32077J561372J590735
$$ 307270 -1450776 -3063360 -2951765 -1664518 -741012 -489412 142665 1704037 3294772
37505C294772M51788p86863j327426j342524j103223m56068M83478R58519N15172
$$ 3294772 3746560 2959697 1632271 289747 -813476 -1269544 -786066 172453 687625
37496F87625j95389k60236J28150m8436r55092j375761l78295J141417J475475
$$ 687625 492236 232000 360150 311714 -643378 -2019139 -2397434 -1256017 219458
37487B19458M17459n13879l11481K57635K45439J38450O39515Q58930l80336j890062
$$ 219458 636917 123038 -188443 69192 314631 453081 1092596 1951526 1571190 -318872
37477c18872j139728J671525L021128Q60674k107021k011306Q13800K562686J335452
$$ -318872 -1458600 212925 3234053 4094727 1987706 -23600 790200 3352886 4688338
37468D688338q99475j765389j333495p58531k19606M97995Q74778M71053j03850
$$ 4688338 3788863 2023474 689979 -68552 -288158 209837 1084615 1555668 1451818
37459A451818j57382k7844k49134m54502j97796p2405p27699j354512o22405J062048
$$ 1451818 1294436 1266592 1017458 562956 365160 292755 -434944 -1789456 -2411861 -1349813
37449a349813J714704M66555j138306j156089K90960J352901Q56476m22452r60286
$$ -1349813 364891 831446 -306860 -1462949 -1171989 180912 1037388 614936 -345350
37440c45350l83261K83552J11016n72142q23471m33828J7345K42873N42979R26100
$$ -345350 -728611 -445059 -334043 -906185 -1729656 -2163484 -2146139 -1903266 -1360287 -434187
37430d34187Q18112N1997n88274l51887N23144J337086J797434J777672Q97992
$$ -434187 383925 435922 -152352 -504239 18905 1355991 3153425 4931097 5829089
37421E829089p68281k057031j841002o30516l5854n98483j152221o25693M47863
$$ 5829089 5060808 3003777 1162775 532259 496405 -102078 -1254299 -1879992 -1432129
37412a432129Q51266M92057M13440J101796J626572Q97409p18905j759826j554116
$$ -1432129 -580863 -88806 324634 1426430 3053002 3950411 3231506 1471680 -82436
37403h2436r05829o14829k58648P61205J763617J616403N70967j35010k71484
$$ -82436 -988265 -1603094 -1861742 -1100537 663080 2279483 2850450 2715440 2443956
37394B443956o18342j034794m36280R80945J589873J120568J349273K877684L726917
$$ 2443956 1825614 790820 354540 1335485 2925358 4045926 5395199 8272883 11999800
37385A1999800K968467L112908N936713Q085078M848363k579524p831135p509356
$$ 11999800 14968267 18081175 24017888 32102966 36951329 34371805 26540670 19031314
37377A9031314m594620k911328k283474j121475k17999r91751k345077k345625
$$ 19031314 14436694 11525366 9241892 8120417 7902418 6910667 4565590 2219965
37369B219965j500940j499980j855744p51160J369913K000373M62972r76237m96589
$$ 2219965 719025 -780955 -2636699 -3387859 -2017946 -17573 445399 -530838 -1027427
37360a027427Q71301J148657J49737p67583p35227j62561J11725j84605n58458
$$ -1027427 -156126 992531 1142268 374685 -360542 -523103 -411378 -595983 -1154441
37351a154441m19715L0445q0310r99034j710519j198779J46751J151990J461570
$$ -1154441 -1574156 -1543711 -1624021 -2623055 -4333574 -5532353 -5385602 -4233612 -2772042
37342b772042J617644J803490J477350L01141j229071k134851j667313k3247J403325
$$ -2772042 -1154398 649092 2126442 2427583 1198512 -936339 -2603652 -2626899 -1223574
37333a223574J232060j5580k94817J000477J848089O20546j198452j267114r6088
$$ -1223574 8486 -7094 -301911 698566 2546655 3167201 1968749 701635 605547
37324F05547M7502q64760p93015L45266K39897j462771j825771N97164K699081
$$ 605547 653049 -211711 -1004726 -659460 -419563 -1882334 -3708105 -3110941 -411860
37315d11860J195493k191890l106161p88295J417623J374447O17432R20665J373957
$$ -411860 783633 -1408257 -4514418 -5302713 -3885090 -2510643 -1893211 -972546 401411
37306D01411M75438q90129o40664J216734K393242J391249o44427j580959q46982
$$ 401411 876849 -13280 -653944 562790 2956032 4347281 3702854 2121895 1274913
37297A274913L72936R26826P28261Q5438r24385j919645j994672r59183r5790
$$ 1274913 1647849 2574675 3302936 3388374 2463989 544344 -1450328 -2409511 -2505301
37288b505301m86105j138787l42271J440033K012008R29774K56084J035002J403700
$$ -2505301 -2991406 -4130193 -4472464 -3032431 -1020423 -90649 165435 1200437 2604137
37279B604137j95269k059342j746865M3873P51141N3853j61856N62963O67185
$$ 2604137 2408868 349526 -1397339 -1353466 -602325 -548472 -710328 -147365 519820
37270E19820k20820l53619J086168K442297K108955O09550p56337j484497j309408
$$ 519820 299000 -54619 1031549 3473846 5582801 6192351 5436014 3951517 2642109
37261B642109n5864J168453P97106l65616K81607K668851L356614J144834k24075
$$ 2642109 2586245 3754698 4551804 4186188 4467795 7136646 10493260 11638094 11414019
37252A1414019K090314N282255O446020R129819J7353047K4869676J9421402q1796
$$ 11414019 13504333 18786588 25232608 34362427 51715474 76585150 96006552 95924756
37244I5924756j8614594k2118464j3597575o318704n858311o664908m035961p22424
$$ 95924756 77310162 55191698 41594123 35275419 29417108 22752200 18716239 17993815
37236A7993815m28661j896609k491509k592272l110334k566218r0073J729694
$$ 17993815 17565154 15668545 13177036 10584764 7474430 4908212 4818139 6547833
37228F547833N13839j749265j686951K03694Q56391k12871p83058j89590J2024
$$ 6547833 7061672 5312407 3625456 3829150 4685541 4472670 3689612 3500022 3512046
37219C512046m87942j82289R38497Q17168j006861k133884j015946O06322N28897
$$ 3512046 3024104 2841815 3780312 4597480 3590619 1456735 440789 1047111 1576008
37210A576008p68929j472926j200492p06353j82472M84828P78431L43953r8150
$$ 1576008 807079 -665847 -1866339 -2572692 -2755164 -2270336 -1491905 -1147952 -1246102
37201a246102J67863P11320R10959R94255J047742K58767j457970k317591r15509
$$ -1246102 -1078239 -366919 544040 1538295 2586037 2844804 1386834 -930757 -1846266
37192a846266J307787J764425K78124r70868p00791K00703O02414M89781J58462
$$ -1846266 -538479 1225946 1504070 533202 -167589 33114 635528 1125309 1283771
37183A283771l72827p70215n06377R4708P5257o51805j111905p80280j90604J66130
$$ 1283771 910944 140729 -365648 -270940 -195683 -847488 -1959393 -2739673 -2930277 -2764147
37173b764147M47621P15329O59977L90341N11747J085801J395782J029781L70394
$$ -2764147 -2316526 -1601197 -941220 -550879 -39132 1046669 2442451 3472232 3842626
37164C842626j99752p48909j273099j505799j360073q77925P6828J223518J401291
$$ 3842626 3642874 2893965 1620866 115067 -1245006 -2122931 -2046103 -822585 578706
37155E78706p586j553924j276824L45768R09339k92030j280376o45102L83660
$$ 578706 571120 -982804 -2259628 -1913860 -1004521 -1296551 -2576927 -3222029 -2838369
37146b838369K42183m97951m50032L05684Q23653J002060J207022J187701P44057
$$ -2838369 -2596186 -3094137 -3544169 -3238485 -2414832 -1412772 -205750 981951 1726008
37137A726008N19236Q03076N76154q13273k058520j634064k28852L77606J64545
$$ 1726008 2245244 3048320 3624474 2811201 752681 -881383 -1110235 -732629 -568084
37128e68084N83945J761054K050234O06253j294860j994206j333930l94782j52018
$$ -568084 15861 1776915 3827149 4433402 3138542 1144336 -189594 -584376 -736394
37119g36394o06106p91250J31433J445135J360138m01154j694940q51731P63864
$$ -736394 -1342500 -2133750 -2002317 -557182 802956 401802 -1293138 -2144869 -1381005
37110a381005Q36805l49407o95627R2498K84070n83218q62919K22446J153044
$$ -1381005 -544200 -893607 -1589234 -1496736 -1212666 -1795884 -2658803 -2436357 -1283313
37101a283313O05089n50412p99461n3579P53479R42195L23910p12175j027030
$$ -1283313 -678224 -1228636 -2028097 -2081676 -1328197 -386002 -62092 -774267 -1801297
37092a801297N1143J214777N44290j422565j987163j43095J983214K306110J250323
$$ -1801297 -1750154 -535377 8913 -1413652 -3400815 -3543910 -1560696 745414 1995737
37083A995737P1408j069049k021746j770257k69617O89141J13134m77996L37469
$$ 1995737 2067145 998096 -1023650 -2793907 -3063524 -2374383 -2261249 -2739245 -2401776
37074b401776J451427J351603P72042R16781Q21442q08124k566312k098293J23162
$$ -2401776 -950349 401254 1173296 2090077 2911519 2103395 -462917 -2561210 -2438048
37065b438048J638581J748264J497497P93025j126446k829027j912591Q21318
$$ -2438048 -799467 948797 2446294 3239319 2112873 -716154 -2628745 -1807427
37057a807427J959579O67474k80675N89072J243408K06425q27367m44121k02296
$$ -1807427 152152 819626 538951 1128023 2371431 2577856 1750489 1306368 1104072
37048A104072j340299j809711L29500L004368L037692J113731K57570P25368K70371
$$ 1104072 -236227 -2045938 -1716438 1287930 4325622 5439353 5696923 6422291 6692662
37039F692662j215330j405888m6060K20649j454721k229293j63985K333325K078820
$$ 6692662 5477332 4071444 4025384 4246033 2791312 562019 398034 2731359 4810179
37030D810179j73496j362499q78232o27766j124869p79069O43302R28758r20411
$$ 4810179 4636683 3274184 2395952 1768186 643317 -135752 507550 1436308 515897
37021E15897k427571j109685J506505J913484j51139j369696Q5536J983143J726224
$$ 515897 -1911674 -3021359 -1514854 398630 247491 -1122205 -1036669 946474 2672698
37012B672698J77560k42994M63077L77510p49117j163552k86230L27608l09870
$$ 2672698 2850258 2607264 3070341 3447851 2698734 1535182 1248952 1576560 1266690
37003A266690j148497j052480k95138O35038J774416K385352J060762j609721
$$ 1266690 118193 -934287 -1229425 -594387 1180029 3565381 4626143 3016422
36995C016422k627101n94956J799263J472301n91563j176970J49564R04052J0146
$$ 3016422 389321 -205635 1593628 3065929 2474366 1297396 1446960 2351012 2361158
36986B361158q43524l82803M58394N54056R2964o22207j762362k611721j727946
$$ 2361158 1517634 1134831 1593225 2147281 2240245 1618038 -144324 -2756045 -4483991
36977d483991N61609J829445R21164k23532L99377J731238J441560m04202j574750
$$ -4483991 -3922382 -2092937 -1171773 -1395305 -995928 735310 2176870 1772668 197918
36968A97918r85009J52295M07288j67588n90881j44782J100902K216645J983500
$$ 197918 -787091 -634796 -227508 -395096 -985977 -1130759 -29857 2186788 4170288
36959D170288K48993j506748j700829n01309O05343Q20898P08919R53715J337483
$$ 4170288 4419281 2912533 1211704 710395 1315738 2136636 2845555 3799270 5136753
36950E136753J152944J05138j318536k110182j552763r5567Q87285O02952k65311
$$ 5136753 6289697 6394835 5076299 2966117 1413354 1317787 2205072 2808024 2542713
36941B542713n75484j36307M27213O44341L58418m99664j486634j578704m87817
$$ 2542713 1967229 1830922 2258135 2902476 3260894 2761230 1274596 -304108 -791925
36932g91925N14770K03004p34685p86878p8248j196n94623l64182R38118J532964
$$ -791925 -277155 -74151 -808836 -1595714 -1673962 -1675158 -2269781 -2633963 -1695845 -162881
36922a62881N80835j10605J057613K561384J825141p67994k287524j429803q553
$$ -162881 417954 307349 1364962 3926346 5751487 4983493 2695969 1266166 1257613
36913A257613J04636n18429l97966L68052N19948k87220j097152j042702k19086
$$ 1257613 1362249 843820 445854 813906 1333854 1046634 -50518 -1093220 -1312306
36904a312306O63233Q69476J27445r39600j211280m50552J95235k06089q48937
$$ -1312306 -649073 220403 347848 -591752 -1803032 -2253584 -2058349 -2264438 -3113375
36895c113375l71026Q63911J185793L68668K08805J617834K771196J590555j042046
$$ -3113375 -3484401 -2620490 -1434697 -1066029 -857224 760610 3531806 5122361 4080315
36886D080315k370944j565401m63531m09648l71490Q53189K181311J636440n34874
$$ 4080315 1709371 143970 -319561 -729209 -1100699 -247510 1933801 3570241 3035367
36877C035367j863144q63808J114700J784729O88026p43933j315201j198206r65332
$$ 3035367 1172223 308415 1423115 3207844 3895870 3151937 1836736 638530 -326802
36868c26802n34791L26889J109967J066432M09105R3029L18704J87619p87841
$$ -326802 -861593 -534704 575263 1641695 2050800 2143829 2462533 2650152 1862311
36859A862311j726488j570962n24653M33996Q42478P75968K52460m15582l39484
$$ 1862311 135823 -1435139 -1959792 -1525796 -683318 92650 345110 -70472 -409956
36850d09956O79662J217053L4462j661039j591542J32403J018709n4124j280105
$$ -409956 269706 1486759 1521221 -139818 -1731360 -1598957 -580248 -634372 -1914477
36841a914477r13140K78790P77732O73658P06840N34769k67378p47069J0115J032264
$$ -1914477 -2827617 -2548827 -1771095 -1097437 -390597 144172 -123206 -870275 -860160 172104
36831A72104R35982L38415P29094J668270J414298k4724q69569o26772p63065
$$ 172104 1108086 1446501 2175595 3843865 5258163 5233439 4363870 3737098 2974033
36822B974033j854112k343804j131144M68847O30191m06106r18010r3659J161039
$$ 2974033 1119921 -1223883 -2355027 -1886180 -1255989 -1662095 -2580105 -2673764 -1512725
36813a512725J401809J06197j697297k193326p41120J140306J627915J042828
$$ -1512725 -110916 -4719 -1702016 -3895342 -4636462 -3496156 -1868241 -825413
36805h25413J082684J910153J888117M28048q96926p96570k1067K77520L19004
$$ -825413 257271 2167424 4055541 4483589 3586663 2790093 2769026 3046546 3365550
36796C365550P03969J052394Q21311L08475j95066j025819j924644j634108J4327
$$ 3365550 4069519 5121913 5943224 6251699 6056633 5030814 3106170 1472062 1486389
36787A486389J057608K2206j679302j731556j97001J121266J668124K262893K733587
$$ 1486389 2543997 2566203 886901 -844655 -1041656 79610 1747734 4010627 6744214
36778F744214J785098n92560k550888k701465j554840k93420N56780Q43593M03559
$$ 6744214 8529312 7936752 5385864 2684399 1129559 836139 1392919 2236512 2640071
36769B640071m73463r96367o90696K16862J200740J666219J071603l96815j568579
$$ 2640071 2166608 1170241 479545 696407 1897147 3563366 4634969 4238154 2669575
36760B669575j543794q47201m58626k39385N19708J493409J672839J018198L32716
$$ 2669575 1125781 278580 -180046 -419431 100277 1593686 3266525 4284723 4617439
36751D617439k54299j129205j716073r43082P04559J411791O90013M4704M07959
$$ 4617439 4363140 3233935 1517862 574780 1279339 2691130 3381143 3425847 3833806
36742C833806O82995j65526j113229n50384J168117J991079O88411j747089l119795
$$ 3833806 4516801 4351275 3238046 2687662 3855779 5846858 6535269 4788180 1668385
36733A668385k142786K39979J665588Q98864p48347j234317m16748L66559P16957
$$ 1668385 -474401 -234422 1431166 2330030 1581683 347366 -69382 297177 1014134
36724A014134J294698J764225R23272p75710j233088n7905M88336q03570j827049
$$ 1014134 2308832 4073057 4996329 4220619 2987531 2929626 3417962 2614392 787343
36715G87343n09464J660365J898060L56643o55944o51422j116641k033639j422672
$$ 787343 277879 1938244 3836304 4192947 3537003 2885581 1768940 -264699 -1687371
36706a687371R98158K487155J053738j453799j848111K8230J377654N01347j048409
$$ -1687371 -689213 1797942 2851680 1397881 -450230 -422000 955654 1457001 408592
36697D08592q63296J028006K345504J627421p7037r21688o43396k77703j71757
$$ 408592 -454704 573302 2918806 4546227 4469190 3547502 2904106 2626403 2454646
36688B454646K59737Q40468L18717j563184k951729j924657R92264L245783K865821
$$ 2454646 2714383 3554851 3873568 2310384 -641345 -2566002 -1573738 1672045 4537866
36679D537866K02026k463680k792696o21685J493652R82481j352176k158512j71012
$$ 4537866 4739892 2276212 -516484 -1138169 355483 1337964 -14212 -2172724 -2343736
36670b343736J972183J661750j8921m77621K72529K25166r24487j431547n39387
$$ -2343736 -371553 1290197 1271276 793655 1066184 1291350 366863 -1064684 -1604071
36661a604071O23013J225984J574507J571677N23803j092985j676083q79850j48161
$$ -1604071 -981058 244926 1819433 3391110 3914913 2821928 1145845 265995 117834
36652A17834l05493m35873J45133O23900L23511o5700M4169j3353o43660q00870
$$ 117834 -187659 -623532 -478399 145501 469012 403312 447481 434128 -209532 -1010402
36642a010402K20268J066186J68879j517482j555435M36745K119552J651652O3765
$$ -1010402 -790134 276052 444931 -1072551 -2627986 -2191241 -71689 1579963 1643728
36633A643728m34071M62103R78410j0109j301930j067711N37981J619310J197468
$$ 1643728 1209657 1671760 2650170 2640061 1338131 270420 808401 2427711 3625179
36624C625179K33441l15438q71351j717648j671238O9459J899647J670275j15645
$$ 3625179 3858620 3543182 2671831 954183 -717055 -647596 1252051 2922326 2806681
36615B806681j117512p22517m36254q42268p63456J61262O21516J38728P557P06419
$$ 2806681 1689169 966652 530398 -311870 -1075326 -914064 -292548 -153820 -146263 560156
36605E60156P38271o00225j563032p39729N70488O76136K79454P50994J307306
$$ 560156 1298427 698202 -864830 -1604559 -1034071 -357935 -78481 672513 1979819
36596A979819M75790q46285n49564J122508J813731O38118q96831j548442j613190
$$ 1979819 2455609 1609324 1059760 2182268 3995999 4634117 3737286 2188844 575654
36587E75654j293911k0257J919278K886762J923171N742j354553j660266j131389
$$ 575654 -718257 -738514 1180764 4067526 5990697 5996439 4641886 2981620 1850231
36578A850231r2850P13206K99436j247207k322985j457193R35949K936369L018890
$$ 1850231 1757381 2470587 2770023 1522816 -800169 -2257362 -1321413 1614956 4633846
36569D633846J313857p85154j977098j956733j071922L92716J921537K193219
$$ 4633846 5947703 5162549 3185451 1228718 156796 549512 2471049 4664268
36561D664268K68297k401298k874869n29609J733500J451604M2585K72900J772928
$$ 4664268 4932565 2531267 -343602 -873211 860289 2311893 2354478 2627378 4400306
36552D400306J814515j73027j832094j658002p73862m00749r4141N82783Q34734
$$ 4400306 6214821 6041794 4209700 2551698 1777836 1377087 1282946 1865729 2700463
36543B700463K23119l38835k70407l31519q83466q48435L13557J182004M60617
$$ 2700463 2923582 2584747 2314340 1982821 1099355 250920 564477 1746481 2207098
36534B207098q27235q82905J34362O20063Q0343n07775n51742n11897p11196p16388
$$ 2207098 1379863 496958 631320 1251383 1331726 823951 272209 -239688 -950884 -1667272
36524a667272j31676P77240J396947J248299K76405r25405j421828q71609R6061
$$ -1667272 -1798948 -1021708 375239 1623538 1899943 974538 -447290 -1318899 -1222838
36515a222838P03668P87150M83914j75954q78389q55962K00571J422455J569277
$$ -1222838 -519170 267980 751894 575940 -302449 -1158411 -957840 464615 2033892
36506B033892M23323r43737j185311L5462J500134J456329k34952j470115m91909
$$ 2033892 2457215 1513478 328167 363629 1863763 3320092 3085140 1615025 1123116
36497A123116J413684J512381k83050j174225J86522J631236J074803j64748K33181
$$ 1123116 2536800 4049181 3766131 2591906 2778428 4409664 5484467 5319719 5552900
36488E552900J637183J519211m91915k214085k240952j318807l90508N51134J302770
$$ 5552900 7190083 8709294 8217379 6003294 3762342 2443535 2053027 2604161 3906931
36479C906931J080073j6246o37927R692J094425J404820P52805k16448p54694
$$ 3906931 4987004 4970758 4332831 4342523 5436948 6841768 7594573 7378125 6623431
36470F623431l57031P14567J156723p2520k018400k467611p69972J233697J640965
$$ 6623431 6266400 6980967 8137690 8065170 6046770 3579159 2809187 4042884 5683849
36461E683849P55044J32215K31686R8564q71239j786461j231472Q59845K704179
$$ 5683849 6438893 6571108 6802794 6901358 6030119 4243658 3012186 3872031 6576210
36452F576210K470463N66212o34753J98487J500248R65918j151768k408055j628815
$$ 6576210 9046673 9612885 8978132 9176619 10676867 11642785 10491017 8082962 6454147
36443F454147l48947l88147j409282j708502n18165J300486K332114J790040N0330
$$ 6454147 6105200 5717053 4307771 2599269 2081104 3381590 5713704 7503744 7554074
36434G554074j562632j884272j076938l20768k37419k03423N18618J541425J705154
$$ 7554074 5991442 4107170 3030232 2709464 2472045 2268622 2787240 4328665 6033819
36425F033819M63453j331680k055669r39882P84007R09316j070711k934427k256179
$$ 6033819 6497272 5165592 3109923 2170041 2954048 3863364 2792653 -141774 -2397953
36416b397953N29231K695750K551292R42922m41609r02903o58988j90740o5224
$$ -2397953 -1868722 827028 3378320 4321242 3879633 2976730 2317742 2127002 2061778
36407B061778n01582r08352o98102m39722j003076j686682q31036J434789K805531
$$ 2061778 1560196 651844 -46258 -485980 -1489056 -3175738 -4006774 -2571985 233546
36398B33546J865741j5271p89690l62835p410k69012o78815q05924n30043K01734
$$ 233546 2099287 2084016 1294326 931491 924081 655069 -23746 -829670 -1359713 -1157979
36388a157979J070669J323101O31070m27670j068267r11780R4981J430904J786064
$$ -1157979 -87310 1235791 1866861 1439191 370924 -540856 -445875 985029 2771093
36379B771093M55576j118433r42741L92256M62316q22315p43554J471966K705203
$$ 2771093 3226669 2108236 1165495 1557751 2020067 1197752 454198 1926164 4631367
36370D631367Q44359j451597q70080J269504J491329o4803n21476L31375N4936
$$ 4631367 5475726 4024129 3154049 4423553 5914882 5850079 5328603 5659978 5714914
36361E714914j371554j172307R37059J580149o56687k469363r53213J867951K342064
$$ 5714914 4343360 3171053 4108112 5688261 5031574 2562211 1608998 3476949 5819013
36352E819013M58603j061455j105136p28559n45207k11640O6701k73495p86457
$$ 5819013 6277616 5216161 4111025 3382466 2837259 2625619 2692320 2418825 1632368
36343A632368o02427j232J73892K20485J058144K283096K342839O92736j459353
$$ 1632368 1029941 1028709 1202601 1423086 2481230 4764326 7107165 7799901 6340548
36334F340548k591928k109490l83174J403271J705884R9673j741783j639306M40007
$$ 6340548 3748620 1639130 1255956 2659227 4365111 4464784 2723001 1083695 1523702
36325A523702K288484K144932N68503o35310n60741K08041O71478M96289K6124
$$ 1523702 3812186 5957118 6525621 5890311 5329570 5537611 6209089 6705378 6731502
36316F731502l92982p01767p36397j31178R15966J324750M21816q51841j105024
$$ 6731502 6338520 5636753 4900356 4769178 5685144 7009894 7431710 6579869 5474845
36307E474845n40827m41102q05919l43080R55573J320336R5721r08054k19123
$$ 5474845 4934018 4492916 3686997 3343917 4299490 5619826 5715547 4807493 4588370
36298D588370R96272J023929L18796K57912O18593M07965L3371L81955O75170
$$ 4588370 5584642 6608571 6927367 7185279 7803872 8211837 8245208 8627163 9302333
36289I302333l42168j759238j606999k16999K01705p13185r55396K51737J099370
$$ 9302333 8960165 7200927 5593928 5376929 5578634 4865449 3910053 4161790 5261160
36280E261160L82754m38003K37859J571285J836346J068906N52277O76475P76140
$$ 5261160 5643914 5205911 5443770 7015055 8851401 9920307 10472584 11149059 11925199
36271A1925199M84327Q4706j35218j67247k57823q60618j988279k579419j547608
$$ 11925199 12409526 12494232 12359014 12191767 11933944 11073326 9085047 6505628 4958020
$$ [...]
##END NTUPLES=NMR SPECTRUM
##END=
