##TITLE=31Pdec_SR21_rm3
 CDCl3, 124 sc
 26.10.2020
##JCAMPDX= 6.0         $$ Bruker NMR JCAMP-DX V2.0
##DATA TYPE= NMR SPECTRUM
##DATA CLASS= NTUPLES
##ORIGIN= UXNMR, Bruker Analytische Messtechnik GmbH
##OWNER= root
$$ XWIN-NMR		Version 3.5
$$ Mon Oct 26 13:45:29 2020 Russian Standard Time (UT+4h)  she@DPX200
##.OBSERVE FREQUENCY= 81.013821
##.OBSERVE NUCLEUS= ^31P
##.ACQUISITION MODE= SIMULTANEOUS
##.ACQUISITION SCHEME= undefined
##.AVERAGES= 124
##.DIGITISER RES= 17
##SPECTROMETER/DATA SYSTEM= spect
##.PULSE SEQUENCE= zgpg30
##.SOLVENT NAME= D2O
##.SHIFT REFERENCE= (INTERNAL, D2O, 0, 182.463)
##AUDIT TRAIL= $$ (NUMBER, WHEN, WHO, WHERE, WHAT)
$$ ##TITLE= Audit trail, XWIN-NMR		Version 3.5
$$ ##JCAMPDX= 5.01
$$ ##ORIGIN= Bruker BioSpin GmbH
$$ ##OWNER= she
$$ F:/spectra/data/she/nmr/P31/1/pdata/1/auditp.txt
$$ ##AUDIT TRAIL=  $$ (NUMBER, WHEN, WHO, WHERE, WHAT)
(   1,<2020-10-26 13:44:48.37 +0400>,<she>,<DPX200>,
      <continue with go, POWCHK disabled, PULCHK disabled
       configuration hash MD5:
       00 E9 B6 7A A2 85 ED C7 34 08 36 98 17 FE 4E 26
       data hash MD5: 32K
       D3 6C 10 25 6C A7 2A 7E 72 B5 D0 49 BF EA C4 A6>)
(   2,<2020-10-26 13:44:50.43 +0400>,<she>,<DPX200>,
      <Start of raw data processing
       efp BC_mod = 2 LB = 1 FT_mod = 6 PKNL = 1 PHC0 = -2362.787 PHC1 = 28.80069 SI = 64K 
       data hash MD5: 64K
       59 6D F7 73 E1 8B 6D DC 7C E5 4B 88 C4 C1 9E 26>)
(   3,<2020-10-26 13:45:02.59 +0400>,<she>,<DPX200>,
      <pk PHC0 = 9.360005 PHC1 = 0 
       data hash MD5: 64K
       53 7A 75 1B 04 BE EB BA B8 B5 A7 88 79 8D 68 49>)
$$ ##END=
$$ 
$$ hash MD5
$$ 1E 8B BE 3F 36 D7 3C 43 6A 75 47 B9 D5 E1 7C 1D
##$RELAX= 
##$RELAX= 
##$RELAX= 
##$RELAX= 
##$RELAX= 
##$RELAX= 
##$RELAX= 
##$RELAX= 
$$ Bruker specific parameters
$$ --------------------------
##$DU= <F:/spectra>
##$EXPNO= 1
##$NAME= <P31>
##$PROCNO= 1
##$TYPE= <nmr>
##$USER= <she>
##$AMP= (0..31)
100 100 100 100 100 100 100 100 100 100 100 100 100 100 100 100 100 100 
100 100 100 100 100 100 100 100 100 100 100 100 100 100 
##$AQSEQ= 0
##$AQ_mod= 1
##$AUNM= <au_zg>
##$AUTOPOS= <>
##$BF1= 81.014009
##$BF2= 200.13
##$BF3= 200.13
##$BF4= 200.13
##$BF5= 200.13
##$BF6= 200.13
##$BF7= 200.13
##$BF8= 200.13
##$BYTORDA= 1
##$CFDGTYP= 0
##$CFRGTYP= 5
##$CHEMSTR= <none>
##$CNST= (0..31)
1 1 145 1 1 1 1 1 1 1 1 1 1 1 1 1 1 1 1 1 1 1 1 1 1 1 1 1 1 1 1 1 
##$CPDPRG= <waltz16>
##$CPDPRG1= <>
##$CPDPRG2= <waltz16>
##$CPDPRG3= <>
##$CPDPRG4= <mlev>
##$CPDPRG5= <mlev>
##$CPDPRG6= <mlev>
##$CPDPRG7= <mlev>
##$CPDPRG8= <mlev>
##$CPDPRGB= <>
##$CPDPRGT= <>
##$D= (0..31)
0 1 0 0 0 0 0 0 0 0 0 0.03 2e-05 3e-06 0 0 0 0 0 0 0 0 0 0 0 0 0 0 0 0 
0 0 
##$DATE= 1603705312
##$DBL= (0..7)
120 120 120 11 120 120 24 19 
##$DBP= (0..7)
150 150 150 150 150 150 150 150 
##$DBP07= 0
##$DBPNAM0= <>
##$DBPNAM1= <>
##$DBPNAM2= <>
##$DBPNAM3= <>
##$DBPNAM4= <>
##$DBPNAM5= <>
##$DBPNAM6= <>
##$DBPNAM7= <>
##$DBPOAL= (0..7)
0.5 0.5 0.5 0.5 0.5 0.5 0.5 0.5 
##$DBPOFFS= (0..7)
0 0 0 0 0 0 0 0 
$$ [...]
##$SUBNAM2= <"">
##$SUBNAM3= <"">
##$SUBNAM4= <"">
##$SUBNAM5= <"">
##$SUBNAM6= <"">
##$SUBNAM7= <"">
##$SUBNAM8= <"">
##$SUBNAM9= <"">
##$SW= 369.568048894756
##$SWIBOX= (0..15)
0 1 3 0 0 0 0 0 0 0 0 0 0 0 0 0 
##$SW_h= 29940.119760479
##$TD= 32768
##$TD0= 1
##$TE= 0
##$TE2= 300
##$TE3= 300
##$TEG= 300
##$TL= (0..7)
0 120 53 12 22 120 120 120 
##$TP= (0..7)
150 150 150 150 150 150 150 150 
##$TP07= 0
##$TPNAME0= <>
##$TPNAME1= <>
##$TPNAME2= <>
##$TPNAME3= <>
##$TPNAME4= <>
##$TPNAME5= <>
##$TPNAME6= <>
##$TPNAME7= <>
##$TPOAL= (0..7)
0.5 0.5 0.5 0.5 0.5 0.5 0.5 0.5 
##$TPOFFS= (0..7)
0 0 0 0 0 0 0 0 
##$TUNHIN= 0
##$TUNHOUT= 0
##$TUNXOUT= 0
##$USERA1= <user>
##$USERA2= <user>
##$USERA3= <user>
##$USERA4= <user>
##$USERA5= <user>
##$V9= 5
##$VALIST= <valist>
##$VCLIST= <CCCCCCCCCCCCCCC>
##$VD= 0
##$VDLIST= <DDDDDDDDDDDDDDD>
##$VPLIST= <PPPPPPPPPPPPPPP>
##$VTLIST= <TTTTTTTTTTTTTTT>
##$WBST= 1024
##$WBSW= 4
##$XGAIN= (0..3)
0 0 0 0 
##$XL= 0
##$YL= 0
##$YMAX_a= 43365
##$YMIN_a= -32543
##$ZGOPTNS= <>
##$ZL1= 120
##$ZL2= 120
##$ZL3= 120
##$ZL4= 120
##$ABSF1= 0
##$ABSF2= 0
##$ABSG= 0
##$ABSL= 0
##$ALPHA= 0
##$AQORDER= 0
##$ASSFAC= 0
##$ASSFACI= 0
##$ASSFACX= 0
##$ASSWID= 0
##$AUNMP= <proc_1d>
##$AZFE= 0.1
##$AZFW= 0.5
##$BCFW= 0
##$BC_mod= 2
##$BYTORDP= 0
##$COROFFS= 0
##$CY= -3
##$DATMOD= 1
##$DC= 0
##$DFILT= <>
##$DTYPP= 0
##$F1P= 0
##$F2P= 0
##$FCOR= 1
##$FTSIZE= 65536
##$FT_mod= 6
##$GAMMA= 0
##$GB= 0
##$INTBC= 1
##$INTSCL= 5.30512e-09
##$ISEN= 30
##$LB= 1
##$LEV0= 0
##$LPBIN= 0
##$MAXI= 10000
##$MC2= 0
##$MEAN= 0
##$ME_mod= 0
##$MI= 50
##$NCOEF= 0
##$NC_proc= -8
##$NLEV= 6
##$NOISF1= 182.463
##$NOISF2= 159.3651
##$NSP= 0
##$NTH_PI= 0
##$NZP= 0
##$OFFSET= 182.463
##$PC= 4
##$PHC0= -2353.427
##$PHC1= 28.80069
##$PH_mod= 1
##$PKNL= yes
##$PPARMOD= 0
##$PSCAL= 0
##$PSIGN= 0
##$REVERSE= no
##$SF= 81.014009
##$SI= 65536
##$SIGF1= 159.3651
##$SIGF2= -187.1042
##$SINO= 113.3802
##$SIOLD= 16384
##$SREGLST= <1H.CDCl3>
##$SSB= 0
##$STSI= 65536
##$STSR= 0
##$SW_p= 29940.119760479
##$SYMM= 0
##$S_DEV= 0
##$TDeff= 32768
##$TDoff= 0
##$TI= <>
##$TILT= no
##$TM1= 0
##$TM2= 0
##$TOPLEV= 0
##$USERP1= <user>
##$USERP2= <user>
##$USERP3= <user>
##$USERP4= <user>
##$USERP5= <user>
##$WDW= 1
##$XDIM= 65536
##$YMAX_p= 298680374
##$YMIN_p= -82151480
$$ End of Bruker specific parameters
$$ ---------------------------------
##NTUPLES= NMR SPECTRUM
##VAR_NAME=  FREQUENCY,     SPECTRUM/REAL,   SPECTRUM/IMAG
##SYMBOL=    X,             R,               I
##VAR_TYPE=  INDEPENDENT,   DEPENDENT,       DEPENDENT
##VAR_FORM=  AFFN,          ASDF,            ASDF
##VAR_DIM=   65536,         65536,           65536
##UNITS=     HZ,            ARBITRARY UNITS, ARBITRARY UNITS
##FACTOR=    0.456856943014862, 1,           1
##FIRST=     14782.0589164895, 0,            0
##LAST=      -15158.0608439895, 0,           0
##MIN=       -15158.0608439895, -82151480,   0
##MAX=       14782.0589164895, 298680374,    0
$$ Real data points
##PAGE= N=1
##DATA TABLE= (X++(R..R)), XYDATA
$$ [...]
46944 -15360738 -10792398 -12658815 -19501614 -25143339 -25066000 -17114348 -2398067 9049088
46936 9049088 1855202 -24780756 -47480065 -43855275 -23525583 -15647275 -25748846 -27971512
46928 -27971512 -7812529 11784485 4804498 -16588226 -19858012 -120627 16716978
46921 16716978 15373715 8408976 7942195 5464127 -8501264 -24006569 -26819552 -21759204
46913 -21759204 -24382606 -35234864 -37811597 -22489163 -1110114 6481628 -5081042
46906 -5081042 -21846649 -26574833 -16097416 -1020715 9152176 14646806 18292294 17997942
46898 17997942 12284128 6441891 4565270 879419 -10755363 -23324784 -25049065 -18329793
46890 -18329793 -16120258 -20090363 -18120729 -6214158 2835543 -1199850 -11758378 -18498068
46882 -18498068 -22434252 -28677992 -33861785 -31132447 -21487997 -12156893 -8870597 -14906560
46874 -14906560 -30579043 -48345641 -56513969 -53395322 -49069163 -47986134 -41390080 -24838016
46866 -24838016 -10505885 -10164701 -16799845 -17261877 -14099050 -18496903 -27790850 -27957442
46858 -27957442 -16692246 -7443179 -9264670 -16532808 -20518229 -18820703 -11368801 1010480
46850 1010480 11239299 10542971 2403308 1987624 16544161 34211276 37641286 23498615
46842 23498615 4727739 -2496767 7667836 25932147 35850850 30540043 20240876
46835 20240876 18152601 21710379 16451327 -2754182 -24326433 -35264189 -34916246 -30905272
46827 -30905272 -28828672 -29016547 -28087134 -22276321 -13483082 -9876862 -13931121 -14200911
46819 -14200911 -149914 18261024 21293211 9902817 7347937 24843841 43640288
46812 43640288 42092779 25257088 13425374 13189277 15954360 16593536 16326270 12035460
46804 12035460 -22674 -11602096 -9998997 937275 2633626 -12281858 -29764041
46797 -29764041 -34791249 -29410445 -24086458 -22488043 -23226308 -27517337 -35442863 -40964921
46789 -40964921 -40102073 -39456893 -47495426 -60858365 -68564203 -67347914 -63186898 -58926818
46781 -58926818 -51046578 -39710493 -31257127 -27215852 -20959313 -10685008 -5800753 -11904831
46773 -11904831 -17797850 -9160006 9513135 19105534 10309553 -8218744 -25506409 -38148311
46765 -38148311 -42086303 -30153822 -6689928 7609673 -2248531 -25762496 -40403911
46758 -40403911 -38907542 -31274520 -24701073 -16265462 -5216900 1523899 147700 -3634111
46750 -3634111 -3123996 1468676 6138101 7453183 2411877 -8982851 -19842960 -22391282
46742 -22391282 -18341180 -15173423 -12768469 -5241499 3111662 -1271803 -18671220 -29571769
46734 -29571769 -21186499 -7641283 -9872527 -25208237 -33236838 -25949856 -14567643 -8396820
46726 -8396820 -4671067 -1745562 -5595029 -16239441 -21132068 -11728711 2543577 6655993
46718 6655993 -382221 -8354755 -13528583 -21735288 -34054182 -40355816 -31552218 -11773814
46710 -11773814 6424024 14781654 12767995 2260916 -14151085 -29829258 -35952012
46703 -35952012 -30177122 -19900605 -13964344 -14039566 -16812855 -20621924 -25080100 -27192706
46695 -27192706 -24234045 -19316881 -17625924 -17256839 -10668542 3429251 16126568 18603651
46687 18603651 10959515 -897618 -10636456 -11181008 3199228 28313523 48321597 48934261
46679 48934261 30743385 6732387 -9790763 -12428202 -2854239 10124353 16648097
46672 16648097 15198071 12295028 10735400 5298544 -5600351 -12947925 -9921823 -4146228
46664 -4146228 -6936644 -15693614 -18011128 -9659640 2636604 13637470 23104928 28276783
46656 28276783 24967811 16870721 12701994 12845938 9469756 1212729 -3851983 -2890121
46648 -2890121 -4239835 -13220663 -21818101 -19242720 -5843233 8916256 16433306 13201677
46640 13201677 1878000 -8179418 -8287421 -1321862 2608586 3402164 12245692 30260673
46632 30260673 39147227 24398037 -1839191 -14535007 -6423502 8618677 18873962
46625 18873962 26484116 35268483 40594945 36636317 25128258 11853277 -66347 -9588050
46617 -9588050 -14728258 -13601190 -6559434 3760780 12824896 15745108 11726600 5783803
46609 5783803 2254530 -1618075 -10592172 -21606657 -25856368 -20770721 -12786282 -6579641
46601 -6579641 1046485 12620180 21830841 20371899 9816345 473880 -694880 3961717
46593 3961717 8532459 10002104 7523046 -130097 -12670535 -25772665 -33797652 -34635480
46585 -34635480 -29777040 -20971358 -10244111 -2497409 -3196464 -11684598 -20254106 -21592427
46577 -21592427 -14354881 -1589314 10400478 10890627 -7736614 -35609370 -48429077
46570 -48429077 -35140239 -14690351 -12380444 -26202176 -33248450 -25488252 -18391510 -22305327
46562 -22305327 -27179161 -23516396 -18383591 -18885450 -17961282 -11434729 -12436516 -30060483
46554 -30060483 -47162203 -41185838 -18081825 -3079045 -3702978 -5463136 -1571276 -1869937
46546 -1869937 -9273309 -10753409 481187 12899690 15733863 14571537 19234391 29330496
46538 29330496 39097376 43866558 36149320 10527899 -20233907 -30537583 -14200420
46531 -14200420 3772103 211353 -15759989 -20219655 -9344913 1423218 3815208
46524 3815208 2372882 -1951666 -14477585 -32466786 -43523284 -40748525 -28790666 -14955423
46516 -14955423 -4651376 -3905262 -14129833 -24695961 -23101685 -13386201 -12041086 -23486790
46508 -23486790 -32401734 -25638363 -10943809 -6118073 -16106836 -28446665 -29181864 -18470570
46500 -18470570 -9985235 -15334709 -29699197 -36813379 -29646032 -18771951 -15031685 -13497120
46492 -13497120 -5581491 1727219 -4483407 -18568391 -21348254 -10597128 -5970603 -17538277
46484 -17538277 -29538519 -26554288 -17463519 -16979078 -18020412 -3769661 20548433 31118953
46476 31118953 21125718 11966726 21769794 38683022 37291716 12696069 -14317514 -23577961
46468 -23577961 -16470128 -8757895 -10551809 -19346564 -29131980 -37721755 -42666377 -37724948
46460 -37724948 -21259013 -4392973 -918819 -9129663 -13988590 -9741767 -8740533 -20924074
46452 -20924074 -35334520 -33981143 -17843240 -5338531 -6540270 -12531525 -12927259 -11427424
46444 -11427424 -16558250 -25145703 -24796587 -10785455 7035535 15217459 10187128 -704755
46436 -704755 -8435206 -9972941 -7827380 -5148348 -3128787 -2162398 -3160093 -6928737 -13165181
46427 -13165181 -20259528 -25428705 -25721435 -20303561 -11330029 -1760657 5973825 8330304
46419 8330304 2230559 -7826566 -9549818 2540985 16142120 15042711 1741127 -6524205
46411 -6524205 -3942373 -1951483 -4799220 1544936 23830932 41415965 30422561 -1852979
46403 -1852979 -26264432 -29637253 -23269949 -17019549 -7297024 6613798 15657607 17940622
46395 17940622 24551001 38611937 44068247 27780533 1066645 -13966581 -11676981
46388 -11676981 -4708246 -4802468 -12837045 -23495653 -30045934 -27629715 -19281138 -14725132
46380 -14725132 -17352855 -19228824 -16256888 -19021606 -36705279 -57803074 -62048481 -47966589
46372 -47966589 -33157112 -28271342 -26627218 -21561801 -18006768 -20519274 -22955710 -18542723
46364 -18542723 -10727928 -6045603 -4192397 -2856040 -4687600 -10775330 -14147712 -10115968
46356 -10115968 -7717286 -18511285 -36099231 -40178493 -23522208 -3131046 1489436
46349 1489436 -8302462 -17435183 -20700362 -26347188 -36685704 -38879873 -23027697 -1050428
46341 -1050428 4612619 -10000299 -24311472 -20138640 -4936746 287327 -9967021 -20550962
46333 -20550962 -19319185 -14073911 -19396843 -33310287 -36606066 -16547764 14300030 27503563
46325 27503563 7763563 -29661517 -53623789 -49257318 -30972636 -20963312 -21477724
46318 -21477724 -17232721 -2056589 10270256 6357285 -6750937 -11650556 -4594127 1801147
46310 1801147 -1732673 -9613910 -12195902 -9245988 -6973749 -6803807 -3979484 3692722
46302 3692722 11309291 13036126 10132614 10093849 17738308 28958084 34777857 30954563
46294 30954563 21649932 13648333 9459182 7024085 3590554 -1725272 -6695738 -5882177
46286 -5882177 4264559 17470774 20081061 7146570 -8716741 -12971589 -9801333 -15064030
46278 -15064030 -29541064 -34916614 -21821227 -6014331 -4767575 -10339235 -4143954 11457390
46270 11457390 16670086 6571394 -3242452 -6436400 -17037655 -39868285 -52608969
46263 -52608969 -36774064 -10303501 -5408157 -23255155 -36268240 -31965146 -27015420
46256 -27015420 -33396444 -37103252 -23333305 -2158786 7931625 7533284 9108980 12271892
46248 12271892 5719564 -10558215 -23270137 -26238718 -27752937 -35273844 -45216420 -51123646
46240 -51123646 -51629648 -46825674 -35719962 -21204410 -10130449 -4793481 -516652 5446538
46232 5446538 8525218 3079908 -10863792 -28286526 -40963581 -38722563 -17489690 11583139
46224 11583139 29426185 29067985 20681780 13795590 5006836 -9959866 -22593465 -21766243
46216 -21766243 -11646831 -6774065 -11105600 -13768224 -6643958 4403991 9360620 6685840
46208 6685840 1245677 -4005305 -8427841 -9974612 -7454124 -4838628 -7372699 -13090429
46200 -13090429 -13436598 -4378872 7237269 11708199 7726807 1371481 -3482226 -7430529
46192 -7430529 -9441822 -7197517 -5529746 -14652902 -33944868 -46832861 -41529554 -28951471
46184 -28951471 -27030536 -33362345 -30603923 -17114850 -12072534 -25412461 -41691002 -43298938
46176 -43298938 -33299741 -23526019 -15657902 -9290728 -14398810 -35512581 -52945961 -42327766
46168 -42327766 -9164052 17224177 22695959 19459633 17495861 9427305 -7972429 -19576002
46160 -19576002 -13726455 -2174744 -2217760 -10194001 -8926788 5505044 19396668 19903861
46152 19903861 5654749 -17366817 -38678836 -45137765 -32396134 -14037844 -8579005
46145 -8579005 -17153174 -23584235 -16541515 -1554786 10308855 15727001 17465213 17379003
46137 17379003 15759883 12705118 6888960 -2963232 -13379282 -17437713 -13182243 -7121295
46129 -7121295 -7205708 -14705136 -23351102 -23670904 -9514455 14620301 33520252 34883159
46121 34883159 23396294 14720486 15304144 16720402 11759205 5413621 3888964 2426364
46113 2426364 -6349028 -18706504 -25589630 -28147800 -35337474 -46834031 -50832842 -41925616
46105 -41925616 -30158326 -26160971 -25746345 -17690129 -2001523 8456393 3745476 -12361185
46097 -12361185 -27846330 -33768628 -29222010 -19152777 -9441959 -2621002 2545982 7136344
46089 7136344 9448996 8103700 5565352 5126126 5866042 4897036 3543674 5496483 8255452
46080 8255452 3301072 -11550379 -25552920 -26340113 -14412014 -696516 7572253 11669382
46072 11669382 13344604 10312511 2255030 -5298068 -7593402 -7118531 -9064917 -13214360
46064 -13214360 -14967704 -12920095 -10875031 -12267816 -15938863 -18131225 -16789770 -13732911
46056 -13732911 -13603526 -19569323 -28785940 -34362985 -34135621 -34286621 -39769167 -44255493
46048 -44255493 -37293253 -20923455 -9483388 -9290793 -8232791 6232305 26081368 31746969
46040 31746969 19273868 4902513 478953 -2220043 -15229480 -33457060 -41780757
46033 -41780757 -37067528 -30056208 -26965555 -22392406 -12971320 -5897692 -7167759 -10390506
46025 -10390506 -6362409 1615419 1885750 -7840855 -16371823 -14468078 -6935718 -4857942
46017 -4857942 -10148071 -13795558 -9425176 -3559306 -8154064 -23844746 -36307064 -33459586
46009 -33459586 -22616588 -22863592 -39981144 -57326070 -56034707 -37477413 -18692037
46002 -18692037 -10036048 -6054724 2479823 15792602 26888372 31073366 30400644 29858465
45994 29858465 30139287 24849312 7773715 -16369076 -33708138 -37073303 -34162893 -34447890
45986 -34447890 -34615489 -26179042 -12628659 -7214384 -15033469 -28388892 -39481219 -46398023
45978 -46398023 -46559461 -37209222 -24616390 -19770206 -21574018 -17927069 -7633382 -4888182
45970 -4888182 -13796616 -15830299 3037668 26959077 30091964 12144647 -5173697 -10609639
45962 -10609639 -11449850 -11787241 -4745964 9794625 18323555 11822148 -2609561 -14079455
45954 -14079455 -19892711 -20540535 -15472933 -9734464 -12420505 -21764815 -23869498 -13772347
45946 -13772347 -5134354 -9464892 -18358779 -18847683 -15069139 -19094939 -28621817 -31464572
45938 -31464572 -27625298 -28482709 -34861112 -34065459 -21445666 -7932339 -946092 5589328
45930 5589328 13929594 11988527 -5397147 -17528632 -296384 36721320 55826326
45923 55826326 37062342 1565863 -18351643 -17689730 -14488021 -17326268 -15362587 -423188
45915 -423188 17507039 23870151 17764808 7738641 -2778477 -14436090 -20237620 -8474202
45907 -8474202 19363868 43670081 46324561 29955952 11995167 3670759 1398324 -3177458
45899 -3177458 -12013982 -21189330 -27590828 -31615368 -34642387 -36269082 -34662950 -29241042
45891 -29241042 -22140444 -15928466 -10223708 -2695798 6070254 11359802 9838012 4376550
45883 4376550 1257120 3844417 10535521 16832599 17248743 7937119 -8479101 -22171967
45875 -22171967 -24796871 -18572923 -12374718 -9489942 -5537362 420856 820723 -8869792
45867 -8869792 -19834113 -19634033 -9325287 -1499875 -1711681 -2308430 2362474 5468164
45859 5468164 -283907 -9008184 -10709592 -8203208 -12212763 -22107310 -25732336 -19532467
45851 -19532467 -13899618 -13436375 -6988210 12527273 31172598 31239778 17012801 7475748
45843 7475748 8445394 9153325 4907142 4436084 10892742 13071978 4533675 -2093527 8247935
45834 8247935 30528812 45394791 43184544 32735326 28271103 34418868 43226504 42492199
45826 42492199 29458589 17040762 19809093 32415689 33166239 14735296 -2027418
45819 -2027418 2969227 17916182 14997559 -8656387 -27145713 -23886355 -12412782 -11276032
45811 -11276032 -16501965 -13277377 -2881824 -401568 -9953836 -18610144 -16514940 -9639013
45803 -9639013 -7332740 -7738097 -4109864 1019731 -899422 -8272354 -7852218 6118202
45795 6118202 20224899 18063256 3067171 -5780687 -97477 8085711 6314638 122244
45787 122244 3057386 16268115 28655663 33188860 32152036 27465654 16672642 787036
45779 787036 -12479828 -17578151 -18141730 -21823848 -31369550 -42784282 -49684747 -48353096
45771 -48353096 -40658276 -32161464 -25776546 -19013408 -9683595 -892820 3614421 5069118
45763 5069118 5136432 469835 -10110945 -17182596 -10498338 4387017 11413468 6642244
45755 6642244 2725073 7522378 11598947 4025666 -10997502 -22892126 -30669016 -38326997
45747 -38326997 -40455165 -26221709 2235326 26322207 29869426 16124058 2629921
45740 2629921 1616566 8238307 9022456 494022 -5747548 -353438 7629524 2540525
45732 2540525 -12611627 -17547236 -4546598 9050653 7019514 -1986755 -1295099 4733027
45724 4733027 -1927329 -21030082 -30018281 -15266962 8791521 18797386 9614152 -5083772
45716 -5083772 -11601321 -7819315 228665 6899013 11505557 15842045 18238580 13978529
45708 13978529 4314953 -639728 4963171 11089850 2858789 -18951934 -38676072 -46273228
45700 -46273228 -45957158 -43463603 -37041298 -25733279 -16103928 -13721536 -14788064 -12189537
45692 -12189537 -4743096 3804268 9791983 10208808 3621666 -6360307 -13395005 -15430328
45684 -15430328 -13667719 -5945834 8429636 17704279 6814353 -17972834 -30127426
45677 -30127426 -17966469 -2763020 -8264718 -26945449 -34778160 -27551574 -20023425 -16556175
45669 -16556175 -8459727 712526 -5743521 -27174310 -38527460 -25212788 -4634911
45662 -4634911 1204866 -3196580 -765693 7351199 6381084 -4217048 -9290788 -3401642
45654 -3401642 1246175 -4655927 -14285598 -16917772 -11663020 -4146271 744485 -1615805
45646 -1615805 -14050049 -30620669 -39545410 -38016260 -35750078 -38314026 -36592576 -21959398
45638 -21959398 -3873156 280387 -10664956 -20701465 -19859971 -15383664 -15717946 -15504764
45630 -15504764 -5808376 8429299 13269150 6328178 928782 6738882 15731600 14273231
45622 14273231 3169950 -3727415 406527 6348046 3303007 -5126873 -6588161 1671710
45614 1671710 8121910 1847248 -13730936 -25268665 -24088990 -12548163 2118798 15211017
45606 15211017 24395845 26115818 17207016 1113649 -11260921 -10835309 88653 10685786
45598 10685786 13587454 10111034 3869901 -4414387 -13040669 -17063344 -15768704 -17046858
45590 -17046858 -26510262 -36222835 -33929269 -21617403 -13936532 -17449023 -22799320 -20773537
45582 -20773537 -15136711 -13844876 -17293307 -22422026 -29800446 -38449900 -41361964 -35086575
45574 -35086575 -26774751 -22624839 -17341663 -6384069 -194485 -10480111 -27808965 -31360428
45566 -31360428 -19695409 -12523507 -19466999 -27035743 -23797310 -19487909 -26783510 -39203256
45558 -39203256 -42258513 -35989987 -30906204 -28753877 -22720076 -12568888 -5295635 -2903100
45550 -2903100 -2360719 -6052845 -19238974 -36958595 -45762667 -40407833 -28542853 -17389195
45542 -17389195 -6402607 4416503 9842044 8149134 6284373 10898556 19671506 24860225
45534 24860225 20417532 4670975 -16607478 -28785771 -20324023 -153523 7522568
45527 7522568 -7323407 -25982560 -24900339 -5324146 12659754 18574081 18566486 16653517
45519 16653517 6958104 -10329760 -20756379 -14397751 -2999109 -4978860 -18043808
45512 -18043808 -21370288 -6178686 9794873 5667368 -14507622 -27843187 -22224036
45505 -22224036 -8153990 -1184100 -3687967 -7727631 -6222542 5425038 30703007 64728866
45497 64728866 89437233 87321416 61277954 32456063 16173308 7550611 -5147827
45490 -5147827 -20165282 -23242989 -7443780 14932339 23462345 10681175 -10750301
45483 -10750301 -22378252 -18934538 -10223439 -6006335 -5396351 -3424553 -1230886 -3187925
45475 -3187925 -7941081 -10223653 -10181013 -13207875 -20253465 -25290571 -23683050 -17067861
45467 -17067861 -8771444 -399719 5423949 4819970 -2386376 -11706836 -19002971 -22136752
45459 -22136752 -18400519 -7067153 5420621 10682252 9720447 10475842 13200732 9407829
45451 9407829 -1307835 -6260459 1106117 8969204 4870072 -4195743 -2672368 9648391
45443 9648391 19169578 19647189 16565538 12084431 1850313 -10772156 -12638643 354320
45435 354320 14074739 13795125 2421794 -6888907 -9267862 -10235071 -13495262 -15534388
45427 -15534388 -11331799 941416 20007437 40472023 52314668 47695727 30132618
45420 30132618 12664794 4819375 4611491 5282902 5624495 8519624 11421930 6288032
45412 6288032 -7586682 -17243609 -10488903 5772979 11181223 -2296475 -19530227 -22648480
45404 -22648480 -14199509 -10638138 -17360486 -21931368 -13138509 3229462 12545884 9288830
45396 9288830 1063232 -2953626 -2546501 -4403807 -11782509 -19145698 -19151499 -13202265 -9727221
45387 -9727221 -10997660 -8869748 1555096 11305050 9416584 348740 -2034999 4226857
45379 4226857 7212781 1924501 -1073071 6070256 14364608 12384901 5124563 5304524
45371 5304524 11332748 8667846 -6943546 -21252075 -21133012 -12156975 -9276809 -16207136
45363 -16207136 -22225871 -17415091 -4110435 7705808 11750841 9916161 7641384 7290291
45355 7290291 6424759 1962526 -4871985 -9046269 -7717983 -4278210 -4471271 -8970953
45347 -8970953 -12349655 -10157697 -4453213 -331008 731025 443483 -2441865 -12874482
45339 -12874482 -31708919 -50215167 -56127457 -45288791 -25744066 -10287300 -5496791
45332 -5496791 -7372021 -6981712 -629246 5914182 4286553 -6274626 -17997235 -23526800
45324 -23526800 -22852481 -21062928 -22521747 -28100020 -34957578 -38163671 -35686046 -31838549
45316 -31838549 -31275078 -29761132 -18242581 1492202 13466043 5779086 -13803876 -27104251
45308 -27104251 -25443991 -13689283 207618 10572465 11881246 1311802 -15331329
45301 -15331329 -26364802 -23947950 -8718323 11641156 24497573 19216969 -302932
45294 -302932 -15484106 -14577358 -8703541 -14883591 -28529466 -28855398 -10566930 7208135
45286 7208135 7419183 -4935832 -15574094 -19712874 -19315177 -12950313 669552 15344625
45278 15344625 22233754 18468699 6786685 -7796665 -18042633 -19013188 -15967991 -19033641
45270 -19033641 -26598524 -24648694 -7371074 13704097 27882497 39322298 52910413
45263 52910413 59371984 48806084 29346555 16785046 12594635 7900706 3362996 7329351
45255 7329351 16494042 16426042 3405071 -9628060 -12625513 -10580472 -11260887 -12510043
45247 -12510043 -8458028 -170733 6154362 6506442 971695 -6793752 -9760096 -2352787
45239 -2352787 12872786 27577779 36868989 41264507 40702860 34080004 25028350 20125900
45231 20125900 19510213 16397127 7766717 -1779112 -9120304 -17742153 -29612659 -38706323
45223 -38706323 -38364093 -30936540 -24722179 -23543593 -23770033 -20909580 -15821373 -13273719
45215 -13273719 -15001956 -15937477 -10207174 -831269 1884822 -5345766 -11891273 -6617631
45207 -6617631 6265689 12408938 5714430 -6251642 -13609646 -13252000 -7508403 -1094360
45199 -1094360 978327 -1366887 -1684621 3174067 5172786 -4497826 -20615790 -30025579
45191 -30025579 -29783414 -27090383 -23285481 -13038138 -517693 247384 -13146660 -24355829
45183 -24355829 -20927238 -11696558 -11965313 -21562626 -28251292 -25279816 -15189493 -1927465
45175 -1927465 10960710 18032429 16127057 8427892 -786933 -10949290 -19981973 -20908370
45167 -20908370 -10687714 3208354 12176454 16655263 19196958 14036852 -5189543 -30548122
45159 -30548122 -44255354 -38521111 -22142659 -6890446 3730075 9868807 8148045
45152 8148045 -4369747 -22143242 -33066478 -30074499 -18854984 -11810849 -14401295 -20191251
45144 -20191251 -20806442 -16831772 -14620251 -15787409 -16365433 -14387983 -11155242 -6469404
45136 -6469404 -562098 714581 -7976592 -21095920 -28533630 -31080461 -36413488 -40217435
45128 -40217435 -29000295 -5790746 6551116 -2215217 -11645701 860364 28054997
45121 28054997 45465488 43925449 32040921 16405447 -941029 -11961662 -10042486
45114 -10042486 -5573879 -15489293 -37510047 -51570011 -47406872 -34998310 -26555015 -23652123
45106 -23652123 -24327501 -27682417 -27527387 -15382810 4837315 16634233 10735422 -3961483
45098 -3961483 -12742002 -9815760 1103665 11306820 10297790 -5349362 -23781734 -27985243
45090 -27985243 -16228457 -3157827 405967 -2249440 -5353964 -10354176 -19639292 -30482538
45082 -30482538 -39101863 -42535911 -35666962 -16946845 2507905 8373976 2723250 -433908
45074 -433908 -285904 -10675993 -30877789 -36932796 -15884677 9846525 11096851 -7926830
45066 -7926830 -18629485 -9093689 5110095 8547366 3855269 -1302095 -8519179 -21853245
45058 -21853245 -36442246 -42178155 -35806507 -25362793 -23010904 -33267138 -47572613
45051 -47572613 -52966319 -46972364 -39050971 -35734792 -32242198 -23863944 -17166718 -20670308
45043 -20670308 -29918536 -32223264 -23727579 -12200225 -4039373 2135486 7934409 9165107
45035 9165107 564211 -17254522 -37254871 -50751178 -53730609 -50377987 -48402916 -49337865
45027 -49337865 -47083201 -38213540 -28672189 -26194348 -30274953 -33635386 -29821724 -16817165
45019 -16817165 735606 9567741 -3315817 -32693828 -53523312 -46365192 -19412727
45012 -19412727 2939606 7695298 31439 -11323669 -22388304 -29425594 -28661705 -22393074
45004 -22393074 -16887616 -13353776 -8237149 -2048318 121500 -2660212 -5057636 -2807977
44996 -2807977 3403643 10703912 15141405 11857751 418721 -11889376 -18224788 -21029581
44988 -21029581 -26368059 -33238228 -36099924 -33899050 -28131338 -16927572 -1186473 9096788
44980 9096788 7522117 5143636 15739975 30662732 27493453 4266786 -15429175 -16410312
44972 -16410312 -10839427 -14392429 -22543453 -24107127 -22919902 -29272831 -39600158 -41005709
44964 -41005709 -30623299 -17261763 -8362154 -6708592 -14664849 -29378008 -38307164 -32606102
44956 -32606102 -22306099 -25360349 -42700085 -56632129 -54501162 -42087691 -31181235
44949 -31181235 -24426382 -16935182 -5845089 5538625 9319836 -721271 -18831934
44942 -18831934 -26067888 -9434955 18156732 29241797 16129564 1258277 6515497
44935 6515497 24402130 31435828 21415676 9695142 7341095 7946612 3863880 503787
44927 503787 4891489 10441007 5977861 -5187526 -8779399 -1495140 3714730 -2568618
44919 -2568618 -13117289 -16910347 -14767624 -13544234 -13356624 -11490926 -12706589 -23086701
44911 -23086701 -37151098 -43844042 -43366056 -44756584 -47878504 -43334349 -31904070 -26893460
44903 -26893460 -31514929 -31221543 -18209457 -7015081 -11877072 -23333454 -25490500 -24865555
44895 -24865555 -39357132 -64246436 -73734227 -57506014 -33038777 -16383198 -2791611
44888 -2791611 13529578 21136522 9703043 -7714677 -10315306 288184 4477024 -4304140
44880 -4304140 -11621335 -6502262 3247288 5900434 2359319 -473059 -2968149 -9721304
44872 -9721304 -18952932 -23936268 -22459788 -18203484 -14594247 -12652518 -12889391 -14251509
44864 -14251509 -13090800 -7813199 -1946600 2458252 10577609 26060028 39190389 34509630
44856 34509630 11796937 -10212984 -14759936 -3691299 10433670 19800051 22836602
44849 22836602 18910331 10727739 6606210 11093639 16887414 14552856 6618037 2660908
44841 2660908 3639421 2190839 -2807213 -4024132 537071 2805394 -2778602 -11261885
44833 -11261885 -15329885 -13079723 -5026225 6912799 14039691 6010668 -12228380 -20000505
44825 -20000505 -7021235 9688328 7324945 -10921508 -19547515 -3696421 24572498
44818 24572498 43415128 43535288 31606605 20883030 21027612 29468953 30652772 11554366
44810 11554366 -19754255 -39407511 -35486990 -22077529 -19657666 -29581100 -37689874 -37763215
44802 -37763215 -37818361 -42082401 -40333339 -23821823 -3458625 282607 -15897555 -33236852
44794 -33236852 -35753422 -29534875 -30245628 -39333559 -42961240 -31333804 -9192179 12408277
44786 12408277 26349429 31343130 31314874 33230825 38479373 37576749 22422127 2380476
44778 2380476 -4183651 4467885 10323280 2178879 -9787818 -13699701 -14760592 -21506466
44770 -21506466 -26085043 -15328816 5597919 17589048 12758138 658296 -8813011
44763 -8813011 -15019083 -19820280 -23940068 -29959310 -37307675 -35446019 -15348797 11966154
44755 11966154 22564177 8283814 -14011026 -25055159 -23055356 -17267633 -14039225
44748 -14039225 -14934658 -18322686 -17371861 -6286867 6825576 4852491 -14017285 -28866765
44740 -28866765 -22459220 -4495696 3585949 -1105695 -2404762 8484050 20556429 19300889
44732 19300889 5102975 -9289683 -14316923 -12586151 -13756148 -21860985 -28575994 -22180193
44724 -22180193 -4258696 7776015 -377568 -21737119 -34750204 -27424218 -9611694
44717 -9611694 -320975 -6661765 -18005414 -19904913 -10676456 -1255237 862592 1978874
44709 1978874 12060891 28149147 35536065 25778658 7147790 -4825614 -3133834 5290597
44701 5290597 6732499 -5894658 -23335640 -26684692 -9174646 12985882 19619357 11624788
44693 11624788 5390653 6229936 3692592 -6381913 -13568341 -12210792 -11856625 -19335642
44685 -19335642 -25933361 -23798247 -21098696 -27047837 -33581031 -27533066 -12540388 -3469610
44677 -3469610 -5536977 -13372636 -24370154 -37404635 -43455112 -34298695 -18277194 -11848029
44669 -11848029 -16679463 -19778490 -14886371 -7965125 -1526420 9671569 24254560 30899781
44661 30899781 24480201 13254926 5844832 2517363 2221862 5165692 4447788 -10557353
44653 -10557353 -35514992 -48787448 -36792517 -11482272 6153518 10536257 10210179
44646 10210179 11003950 11910623 12567405 14067830 14248341 10086740 3834983 1472827 6043675
44637 6043675 14934616 20832781 14611573 -6420875 -31038873 -42589886 -38450974 -32772286
44629 -32772286 -35993633 -42171113 -43328318 -44602676 -53426078 -62602828 -58592358 -41866006
44621 -41866006 -25010894 -13426867 -2271087 8282011 10190191 3007398 -1873925
44614 -1873925 1413762 3347889 -5222016 -16582738 -15568143 -445295 15053048 18516385
44606 18516385 10209079 -997435 -6226721 -1776461 7638679 10388670 -865541 -17824947
44598 -17824947 -22678554 -8782454 10426262 17759731 12092765 4749684 419968 -7053032
44590 -7053032 -18735721 -22462073 -8534480 13529690 23887981 15716108 1059196
44583 1059196 -6181881 -4776141 -1771623 -732969 1077527 6837409 14792467 18313538
44575 18313538 11674929 -2500849 -13475882 -13653073 -7545662 -4544510 -4923609 -386879
44567 -386879 11618463 22256087 22412778 13150473 2516751 -2710842 -186086 7640999
44559 7640999 14568374 16961044 18826737 23958235 25020126 12270903 -5984254 -7219407
44551 -7219407 14046633 33690245 28611689 7650528 -3450731 1170589 4124877 -6131498
44543 -6131498 -22093800 -33898516 -41289044 -44262273 -37623006 -22848829 -13055147 -16972773
44535 -16972773 -27218832 -33143210 -36687790 -45276836 -55901001 -58482687 -51817388 -44160127
44527 -44160127 -38493787 -29138121 -15621105 -8437827 -13991154 -22280177 -19676278 -9548529
44519 -9548529 -8198966 -19734753 -27459591 -16973731 1837677 7339501 -3993746 -13928432
44511 -13928432 -9720191 -1426726 -5052105 -18698195 -26355290 -20471531 -9635072 -4460152
44503 -4460152 -5307956 -6312510 -4879895 -3587379 -6046302 -13350939 -22706608 -28163650
44495 -28163650 -24009707 -8886338 12174539 28441272 28356211 9479466 -15230081 -27419106
44487 -27419106 -22959937 -15432099 -16008607 -18004503 -9513958 5627086 11503155 2314088
44479 2314088 -10605501 -14480394 -8400709 -53123 2489395 -4867868 -17882517 -23715203
44471 -23715203 -13578365 4403501 14346535 13855384 13916300 17048354 11512780 -6686700
44463 -6686700 -21636403 -18492369 -4761935 2134622 -843999 -4491310 -6130961 -9943360
44455 -9943360 -12531250 -5496357 7299736 11576278 5115708 2416867 9796946 11045466
44447 11045466 -9043440 -36896003 -42557240 -17685172 13809738 25954598 18764135
44440 18764135 8965251 2893657 -8407522 -29275653 -47709464 -49019417 -33763435
44433 -33763435 -15459933 -4884697 -3371576 -8147929 -15424876 -18536180 -12071382 -628027
44425 -628027 3805239 -3264946 -13070174 -16608992 -16409970 -19427565 -24724025 -26265085
44417 -26265085 -23121422 -17516550 -6069548 15703462 40129515 50085009 38853932
44410 38853932 18680089 5241497 1465777 1642221 2976271 4705282 2068861 -8255146
44402 -8255146 -19367663 -21106624 -15253510 -13504329 -18902750 -20265703 -9897384 3271281
44394 3271281 6514381 1704555 399586 5180918 7850958 5057352 3297955 5765777
44386 5765777 5453384 -3095491 -14149761 -19697540 -20745429 -22317126 -23501540 -21212504
44378 -21212504 -19215741 -23818652 -32910712 -38165340 -36855524 -33437791 -30813496 -28219897
44370 -28219897 -26112165 -23860911 -14254382 8065726 32211243 38140782 22001788 2135065
44362 2135065 -6039324 -8983727 -20094869 -36650705 -44181984 -37723513 -26427788 -19711781
44354 -19711781 -19049777 -21727722 -23652054 -20086314 -12274662 -11257344 -25211802 -44164811
44346 -44164811 -48669619 -35133397 -21066049 -20949096 -27673525 -25481993 -12989680 -3056948
44338 -3056948 -3847040 -10760996 -17320361 -24278007 -33642508 -40324214 -36561134 -22692614
44330 -22692614 -7997148 -1040692 -3629547 -13654715 -27197187 -35798237 -29468541 -8926062
44322 -8926062 10334629 14010199 5406094 -2527762 -7445110 -17528554 -32392662 -39343411
44314 -39343411 -32853575 -23262792 -18533533 -11258759 4886427 18269244 14584561 865033
44306 865033 -3289780 5166326 9897609 1759579 -8330058 -7208983 3353421 13174432
44298 13174432 17213194 17080962 16746490 20501582 27971957 29409878 15407352 -6129327
44290 -6129327 -13735650 1683407 24684415 35082136 30135397 19960723 11245620 5782073
44282 5782073 6728825 13719474 16782670 7847463 -4471767 -4459279 7061873 12507963
44274 12507963 4201172 -2052307 11344530 37458175 51686050 41805288 20072723
44267 20072723 4116457 -3808090 -12083083 -21653722 -23735967 -14743124 -2470761 6584459
44259 6584459 16282008 29507302 36276261 25876499 7399296 3476176 21015005 40778653
44251 40778653 41709348 25263345 8396453 1384121 1911207 4636382 6012302 2844807
44243 2844807 -4085252 -6372890 2838947 16090238 17138430 1697824 -14881937 -14912400
44235 -14912400 1687722 19326853 25348545 21433455 17059537 16842125 17563715 15507649
44227 15507649 11763603 8593380 4627631 -2111896 -8732073 -10328644 -7594730 -6059163
44219 -6059163 -7688849 -9176818 -9144083 -10085060 -11433776 -8737577 -3571862 -5833774 -19236587
44210 -19236587 -31443884 -28167446 -13593082 -6888601 -18317386 -36783525 -43102492
44203 -43102492 -30309659 -8619500 6411101 8617549 5287215 7306505 16378311 24630206
44195 24630206 25938997 21625546 13455539 -928922 -19904041 -31985074 -26816701 -9228760
44187 -9228760 5096425 6264355 -3336837 -15902719 -24103906 -22529575 -11725941 -496226
44179 -496226 2891396 1236006 3289766 9357771 10535993 2763444 -7144225 -11910945
44171 -11910945 -12559799 -13192908 -13346704 -10075807 -3754426 1809260 2646346 -3634701 -16215017
44162 -16215017 -29380357 -35336967 -30964791 -20940957 -13893052 -15855073 -25377720 -33235128
44154 -33235128 -29857316 -15958564 -2707523 1550680 85328 -626016 -1492687 -5910374
44146 -5910374 -10649578 -11584498 -13774937 -24340897 -38520194 -45433704 -45781595 -49799424
44138 -49799424 -57700582 -57421663 -44570862 -29369617 -18443889 -4443073 18166900
44131 18166900 39962910 49196969 47324623 42108204 34458453 22701307 12134134 8798930
44123 8798930 8623443 2970397 -8179364 -16540802 -15780001 -5546148 9627789 19637458
44115 19637458 14272460 -2367929 -9604730 7637259 38751656 58646546 54973190
44108 54973190 35692584 14528058 -492881 -6741439 -5889472 -3660987 -4427942 -7126585
44100 -7126585 -10138177 -14948227 -20066654 -19158014 -12543325 -11511722 -21214746 -28756354
44092 -28756354 -21204738 -6361047 283496 1071859 9007302 20347670 17216076 -2137211
44084 -2137211 -17820423 -16885826 -7052427 2898001 14881683 25538709 20427194 -2323436
44076 -2323436 -21129169 -19905179 -12394984 -19320637 -34016464 -32481695 -11093169 7227612
44068 7227612 4077932 -14740838 -32341753 -38666125 -31906848 -14892346 3835716 13304704
44060 13304704 9873628 -205713 -9588843 -16541812 -21823495 -24151231 -21870259 -17181520
44052 -17181520 -16421596 -24356997 -36287828 -38436773 -22870503 -1548016 4171258 -9616904
44044 -9616904 -24515930 -26911674 -25863330 -33496185 -41890670 -37004083 -25443339 -25173143
44036 -25173143 -33430792 -27892062 -2976501 17463706 12691233 -8007895 -22636904
44029 -22636904 -25751268 -26452944 -28136407 -25821641 -18707014 -12715878 -12569291 -19378113
44021 -19378113 -32040410 -43720243 -43074379 -28188244 -13323631 -11233352 -14784531 -9521435
44013 -9521435 132757 -5313469 -29148902 -48435881 -42795755 -20047339 -3092186 -800462
44005 -800462 -3732256 -3277290 -2163518 -5578722 -11754552 -15389807 -15581635 -16575859 -21808727
43996 -21808727 -28914902 -31358784 -26050033 -18506846 -16774779 -19522831 -15689762 328234
43988 328234 18299358 23278408 13967078 2741979 -1000511 575428 1868030 1469753
43980 1469753 -1374581 -9522963 -21161452 -26299311 -17531539 -1453082 7382569 2690889
43972 2690889 -8894063 -18272204 -22914250 -24834163 -24867388 -21640216 -14238258 -4640521
43964 -4640521 2218676 2305281 -2483265 -5960036 -6110585 -7375150 -11072508 -9974768 335060
43955 335060 10583302 9055158 -3133 -2393065 3077171 3414544 -4694609 -7833709
43947 -7833709 -161905 3381058 -8316996 -20750199 -15787025 -3734681 -9629058 -32654354
43939 -32654354 -45135608 -34286709 -19884212 -21254104 -28740809 -23001433 -6113242
43932 -6113242 4529355 2935638 -2442739 -5981231 -8592226 -7871035 -317411 8049871
43924 8049871 7892759 2673947 3542671 7485883 -2416412 -29641975 -53058285 -52687421
43916 -52687421 -34290510 -17306189 -8904456 -3572290 -648317 -5559831 -15322232 -18445959
43908 -18445959 -12201492 -7434238 -11517303 -17223969 -14918862 -6875781 -1449261 328169
43900 328169 3290500 7599581 9158983 8726577 11429313 16991431 19045286 16067141
43892 16067141 14960944 19876311 24180486 19226251 6799331 -3264845 -5970766 -6363147
43884 -6363147 -11918128 -23291650 -33421771 -34832466 -28231461 -23011744 -25940556 -30132520
43876 -30132520 -22104522 -1952174 12265345 7013845 -7589194 -11606424 -2867699 2912719
43868 2912719 -1825865 -5889120 945892 11497698 12893096 4233546 -7247975 -19258422
43860 -19258422 -32090730 -38848784 -30991285 -12510920 2138603 4711828 -813386 -8529916
43852 -8529916 -17432929 -26570084 -32046186 -31610481 -25933985 -14698050 1003104 12467073
43844 12467073 10354820 471685 547120 15034983 24856674 12433989 -12558950 -25639886
43836 -25639886 -19630404 -9429909 -6959911 -7309924 -2838574 3283977 5046589 4614553
43828 4614553 6040115 4716990 -6675881 -24168438 -33329271 -25030389 -4933492 13708647
43820 13708647 22540343 21932510 15647791 5497851 -6979588 -14998243 -8265171 14481363
43812 14481363 37381297 40235954 21016938 -1661693 -10966163 -8444046 -4162750 -595725
43804 -595725 4426868 6912909 1709451 -5783408 -6216428 -3070791 -9051986 -24830497
43796 -24830497 -35607311 -32766439 -25321720 -23481604 -23906233 -20606573 -18953583 -26429674
43788 -26429674 -37358865 -39992678 -34183749 -29959351 -31828790 -36063551 -40850570 -46890859
43780 -46890859 -48878964 -38715716 -18681792 -1313622 5125969 2251619 -6505587 -18340014
43772 -18340014 -25403446 -19946969 -8080464 -5600450 -15686114 -23487665 -18575093 -9214519
43764 -9214519 -5939577 -4507168 2488216 8271369 1577870 -13088956 -20293969 -15207739
43756 -15207739 -6112612 2162546 12462838 22853631 24692959 16703783 8695255 6502653
43748 6502653 3979100 -4062836 -10491585 -5692217 7217393 15413783 12274476 3718319
43740 3718319 -1016442 -216738 104784 -5248939 -14393228 -22170036 -28499229 -37668309
43732 -37668309 -47905334 -49026944 -36478264 -21361886 -17300649 -21732509 -21572761 -14969851
43724 -14969851 -13439799 -20588416 -23258306 -11189168 5295456 7007402 -10401253 -32541790
43716 -32541790 -42907251 -37707308 -26740755 -23349229 -31071733 -39064297 -35301716 -24036059
43708 -24036059 -21425522 -31883263 -40051655 -32418973 -16108643 -6707825 -6453103 -6544611
43700 -6544611 -4832237 -7359706 -14374459 -17695202 -13258021 -6274534 -2084967 -202756
43692 -202756 607795 -1206034 -5708650 -9285922 -9286651 -7072236 -5195951 -4636694 -5052046
43683 -5052046 -5303729 -4864180 -6707018 -15221842 -27795183 -33561522 -26449536 -14622278
43675 -14622278 -9489403 -10067490 -7641224 -1934823 -818479 -5255198 -7003308 -2963734
43667 -2963734 -706056 -6403633 -16158065 -22257504 -20646093 -11278143 426100 2716097
43659 2716097 -10563432 -26040298 -22174002 1421015 19666622 13932901 -4412705
43652 -4412705 -11440258 -493025 16114309 26025077 25618726 16292574 3313064 -5449759
43644 -5449759 -7906014 -10063482 -13659481 -10091465 4359699 17147270 15849661 7227245
43636 7227245 5081111 6773841 -339959 -14278429 -20547604 -17591525 -19111338 -28604988
43628 -28604988 -32615870 -25286658 -19133137 -21910999 -22281159 -11566084 -1611300 -3657986
43620 -3657986 -4962149 11526104 34654397 37549090 19032147 6546772 14144542 22371409
43612 22371409 11076141 -8688495 -13395601 -4067692 -3071803 -18262475 -30915278 -23358224
43604 -23358224 -2980080 9686366 6917268 -1538079 -4169548 940858 8282420 11014150
43596 11014150 5511616 -4473165 -9203803 -4255777 1218643 -4760578 -18643335 -23973259
43588 -23973259 -14898941 -5545037 -8874493 -17118759 -15386212 -7028174 -9002326 -23603594
43580 -23603594 -32333366 -23018321 -8142306 -6433244 -16855402 -23011123 -17251100 -7788715
43572 -7788715 -3842536 -5429934 -9372729 -15517535 -22563490 -24386082 -16292948 -2361994
43564 -2361994 7537694 7257373 -1000835 -10007501 -13089638 -7326463 5623555 20119119
43556 20119119 29175103 29140400 22798208 16110946 10551467 1071031 -15367847 -31851292
43548 -31851292 -37769783 -32397742 -25276720 -21622551 -15529147 -2422025 9871935 11574193
43540 11574193 7529739 11902688 26753720 37077935 30604099 13388059 222802
43533 222802 -3027727 -177148 6558258 18457399 31464246 34668197 21698594 -634922
43525 -634922 -18250111 -21939071 -12322422 3227653 15152713 16242057 6870504 -4040765
43517 -4040765 -6842236 -907048 5450602 4748200 -2531639 -10588869 -14923126 -15478857
43509 -15478857 -15903202 -20148471 -26758086 -26934733 -13860125 4900005 11813879 871561
43501 871561 -12275073 -9002669 8914874 23721849 25224438 18532329 10115945 -259218
43493 -259218 -10591008 -11900934 597673 19355103 33359711 38830008 36892518 28451216
43485 28451216 16885426 8338312 3341033 -4206068 -13498774 -11790237 7508018 30119641
43477 30119641 36572138 26642192 15038587 7358719 -4081244 -21225205 -33135973
43470 -33135973 -32028213 -23823606 -17016321 -10946920 -1534041 8715291 12913726 8084764
43462 8084764 -2219914 -10217527 -8346242 3054799 12401375 8182634 -5991329 -15669132
43454 -15669132 -15258154 -13168592 -14930001 -13205601 -1508971 11886248 13113538 97136
43446 97136 -17348016 -30604908 -38177512 -41761748 -43266573 -44497121 -45588941 -45403384
43438 -45403384 -45343279 -48340769 -51366105 -44838493 -24518391 164175 14321056 11364651
43430 11364651 -3471674 -18450176 -22258733 -12479093 -399430 -403990 -11592148 -18667179
43422 -18667179 -14531997 -9983718 -13629594 -15330258 -2623831 16348416 22488643 13222155
43414 13222155 4707239 8599076 20654204 31557147 35530791 27955372 7846488 -14927177
43406 -14927177 -26153874 -23336302 -15718044 -8312171 1967667 12884018 13684700 1166977
43398 1166977 -12317995 -13992186 -5295561 4821771 13188578 21636477 28715491 29648018
43390 29648018 22478570 10557122 820477 -196800 6654776 10482321 1627582 -14026541
43382 -14026541 -20375272 -12039761 -258263 5486694 11333378 27685746 51612146 68541968
43374 68541968 67741375 50818779 28348699 12039327 6817275 7589125 6522287 3704618
43366 3704618 5602099 13549822 21341512 24951652 26635919 28441286 29998874 32752979
43358 32752979 36073276 29644801 3886893 -29824821 -45691288 -36439861 -23831567
43351 -23831567 -27672086 -40337877 -43878469 -37151759 -30260381 -23915806 -12092726 1680953
43343 1680953 6530026 -1118819 -16080384 -31345357 -37301735 -24694674 -229730 13052307
43335 13052307 5405599 -3394297 4691829 14196679 877796 -24536874 -29264287 -9825080
43327 -9825080 3278625 -6247747 -20741049 -23689519 -22282770 -22909088 -14798645 3986136
43319 3986136 10855217 -8425545 -31591720 -28948990 -6114325 6344566 -3546231 -19106905
43311 -19106905 -24035497 -20922662 -20100259 -24596639 -28615911 -23780620 -7952396 9141864
43303 9141864 15552115 14649979 21445154 37474760 45289883 35592084 21619163 15095467
43295 15095467 8111645 -4430932 -5339323 18126689 45227448 47273403 29201036 16292825
43287 16292825 11296873 -520095 -11496448 1839993 30351513 33378449 1214964
43280 1214964 -22794248 -4061368 32825563 43067312 24322075 8211421 7822342
43273 7822342 8699831 3663850 3277779 11260747 16819341 15720181 16913660 22973140
43265 22973140 23612436 16050573 14942305 32030497 57990086 74557646 76543821 72934558
43257 72934558 71952955 73544752 74392965 74312046 77560857 89479314 110180448 131316431
43249 131316431 142736256 143719517 144311734 153684666 169200143 178010158 168546442 141964549
43241 141964549 114753684 107385508 125003137 149961053 158834290 146850074 130042523
43234 130042523 123368660 124394465 121627746 111475013 100109312 92295315 85728965 76231069
43226 76231069 63136460 48764743 36707855 31377138 34590648 40180427 36205935 17413834
43218 17413834 -5786583 -15405682 -3662639 20001437 39010776 42523761 28938606
43211 28938606 4499209 -17112523 -20346121 -1235314 26611363 45963104 53795597
43204 53795597 58046871 59679060 50078299 28675111 10773944 9628372 18752376 21764018
43196 21764018 14965104 9622758 13438035 20480142 22041820 18866821 17053452 17037567
43188 17037567 13842195 7464839 6353166 17004010 33486281 42524522 38699751 29211111
43180 29211111 22055794 16122215 8126957 3234922 9348017 22964802 30987383 28021273
43172 28021273 23034203 25975252 35413649 42786506 42095041 32162743 15993215 1321628
43164 1321628 -4459953 -2814733 -1469113 -2589115 -2365644 -2700196 -10004190 -18878889
43156 -18878889 -13184501 7936738 21126251 9050894 -14533763 -25850667 -24113276
43149 -24113276 -23721275 -24300415 -12926034 8546608 23280186 26581385 29740829 34572478
43141 34572478 28298162 10308704 1025400 13341652 34302405 46264324 48347390
43134 48347390 45003208 31835296 8821062 -7966083 -6274469 2223901 -110064 -8509989
43126 -8509989 -4549545 13669937 29788303 34086665 31344258 25302943 14082708 2963012
43118 2963012 4144691 18038204 28383549 22670621 7155825 -4582402 -9355976 -13726345
43110 -13726345 -21259297 -26977528 -23138666 -7910362 11143634 22967602 23829309 19631488
43102 19631488 15915102 11552269 6354842 6464549 13759995 17959765 11104900 3083419
43094 3083419 7825999 18969659 17480860 2299654 -6897138 -1045394 4877271 -1619594
43086 -1619594 -10072317 -7007442 -216077 -4921032 -16619758 -18214028 -9285378 -7579420
43078 -7579420 -20307248 -32829776 -32092922 -25859876 -28474861 -38371687 -42186071 -35286371
43070 -35286371 -25013375 -15094849 -887144 15664007 19589003 2940992 -16532165
43063 -16532165 -12629832 13816649 32877044 24484904 4408396 483020 15734245
43056 15734245 30950384 35240414 34754048 34272919 30347592 24596308 24852957 28099672
43048 28099672 20123594 -490248 -15194759 -12072525 -3351328 -4226187 -9677817 -7766030
43040 -7766030 -2518218 -5080647 -11962934 -11846960 -7395014 -10022444 -16831361 -13390582
43032 -13390582 1283231 12473873 13764951 13775275 15908320 11539509 42896 -3366183
43024 -3366183 10185324 29110431 40158960 46490656 54323768 54997394 36456397 4485687
43016 4485687 -22427351 -34316305 -33642202 -24010479 -8459930 4993471 9211501 7088773
43008 7088773 4021859 -4067749 -21435943 -35196137 -25175498 6928211 34693835
43001 34693835 38756499 27417679 18788455 16157734 11722898 4055818 -1675084 -5472303
42993 -5472303 -11803553 -18933672 -19616598 -12400356 -3247877 4728286 14472126 25900774
42985 25900774 32123656 29674949 26366521 32069800 44130358 48580725 36692716 15716659
42977 15716659 871572 -543372 5914598 11163967 12464788 12500200 12444275 10521269
42969 10521269 6787978 4456349 4578671 3375592 -1582356 -5199568 45484 12808915
42961 12808915 21363971 15679729 -1466267 -17564924 -22741001 -16889046 -6279337 3270885
42953 3270885 9402788 12547100 14433706 16132033 16020071 10734847 -35651 -10643094
42945 -10643094 -14157858 -10324493 -6187089 -7609497 -12561119 -14429687 -9540611 712726
42937 712726 12167483 18738142 14198341 -622590 -13530050 -11343707 3891789 16221983
42929 16221983 16108371 11525936 13375622 18024452 14236260 2526131 -4590120 -1062001
42921 -1062001 5706585 8566576 10340072 15102771 19525499 19927451 20425466 26182454
42913 26182454 34213919 38761871 40905058 44504591 46878251 42805439 34792370 29623295
42905 29623295 26729273 20167412 10804991 5202735 2526084 -4530324 -13570519 -11407719
42897 -11407719 4858595 19246673 19023800 13671762 18842334 30368951 30340616 15120107
42889 15120107 616110 -1704702 642123 -4231137 -14771738 -20296231 -16445882 -9597768
42881 -9597768 -9001102 -18064091 -30281041 -32257123 -15894825 9921427 25045063 18793627
42873 18793627 535569 -13032617 -15532910 -12034237 -8868420 -8946860 -13185657 -19264417
42865 -19264417 -20684599 -13414826 -2449440 4042764 5968626 10107676 17864745 21826110
42857 21826110 16918271 8420198 4829138 7663512 12540537 15604250 13406005 989354
42849 989354 -21369777 -41031314 -42553460 -27167712 -14033886 -16622604 -25388582 -22302483
42841 -22302483 -6928571 3771612 414926 -6884469 -5444971 2246083 5330959 1316616
42833 1316616 -3058117 -3025480 994963 8599179 19357027 28932608 32840958 33065908
42825 33065908 33756186 31888302 20945944 3903725 -6558841 -2859887 9851651 22262701
42817 22262701 29303526 28528728 19244406 6985877 871728 2159173 2401088 -3387850
42809 -3387850 -9587658 -10261734 -8136056 -7771082 -8209484 -9040756 -15119476 -26659585 -32330995
42800 -32330995 -22346385 -2631870 13928328 24775626 35408672 44905740 46430177
42793 46430177 40226874 34482797 33542094 34567490 34517560 31842144 24680991 17271007
42785 17271007 22941508 47327774 73066923 77627522 63631263 52484158 49202629
42778 49202629 37641442 15389029 6469006 24837109 48075159 48019043 30738061 22729640
42770 22729640 29006744 30318711 16811193 -30460 -8637137 -8684591 219386 19510608
42762 19510608 36819149 31474784 4066250 -17597655 -13521092 3226697 9823141
42755 9823141 7975104 16499756 37930907 52925477 47875571 31499167 20196121 19798910
42747 19798910 27358723 40231000 54668047 61503200 52930597 33302159 16994992
42740 16994992 14133479 21848891 30574245 35437293 38814524 43932202 50294182 56112666
42732 56112666 61533876 66893558 70227136 69928684 68628536 70807397 76934426 83348524
42724 83348524 87580180 89843877 89329642 84266399 77668044 78193875 91364360 112508923
42716 112508923 131882167 144954890 154442333 163500981 170480046 171107202 164661268 157576564
42708 157576564 159764406 174855206 194558599 206822642 210214571 214694938 225616896
42701 225616896 233598332 226635923 207859947 192885171 190461651 193399377 189797330 176995495
42693 176995495 162367562 155107826 159032417 169325397 175131217 169801225 159840119 158994796
42685 158994796 172299236 191390132 206596030 215915003 219171612 213589025 203578872
42678 203578872 206374588 234422002 274658978 298680374 295050707 279627913 270558453
42671 270558453 265884398 254235374 237219593 227942558 230892747 235740390 232163893 221103163
42663 221103163 208287059 194765315 179569449 166921878 163673914 169397824 173603691
42656 173603691 165497893 145522112 124768842 112037959 104161385 92908722 79688349
42649 79688349 75858790 85688235 96899711 95436135 84063359 76485003 76153402 73300035
42641 73300035 63969354 58597335 64950905 73030563 67474668 49722557 37266855 41824661
42633 41824661 56513065 65775152 62234427 51791484 45148698 45836834 46587709 39213138
42625 39213138 27537038 24787075 35644471 48118515 49507573 43781858 43259230 47251923
42617 47251923 41886281 22064644 1485525 -4079729 5691705 20690542 34696185
42610 34696185 46391515 51756129 46285346 34807884 30099965 37853297 48374607 48265088
42602 48265088 37566230 29056114 30249977 33531673 29513884 24271428 32596575 54621394
42594 54621394 71452864 69102459 55825232 47359982 44928801 39761201 31362467 26090994
42586 26090994 22510652 15234970 11190745 22894070 43929422 51672126 40672093 32792060
42578 32792060 43244097 56237234 50459836 31787985 20030151 15882863 5202684
42571 5202684 -10792014 -15087934 -3993624 7084999 10412012 16230874 29201899 35193035
42563 35193035 23417460 5649122 -305184 5436638 10765860 12174028 15551449 22448262
42555 22448262 28627836 33103215 37641487 39773225 36247072 31395679 32514160 38236076
42547 38236076 40573246 37605556 34971349 34776168 32443636 26240777 21039592 19265429
42539 19265429 15896769 7430575 -133788 1593549 11539171 20306916 22186093 20950146
42531 20950146 22621032 26176890 24688789 15220815 4482337 2165548 9708137 19063918
42523 19063918 23268494 24426874 28656628 36302957 41460524 40064451 34380777 29254023
42515 29254023 26933591 26047179 23375596 16448182 6475692 -1263282 -2056729 3013763
42507 3013763 8065655 8291091 3212969 -4714746 -11673049 -13074917 -6627252 3698813
42499 3698813 9912518 8598344 4988294 5504854 8068361 4634459 -5880318 -12833938
42491 -12833938 -7009231 4922755 7574982 -496424 -1264379 18663257 46493489 57868188
42483 57868188 49300099 40757465 43881186 44287688 25386993 -3222686 -16501930 -6939206
42475 -6939206 8787869 14687812 12405675 11047872 12909632 14899517 15131679 12421514
42467 12421514 5832451 -869137 -830491 5416462 7726356 -124874 -10684729 -12604081
42459 -12604081 -5039215 4006494 9073701 10147050 8488313 7597695 14964389 33235265
42451 33235265 50676422 50727570 33063630 15863522 13227046 19123311 20338384 17475202
42443 17475202 21781208 33523013 36498896 19499276 -5199943 -14006216 -521278
42436 -521278 16600753 16321783 -585215 -14504867 -10472723 7045427 22404213 26659986
42428 26659986 24798750 27367818 37582526 47443179 46469746 33391048 17256580 6690958
42420 6690958 1286369 -3945697 -8818714 -7711605 1338364 11722994 13820653 3692284
42412 3692284 -13069241 -23969831 -18390464 1631728 20507093 24048734 14540958 5311228
42404 5311228 1803872 -3086785 -13578958 -21528376 -18636358 -10036454 -6827301 -9564732
42396 -9564732 -8506858 852282 10619659 10328826 -1290387 -16109557 -25252657 -27061293
42388 -27061293 -27922519 -34854830 -46686982 -54529200 -51513795 -38797583 -21552982 -4598504
42380 -4598504 6306580 6524883 763712 1888308 14644848 27404268 28613189 24499278
42372 24499278 28717633 39558534 42111855 31805114 20412323 16216011 12985234 4481237
42364 4481237 -3230917 -2542933 2915732 5887271 7974348 14291658 21209097 19952840
42356 19952840 9900438 -411643 -4068324 -578056 7881941 17325010 20261145 11403269
42348 11403269 -3327939 -9469708 1719197 24363516 43646104 47795178 35637134
42341 35637134 16697968 4542622 6582637 18499513 29134479 30683618 24178038
42334 24178038 16977773 15583289 18599006 16546332 2234815 -18469414 -31567217 -31564849
42326 -31564849 -26055766 -21548254 -14752865 -4392368 -1004147 -12666008 -27638521 -26113705
42318 -26113705 -7212564 10398596 15560643 17270199 25822451 35395809 34366834 23351264
42310 23351264 13458591 12744224 22068518 38147960 52484275 53335895 38917151 24644247
42302 24644247 26228609 37350351 35782435 12713651 -15520778 -28930574 -26561201
42295 -26561201 -20702353 -17240945 -12513351 -5233543 933331 7497081 22068533 43495992
42287 43495992 55102434 42239064 12523117 -10967061 -15493572 -8416410 -1048315
42280 -1048315 5889006 15633476 24332354 26296486 24726768 26662272 29375122 22242326
42272 22242326 3254306 -15203635 -20134475 -11043375 3722382 18020786 31242622
42265 31242622 44122378 54970554 59402708 53833190 41151209 30705665 27941209
42258 27941209 26309073 16522940 2156294 -3825872 1383847 6286540 4559674 5990782
42250 5990782 19225848 34735973 38070491 32995535 36038071 49989893 58124321 47755776
42242 47755776 27004370 12353226 8970901 10582085 12344438 15483411 21254202 26857945
42234 26857945 28284143 24572806 18981611 16565868 19302660 22973877 20764822 11077474
42226 11077474 499647 -1619709 9136103 28774697 46770737 52655068 44645385
42219 44645385 32166021 26818181 30890616 37814533 42492937 45279767 45600724 39770061
42211 39770061 29568869 26125080 37173622 53102074 54192013 33391418 6126359
42204 6126359 -5573675 4366689 21768947 28263479 19100844 5479152 774371 5607768
42196 5607768 8456008 2131454 -4246660 3933611 24686831 37654514 29964563 15634058
42188 15634058 18102788 37377010 49250586 39671456 24599963 26144607 40997939
42181 40997939 47307466 36553343 22304200 18551024 24927211 35289332 45684070
42174 45684070 48745483 34631005 6091063 -18723376 -27312778 -26435127 -26013628 -21593009
42166 -21593009 -5908399 12232432 17387473 10456429 5843706 8525191 10288015 8227197
42158 8227197 10489214 20939191 32467011 39197827 42579947 42034348 32882758 18328345
42150 18328345 10700926 14823885 21670350 24006932 25800063 29327446 26429125 12721274
42142 12721274 -812387 -1955620 5797699 11339260 12858566 15465031 19074846 19892160
42134 19892160 17922962 13318188 3094713 -8019217 -3872089 20974292 44594225
42127 44594225 42100224 20787800 9777545 17236303 21812330 9953242 -2486072
42120 -2486072 3493160 21823593 33741520 34068435 30195558 25643302 20376379 20498689
42112 20498689 31845537 46552337 49496582 37984363 24436892 19482359 22105737
42105 22105737 27440897 34920101 45284153 56031542 63799481 67803845 68392940 64406745
42097 64406745 53665989 35598998 14156075 -1214928 -704856 16240486 38323184
42090 38323184 53014494 58252234 60182039 61736884 59074776 49171384 35640656 25150286
42082 25150286 20891325 20702701 19884618 15958680 12273475 15411293 26277391 35889914
42074 35889914 34815677 25926794 21914608 28954414 38436742 37909136 25966562 12508646
42066 12508646 7130140 11188665 19564712 26355830 29304861 31338350 37121142 46010735
42058 46010735 50290199 44030518 32440301 27455401 33438711 42108615 43734480 38963554
42050 38963554 35824389 37820538 39533753 33895735 21272486 10906965 13051228 27368783
42042 27368783 39657368 35424172 18074539 6179168 8709477 12647619 4133182 -8082524
42034 -8082524 -6074809 6461182 7966799 -5498529 -11585786 2928891 19883108 18242281
42026 18242281 6498434 6083898 16260258 19821165 15329398 17129827 25994966 27057209
42018 27057209 19847814 23515170 43612371 58471877 51862514 37531574 34618185 37444342
42010 37444342 30180842 17202953 15570048 25343252 30182298 24348929 18163575 16565204
42002 16565204 11982203 2390310 -533297 11587437 30410155 40801603 35939132 19159223
41994 19159223 -310286 -10196303 -3262395 12289662 17769753 4360101 -16675878
41987 -16675878 -27274765 -20739386 -4344388 10227966 16148409 16018312 18999254 28824487
41979 28824487 35435878 26530652 7737728 366188 14504159 34388521 38130729 24257532
41971 24257532 9275839 3885967 2399859 -4644925 -16536260 -24336005 -21683616 -9585507
41963 -9585507 8001675 29296399 52564805 70077231 70191206 50229261 23759240
41956 23759240 8325351 7483793 11963531 16371211 23865763 33256839 34569505 24111627
41948 24111627 13216669 12564439 16064575 11431686 777238 -2197070 6842105 17306688
41940 17306688 19655276 15608252 10101393 3547207 -3403907 -6083935 -2529939 2492879
41932 2492879 5432469 9555882 16530456 18872562 9780326 -3219855 -4627245 9360206
41924 9360206 26731954 36322707 39114336 39650175 36191698 26981343 18918006 19917744
41916 19917744 26371290 28232901 24453633 22474311 22927216 17738675 6685094 2487728
41908 2487728 11536844 20991236 16717021 5998439 8317103 27079477 44652417 45864718
41900 45864718 33873885 20131410 10135877 4483744 4985408 12143518 20729802 23613085
41892 23613085 18722293 10172951 4275937 4607615 8537845 9863891 8020951 11280012
41884 11280012 25196349 42227226 51581306 55335387 62437405 68871017 59982064 35646036
41876 35646036 16736868 18373688 30065461 32454458 22704076 12289480 9042765 13409101
41868 13409101 25014468 40260864 48302295 41126286 24561993 10269573 1612879
41861 1612879 -3513989 -2868978 4780837 10193184 3992501 -6464065 -5101052 9006879
41853 9006879 20085615 18584763 11786007 9516348 12586428 18656729 26750497 31419571
41845 31419571 24783851 10700221 6052516 20214151 41381516 50272389 40522526 19982739
41837 19982739 -18174 -9509250 -1756645 19895688 40623001 47417794 41850642 34557729
41829 34557729 31142870 30219605 31905144 39416240 51712138 61556947 63880957 62332930
41821 62332930 64291203 70630703 73653687 66772370 54185300 46674217 47402381 47787102
41813 47787102 40927501 32589955 31644623 34774950 30890665 18546449 8189924 7315377
41805 7315377 14098658 26067635 42569080 55874616 53419531 35762419 20949003
41798 20949003 22381655 31584289 32070164 22021570 12641141 10300934 11784901 13812676
41790 13812676 16562251 18693310 17259365 12250054 5471697 -2728042 -9610505 -6662450
41782 -6662450 11523692 36498464 52045531 51073385 40519958 30600271 25753681 25570057
41774 25570057 27646538 28311469 25443934 21258712 18637338 15717181 8794572 -246641
41766 -246641 -4701351 -1716228 3938602 5580928 1521683 -3777850 -3948115 2716438
41758 2716438 10176420 11091836 7008507 6878505 13481057 18313109 14378668 6972458
41750 6972458 5561924 11657612 21994271 36551722 53614061 62937575 55932280 39539742
41742 39539742 28374127 25199262 21078837 13578893 11582825 20214400 32738930 40955220
41734 40955220 44371736 46168872 48222999 52151483 57648177 59334983 53901234 49628476
41726 49628476 57480214 72244888 75697974 61324133 42534431 32078025 27434244
41719 27434244 23150925 23037427 29828147 35070729 31338084 24712262 23183636 22031850
41711 22031850 14264584 7206764 12495004 24537165 26208739 15253016 8742551 18374715
41703 18374715 35046570 43017231 38654720 29459757 22892525 22094780 26622552 31982396
41695 31982396 32443386 28220547 26432424 31828733 39676174 40817364 31928906 19001895
41687 19001895 11882637 15425174 24241442 27019261 18368886 4835935 -3692183 -5779967
41679 -5779967 -7017158 -9687276 -10666650 -8426748 -4839172 -120343 6560705 11238598
41671 11238598 8794434 4351044 11017461 30875493 46815007 41237851 17367158 -5580084
41663 -5580084 -13616899 -6358397 10847001 31689164 46527776 46917901 36413583 28858457
41655 28858457 31961267 39663466 44852227 50951528 62572367 71281472 63151715 40042939
41647 40042939 21803529 23309678 37745299 47754782 45967953 37806534 30028846 25697767
41639 25697767 27685001 37233721 48104831 50251671 41918845 32064617 28405479 28770032
41631 28770032 27108563 22443580 17779700 14403603 11571726 9027078 6550496 3700230
41623 3700230 2382923 6093970 13915777 19282407 17854295 12475415 7099388 1003202
41615 1003202 -6274340 -9554383 -4181301 6079359 13875747 18033800 22134068 26476278
41607 26476278 28438152 28064232 26233265 20614399 11534836 7760209 15701488 26182097
41599 26182097 25554822 18806787 24990268 46431167 60442877 50881207 31858223 25981724
41591 25981724 31565805 29388611 14691326 2753537 3920559 11441851 17073879 22425180
41583 22425180 28791062 30005106 24173535 21086592 27732542 35593781 33896464 28273384
41575 28273384 32461039 45093086 49936823 40439662 29610368 29682642 34113280 29753857
41567 29753857 18929351 16771499 28571727 41546602 41995755 31949617 23346722 21292835
41559 21292835 20342398 15859337 11688010 13303054 17753487 16592630 9035142 5784201
41551 5784201 14945206 28578691 31841284 24760882 23960009 38402687 54799714 57218935
41543 57218935 51850878 56509547 69813938 70287990 49101702 24335588 13262601 7869258
41535 7869258 -6698120 -22917215 -20864657 -1138325 13938950 12527177 7026381 11139241
41527 11139241 21102453 28118040 34138941 43696678 51699812 52693190 54348617 67818824
41519 67818824 88805193 101261128 98514874 89157533 82045603 76680885 70623030 66337533
41511 66337533 65981826 66372136 63936595 59979896 57330712 56003530 55795493 59281186
41503 59281186 67853037 77167301 80745656 77350381 71908634 69614688 71254671 73906010
41495 73906010 74236335 70644005 62910479 50562027 33224966 14237234 2350539 5846026
41487 5846026 23908570 46802103 65636199 78687510 86990845 88868143 83018602 73063380
41479 73063380 63213186 52030647 37513475 26831454 31268394 48612472 59925210
41472 59925210 51001262 30917246 20638703 27007371 37900005 41840589 41117614 42509486
41464 42509486 45150178 44291733 40549625 38009619 36976374 35372859 34765145 38333326
41456 38333326 44008673 45803457 42264488 38837373 40993473 48093494 54309740 53813850
41448 53813850 46375597 39501848 42006561 52827530 60291881 56285697 46187554 39378135
41440 39378135 35828513 30329517 24514384 23331153 23040316 16290714 8399788 13467025
41432 13467025 31481467 44735900 43534970 40792430 50802375 66205127 70017327
41425 70017327 61909185 56548374 59113735 57802357 42982576 23094277 17086356 35564611
41417 35564611 70315323 99469823 105257595 90641683 75352420 72175983 73627583
41410 73627583 68025126 60005090 63258148 78254806 91282119 94272872 92125439 89698838
41402 89698838 84858165 77251178 71548874 67586171 58833857 46353896 43311647 57600889
41394 57600889 78227676 87123843 78303639 58369789 34975952 13962914 3282321
41387 3282321 9156893 27572727 45446679 51110273 41746139 23438255 7304617 2437156
41379 2437156 8500665 17107418 22364202 25979393 29877781 30477765 25687613 21792493
41371 21792493 26007499 35641897 41616392 40183652 34759532 28798528 23699392 21561365
41363 21561365 22876073 23126169 18792329 15083594 19787193 30463672 36513577 34159363
41355 34159363 30051623 28201408 23107647 10624926 -2105665 -3790056 8490619 28145005
41347 28145005 45872538 54013227 49751088 39087528 33198639 36012152 39619421 36272345
41339 36272345 29168388 25500560 25351660 26030100 31354998 44723317 56639473 53957408
41331 53957408 42165042 42619363 61996915 79413698 74233760 54340571 42592858
41324 42592858 43812648 42646162 31317931 21351892 24016707 33689408 37383169 30374121
41316 30374121 16151115 313040 -8817226 -2748449 15457801 29282401 27280836
41309 27280836 17191110 12840553 14108819 11425180 4619713 3097447 8967143 14121718
41301 14121718 15174321 17789970 23000089 22508096 13865300 8884793 18265182 35877498
41293 35877498 46906147 45538177 36512594 24601665 11935333 3109518 3928216 13935922
41285 13935922 24804648 26804317 16029069 -1527095 -11854409 -4829425 12619868
41278 12619868 22169095 17414630 12971393 22646517 37574529 38634726 24967720 14963909
41270 14963909 19788777 30777356 35902096 35350954 35178841 36507457 37929360 40012066
41262 40012066 40824947 35091928 24922632 23307427 37732689 56692302 62929709 55498776
41254 55498776 47204306 43201813 36126282 23922770 18143750 27115860 41429743 46566847
41246 46566847 43553765 45274471 54573417 58474117 46896580 26686301 10916677 2077051
41238 2077051 -5645368 -12591730 -13143034 -8316234 -7644669 -14534407 -18869180 -11247158
41230 -11247158 1637348 4547000 -6338003 -19665139 -24177614 -18848868 -6528011
41223 -6528011 13049470 38228769 59659331 67217077 61245768 51761358 47165916 47546976
41215 47546976 47964512 43933342 33800342 19995425 9004518 6990333 14243296 25814422
41207 25814422 37167839 46143290 50275612 47679338 41797083 39243765 39940765 35918663
41199 35918663 25348245 20953751 34688106 57689887 67615500 56479518 39330759
41192 39330759 32370875 35211745 41315480 52823236 72642451 90995772 95100598 88110019
41184 88110019 83949812 85369097 81815201 69038763 55637758 47871342 43164807 42860436
41176 42860436 55284986 78049634 92120632 85090192 69044092 63406869 69862923
41169 69862923 76715450 78777867 78492556 74726368 66261972 61371196 67601245 75125130
41161 75125130 67188979 46399919 33504367 38217473 48049628 50408094 49531391 53927412
41153 53927412 61003050 64165587 64980336 68377061 73067715 74982747 73820437 69225295
41145 69225295 57597741 40484838 29366414 32968309 44569010 50664806 48514513
41138 48514513 46438047 49566675 54495808 57384543 58888797 59713123 57981721 53546533
41130 53546533 50162670 50240898 50093050 43806840 31733910 22275633 22489765 27661558
41122 27661558 24980309 10142928 -4664220 -4858884 8454383 22128274 29877399 37610485
41114 37610485 50013531 62357133 68285991 66549292 56946614 38966349 18638587
41107 18638587 7503382 9150656 14721997 17108639 21231250 33707583 50175039 60681698
41099 60681698 61976329 57921106 53084556 51147621 53365792 54128578 46177370 34930619
41091 34930619 36760374 55617222 73204268 72995622 62687609 59424884 63119964 61096605
41083 61096605 51728821 45002432 43611116 42002810 42536739 53693255 71013492 78403341
41075 78403341 72626172 69102071 76444107 81244029 68654928 45867574 32585482 35093548
41067 35093548 41374842 39182971 29412924 20785057 17546936 16035776 12276895 9059998
41059 9059998 11383126 16772983 18239175 17996456 26775178 43728184 50201269 34859243
41051 34859243 12926016 5028795 7616274 3663862 -6034146 -5868114 5101175 12777547
41043 12777547 16858644 32578824 59086395 73446582 65513746 53426223 52517836 53259093
41035 53259093 44698637 35976068 36143523 34324933 21394400 12241389 22205117 37083434
41027 37083434 32989764 14691365 7354387 17542866 28644688 30926803 30927589 32069337
41019 32069337 29170594 23484446 23408576 29582047 36867360 48751349 69770356 86222014
41011 86222014 78134676 51773518 36351050 43903474 55384480 53083468 43705894 38888540
41003 38888540 34047465 21177345 7020461 3717307 11499313 21527649 27367713 26676080
40995 26676080 21334827 20628160 32011756 44862061 39144543 15794346 247741 7034907
40987 7034907 19891552 19051522 9411868 6189757 10134886 15076141 24255973 38825204
40979 38825204 44311309 31496121 18987672 29633888 53092785 59380693 44991315
40972 44991315 36238089 45926896 55982946 50032273 36772852 29846328 27495204 26179600
40964 26179600 34530249 56729915 77138439 79630846 71918586 73193456 84624559 89166566
40956 89166566 77324188 57680383 42252660 34521226 33407273 37929552 44264710 45851323
40948 45851323 40444045 33129501 30386205 33663834 38941204 40448004 35958365 30240484
40940 30240484 30397427 35510521 35914065 27266038 19214882 21903308 28843619 25154186
40932 25154186 11639388 6766115 20500364 39082456 44631467 39623450 39395908 46947086
40924 46947086 50816281 46801777 44962045 50109187 51196353 41100106 34250944 48094254
40916 48094254 73759479 84218874 71329283 55828617 55549487 61895010 58342451 46518007
40908 46518007 38320468 33350298 23009420 11802423 15375808 36918204 61641568
40901 61641568 76979093 83979167 86150738 82055291 74136046 70942173 73622718 72587542
40893 72587542 64749021 61249373 68946022 76817127 72585061 62069315 58606331 62274500
40885 62274500 64285218 64512025 68359619 71253736 63435362 48085809 38250987 36451880
40877 36451880 33395975 26655327 23489317 24324556 22446139 23055269 40955367 71240671
40869 71240671 84325856 64389576 33972340 22665994 27660974 26910672 18213589 18403265
40861 18403265 29535340 34202896 27052473 25639514 41548713 61150245 66100183 57092978
40853 57092978 46032882 38235100 34431904 38825069 51696895 62096269 60213749 50644730
40845 50644730 42610767 34544921 20966547 7722811 5003977 8884118 6058952 -3388025
40837 -3388025 -4205914 9728504 24229920 24822470 16367203 14233074 24062070 38824616
40829 38824616 50452567 56352621 57342041 55394205 52006116 45627380 33774163 20045120
40821 20045120 13736796 18344984 25759689 27292161 25486902 28163697 34805750 37344761
40813 37344761 32847700 26881421 23650461 20599241 15450737 12275368 16131925 25056022
40805 25056022 31497635 30685869 25108450 21102805 22460703 27474802 31808504 33698713
40797 33698713 35145659 37847578 40285090 40423146 39114617 38331680 37746506 36045721
40789 36045721 34480817 35995245 41303347 48255548 54203178 56725695 53789767 46445933
40781 46445933 39630869 36246652 32087906 21977859 10279257 8688268 21446512 37943871
40773 37943871 43496467 34665516 21421128 16300598 23162411 34650234 39374984 32985740
40765 32985740 22274405 16917191 19102267 24736503 31759707 40115430 45038002 40435599
40757 40435599 30879846 29356333 37759128 40441540 26402991 8825726 9769926 30748081
40749 30748081 52467051 61509252 62250243 61057222 54477201 40066249 26635692 23933107
40741 23933107 29649800 35123145 37548138 38250199 35023102 26163986 18229153 19694352
40733 19694352 28763212 36417459 39831203 43530972 48654297 51411469 52231420 55494089
40725 55494089 58626703 52922776 38655338 27858277 26938638 28442602 27359286 32491826
40717 32491826 49424648 63535325 57159828 37500951 28593335 36943719 44450698 38453565
40709 38453565 29542706 31172676 38565175 40718907 40316682 45905956 52688199 48352505
40701 48352505 35052708 29377111 38989398 52635210 57102776 53456175 51279629 54553312
40693 54553312 58833963 58223318 51683999 45026825 46712152 57610031 66661490 63761082
40685 63761082 55734641 59597696 78414706 94844843 93599535 80388178 71532556 73536028
40677 73536028 81805077 92052026 101570329 103679351 93357326 77859792 70914251 75050008
40669 75050008 78988108 74469203 66467272 63109516 64089433 65035155 66786844 72724714
40661 72724714 80439916 83894374 83324603 86126453 95817999 105059501 103779390 92597865
40653 92597865 83947113 88275288 101441357 108911408 102576238 90526062 88363427 102398532
40645 102398532 123217741 134879036 129274646 112968942 101304178 103979546 115002228
40638 115002228 119341137 111112120 101039532 102228303 113158042 121393277 121023670 117615319
40630 117615319 116279093 114579441 110394729 108359126 112891844 120503263 124636081 124058707
40622 124058707 121474715 117602030 111931723 106588462 104687253 107064496 113870737 125362449
40614 125362449 137145478 140218432 132129990 122852485 121491856 122349004 115114590 105139995
40606 105139995 109114550 129662294 148796713 151361437 141755511 130668963 118745554
40599 118745554 104375071 96270018 103409303 119080252 129909378 136525410 149185375
40592 149185375 164389820 163845459 141146294 114234176 103739122 110648404 123067452
40585 123067452 133701063 140418294 138688026 126036215 109765624 100188387 99402867 104522741
40577 104522741 116193706 133415651 145123195 140424732 125713033 118519572 123986163
40570 123986163 130074224 127189462 118488776 107238496 89505183 67999545 59520812
40563 59520812 75415656 102924385 119265826 119159014 115504244 116296609 115349677 106881317
40555 106881317 96028912 89740345 86546666 81736718 76967903 78732196 89782140 105729837
40547 105729837 118598940 122417719 117939874 112835841 114150635 119902464 121951373 117824586
40539 117824586 114322896 116781049 120092042 115421566 102680631 90804805 86869070 89972229
40531 89972229 95578240 100481013 101960734 97283750 88184479 82623726 86533052 94545078
40523 94545078 94834687 84680440 75409376 78210732 90449910 102085388 111047181 123048769
40515 123048769 137711240 145607017 141450582 130783780 119794585 107730260 94523970
40508 94523970 86108802 84191435 79603183 66040109 53080982 53678946 64538650 72258730
40500 72258730 74532878 79823399 87895590 87959282 78471995 72123511 75554192 79244139
40492 79244139 75184598 70492654 73309405 77311831 72580461 62916763 59685025 64776656
40484 64776656 71672552 78358632 87193353 95426552 97541304 95204237 94304706 93340221
40476 93340221 85095156 70001408 58521145 58765214 68445909 79546425 85509133 84829405
40468 84829405 82466957 84720881 87596977 76748518 48354189 23428128 26920789 55003978
40460 55003978 78750053 81217425 74731462 76933285 85919284 88914227 83371554 77140968
40452 77140968 74712685 74670492 77010430 83059348 89299201 88847610 79635043 67177624
40444 67177624 59702004 62314302 73447221 85157966 89795513 87395282 82991152 77708812
40436 77708812 69763493 64072466 69875955 84972172 93916193 89227098 83168999 87729991
40428 87729991 93381511 83547094 64006573 58498269 73789795 87606419 79448086 59331182
40420 59331182 53267549 68052136 84780686 86259444 77790078 75632053 83995067 93076215
40412 93076215 96628288 99931099 106694968 108148258 95020059 75206755 66832276 73556230
40404 73556230 79550815 73309550 64226636 66836263 78118548 82252069 72907887 59359914
40396 59359914 52560122 55174429 64361670 75044600 80394466 77243642 71081741 68589673
40388 68589673 66951439 59600892 50938605 53358285 67877954 79777561 78378679 70764500
40380 70764500 69334542 74670586 78694815 77663509 72994030 64269076 51215105 40303705
40372 40303705 39819906 47582432 51090992 42554702 29132575 25395415 37683936 57500563
40364 57500563 69480713 65654737 52523574 43619513 44988251 50126856 50238547 46026312
40356 46026312 45465275 51578527 57827190 57583730 54425296 58528316 72879834 87260807
40348 87260807 88937103 77118262 62641950 54372215 51671832 51061380 52717428 55890200
40340 55890200 54963847 47843145 43275864 50123414 61856777 62467113 48136020 32713705
40332 32713705 29330181 36127689 44094838 50218049 56916893 64502984 69914782 69505602
40324 69505602 60516812 44541052 31147376 31487104 45628459 62419484 73310978
40317 73310978 78255484 77041955 67007877 53989709 52277245 65075178 76904903
40310 76904903 75786959 71089785 76065314 84056227 79926056 67594696 65756153 78324020
40302 78324020 88663065 84550496 71038732 55770164 39608459 27701156 32388923
40295 32388923 54803578 76593011 81029848 72974194 68140103 71220353 75277745 76158133
40287 76158133 75960622 74833374 68811340 56245082 41396378 31514622 31445874 38524660
40279 38524660 43291118 40723390 39642827 52067917 73269462 84431561 77764621 65243514
40271 65243514 57156418 47787574 32421234 22807282 30042323 44060602 48377409 46571567
40263 46571567 54073843 69001975 73107469 61339357 49102423 46490686 45334841 38949129
40255 38949129 36304392 45347244 56696701 57456071 51792709 54452060 68751343 82153368
40247 82153368 81898184 67617197 49688206 39294626 37998721 35697033 23419182 7722771
40239 7722771 3207418 9451954 8477438 -8629583 -25877642 -23869616 -6130885 9307755
40231 9307755 15979866 21440522 29544387 36724565 43473493 53322886 60243810 52631161
40223 52631161 32337548 15832278 13315862 19870227 29889497 44409185 58223921
40216 58223921 56830564 38025248 23074518 31568914 54023292 64241419 52501834
40209 52501834 31506010 14343681 3652938 1631657 12747566 31360321 41016047
40202 41016047 34192693 23042288 22864075 32613833 39535860 37060534 29962689 25477339
40194 25477339 26647879 32504617 38966937 40816006 36936141 31747750 28443074 24793394
40186 24793394 19888176 19467663 26855596 32787839 24908444 6857349 -3293067 3350691
40178 3350691 14838724 16419792 11282267 13538693 25735093 35211536 33037735 25865384
40170 25865384 24567992 28900324 30262379 25403264 19841226 18719544 21087543 24192042
40162 24192042 27193237 28053685 22859779 13357224 10175294 20522377 34614998 33953747
40154 33953747 15222092 -3020574 -2786827 11545109 21328456 17671019 7446974 -1270956
40146 -1270956 -7479755 -10032748 -4660688 6371578 12014354 7994705 6417456 19356866
40138 19356866 38542761 44239091 32818479 21903468 24927037 33197073 31293983 21222614
40130 21222614 19621007 33734453 50863522 53662691 38936541 18432088 5981801
40123 5981801 7108004 17621126 28207165 31383318 26893492 20522423 16903851 14868031
40115 14868031 11083041 6235112 4878370 9947325 19868786 30347267 36145076 32073071
40107 32073071 17227809 -98789 -6616563 2612050 17764164 25682508 25518559 27268143
40099 27268143 35859553 44533963 46566896 46098552 51061275 59887534 63032406 56367155
40091 56367155 45490932 35874306 26092305 14407215 6118128 8241375 19185769 29193203
40083 29193203 30780416 24825048 16766817 11246964 11077962 16612443 23415327 24256529
40075 24256529 17372449 10664085 13346101 24173350 32418909 30982355 24027125 19906790
40067 19906790 20991397 24003741 26904321 30298292 33406059 33877569 31909147 30021330
40059 30021330 27782073 21105566 8778912 -3905027 -10434509 -9263082 -2954552 5224722
40051 5224722 11116431 10087480 2495836 -3533932 -143214 10206232 17794337 18732240
40043 18732240 19434396 26261808 35783698 39205269 33696876 25312897 21648505 24820183
40035 24820183 31307381 35472282 32496684 21042571 5967887 -2690801 2622135 18246290
40027 18246290 30608128 29923604 22052115 22178579 35188964 47331607 42208946 22093634
40019 22093634 6447281 8718367 21284043 26953611 20047664 9683501 4599032 3110524
40011 3110524 744771 676288 9138479 22755344 29039956 22201296 11882215 10964825
40003 10964825 19239854 25996295 26129778 25190652 28042550 31085411 29305134 24398248
39995 24398248 21071437 19984096 18982205 17391549 14687976 8785709 448096 -4058359
39987 -4058359 181764 9726722 16599723 15936762 6679053 -9458393 -24033654 -23408038
39979 -23408038 -3343374 21671971 32685274 27151433 17404996 12658831 13113143 17940862
39971 17940862 25538947 27368376 16521884 3454922 7444189 28525252 43634339
39964 43634339 37231485 20629221 11876111 11141355 8758847 5520720 9216073 18201747
39956 18201747 23435029 22812014 20438563 15026754 2112636 -13473676 -19398142 -11117539
39948 -11117539 2979149 11429998 8122184 -6092804 -22103527 -26098851 -13443508
39941 -13443508 3550669 9993401 6600459 4320199 6372490 8257083 11121067 19182861
39933 19182861 24899280 14086409 -10421982 -25798383 -16930984 4795282 17840526
39926 17840526 16164749 11121976 14636389 26964082 37204192 33378934 16426252 3157372
39918 3157372 7506932 20905218 23055824 11299940 3721597 10536641 20173687 21289119
39910 21289119 21071131 29052576 37425718 33763474 23223456 20550030 25549506 23765460
39902 23765460 10570643 -229532 5538806 25428179 43471749 44258260 25002379
39895 25002379 -173899 -10134232 2216462 20415071 22061810 3927183 -15946895
39888 -15946895 -18286280 546315 27768172 44306234 39424148 20701464 5861371
39881 5861371 2039395 1171431 -762554 6176054 26667166 45239924 46589239 39618523
39873 39618523 42163864 50790166 48608357 37548385 36087828 44093537 37958245 9293466
39865 9293466 -16458255 -14096778 8015515 24093020 24652088 17832785 9933811 2422240
39857 2422240 -81471 4280514 5864773 -4591304 -19412065 -23048127 -14680235 -8461575
39849 -8461575 -12439800 -19171994 -17339283 -2984836 19957855 40991171 46489432 32356607
39841 32356607 13057673 7728640 16736611 22571293 15599342 7108320 11062992 22665027
39833 22665027 24614337 10771196 -5389174 -6912254 7642289 24500778 31622683
39826 31622683 30969306 32543789 40502262 50382906 57883195 62600320 62511986 54105001
39818 54105001 42080775 39691701 52006091 66241259 67688010 59097697 53804265 54530242
39810 54530242 51721992 41134831 29787436 22660521 15282857 3700553 -7617672
39803 -7617672 -12867515 -12785790 -10777622 -6783737 909521 11975676 24620496 35629962
39795 35629962 39106900 31334508 18319795 11465411 13245739 14188788 6975600 -4040679
39787 -4040679 -11166943 -12962450 -9888500 1235517 19512346 32231990 25216502 -71495
39779 -71495 -26906126 -39769298 -34771658 -16511830 6824042 24874770 29799218 23322702
39771 23322702 15191325 12582997 14322097 16485708 18949610 23063193 26061230 22787805
39763 22787805 13396057 5620494 6488030 13052346 15423085 10393645 7680877 17847674
39755 17847674 36508837 47345975 41277877 26059219 14844409 11820724 12977864
39748 12977864 15120721 18331513 22908690 28692470 34828828 37234256 31153230 20353484
39740 20353484 17322917 27033212 35949478 27005184 2810702 -16259776 -16570505 -4141383
39732 -4141383 7422744 12071165 11909651 11326084 14082327 19677097 20598820 10642257
39724 10642257 -2452991 -2412834 13515156 27932856 25155916 10459138 -857841 -5048571
39716 -5048571 -9217688 -14580351 -13316750 -1453055 15150045 28066459 32056260 24912867
39708 24912867 10061933 -1656721 -1799391 4462114 5924014 2964571 5885506 15068676
39700 15068676 17039465 5446832 -7633668 -9887623 -6103059 -6113963 -6368002 1225445
39692 1225445 9416592 2982056 -15470579 -25142341 -15790355 -386320 7522831 13357482
39684 13357482 26745658 39586036 35251259 14599787 -3041456 -4898501 2575749
39677 2575749 8129338 10143323 11330176 9850167 4169343 -221789 2302928 8310257
39669 8310257 10820325 9799605 8604917 4383261 -6274083 -14246787 -5359401 16048803
39661 16048803 26394376 14074185 -2447168 -983449 11354171 10286968 -6012359
39654 -6012359 -11740361 8717253 37727303 48601510 37544509 19813831 6480134
39647 6480134 -806151 -543539 7624612 16598712 19743574 22215495 32156788 43991995
39639 43991995 44509550 33804745 24838508 21633752 14327406 -240085 -9440648 -4149606
39631 -4149606 6937345 11965081 12567159 14376169 11747517 -3391749 -23575297 -31102952
39623 -31102952 -19356519 2230885 22260412 35831912 41093520 38902530 36238569
39616 36238569 40100584 47432946 50025490 48978865 53399661 63157082 64926744 51245794
39608 51245794 34141858 31274594 43364391 53714418 49345827 36292981 31601726
39601 31601726 43052906 60966658 71686416 74773725 79465628 85435939 79790847 59412783
39593 59412783 43350425 49296289 66583382 70391180 58376802 52244452 61661424 69233320
39585 69233320 60236585 47261611 50278267 66445945 76896007 74579320 68388998 64584309
39577 64584309 60127869 53005654 45828354 39424727 33633090 33033248 40944613 49393157
39569 49393157 47160652 37429136 34833712 43771982 52305535 50605074 43186998 38041894
39561 38041894 35102063 32249355 32994217 40044789 48288544 51486200 50035224 46004655
39553 46004655 37467234 25142761 17817748 21895052 30453430 31955863 25646112 18739987
39545 18739987 12732391 4381427 -2503174 -487517 5790789 2623446 -9771187 -12745537
39537 -12745537 3448801 22163182 23721674 14459196 13972826 20873659 14882359 -5930591
39529 -5930591 -15100305 3657659 28273009 27263451 3585914 -12284111 -6648821 3522113
39521 3522113 1836332 -5250972 -5695720 -2472477 -3410850 -3624322 6076455 20526598
39513 20526598 25366790 18065387 10391120 10292592 13201545 12873328 10290785 8231432
39505 8231432 5341220 337872 -3563727 -2989705 203959 1207722 -2241153 -8584231
39497 -8584231 -14717351 -18168189 -18329019 -16036399 -11430526 -3815678 4941609 9735162
39489 9735162 8052388 4074507 3645037 7822287 14554382 22181003 26264540 18840461
39481 18840461 -288586 -15624713 -10726813 9997738 25616449 25356669 18626058 15567842
39473 15567842 11443704 -1398286 -16905396 -22275681 -15841216 -7050715 -1100145 6414708
39465 6414708 18890948 30380037 30733166 16058785 -6708197 -23812707 -24301028 -8724830
39457 -8724830 11071104 21730249 18368274 6649559 -2339152 -527718 9655899 16627899
39449 16627899 12586057 3651028 1274695 5608237 6543952 1016044 -2417521 662787
39441 662787 2541410 -2338679 -6609788 -2873133 2510529 51765 -6030495 -4431296
39433 -4431296 4627835 10095158 6547578 -1808070 -11178274 -20116261 -22830255 -13247578
39425 -13247578 3555041 15453213 19664866 23592673 28579503 26571975 17005216 13156880
39417 13156880 23354386 36503275 36467213 23592929 11475311 6957217 4432844 -685538
39409 -685538 -3045712 3984724 16267558 21545595 14551476 5444583 8905777 25366264
39401 25366264 39075555 37825563 28126096 24037918 26349383 23282725 10017970 -4005311
39393 -4005311 -8953062 -5517075 1216579 9291838 16507474 17895265 12961624 9805767
39385 9805767 16187917 29940832 41664551 43350774 33007244 16338295 5248276
39378 5248276 7996666 19299041 27373784 30649561 36256906 40751073 28729087 -1075163
39370 -1075163 -24036226 -18666946 3048171 10576464 -6434183 -30593693 -43699002
39363 -43699002 -43925260 -36634650 -25089160 -14429707 -11487530 -15033929 -15807212 -9975229
39355 -9975229 -3232979 1453915 9248956 21237152 27113265 18248880 1093758 -10706280
39347 -10706280 -12995632 -12428100 -14345163 -16730821 -15262938 -8444320 2574571 14898495
39339 14898495 23684881 24220487 16246935 5571330 -67515 2151424 7500942 9259026
39331 9259026 6557970 3700892 1545462 -4735306 -16141728 -24327920 -21925760 -13644634
39323 -13644634 -9459848 -10824349 -12737909 -15754816 -23901593 -31867118 -28173638 -13809024
39315 -13809024 -4380591 -8355391 -15653194 -15472537 -13422903 -19726001 -29662119 -29720249
39307 -29720249 -18887420 -10534019 -13783213 -24001965 -32502925 -35908854 -33576979 -23948941
39299 -23948941 -7643734 10396340 24771375 33040547 34791689 30784673 23601935 16103656
39291 16103656 9086522 3039324 940034 5238183 12676647 16638983 15068569 12291319
39283 12291319 12684928 16195826 20371252 22937447 21608053 15000059 5021875 -4381638
39275 -4381638 -11503958 -17079005 -20048710 -17164454 -8643207 -938518 -756223 -7190207
39267 -7190207 -11753034 -6426210 8353792 23114730 27213822 18637231 5873077 -824867
39259 -824867 862479 5487486 7796622 7569810 7270214 8337588 10677866 13530685 15735956
39250 15735956 16340471 15451269 13794531 11717047 9333719 6773308 3488869 -1030238
39242 -1030238 -4692575 -3568226 2259346 6232117 2566625 -5887821 -11537145 -12411962
39234 -12411962 -13019299 -14806150 -12139418 -384544 16886588 32176897 41820176 45724656
39226 45724656 42707142 31467560 15469494 1947631 -5228411 -8670885 -12441407 -17020188
39218 -17020188 -21210407 -25901930 -31871001 -35101246 -29451522 -15352150 -1404510 5292487
39210 5292487 6245437 5517020 1844027 -6236683 -11338474 -3833678 12094476 19700142
39202 19700142 10759748 -3934689 -10489091 -9346566 -9322960 -12137596 -12837076 -10732059
39194 -10732059 -10031758 -12374696 -16853647 -23856981 -30666015 -28314616 -13537453 657036
39186 657036 -844922 -13768345 -21547167 -21315211 -24627453 -31224926 -23575778 3866594
39178 3866594 29327900 31526299 17840319 8692255 6088255 -2852822 -18030519 -22835703
39170 -22835703 -8526879 14452686 31536444 36868902 29549750 11175760 -8452035
39163 -8452035 -15248801 -6767292 4149038 5977576 544482 -5068543 -8659033 -8983561
39155 -8983561 -1158546 15233075 29743761 31714757 23550742 15941149 13700613 14249922
39147 14249922 16725728 23074597 30864486 34011428 31771844 29379930 28440545 24535733
39139 24535733 16646408 10548099 8578988 4469493 -4684255 -8889941 1949480 20273076
39131 20273076 28317287 22774046 19191388 28394785 40470822 39352445 24091330 6802813
39123 6802813 -3733314 -7177244 -5920417 -4171340 -8347989 -18133714 -21333897 -9372789
39115 -9372789 5963385 6017739 -5965292 -7030160 11303011 28820384 24744005 4644711
39107 4644711 -11671811 -15958598 -12324245 -3536620 8208190 14549996 10462015 5511292
39099 5511292 11171079 21208038 19837481 6386494 -4363394 -5626234 -5619705 -9020219
39091 -9020219 -7939519 2569129 13518639 14378580 6977901 466070 81141 5909948
39083 5909948 15383991 22748968 23176145 20467768 22860563 29074947 28379285 17331776
39075 17331776 4899865 -3420039 -13323120 -26225952 -30040199 -17413288 -1921704
39068 -1921704 -1273467 -11962137 -16238039 -9453018 -3803727 -6017107 -8092837 -3763686
39060 -3763686 216524 -3882213 -11922766 -15063296 -12639148 -9997498 -8286033 -4591007
39052 -4591007 -134036 -169000 -4418740 -4325490 5674083 17748446 17703647 2509036 -14994189
39043 -14994189 -21307737 -16598839 -9261417 -2107251 7356865 16259439 17408400 11879469
39035 11879469 9437548 12922015 12934730 3849667 -5103582 -3244143 5363068 9323775
39027 9323775 7591841 8587381 14844031 19467358 17345049 10588250 2271213 -7088068
39019 -7088068 -15167404 -16665047 -9286071 2738079 12627082 16677025 16482804 17256874
39011 17256874 22263086 27891595 27846095 23132969 21503093 24260219 22007502 9458488
39003 9458488 -3746047 -5636890 1349502 5960549 4840865 3001711 2138290 60801
38995 60801 -1120967 2176592 5643210 1587483 -8038650 -13245028 -9643743 -1237452
38987 -1237452 7926548 14803179 13726583 3936546 -2667918 4796314 17604599 18047419
38979 18047419 6267397 -1568585 -921251 -3341396 -10465443 -6879393 12472473 29444043
38971 29444043 29618620 22872375 22603287 22452008 11772881 -480721 1745511 14499243
38963 14499243 19278241 10306718 -1125739 -5624315 -3103386 5462289 18734624 29650341
38955 29650341 32184729 30398753 29366094 23472175 7977813 -5049999 -1070783 11086849
38947 11086849 8849390 -9228459 -20436702 -13590870 -5675304 -13534995 -27806792 -28437287
38939 -28437287 -12842890 5126941 15061285 15863897 8081773 -7241243 -24319391 -36060889
38931 -36060889 -40604924 -39335910 -31861755 -18622004 -5317379 1133628 -251408 -4676575
38923 -4676575 -6577551 -2455204 7207071 16214891 17482269 12692949 12036325 20331308
38915 20331308 28816914 26541382 15938141 10363571 17761497 32456412 42517017 40230756
38907 40230756 25109392 1647294 -22618577 -38419940 -38145534 -21604064 794788
38900 794788 14072855 11725695 1814617 -2826893 1321770 7950324 11884930 13912327
38892 13912327 14881905 12388000 6063982 628372 -133129 896773 -2349061 -11698962
38884 -11698962 -22694628 -28865894 -27609418 -22804583 -20789940 -22964681 -25036001 -24592710
38876 -24592710 -23896480 -22108689 -12834831 3396070 12702491 5724963 -4484355 2382701
38868 2382701 23958788 37169643 30149971 14995795 6427955 5900528 11881875 26637827
38860 26637827 43468742 45328781 28993411 14976053 19141261 29198236 26063640
38853 26063640 14660104 12472016 17481706 11607010 -7489379 -21175575 -17771899 -5618659
38845 -5618659 5069507 14685051 22474399 19050693 551787 -20490751 -27258962 -15254032
38837 -15254032 7590550 29878449 41978718 40197157 30709107 24185102 24163023 25867999
38829 25867999 26016862 25564259 22707032 13450652 1337574 -3422839 2012848 8834380
38821 8834380 9236502 4248002 -3569435 -14588085 -25562666 -29988638 -30099869 -36441345
38813 -36441345 -48512657 -48962954 -28334928 -4476466 -2345404 -20817967 -34897958
38806 -34897958 -28411332 -9816213 5225173 13076485 18808626 23918555 25395254 22937272
38798 22937272 20749136 22344649 26368660 28035231 24203749 17082850 12703402 15623174
38790 15623174 25260251 36138113 40460704 33240993 19001185 11059525 17693515 29737019
38782 29737019 29523287 12817655 -6425963 -14647243 -12163116 -4614249 7663547 23756247
38774 23756247 34807831 32983856 22571747 13268918 7474687 3437780 5851703 21412783
38766 21412783 44966845 60577708 57997833 41557406 22846871 10560023 6762737
38759 6762737 7409092 7058363 6692513 13462953 28594753 41851430 45151066 44927046
38751 44927046 51098501 60053528 61164309 55438753 52834610 53353727 47125919 33999302
38743 33999302 26385238 28924081 31361240 27636323 26401619 33543203 38413845 29618097
38735 29618097 13761027 5247600 5211035 4491637 2855553 10662189 31029771 52144588
38727 52144588 61314075 59974109 60636236 71554758 87179131 94495311 88664100 79464653
38719 79464653 78776180 85058262 87349284 82243442 76518187 72904130 65787686 54474803
38711 54474803 48012733 50612632 53827694 50263981 43476209 36537001 24087196 6659765
38703 6659765 -498778 12151519 29914553 32291969 21484101 15352176 19632313 26371303
38695 26371303 34114943 47973640 61836851 62748454 54155893 53222492 61558928 60099249
38687 60099249 39396095 14548976 1376202 -3001562 -5460996 -1743497 10055082
38680 10055082 16932831 8162155 -6534836 -10994524 -4975112 1583612 6981208 15032747
38672 15032747 21506745 19004760 10670188 5431285 4076055 2562087 3736361 12064318
38664 12064318 21180014 20849505 13287780 9175165 10561621 11551422 13093753 21778294
38656 21778294 34491257 39097803 31630527 19875960 9379498 -752402 -7453681
38649 -7453681 -3881779 6706914 10700442 2420844 -8470530 -11501817 -6506828 2546694
38641 2546694 12800833 17855407 10433627 -4744732 -12152672 -5608630 3283255 3027637
38633 3027637 -1756727 576983 12354847 26152596 33456562 29117466 15522123 5999709
38625 5999709 13669006 32558337 41701571 33191717 22133062 21216648 21735129 12839394
38617 12839394 4655627 13659988 34302840 44928214 38030142 26547116 20954021 16992009
38609 16992009 8827006 317867 -2341014 -100823 2071565 3041146 6978040 18007379
38601 18007379 32470047 37371462 23507079 1706408 -4874822 9649972 24252135
38594 24252135 20353043 8042032 9095294 25066328 39782442 45457255 47117287 46328156
38586 46328156 40439503 35372888 39558751 46256631 41191335 27207104 21221299 26318399
38578 26318399 28515272 23595653 24005435 33199967 35980690 23677408 8541054 2999142
38570 2999142 3726185 6005875 13437987 22012213 16350862 -3465440 -13029239 366103
38562 366103 13960401 4062057 -15042144 -14136072 3611119 9428119 -4449846 -15845151
38554 -15845151 -9457194 4700335 12198072 10132977 -800337 -18573808 -30640282
38547 -30640282 -22839980 -1471755 12683633 15412049 23279048 42223268 54568273
38540 54568273 46638792 28944400 17145381 10754991 3534181 -1199342 -106298 -1020086
38532 -1020086 -9599257 -15884905 -8832737 5180539 12678535 13494861 16315088 20864453
38524 20864453 19444208 11366842 2135505 -7337710 -17145286 -18474894 -2667576 21393858
38516 21393858 33924044 29171796 20583634 19859051 24328639 28372224 33876397 42250380
38508 42250380 46312269 39250608 26177869 19014270 22403266 29748054 30861111 19666874
38500 19666874 -2625053 -26814920 -39470361 -33104035 -14838952 -2038671 -6092551
38493 -6092551 -20737933 -28896154 -21500729 -6491470 2357128 982231 -5047794 -11312123
38485 -11312123 -16532260 -16132408 -5531458 8239338 10315101 -1447090 -11479460 -9704702
38477 -9704702 -7429875 -18114767 -33113521 -33260561 -18289099 -5924585 -3269611 1521218
38469 1521218 15655025 28093404 27756788 20628473 17924884 18355725 14460733 9144409
38461 9144409 12705528 25966844 37556531 38743699 33138825 29944675 33076606 39508362
38453 39508362 45438128 50786829 56283932 57433126 46483407 24322292 5649677 4284741
38445 4284741 15691888 23925698 24828166 29465125 42181000 50043469 42074477 26608205
38437 26608205 19034156 22232063 30193653 41192809 53799462 58367012 48797475 37147847
38429 37147847 39187134 49061773 47291142 32658838 24642583 30718199 33730545 21233992
38421 21233992 6666384 6463514 13065150 9547968 -922190 -1486592 9113943 15496265
38413 15496265 12955864 15014575 29292608 43775618 45574457 39590488 37950372 40517372
38405 40517372 37505827 26447649 16049206 14510783 21588715 31767499 39205139 39376447
$$ [...]
##END NTUPLES=NMR SPECTRUM
##END=
