##TITLE=31Pdec_SR21_rm2
 , 24 sc
 21.10.2020
##JCAMPDX= 6.0         $$ Bruker NMR JCAMP-DX V2.0
##DATA TYPE= NMR SPECTRUM
##DATA CLASS= NTUPLES
##ORIGIN= UXNMR, Bruker Analytische Messtechnik GmbH
##OWNER= root
$$ XWIN-NMR		Version 3.5
$$ Wed Oct 21 12:50:59 2020 Russian Standard Time (UT+4h)  she@DPX200
##.OBSERVE FREQUENCY= 81.013821
##.OBSERVE NUCLEUS= ^31P
##.ACQUISITION MODE= SIMULTANEOUS
##.ACQUISITION SCHEME= undefined
##.AVERAGES= 24
##.DIGITISER RES= 17
##SPECTROMETER/DATA SYSTEM= spect
##.PULSE SEQUENCE= zgpg30
##.SOLVENT NAME= CDCl3
##.SHIFT REFERENCE= (INTERNAL, CDCl3, 0, 182.463)
##AUDIT TRAIL= $$ (NUMBER, WHEN, WHO, WHERE, WHAT)
$$ ##TITLE= Audit trail, XWIN-NMR		Version 3.5
$$ ##JCAMPDX= 5.01
$$ ##ORIGIN= Bruker BioSpin GmbH
$$ ##OWNER= she
$$ F:/spectra/data/she/nmr/P31/1/pdata/1/auditp.txt
$$ ##AUDIT TRAIL=  $$ (NUMBER, WHEN, WHO, WHERE, WHAT)
(   1,<2020-10-21 12:49:55.34 +0400>,<she>,<DPX200>,
      <created by zg, POWCHK disabled, PULCHK disabled
       configuration hash MD5:
       00 E9 B6 7A A2 85 ED C7 34 08 36 98 17 FE 4E 26
       data hash MD5: 32K
       53 3A 73 3F D5 C8 40 FE 9A 48 31 17 6B 6E 6B C2>)
(   2,<2020-10-21 12:50:02.78 +0400>,<she>,<DPX200>,
      <Start of raw data processing
       efp BC_mod = 2 LB = 1 FT_mod = 6 PKNL = 1 PHC0 = -2391.907 PHC1 = 64.80058 SI = 64K 
       data hash MD5: 64K
       82 CC A9 48 B3 CE 9E 6A 57 6C C7 4E 0A 78 42 72>)
(   3,<2020-10-21 12:50:28.40 +0400>,<she>,<DPX200>,
      <pk PHC0 = 2.104668 PHC1 = 0 
       data hash MD5: 64K
       B5 B7 14 69 29 74 1E FF ED 5D 6E 62 50 88 4F 23>)
(   4,<2020-10-21 12:50:31.92 +0400>,<she>,<DPX200>,
      <abs ABSG = 5 
       data hash MD5: 64K
       9B BB 50 4C 37 CD 9D A1 9E C3 CD 96 AA 35 62 A3>)
$$ ##END=
$$ 
$$ hash MD5
$$ F2 90 B7 2E A5 A2 57 11 68 4F EF 3F 36 74 52 85
##$RELAX= 
##$RELAX= 
##$RELAX= 
##$RELAX= 
##$RELAX= 
##$RELAX= 
##$RELAX= 
##$RELAX= 
$$ Bruker specific parameters
$$ --------------------------
##$DU= <F:/spectra>
##$EXPNO= 1
##$NAME= <P31>
##$PROCNO= 1
##$TYPE= <nmr>
##$USER= <she>
##$AMP= (0..31)
100 100 100 100 100 100 100 100 100 100 100 100 100 100 100 100 100 100 
100 100 100 100 100 100 100 100 100 100 100 100 100 100 
##$AQSEQ= 0
##$AQ_mod= 1
##$AUNM= <au_zg>
##$AUTOPOS= <>
##$BF1= 81.014009
##$BF2= 200.13
##$BF3= 200.13
##$BF4= 200.13
##$BF5= 200.13
##$BF6= 200.13
##$BF7= 200.13
##$BF8= 200.13
##$BYTORDA= 1
##$CFDGTYP= 0
##$CFRGTYP= 5
##$CHEMSTR= <none>
##$CNST= (0..31)
1 1 145 1 1 1 1 1 1 1 1 1 1 1 1 1 1 1 1 1 1 1 1 1 1 1 1 1 1 1 1 1 
##$CPDPRG= <waltz16>
##$CPDPRG1= <>
##$CPDPRG2= <waltz16>
##$CPDPRG3= <>
##$CPDPRG4= <mlev>
##$CPDPRG5= <mlev>
##$CPDPRG6= <mlev>
##$CPDPRG7= <mlev>
##$CPDPRG8= <mlev>
##$CPDPRGB= <>
##$CPDPRGT= <>
##$D= (0..31)
0 1 0 0 0 0 0 0 0 0 0 0.03 2e-05 3e-06 0 0 0 0 0 0 0 0 0 0 0 0 0 0 0 0 
0 0 
##$DATE= 1603270194
##$DBL= (0..7)
120 120 120 11 120 120 24 19 
##$DBP= (0..7)
150 150 150 150 150 150 150 150 
##$DBP07= 0
##$DBPNAM0= <>
##$DBPNAM1= <>
##$DBPNAM2= <>
$$ [...]
##$SUBNAM3= <"">
##$SUBNAM4= <"">
##$SUBNAM5= <"">
##$SUBNAM6= <"">
##$SUBNAM7= <"">
##$SUBNAM8= <"">
##$SUBNAM9= <"">
##$SW= 369.568048894756
##$SWIBOX= (0..15)
0 1 3 0 0 0 0 0 0 0 0 0 0 0 0 0 
##$SW_h= 29940.119760479
##$TD= 32768
##$TD0= 1
##$TE= 0
##$TE2= 300
##$TE3= 300
##$TEG= 300
##$TL= (0..7)
0 120 53 12 22 120 120 120 
##$TP= (0..7)
150 150 150 150 150 150 150 150 
##$TP07= 0
##$TPNAME0= <>
##$TPNAME1= <>
##$TPNAME2= <>
##$TPNAME3= <>
##$TPNAME4= <>
##$TPNAME5= <>
##$TPNAME6= <>
##$TPNAME7= <>
##$TPOAL= (0..7)
0.5 0.5 0.5 0.5 0.5 0.5 0.5 0.5 
##$TPOFFS= (0..7)
0 0 0 0 0 0 0 0 
##$TUNHIN= 0
##$TUNHOUT= 0
##$TUNXOUT= 0
##$USERA1= <user>
##$USERA2= <user>
##$USERA3= <user>
##$USERA4= <user>
##$USERA5= <user>
##$V9= 5
##$VALIST= <valist>
##$VCLIST= <CCCCCCCCCCCCCCC>
##$VD= 0
##$VDLIST= <DDDDDDDDDDDDDDD>
##$VPLIST= <PPPPPPPPPPPPPPP>
##$VTLIST= <TTTTTTTTTTTTTTT>
##$WBST= 1024
##$WBSW= 4
##$XGAIN= (0..3)
0 0 0 0 
##$XL= 0
##$YL= 0
##$YMAX_a= 38582
##$YMIN_a= -22073
##$ZGOPTNS= <>
##$ZL1= 120
##$ZL2= 120
##$ZL3= 120
##$ZL4= 120
##$ABSF1= 182.463
##$ABSF2= -187.1042
##$ABSG= 5
##$ABSL= 3
##$ALPHA= 0
##$AQORDER= 0
##$ASSFAC= 0
##$ASSFACI= 0
##$ASSFACX= 0
##$ASSWID= 0
##$AUNMP= <proc_1d>
##$AZFE= 0.1
##$AZFW= 0.5
##$BCFW= 0
##$BC_mod= 2
##$BYTORDP= 0
##$COROFFS= 0
##$CY= -3
##$DATMOD= 1
##$DC= 0
##$DFILT= <>
##$DTYPP= 0
##$F1P= 0
##$F2P= 0
##$FCOR= 1
##$FTSIZE= 65536
##$FT_mod= 6
##$GAMMA= 0
##$GB= 0
##$INTBC= 1
##$INTSCL= 5.30512e-09
##$ISEN= 30
##$LB= 1
##$LEV0= 0
##$LPBIN= 0
##$MAXI= 10000
##$MC2= 0
##$MEAN= 0
##$ME_mod= 0
##$MI= 50
##$NCOEF= 0
##$NC_proc= -6
##$NLEV= 6
##$NOISF1= 182.463
##$NOISF2= 159.3651
##$NSP= 0
##$NTH_PI= 0
##$NZP= 0
##$OFFSET= 182.463
##$PC= 4
##$PHC0= -2389.802
##$PHC1= 64.80058
##$PH_mod= 1
##$PKNL= yes
##$PPARMOD= 0
##$PSCAL= 0
##$PSIGN= 0
##$REVERSE= no
##$SF= 81.014009
##$SI= 65536
##$SIGF1= 159.3651
##$SIGF2= -187.1042
##$SINO= 113.3802
##$SIOLD= 16384
##$SREGLST= <1H.CDCl3>
##$SSB= 0
##$STSI= 65536
##$STSR= 0
##$SW_p= 29940.119760479
##$SYMM= 0
##$S_DEV= 0
##$TDeff= 32768
##$TDoff= 0
##$TI= <>
##$TILT= no
##$TM1= 0
##$TM2= 0
##$TOPLEV= 0
##$USERP1= <user>
##$USERP2= <user>
##$USERP3= <user>
##$USERP4= <user>
##$USERP5= <user>
##$WDW= 1
##$XDIM= 65536
##$YMAX_p= 281822279
##$YMIN_p= -20186122
$$ End of Bruker specific parameters
$$ ---------------------------------
##NTUPLES= NMR SPECTRUM
##VAR_NAME=  FREQUENCY,     SPECTRUM/REAL,   SPECTRUM/IMAG
##SYMBOL=    X,             R,               I
##VAR_TYPE=  INDEPENDENT,   DEPENDENT,       DEPENDENT
##VAR_FORM=  AFFN,          ASDF,            ASDF
##VAR_DIM=   65536,         65536,           65536
##UNITS=     HZ,            ARBITRARY UNITS, ARBITRARY UNITS
##FACTOR=    0.456856943014862, 1,           1
##FIRST=     14782.0589164895, 0,            0
##LAST=      -15158.0608439895, 0,           0
##MIN=       -15158.0608439895, -20186122,   0
##MAX=       14782.0589164895, 281822279,    0
$$ Real data points
##PAGE= N=1
##DATA TABLE= (X++(R..R)), XYDATA
$$ [...]
$$ plain form
46735 -1919406 655320 1651233 416177 -2131121 -4359752 -4944657 -3907493 -2707230
46727 -2707230 -2583645 -2865962 -1853006 517538 2064487 1116940 -1087475 -1911627 -759491
46718 -759491 360184 -178569 -1447775 -1560978 -414487 424955 134228 -455920 -464553
46709 -464553 -168824 -91898 19850 516894 970359 839999 349401 -164830 -1060086 -2488871
46699 -2488871 -3384600 -2697580 -1174646 -396071 -329937 441447 2102796 3166589 3071836
46690 3071836 3251786 4682780 6106333 5961007 4681943 3698234 3337132 3182584 3408748
46681 3408748 4070253 3973307 2191061 162900 222891 2138120 3136025 1696515 -540179
46672 -540179 -1317832 -611217 41520 -162321 -795113 -1274751 -1404516 -1197489 -917740 -1065694
$$ packed form
46735a919406K574726R95913j235056k547298k228631n84905J037164J200263
46727b707230J23585k82317J012956K370544J546949r47547k204415q24152J152136
46718g59491J119675n38753j269206j13203J146491Q39442k90727n90148q633
46709d64553K95729P6926J11748M97044M53465j30360m90598n14231q95256j428785
46699b488871q95729O87020J522934P78575O6134P71384J661349J063793r4753
46690C071836J79950J430994J423553j45326j279064r83709l61102j54548K26164
46681C408748O61505r6946j782246k028161N9991J915229R97905j439510k236694
46672e40179p77653P06615O52737k03841o32792m79638j29765K07027K79749j47954
$$ plain form
46662 -1065694 -1801023 -2639957 -3151866 -3626751 -4523983 -5449088 -5257722 -3339535 -567850
46653 -567850 1212420 734352 -1556534 -3873489 -4563786 -3198012 -500581 2214123 3512500
46644 3512500 2621617 356760 -1266185 -1014607 339560 1296891 1485955 1446139 1248348
46635 1248348 528475 -499846 -1347591 -2323579 -3930735 -5318338 -4932778 -2928425 -1326081
46626 -1326081 -1273732 -1710118 -1471421 -1112675 -1458973 -1748994 -858420 471151 387358 -1312857
46616 -1312857 -2698131 -2157991 -208750 1468339 1939580 1555060 1132474 1089197 1257574
46607 1257574 1288308 1091706 809771 502692 128906 -284049 -784623 -1588023 -2532051 -2827334
46597 -2827334 -2198137 -1866777 -3054833 -4625194 -3971136 -688828 2451328 3096144 2113611
$$ packed form
46662a065694p35329q38934n11909m74885q97232r25105J91366J918187K771685
46653e67850J780270m78068k290886k316955o90297J365774K697431K714704J298377
46644C512500q90883k264857j622945K51578J354167R57331J89064l9816j97791
46635A248348p19873j028321q47745r75988j607156j387603L85560K004353J602344
46626a326081N2349m36386K38697L58746l46298k90021Q90574J329571q3793j700215
46616a312857j385274N40140J949241J677089M71241l84520m22586m3277J68377
46607A257574L0734j96602k81935l07079l73786m12955n00574q03400r44028k95283
46597b827334O29197L31360j188056j570361O54058L282308L140156O44816r82533
$$ plain form
46588 2113611 1519090 1338831 490045 -451413 273300 2731026 4894278 5097409 3404733
46579 3404733 803026 -1410024 -1757980 137851 2527011 3418061 3248558 3808938 4822931
46570 4822931 4077174 1240497 -1100704 -1214108 -618602 -1232946 -2205268 -1515626 720511
46561 720511 2541188 2813630 1901228 427021 -986962 -1370064 -397280 686624 533178
46552 533178 -404066 -813742 -762878 -1297230 -2218733 -2205816 -1189932 -687731 -1298350 -1606764
46542 -1606764 -408203 1374297 2024600 1282861 231296 -341079 -441345 -223038 168041
46533 168041 302958 -108607 -541177 -170237 819138 1189039 333981 -547416 306820 2950492
46523 2950492 5499517 6429807 6373791 7078848 9293648 12645781 17005586 22374296 27341688
$$ packed form
46588B113611n94521j80259q48786r41458P24713K457726K163252K03131j692676
46579C404733k601707k213050l47956J895831K389160Q91050j69503N60380J013993
46570D822931p45757k836677k341201j13404N95506o14344r72322O89642K236137
46561G20511J820677K72442r12402j474207j413983l83102R72784J083904j53446
46552E33178r37244m09676N0864n34352r21503J2917J015884N02201o10619l08414
46542a606764J198561J782500O50303p41739j051565n72375j00266K18307L91079
46533A68041J34917m11565m32570L70940R89375L69901q55058q81397Q54236K643672
46523B950492K549025R30290n6016P05057K214800L352133M359805N368710M967392
$$ plain form
46514 27341688 29404446 27682741 24083474 20870188 18272794 15540167 12998333 11407463
46506 11407463 10237778 8552022 7174285 8059893 11590662 16222219 20705588 24728902
46498 24728902 27279239 26663411 23005757 18813200 15913361 13390032 9773104 5820571
46490 5820571 3563368 3549990 4554281 5391504 5674299 5253755 4219866 3240712 2886650
46481 2886650 2840286 2564618 2312019 2604355 3220061 3677837 4232340 5292046 6278568
46472 6278568 6297237 5677539 5564109 6063550 6079464 5082051 3809889 2946433 2229163 1301844
46462 1301844 502060 276840 500156 795640 1000995 1062827 1015754 1186748 1771998 2152364
46452 2152364 1490985 221603 -44973 1385314 3143537 3447302 2251904 973787 522662
$$ packed form
46514B7341688K062758j721705l599267l213286k597394k732627k541834j590870
46506A1407463j169685j685756j377737Q85608L530769M631557M483369M023314
46498B4728902K550337o15828l657654m192557k899839k523329l616928l952533
46490E820571k257203j3378J004291Q37223K82795m20544j033889r79154l54062
46481B886650m6364k75668k52599K92336O15706M57776N54503J059706R86522
46472F278568J8669o19698j13430M99441J5914r97413j272162q63456p17270r27319
46462A301844p99784k25220K23316K95484K05355O1832m7073J70994N85250L80366
46452B152364o61379j269382k66576J430287J758223L03765j195398j278117m51125
$$ plain form
46443 522662 490242 194498 -242539 -127432 811033 1900939 2063987 945317 -596213
46434 -596213 -1395520 -1312329 -1238512 -1744996 -2263317 -1907773 -721807 297062 294245 -558609
46424 -558609 -1248072 -941380 123517 872603 604589 -342461 -1354093 -2415495 -3602202
46415 -3602202 -4232666 -3593928 -2315692 -1795310 -2129464 -1893096 -407862 1033192 1002700
46406 1002700 -35277 -548504 -40646 756965 1329738 1929712 2833527 3924264 5011943
46397 5011943 5987466 6734912 7281197 7736998 7704783 6290948 3359259 278764 -1384036
46388 -1384036 -1572112 -1360911 -1252491 -761557 534556 2462256 4644508 6590012 7581559
46379 7581559 7392733 6939084 7221503 7810529 7554284 6644543 6451375 7063045 6683817
$$ packed form
46443E22662l2420k95744m37037J15107R38465J089906J63048j118670j541530
46434e96213p99307Q3191P3817n06484n18321L55544J185966J018869k817q52854
46424e58609o89463L06692J064897P49086k68014r47050j011632j061402j186707
46415c602202o30464O38738J278236N20382l34154K36368J485234J441054l0492
46406A002700j037977n13227N07858P97611N72773N99974R03815J090737J087679
46397E011943R75523P47446N46285M55801l2215j413835k931689l080495j662800
46388a384036j88076K11201J08420M90934J296113J927700K182252J945504R91547
46379G581559j88826m53649K82419N89026k56245r09741j93168O11670l79228
$$ plain form
46370 6683817 4320232 1625171 824069 1835735 2861325 3136344 3498463 4411094 5012070
46361 5012070 4543266 3573333 3154157 3482852 4005029 4331239 4448489 4383760 4300920 4744228
46351 4744228 6081294 7618165 7904098 6251276 3530841 1129805 -410608 -1207856
46343 -1207856 -1039151 440454 2552224 3803288 3637980 3054918 2983468 3015370 2487418
46334 2487418 1829615 1709706 1622465 732666 -367593 -293490 930711 1890724 2040540
46325 2040540 2303447 3144843 3749153 3707503 3841533 4424223 4174877 2336768 457739
46316 457739 529789 2212440 3443610 3222891 2323282 1655871 1356041 1289157 1220098 647545
46306 647545 -459387 -1093803 -508607 387175 286786 -320857 124243 1598750 2461036
$$ packed form
46370F683817k363585k695061q01102J011666J025590K75019L62119R12631O00976
46361E012070m68804r69933m19176L28695N22177L26210J17250o4729q2840M43308
46351D744228J337066J536871K85933j652822k720435k401036j540413p97248
46343a207856J68705J479605K111770J251064j65308n83062p1450L1902n27952
46334B487418o57803j19909q7241q89799j100259P4103J224201R60013J49816
46325B040540K62907Q41396O04310m1650J34030N82690k49346j838109j879029
46316D57739P2050J682651J231170k20719q99609o67411k99830o6884o9059n72553
46306F47545j106932o34416N85196Q95782j00389o07643M45100J474507Q62286
$$ plain form
46297 2461036 2111226 1650147 1508392 603542 -1243910 -2196797 -1204229 -148272 -1260256
46288 -1260256 -3634946 -4459286 -3026060 -1359721 -1032066 -1443038 -1583391 -1638434 -2047135
46279 -2047135 -2366055 -2067704 -1569039 -1543424 -1819266 -1778335 -1384306 -1015990 -591509 310612
46269 310612 1518207 2188258 1795361 624674 -881692 -2618265 -4198842 -4436488 -2411060
46260 -2411060 915707 3111833 2841993 1362704 746136 1202100 1271530 422347 -24093
46251 -24093 969015 2369887 2452894 1200126 172050 282547 799525 637770 -236447
46242 -236447 -1039123 -1285870 -1248184 -1358625 -1372488 -439344 1632337 3446136 3252284 1296441
46232 1296441 -140209 350090 1483555 1414825 577279 744083 1943949 2406748 1608444
$$ packed form
46297B461036l49810m61079j41755r04850j847452r52887R92568J055957j111984
46288a260256k374690q24340J433226J666339L27655m10972j40353n5043m08701
46279b047135l18920K98351M98665K5615k75842M0931L94029L68316M24481R02121
46269C10612J207595O70051l92897j170687j506366j736573j580577k37646K025428
46260b411060L326767K196126k69840j479289o16568M55964O9430q49183m46440
46251b4093R93108J400872Q3007j252768j028076J10497N16978j61755q74217
46242b36447q02676k46747L7686j10441j3863R33144K071681J813799j93852j955843
46232A296441j436650M90299J133465o8730q37546J66804J199866M62799p98304
$$ plain form
46223 1608444 1258678 2565541 4334189 4945638 4879291 5895729 8529782 11647821 13969226
46214 13969226 14940821 14516779 13141170 11806039 11322880 11599024 12065066 12433182 12612899
46205 12612899 12582438 13061230 15523020 20387168 25605818 28207331 27118949 23606436
46197 23606436 19344499 15240651 11871002 9566134 7811571 5795300 3884063 3408141
46189 3408141 4570245 5751208 5583402 4704357 4538701 5063644 4868341 3223892 1208045
46180 1208045 553296 1699259 3166176 3011835 1099882 -377020 807629 4325877
46172 4325877 7785897 9586849 10088307 9886514 8571637 6066742 3812555 3192776 3553591
46163 3553591 3204760 1905129 901873 731344 534737 -232425 -829486 -548135 119616
$$ packed form
46223A608444l49766J306863J768648O11449o6347J016438K634053L118039K321405
46214A3969226R71595m24042j375609j335131m83159K76144M66042L68116J79717
46205A2612899l0461M78792K461790M864148N218650K601513j088382l512513
46197B3606436m261937m103848l369649k304868j754563k016271j911237m75922
46189C408141J162104J180963j67806q79045j65656N24943j95303j644449k015847
46180A208045o54749J145963J466917j54341j911953j476902J184649L518248
46172D325877L460020J800952N01458k01793j314877k504895k254187o19779L60815
46163C553591l48831j299631j003256j70529j96607p67162n97061K81351O67751
$$ plain form
46154 119616 425957 674499 1633453 3052862 3741255 3163881 2207580 2013903 2528331
46145 2528331 2744500 2212618 1595597 1461517 1245351 209652 -1013647 -1069624 -103490
46136 -103490 110615 -1103747 -1903498 -501848 1954384 2868992 1983290 1602601 2924103
46127 2924103 4213368 3492942 1384683 -26792 -76504 141425 -262153 -979437 -1344046
46118 -1344046 -1199304 -900627 -994309 -1700368 -2306887 -1613952 368937 1815381 1181811
46109 1181811 -565332 -1077299 234748 1586958 1465657 435083 -169129 21511 775205
46100 775205 2129988 3769044 4481361 3573494 2170707 1743712 1893735 1232502 134480
46091 134480 577397 2931894 4982570 5094895 4507683 5073252 6391760 7175563 8180938
$$ packed form
46154A19616L06341K48542R58954J419409O88393n77374r56301j93677N14428
46145B528331K16169n31882o17021j34080k16166j035699j223299n5977R66134
46136a03490K14105j214362p99751J401650K456232R14608q85702l80689J321502
46127B924103J289265p20426k108259j411475m9712K17929m03578p17284l64609
46118a344046J44742K98677r3682p06059o06519O92935J982889J446444o33570
46109A181811j747143n11967J312047J352210j21301j030574o04212J90640P53694
46100G75205J354783J639056P12317r07867j402787m26995J50023o61233j098022
46091A34480M42917K354497K050676J12325n87212N65569J318508P83803J005375
$$ plain form
46082 8180938 11193356 15583909 18686383 19945167 21911516 25911866 29167334 28240674
46074 28240674 23703805 19067248 16038273 13336006 10009509 7423771 7093533 8200064
46066 8200064 8446478 6671472 3852177 1911598 1939421 3269397 4156757 3666861 2734457
46057 2734457 2820937 3829261 4269394 3394050 2090211 1475928 1642492 2095998 2450070
46048 2450070 2273077 1236277 -59406 -376457 383874 667924 -582991 -2116306 -1824851
46039 -1824851 523439 3188215 4786856 5497286 5917430 5910410 5048920 3457652 1707742
46030 1707742 302262 -393839 -151930 739188 1394851 1231053 950002 2059671 5063113
46021 5063113 8508444 10422521 10531155 10267849 10466143 10105748 8070845 5198983 3285127
$$ packed form
46082H180938L012418M390553L102474J258784J966349M000350L255468r26660
46074B8240674m536869m636557l028975k702267l326497k585738l30238J106531
46066H200064K46414j775006k819295j940579K7823J329976Q87360m89896r32404
46057B734457Q6480J008324M40133q75344j303839o14283J66564M53506L54072
46048B450070j76993j036800j295683l17051P60331K84050j250915j533315K91455
46039a824851K348290K664776J598641P10430M20144p020q61490j591268j749910
46030A707742j405480o96101K41909Q91118O55663j63798k81051J109669L003442
46021E063113L445331J914077J08634k63306J98294l60395k034903k871862j913856
$$ plain form
46012 3285127 2558654 1738942 583858 633198 2736874 5274039 5948891 4516332 2699857
46003 2699857 1976189 2354108 2939616 2911005 2173346 1517534 1708429 2115074 1102579
45994 1102579 -1600236 -3908581 -3772475 -1757603 -9216 723223 1516311 2956923 4002223
45985 4002223 3568685 2163124 1357300 2155232 4076079 5422845 4571807 1636250 -1239784
45976 -1239784 -1928017 -559133 978617 1546125 1706073 2123202 2264319 1406095 195240
45967 195240 280506 2441782 5622046 7997658 8780431 8640925 8322530 7458018 5502852
45958 5502852 3436950 3131973 4680880 5796621 4770785 2776820 1989900 2507830 2721106
45949 2721106 1950120 943235 237627 -138921 395899 2381951 4597204 4873430 3026751
$$ packed form
46012C285127p26473q19712j155084M9340K103676K537165O74852j432559j816475
46003B699857p23668L77919N85508k8611p37659o55812J90895M06645j012495
45994A102579k702815k308345J36106K014872J748387P32439P93088J440612J045300
45985D002223m33538j405561q05824P97932J920847J346766q51038k935557k876034
45976a239784o88233J368884J537750N67508J59948M17129J41117q58224j210855
45967A95240Q5266K161276L180264K375612P82773j39506l18395q64512j955166
45958E502852k065902l04977J548907J115741j025836j993965p86920N17930K13276
45949B721106p70986j006885p05608l76548N34820J986052K215253K76226j846679
$$ plain form
45940 3026751 1263830 1197203 2087592 2582968 2527924 2280104 1775627 1198824 1252749 1877242
45930 1877242 1978750 1323761 1361431 3074083 5217102 5907929 4969322 3543927 2361724
45921 2361724 1629500 1749178 2762021 3656598 3437677 2413569 1474387 803061 357406
45912 357406 789494 2501147 4375432 4883530 4090715 3264632 2908807 2608200 2480570
45903 2480570 3129432 4142982 4273873 3482997 3367110 4915257 6978992 7771009 7130285
45894 7130285 6541359 7342048 9504435 11944130 13641596 14651797 16271910 19973779
45886 19973779 25758567 31448422 33821223 30940233 23903060 16322481 11539501 9991110
45878 9991110 9463371 7858909 5213622 3023702 2397600 3184274 4249094 4301651 3106550
$$ packed form
45940C026751j762921o6627Q90389M95376n5044k47820n04477n76803N3925O24493
45930A877242J01508o54989L7670J712652K143019O90827r38607j425395j182203
45921B361724p32224J19678J012843Q94577k18921j024108r39182o71326m45655
45912C57406M32088J711653J874285N08098p92815q26083l55825l00607j27630
45903B480570O48862J013550J30891p90876j15887J548147K063735P92017o40724
45894G130285n88926Q00689K162387K439695J697466J010201J620113L701869
45886A9973779N784788N689855K372801k880990p037173p580579m782980j548391
45878I991110n27739j604462k645287k189920o26102P86674J064820N2557j195101
$$ plain form
45869 3106550 2043488 2577957 4044791 4318190 3220006 3590671 7643192 13541484 17317653
45860 17317653 17403205 15512864 13567744 11733375 9656798 7918589 7456566 8283018 9208803
45851 9208803 8633707 5933870 2502825 777505 1534081 2942462 3200456 3046602 4223859
45842 4223859 6427090 7788769 7947128 8441912 9964857 11338875 11881090 13089329 17032186
45833 17032186 23998931 32165845 38642969 40733352 37506698 30735961 23487188 17560980
45825 17560980 12997303 9643864 7690955 6665848 5552801 4284326 3703071 3749741
45817 3749741 3218441 1777700 733528 1137570 2425284 3510016 4005859 3879335 3141353
45808 3141353 2320912 1973153 1448710 -320069 -2559338 -3108376 -1702461 -669635 -1337685
$$ packed form
45869C106550j063062N34469J466834K73399j098184L70665M052521N898292L776169
45860A7317653Q5552j890341j945120j834369k076577j738209m62023Q26452R25785
45851I208803n75096k699837l431045j725320P56576J408381K57994j53854J177257
45842D223859K203231J361679J58359M94784J522945J374018N42215J208239L942857
45833A7032186O966745Q166914O477124K090383l226654o770737p248773n926208
45825A7560980m563677l353439j952909j025107j113047j268475n81255M6670
45817C749741n31300j440741j044172M04042J287714J084732M95843j26524p37982
45808C141353q20441l47759n24443j768779k239269n49038J405915J032826o68050
$$ plain form
45799 -1337685 -1889537 -316136 2373546 3769595 3460497 2864671 2690452 2452146 1881993
45790 1881993 1240427 700185 590124 1520964 3188103 4046269 3397439 2673907 3213137
45781 3213137 3939586 3025424 903032 -278737 457887 2324828 4378579 5949623 6170315
45772 6170315 5016456 4257391 5417055 7402676 8355652 9262222 12918528 19132908 23738944
45763 23738944 23353308 19063972 14464387 11824506 11119709 11094200 10095808 7234778 3878666
45754 3878666 2853414 5052143 7874154 8277295 6696518 6705925 10984408 18406466 25041457
45745 25041457 27570085 25797079 22058814 18348282 14606294 10245999 6357514 4884617
45737 4884617 5848893 7018807 6643352 5172143 3902373 3257182 2956155 2696389 2034227
$$ packed form
45799a337685n51852J573401K689682J396049l09098n95826j74219k38306n70153
45790A881993o41566n40242j10061R30840J667139Q58166o48830p23532N39230
45781C213137P26449r14162k122392j181769P36624J866941K053751J571044K20692
45772F170315j153859p59065J159664J985621R52976R06570L656306O214380M606036
45763B3738944l85636m289336m599585k639881p04797k5509r98392k861030l356112
45754C878666j025252K198729K822011M03141j580777R407M278483P422058O634991
45745B5041457K528628j773006l738265l710532l741988m360295l888485j472897
45737D884617R64276J169914l75455j471209j269770o45191l01027k59766o62162
$$ plain form
45728 2034227 613758 -962481 -1533019 -1105083 -986808 -1641457 -1786514 -527594 912974
45719 912974 822653 -629781 -1914869 -2233424 -1763743 -479503 1747872 4065537 5056715
45710 5056715 4428827 3311355 2724772 2572682 2280796 1642369 756290 -262868 -1179278
45701 -1179278 -1633151 -1525509 -1171959 -895391 -654139 -219754 438978 1141070 1784519
45692 1784519 2386022 2728796 2290761 949285 -393651 -536316 562749 1726100 2144906
45683 2144906 2157348 2109418 1651706 980945 1406386 3194339 4048239 1876846 -1599401
45674 -1599401 -2534455 -224676 1930131 1301131 -733556 -1613019 -1261305 -1121700 -1385565
45665 -1385565 -1347773 -1336623 -2141363 -3174756 -3130350 -2118313 -1476157 -1668563 -1855501 -1392035
$$ packed form
45728B034227j420469j576239n70538M27936J18275o54649j45057J258920J440568
45719I12974r0321j452434j285088l18555M69681J284240K227375K317665R91178
45710E056715o27888j117472n86583j52090k91886o38427q86079j019158r16410
45701a179278m53873J07642L53550K76568K41252M34385O58732P02092O43449
45692A784519O01503L42774m38035j341476j342936j42665J099065J163351M18806
45683B144906J2442m7930m57712o70761M25441J787953Q53900k171393l476247
45674a599401r35054K309779K154807o29000k034687q79463L51714J39605k63865
45665a385565L7792J1150q04740j033393M4406J012037O42156j92406j86938M63466
$$ plain form
45655 -1392035 -391982 1093473 3148601 5211381 6330747 6270740 5513054 4351182 2907815
45646 2907815 1767559 1484901 1594697 1181396 355451 134672 917825 2090900 3110261
45637 3110261 3969774 4609267 4860955 4992405 5323638 5327812 4174113 2221577 881348
45628 881348 812930 1258357 1323903 891197 102106 -879163 -1250368 24868 2509295 4042648
45618 4042648 3128771 893378 -244349 572580 1961098 2279339 1485242 827614 1128184
45609 1128184 1784140 1629920 609451 45045 938355 2544831 3283670 2672388 1532600
45600 1532600 553223 -317066 -1074391 -1364451 -1260540 -1380194 -1808500 -1705847 -470502
45591 -470502 1323953 2553667 2573051 1371198 -608503 -2418384 -3012776 -2199038 -795429
$$ packed form
45655a392035J000053J485455K055128K062780J119366o0007p57686j161872j443367
45646B907815j140256k82658J09796m13301q25945k20779P83153J173075J019361
45637C110261Q59513O39493K51688J31450L31233M174j153699j952536j340229
45628H81348o8418M45427O5546m32706p89091r81269l71205J275236K484427J533353
45618D042648r13877k235393j137727Q16929J388518L18241p94097o57628L00570
45609A128184O55956j54220j020469n64406Q93310J606476P38839o11282j139788
45600A532600r79377q70289p57325k90060J03911j19654m28306J02653J235345
45591d70502J794455J229714J9384j201853j979701j809881n94392Q13738J403609
$$ plain form
45582 -795429 396010 1261670 1863463 1992587 1624515 1183778 924559 577548 -54644
45573 -54644 -738659 -1358148 -2143145 -2983384 -3247586 -2761740 -2247095 -2241282 -2278380 -1727380
45563 -1727380 -770471 54960 604181 829520 543878 164567 760637 2439185 3620310
45554 3620310 3060466 1688130 1047369 820109 -298949 -1913322 -2306308 -1361288 -783568
45545 -783568 -1100327 -841342 452331 807237 -1065262 -3265126 -3344523 -1925619 -1366459
45536 -1366459 -1869980 -1523147 175728 1448312 1155921 268128 -185184 -531711 -1007342
45527 -1007342 -900071 -271504 -634806 -2414114 -3434070 -1854745 745283 1448302 211330
45518 211330 -494488 201740 563077 -374486 -1100028 -347544 709434 479925 -484612
$$ packed form
45582g95429J191439Q65660O01793J29124l68072m40737k59219l47011o32192
45573e4644o84015o19489p84997q40239k64202M85846N14645N813l7098N51000
45563a727380R56909Q25431N49221K25339k85642l79311N96070J678548J181125
45554C620310n59844j372336o40761k27260j119058j614373l92986R45020N77720
45545g83568l16759K58985J293673L54906j872499k199864p9397J418904N59160
45536a366459n03521L46833J698875J272584k92391q87793m53312l46527m75631
45527a007342J07271O28567l63302j779308j019956J579325K600028P03019j236972
45518B11330p05818O96228L61337r37563p25542P52484J056978k29509r64537
$$ plain form
45509 -484612 -577253 437463 1689365 2915038 4225965 4882085 4067369 2556294 1945757
45500 1945757 2317918 2213973 987495 -357533 -982931 -1411149 -2282951 -3094452 -2974025
45491 -2974025 -1936739 -656626 445203 1305642 1873064 2142362 2205348 2011929 1508208
45482 1508208 1135567 1510605 2326308 2346154 1012215 -624768 -1245954 -965131 -887476
45473 -887476 -1367937 -1653366 -1183938 -334566 392522 1177193 2357397 3500684 3647274
45464 3647274 2493212 830699 -413468 -1180119 -1901224 -2434502 -2119239 -961686 39363
45455 39363 156284 -182156 -343266 -600958 -1393684 -2069547 -1641183 -608410 -649009 -2219226
45445 -2219226 -3674452 -3340814 -1536733 57575 244110 -1087694 -3391659 -5625066
$$ packed form
45509d84612r2641J014716J251902J225673J310927O56120q14716j511075o10537
45500A945757L72161j03945j226478j345028o25398m28218q71802q11501J20427
45491b974025J037286J280113J101829Q60439N67422K69298O2986j93419n03721
45482A508208l72641L75038Q15703J9846j333939j636983o21186K80823P7655
45473h87476m80461k85429M69428Q49372P27088P84671J180204J143287J46590
45464C647274j154062j662513j244167p66651p21105n33278L15263J157553J001049
45455C9363J16921l38440j61110k57692p92726o75863M28364J032773m0599j570217
45445b219226j455226L33638J804081J594308J86535j331804k303965k233407
$$ plain form
45437 -5625066 -6456003 -5232900 -2744328 -540646 483464 699887 1247452 3029470 5724610
45428 5724610 7653295 7269187 5031678 3064757 2626776 2804528 2246662 1165297 662325
45419 662325 894129 1107338 975997 689676 122171 -750361 -873644 853306 3413018
45410 3413018 4138732 1977833 -1060105 -2555972 -2526801 -2422619 -2373795 -1277778 667570
45401 667570 1518816 333634 -1163600 -847765 843883 1660219 786346 -281472 -225592
45392 -225592 371948 499100 406016 557644 80145 -1919828 -4047885 -3730245 -823452
45383 -823452 1804541 1959951 685130 186245 824421 1588169 2229091 3063871 3413118
45374 3413118 2237789 154733 -1013122 -857371 -881354 -1980420 -3017949 -2654034 -1236364
$$ packed form
45437e625066q30937J223103K488572K203682J024110K16423N47565J782018K695140
45428E724610J928685l84108k237509j966921m37981J77752n57866j081365n02972
45419F62325K31804K13209j31341k86321n67505q72532j23283J726950K559712
45410C413018P25714k160899l037938j495867K9171J04182M8824J096017J945348
45401F67570Q51246j185182j497234L15835J691648Q16336q73873j067818N5880
45392b25592N97540J27152r3084J51628m77499j999973k128057L17640K906793
45383h23452K627993J55410j274821m98885O38176P63748O40922Q34780L49247
45374C413118j175329k083056j167855J55751k3983j099066j037529L63915J417670
$$ plain form
45365 -1236364 105707 1142849 2143220 2601459 1745314 -2683 -1313393 -1670840 -1717513
45356 -1717513 -1794038 -1280876 147153 1602431 2109900 1985394 2164384 2570653 2244760
45347 2244760 1025998 -46126 -288207 -208337 -216020 340709 1789352 2773190 1883331
45338 1883331 190937 270059 2503571 4203263 3167142 532313 -1030435 -644009 652002
45329 652002 2023539 3278232 3675291 2237049 -484473 -2443958 -2470428 -1570761 -1333112
45320 -1333112 -1870624 -1990853 -869937 1074275 2793527 3682816 3987559 4179854 4042460
45311 4042460 2829394 603042 -1199750 -1261233 -63200 799715 776989 824210 1657193
45302 1657193 2580188 2495521 1401264 399678 536308 1846581 3305353 3741438 3093500
$$ packed form
45365a236364J342071J037142J000371M58239q56145j747997j310710l57447m6673
45356a717513p6525N13162J428029J455278N07469j24506J78990M06269l25893
45347B244760j218762j072124k42081P9870p683N56729J448643R83838q89859
45338A883331j692394P9122K233512J699692j036121k634829j562748L86426J296011
45329F52002J371537J254693L97059j438242k721522j959485k6470Q99667K37649
45320a333112n37512j20229J120916J944212J719252Q89289L04743J92295j37394
45311D042460j213066k226352j802792o1483J198033Q62915k2726M7221Q32983
45302A657193R22995q4667j094257j001586J36630J310273J458772M36085o47938
$$ plain form
45293 3093500 2523172 2868383 3481064 3377295 2946428 3187293 3572490 2496373 196255
45284 196255 -659285 1622064 5207027 6977368 6263862 4809754 3810261 2886672 1880881
45275 1880881 1770557 3107766 4782554 5217471 4144729 2556521 1439182 1212959 1982233
45266 1982233 3486681 4818817 4921876 3717530 2397847 2255278 3341534 4508335
45258 4508335 4652597 3666765 2278818 1352504 1395333 2334926 3530187 4240924 4257697
45249 4257697 3847150 3081531 1788953 406908 156639 1666132 3824572 4763405 3825722
45240 3825722 2025419 853521 1216495 3095753 5376623 6355787 5455358 4238273 4640794
45231 4640794 6401182 7565493 7453876 7408845 8172782 8342894 6561525 3853323 2312905
$$ packed form
45293C093500n70328L45211O12681j03769m30867K40865L85197j076117k300118
45284A96255q55540K281349L584963J770341p13506j454108r99493r23589j005791
45275A880881j10324J337209J674788M34917j072742j588208j117339k26223P69274
45266A982233J504448J332136J03059j204346j319683j42569J086256J166801
45258D508335J44262r85832j387947r26314M2829R39593J195261P10737J6773
45249D257697m10547p65619j292578j382045k50269J509493K158440R38833r37683
45240C825722j800303j171898L62974J879258K280870R79164r00429j217085M02521
45231D640794J760388J164311j11617m5031P63937J70112j781369k708202j540418
$$ plain form
45222 2312905 2297482 2358751 1495743 144043 -878074 -1224154 -793588 385338 1840503
45213 1840503 2803586 2797105 1853107 438197 -565773 -392980 578282 986442 352529
45204 352529 4700 1145951 2777341 2981847 1795997 1050990 1374119 1289785 -27234
45195 -27234 -876981 702499 3861144 5723068 4920940 2960797 1939157 2056936 1967180
45186 1967180 888827 -442824 -891390 -410119 -63886 -680127 -1833600 -2371348 -1759093
45177 -1759093 -568955 382281 1011470 1821700 2957098 3786468 3563722 2297298 748254
45168 748254 -331470 -679060 -298826 737868 1989363 2593821 2129423 1398689 1758219
45159 1758219 3579094 5792476 6999492 6645858 5164919 3477210 2356481 1805899
$$ packed form
45222B312905j5423O1269q63008j351700j022117l46080M30566J178926J455165
45213A840503R63083o481r43998j414910j003970J72793R71262M08160o33913
45204C52529l47829J141251J631390K04506j185850p45007L23129q4334j317019
45195b7234q49747J579480L158645J861924q02128j960143j021640J17779q9756
45186A967180j078353j331651m48566M81271L46233o16241j153473n37748O12255
45177a759093J190138R51236O29189Q10230J135398Q29370k22746j266424j549044
45168G48254j079724l47590L80234J036694J251495O04458m64398p30734L59530
45159A758219J820875K213382J207016l53634j480939j687709j120729n50582
$$ plain form
45151 1805899 1127945 91679 -346754 600183 1864051 1671398 399833 430667 2495751
45142 2495751 4092620 2904942 193945 -1060392 -225842 889562 1258826 1594793 2230848
45133 2230848 2329886 1601894 877720 436001 -443777 -1586344 -1384656 773904 3031334
45124 3031334 3266992 1697152 131701 -369864 58470 1042544 2032092 2109718 1087568
45115 1087568 313498 1091699 2668352 3070716 1678893 -336516 -1916411 -2960104 -3230834
45106 -3230834 -2088323 29422 1221093 288146 -1505756 -1906329 -510246 827860
45098 827860 376278 -1444264 -2625666 -1776179 460854 2088856 1765161 50701 -1433411
45089 -1433411 -1897683 -2009742 -2657487 -3704578 -4300084 -3954802 -2868783 -1538956 -518624
$$ packed form
45151A805899o77954j036266m38433R46937J263868j92653j271565L0834K065084
45142B495751J596869j187678k710997j254337Q34550J115404L69264L35967O36055
45133B230848R9038p27992p24174m41719q79778j142567K01688K158560K257430
45124C031334K35658j569840j565451n01565M28334R84074R89548P7626j022150
45115A087568p74070P78201J576653M02364j391823k015409j579895j043693k70730
45106c230834J142511K117745J191671r32947j793902m00573J396083J338106
45098H27860m51582j820542j181402Q49487K237033J628002l23695j714460j484112
45089a433411m64272j12059o47745j047091n95506L45282J086019J329827J020332
$$ plain form
45080 -518624 -270820 -706464 -1051585 -709318 -78733 53074 -301165 -527564 -641786 -1265022
45070 -1265022 -2196265 -2166590 -613670 1300555 2288380 2694890 3568971 4623595 4480918
45061 4480918 2775828 771379 -205776 73400 1162071 2408653 2836819 1694402 -435936
45052 -435936 -1935039 -1915971 -956312 37883 692950 752763 77220 -547176 57344 1498502
45042 1498502 1777252 63610 -1862569 -2000042 -602815 944732 2226469 3080627 2222083
45033 2222083 -1058300 -4594050 -5265331 -3063965 -929945 -500688 -444358 503403 1274499
45024 1274499 395003 -1653192 -3279619 -3675207 -2837264 -1041399 624454 511914 -1468492
45015 -1468492 -3022212 -2181568 -49797 643341 -783227 -2279923 -2007998 -571930 139142
$$ packed form
45080e18624K47804m35644l45121L42267O30585J31807l54239k26399j14222o23236
45070a265022r31243K9675J552920J914225R87825M06510Q74081J054624j42677
45061D480918j705090k004449r77155K79176J088671J246582M28166j142417k130338
45052d35936j499103J9068R59659R94195O55067N9813o75543o24396O04520J441158
45042A498502K78750j713642j926179j37473J397227J547547J281737Q54158q58544
45033B222083l280383l535750o71281K201366K134020M29257N6330R47761P71096
45024A274499q79496k048195j626427l95588Q37943J795865J665853j12540j980406
45015a468492j553720Q40644K131771O93138j426568j496696K71925J436068P11072
$$ plain form
45006 139142 -542857 -1419525 -1111036 137522 766022 25378 -894728 -485104 954466
44997 954466 1910511 1972747 2045741 2299988 1736810 297632 -431127 372457 1267836 765351
44987 765351 -376578 -634612 -323607 -856447 -2123285 -2531587 -1446475 72117 1000794
44978 1000794 1455190 1958178 2692619 3520228 3913701 3161724 1560183 847841 2170254
44969 2170254 4083973 4160703 2345468 1001576 1584505 3072625 4040543 4456126 4658965
44960 4658965 4205700 2872108 1588819 1167509 938778 -234673 -2222199 -3877472 -4468242
44951 -4468242 -3955072 -2427798 -308427 1283259 1474785 845023 749291 1483265 2012431
44942 2012431 1572768 604114 -180458 -760534 -1265061 -1149720 183161 2124218 3106626
$$ packed form
45006A39142o81999q76668L08489J248558O28500p40644r20106M09624J439570
44997I54466R56045O2236P2994K54247n63178j439178p28759Q03584Q95379n02485
44987G65351j141929k58034L11005n32840j266838m08302J085112J518592R28677
44978A000794M54396N02988P34441Q27609L93473p51977j601541p12342J322413
44969B170254J913719P6730j815235j343892N82929J488120R67918M15583K02839
44960D658965m53265j333592j283289m21310k28731j173451j987526j655273n90770
44951d468242N13170J527274K119371J591686J91526o29762r5732P33974N29166
44942B012431m39663r68654p84572n80076n04527J15341J332881J941057R82408
$$ plain form
44933 3106626 2419491 1195273 1093495 2310226 3491369 3566456 3004088 2932673 3490886
44924 3490886 3628172 2489265 536115 -918339 -1106557 -474295 78613 292023 432733
44915 432733 241433 -1058719 -3152239 -3983331 -2020107 1253812 2712756 1537051 64966
44906 64966 178632 746513 -41417 -1449820 -1340624 334766 1387668 629573 -678310
44897 -678310 -952598 -269877 389428 683548 981992 1626292 2618171 3570744 3819678 3099011
44887 3099011 2029920 1286184 535681 -820712 -2084522 -1776146 86849 1532743 993560
44878 993560 -889998 -2364449 -2575657 -1917061 -1155744 -862331 -1190894 -1714801 -1810073
44869 -1810073 -1385383 -808340 -145413 861652 2107337 3195935 4120365 4945816 4984968
$$ packed form
44933C106626o87135j224218j01778J216731J181143P5087n62368p1415N58213
44924C490886J37286j138907j953150j454454j88218O32262N52908K13410J40710
44915D32733j91300j300152k093520q31092J963224L273919J458944j175705j472085
44906F4966J13666N67881p87930j408403J09196J675390J052902p58095j307883
44897f78310k74288O82721O59305K94120K98444O44300R91879R52573K48934p20667
44887C099011j069091p43736p50503j356393j263810L08376J862995J445894n39183
44878I93560j883558j474451k11208O58596P61317K93413l28563n23907r5272
44869a810073M24690N77043O62927J007065J245685J088598R24430Q25451L9152
$$ plain form
44860 4984968 3540547 1462007 489013 827511 993891 485913 724024 2398175 3749186
44851 3749186 3048196 1371420 1079685 2452687 3673771 3618553 2864500 2124695 1356513
44842 1356513 581364 186613 33224 -689258 -2281436 -3906897 -4484460 -3765465 -2378149
44833 -2378149 -1177567 -648132 -702836 -986695 -1296254 -1471487 -1111957 -61700 943306
44824 943306 1027054 551932 593629 984619 407385 -1214503 -2234177 -1951157 -1792133 -2595175
44814 -2595175 -2749401 -855614 1585299 2382143 2005279 2206251 2641340 1800940 319563
44805 319563 104809 699589 -24346 -1655816 -1461246 679837 1408626 -777364 -3005413
44796 -3005413 -2753039 -1654317 -2017006 -2588600 -1095666 1242977 1417949 -468726 -1592065
$$ packed form
44860D984968j444421k078540r72994L38498J66380n07978K38111J674151J351011
44851C749186p00990j676776k91735J373002J221084n5218p54053p39805p68182
44842A356513p75149l94751j53389p22482j592178j625461n77563P18995J387316
44833b378149J200582N29435n4704k83859l09559j75233L59530J050257J005006
44824I43306Q3748m75122M1697L90990n77234j621888j019674K83020J59024q03042
44814b595175j54226J893787K440913P96844l76864K00972M35089q40400j481377
44805C19563k14754N94780p23935j631470J94570K141083P28789k185990k228049
44796c005413K52374J098722l62689n71594J492934K338643J74972j886675j123339
$$ plain form
44787 -1592065 -1039306 -579603 -872296 -316142 1565604 2521492 782494 -2153775 -3484195
44778 -3484195 -2587432 -1250518 -1201377 -2488016 -3959910 -4657314 -4721586 -4975991 -5536688
44769 -5536688 -5417828 -4115601 -2822548 -2889590 -3651492 -3334632 -1874815 -1043226 -1595099
44760 -1595099 -2130005 -1422936 -220939 280079 377493 1024836 1998581 2228189 1498560
44751 1498560 719520 662041 1184786 1587237 1215174 -83432 -1694606 -2629029 -2408767
44742 -2408767 -1288061 405249 2502373 4440128 5321446 4944130 4078275 3374590 2759713
44733 2759713 2202602 2034587 1986611 1093061 -614093 -1517057 -682085 396239 -156760
44724 -156760 -1683913 -1972836 -650862 423545 154988 -417743 -194358 381572 591123
$$ packed form
44787a592065N52759M59703k92693N56154J881746R55888j738998k936269j330420
44778c484195Q96763J336914M9141j286639j471894o97404o4272k54405n60697
44769e536688J18860J302227J293053o7042p61902L16860J459817Q31589n51873
44760a595099n34906P07069J201997N01018R7414O47343R73745K29608p29629
44751A498560p79040n7479N22745M02451l72063j298606j611174r34423K20262
44742b408767J120706J693310K097124J937755Q81318l77316q65855p03685o14877
44733B759713n57111j68015m7976q93550j707154r02964Q34972J078324n52999
44724a56760j527153k88923J321974J074407k68557n72731K23385N75930K09551
$$ plain form
44715 591123 723226 1037563 772850 -557704 -1908643 -2099750 -1702879 -2057885 -2895564
44706 -2895564 -2593104 -796729 842918 1094551 925058 1834001 3339363 3526806 1893465
44697 1893465 228985 170617 985940 800734 -599317 -1547906 -1068052 -270395 -596519
44688 -596519 -1812888 -2698589 -2859080 -2708032 -2295078 -1472435 -821708 -1013456 -1472799
44679 -1472799 -1138429 -375937 -448316 -1104467 -741035 629772 866801 -798394 -1976634
44670 -1976634 -523912 2155613 3302047 2744685 2178293 1638714 -383688 -3653857 -5879235
44661 -5879235 -6019502 -5461608 -5369488 -5171269 -4447312 -4110756 -4600096 -4802457 -3993359 -3127551
44651 -3127551 -2919175 -2348575 -652060 746234 201513 -1383513 -1782463 -713274 127781
$$ packed form
44715E91123J32103L14337k64713j330554j350939j91107L96871l55006q37679
44706b895564L02460J796375J639647K51633j69493R08943J505362J87443j633341
44697A893465j664480n8368Q15323j85206j400051r48589M79854P97657l26124
44688e96519j216369q85701j60491J51048M12954Q22643O50727j91748m59343
44679a472799L34370P62492p2379o56151L63432J370807K37029j665195j178240
44670a976634J452722K679525J146434n57362n66392n39579k022402l270169k225378
44661e879235j40267N57894R2120J98219P23957L36556m89340k02361Q09098Q65808
44651c127551K08376N70600J696515J398294n44721j585026l98950J069189Q41055
$$ plain form
44642 127781 -90430 -464418 -390249 -666054 -2048968 -3934710 -4999405 -4464880 -2618574
44633 -2618574 -716108 -184927 -1156525 -2105244 -1833069 -1300033 -2185960 -4028469 -4527825
44624 -4527825 -2862759 -987917 -968654 -2404134 -3376044 -2919138 -1610699 -421003 142601
44615 142601 151806 132710 523430 970858 665778 -421541 -1355797 -1577574 -1586688 -1829232
44605 -1829232 -1810751 -1053845 -179951 -108703 -633281 -664217 362109 2023648 3609199
44596 3609199 4606915 4714830 4044001 3248688 2930334 2937956 2607550 1599044 277632
44587 277632 -529197 -83197 1472966 2776474 2455367 938225 73782 477877 547667
44578 547667 -906034 -2434186 -2033070 -385823 195292 -470344 -328207 1087989 1515225
$$ packed form
44642A27781k18211l73988P4169k75805j382914j885742j064695N34525J846306
44633b618574J902466N31181r71598r48719K72175N33036q85927j842509m99356
44624d527825J665066J874842J9263j435480r71910M56906J308439J189696N63604
44615A42601R205j9096L90720M47428l05080j087319r34256k21777r114k42544
44605a829232J8481P56906Q73894P1248n24578l0936J026326J661539J585551
44596C609199R97716J07915o70829p95313l18354P622l30406j008506j321412
44587B77632q06829M46000J556163J303508l21107j517142q64443M04095O9790
44578E47667j453701j528152M01116J647247N81115o65636J42137J416196M27236
$$ plain form
44569 1515225 -269700 -2040407 -1342882 730671 1253700 -210222 -1360812 -700212 924201
44560 924201 2209264 2748219 2276413 498847 -1742683 -2681323 -1662571 205276 1741745
44551 1741745 2655393 2617298 1264994 -198319 504750 3327523 4936722 3013978 -116651
44542 -116651 -538025 1728098 3037074 1565211 -495745 -637071 715371 1736970 1869643
44533 1869643 1521262 676545 -638013 -1530008 -1274402 -478866 -127263 -169626 -95856 -159154
44523 -159154 -848311 -1719189 -1962312 -1753686 -1892612 -2338852 -2196733 -1067032 512649
44514 512649 1929772 2997963 3625750 3652523 3001295 1618293 -373507 -2036074 -1864486
44505 -1864486 442860 3049879 3877945 2997213 2045262 1777471 1614852 1333402 1481951
$$ packed form
44569A515225j784925j770707O97525K073553N23029j463922j150590O60600J624413
44560I24201J285063N38955m71806j777566k241530r38640J018752J867847J536469
44551A741745R13648l8095j352304j463313P03069K822773J609199j922744l130629
44542a16651m21374K266123J308976j471863k060956j41326J352442J021599J32673
44533A869643l48381q44717j314558q91995K55606P95536L51603m2363P3770o3298
44523a59154o89157q70878k43123K08626j38926m46240J42119J129701J579681
44514E12649J417123J068191O27787K6773o51228j383002j991800j662567J71588
44505a864486K307346K607019Q28066q80732r51951k67791j62619k81450J48549
$$ plain form
44496 1481951 1874447 1284825 -667762 -2570836 -2963002 -2093846 -1162054 -601723 -35209
44487 -35209 575231 676653 -11953 -972937 -1379242 -975195 -433649 -685387 -1723604 -2398276
44477 -2398276 -1836795 -709477 -365381 -937657 -1194965 -281947 1230065 2144920 1800167
44468 1800167 418181 -995177 -1238313 -276210 186653 -1328436 -3612026 -3765283 -1004403
44459 -1004403 2053777 2657312 1132286 -189347 -141926 485602 700137 492715 295367
44450 295367 158610 -233362 -943889 -1289804 -311407 1784349 3125481 2211282 197604
44441 197604 -353750 929748 1748599 795761 -204312 550915 1846151 1336282 -716721
44432 -716721 -1890822 -1225407 -176275 9059 -161932 56714 239259 -304870 -1235971
$$ packed form
44496A481951L92496n89622j952587j903074l92166Q69156R31792N60331N66514
44487c5209O10440J01422o88606r60984m06305M04047N41546k51738j038217o74672
44477b398276N61481J127318L44096n72276k57308R13018J512012R14855l44753
44468A800167j381986j413358k43136R62103M62863j515089k283590j53257K760880
44459a004403L058180O03535j525026j321633M7421O27528K14535k07422j97348
44450B95367j36757l91972p10527l45915R78397K095756J341132r14199k013678
44441A97604n51354J283498Q18851r52838j000073P55227J295236n09869k053003
44432g16721j174101O65415J049132J85334j70991K18646J82545n44129r31101
$$ plain form
44423 -1235971 -1564206 -873556 237422 769435 411460 117437 1096235 2959934 3787621
44414 3787621 2727154 1461510 1871296 3192539 3176283 1481674 -19670 -173206 212423
44405 212423 330885 691911 1732150 2634450 2460213 1390129 110353 -1033222 -1616824
44396 -1616824 -964628 740486 2055709 1901858 913381 352899 373886 328088 248267 837422
44386 837422 2065635 2854622 2525720 1869868 2163446 3341067 3877834 2894057 1821470
44377 1821470 2884272 5798034 7354703 5297436 1523446 -157486 1167521 2882417
44369 2882417 2889640 2046382 1915017 2278745 2393351 3040439 5226204 7606060 7397828
44360 7397828 4037155 295184 -780596 1044216 3629699 4996239 4679468 3236665
$$ packed form
44423a235971l28235O90650J110978N32013l57975k94023R78798J863699Q27687
44414C787621j060467j265644M09786J321243j6256j694609j501344j53536L85629
44405B12423J18462L61026J040239R02300j74237j070084j279776j143575n83602
44396a616824O52196J705114J315223j53851r88477n60482K0987m5798p9821N89155
44386H37422J228213P88987l28902o55852K93578J177621N36767r83777j072587
44377A821470J062802K913762J556669k057267l773990j680932J325007J714896
44369B882417P223q43258j31365L63728J14606O47088K185765K379856k08232
44360G397828l360673l741971j075780J824812K585483J366540l16771j442803
$$ plain form
44352 3236665 1441417 26224 -465026 14903 1011313 2087403 3232802 4545984 5673228
44343 5673228 5981292 5315490 4144010 2849674 1433116 151808 -255476 454287 1411433
44334 1411433 1686404 1455859 1378303 1396725 1157401 1090376 1805434 2734196 2793182 2276770
44324 2276770 2533352 3630171 3995150 2849967 1433069 1117932 1772065 2763744 4070114
44315 4070114 5306391 5130592 3100375 1026782 908349 2327757 3418078 3628846 3785946
44306 3785946 3962268 3284152 1818993 794253 645885 522475 215503 986632 3656828
44297 3656828 7179550 10090791 12315860 14427994 15969730 15900114 14401836 12935871
44289 12935871 12335417 11835158 10382569 8211419 6567478 6211250 6700072 7107217 7130772
$$ packed form
44352C236665j795248j415193m91250M79929R96410J076090J145399J313182J127244
44343E673228L08064o65802j171480j294336j416558j281308m07284P09763R57146
44334A411433K74971k30545p7556J8422k39324o7025P15058R28762N8986n16412
44324B276770K56582J096819L64979j145183j416898l15137O54133R91679J306370
44315D070114J236277j75799k030217k073593j18433J419408J090321K10768J57100
44306C785946J76322o78116j465159j024740j48368j23410l06972P71129K670196
44297C656828L522722K911241K225069K112134J541736o9616j498278j465965
44289A2935871o00454n00259j452589k171150j643941l56228M88822M07145K3555
$$ plain form
44280 7130772 7403068 8753470 11088968 13000514 12808706 10318287 7316184 5848599
44272 5848599 6063272 6292680 5253359 3375637 1697707 427776 -593541 -829061 256692
44263 256692 1773589 2149707 1459584 1573604 3377409 5140949 4764515 2798355 1838964
44254 1838964 3146109 5175885 5800696 4970352 4395939 5056811 5982199 5750781 4495303
44245 4495303 3667825 4009515 4667696 4616740 4097631 3975519 4321682 4523533 4397639 4275010
44235 4275010 4255815 4264335 4535894 5091372 5132041 4181432 3465296 4574428 6830253 7775086
44225 7775086 6590284 5191615 5279684 6145151 6476618 6674171 7861588 9785102 11268385
44216 11268385 12023752 12688092 13710563 15442843 18702452 23851685 29489446 33065865
$$ packed form
44280G130772K72296J350402K335498J911546j91808k490419l002103j467585
44272E848599K14673K29408j039321j877722j677930j269931j021317k35520J085753
44263B56692J516897L76118o90123J14020J803805J763540l76434j966160r59391
44254A838964J307145K029776O24811q30344n74413O60872R25388k31418j255478
44245D495303q27478L41690O58181n0956n19109j22112L46163K01851j25894j22629
44235D275010j9195Q520K71559N55478M0669r50609p16136J109132K255825R44833
44225G775086j184802j398669Q8069Q65467L31467J97553J187417J923514J483283
44216A1268385P55367O64340J022471J732280L259609N149233N637761L576419
$$ plain form
44208 33065865 32809308 28803071 22909908 18046777 16348161 17130494 17662719 16776575 16468195
44199 16468195 18926210 23513306 28156409 32107251 35246691 36044013 32950219 27281331
44191 27281331 22140540 18648075 15620097 12772118 11433059 11646356 11311975 9310562
44183 9310562 7262160 6914027 7667907 8073951 8095303 8247692 7775123 5559890 2304472
44174 2304472 213543 495663 2140251 3200035 2699843 1294693 376187 562245 1185602
44165 1185602 1454185 1581775 2059541 2422970 2004554 1516242 2231788 3636869 3785865
44156 3785865 2383040 1492432 2251499 2780640 863276 -2710021 -5196330 -5386177 -4357687
44147 -4357687 -3335096 -2485875 -1727227 -1266561 -1074657 -768275 -238321 228814 489298
$$ packed form
44208C3065865k56557m006237n893163m863131j698616P82333N32225q86144l08380
44199A6468195K458015M587096M643103L950842L139440P97322l093794n668888
44191B7281331n140791l492465l027978k847979j339059K13297l34381k001413
44183I310562k048402l48133P53880M06044K1352J52389m72569k215233l255418
44174B304472k090929K82120J644588J059784n00192j405150r18506J86058O23357
44165A185602K68583J27590M77766L63429m18416m88312P15546J405081J48996
44156C785865j402825q90608P59067N29141j917364l573297k486309j89847J028490
44147d357687J022591Q49221P58648M60666J91904L06382N29954M67135K60484
$$ plain form
44138 489298 656472 724593 589932 423342 625548 1425937 2688472 3879344 4117176
44129 4117176 2763608 298581 -1844436 -2667210 -2401280 -1678263 -604434 826890 2071304
44120 2071304 2553467 2487168 2514263 2815776 3160477 3502285 3861311 3837911 2952542 1469874
44110 1469874 368791 414145 1492090 2740840 3145313 2321546 1058722 762371 1907573
44101 1907573 3304461 3411506 2189488 1073011 1170318 2136034 2984904 3390515 3669279
44092 3669279 3818181 3308042 2033430 951432 1287306 3225211 5698196 7333892 7373365
44083 7373365 6073537 4761115 5039129 7011849 8592358 7770546 5439655 4477311 5893155
44074 5893155 7680893 8028373 7664946 7911182 8323769 7913174 7161636 7080793 7557412
$$ packed form
44138D89298J67174O8121j34661j66590K02206Q00389J262535J190872K37832
44129D117176j353568k465027k143017q22774K65930P23017J073829J431324J244414
44120B071304M82163o6299K7095L01513L44701L41808L59026k3400q85369j482668
44110A469874j101083M5354J077945J248750M04473q23767j262824k96351J145202
44101A907573J396888J07045j222018j116477R7307R65716Q48870M05611K78764
44092C669279J48902n10139j274612j081998L35874J937905K472985J635696L9473
44083G373365j299828j312422K78014J972720J580509q21812k330891r62344J415844
44074E893155J787738L47480l63427K46236M12587m10595p51538q0843M76619
$$ plain form
44065 7557412 8257312 9709879 11746387 12566653 11506383 11003889 13324857 17051900 19579346
44056 19579346 21185307 23374092 25266201 25711128 27092179 32301664 39671284 46267976
44048 46267976 54313516 67793584 85024057 103924937 133207883 184075210 245544756
44041 245544756 281822279 266496662 212549093 157410328 123726784 106646452 94786650
44034 94786650 87076408 86259930 89935249 95431333 104714797 117222647 124159927 117208995
44026 117208995 99163649 79958782 65050917 53085534 42514456 34519106 29776386
44019 29776386 26954540 24963917 23801261 23016130 21572961 19231599 16500183 13673853
44011 13673853 11195772 10028847 10255869 10359509 9325511 8289325 8571062 9354185 9108026
$$ packed form
44065G557412O99900J452567K036508Q20266j060270n02494K320968L727043K527446
44056A9579346J605961K188785J892109M44927J381051N209485P369620O596692
44048D6267976Q045540J3480068J7230473J8900880K9282946N0867327O1469546
44041B45544756L6277523j5325617n3947569n5138765l3683544j7080332j1859802
44034I4786650p710242q16478L675319N496084R283464J2507850O937280o950932
44026A17208995j8045346j9204867j4907865j1965383j0571078p995350m742720
44019B9776386k821846j990623j162656p85131j443169k341362k731416k826330
44011A3673853k478081j166925K27022J03640j033998j036186K81737P83123k46159
$$ plain form
44002 9108026 8192444 8076303 8774312 9016250 8482588 8122409 8522518 9392791 10397188
43993 10397188 11306847 11693997 11475628 11204317 10910481 9552798 6788954 4282913 3685456
43984 3685456 4110489 3437025 1666175 1009151 2552507 4653110 5231983 4292531 3345972
43975 3345972 3262787 3656546 4008721 4435140 5056984 5218945 4118045 2241724 1298839
43966 1298839 2162972 3676691 4391245 4691069 5812281 7364554 7694406 6585952 5562663
43957 5562663 5192136 4202872 2083416 549836 1089487 2556562 2694363 1061094 -810149
43948 -810149 -1409106 -441178 1243477 2171528 1471686 81244 -229706 674322 1198959
43939 1198959 762074 758832 1919674 2685382 1651762 -45244 -474044 296922 848604
$$ packed form
44002I108026r15582j16141O98009K41938n33662l60179M00109Q70273J004397
43993A0397188R09659L87150k18369k71311k93836j357683k763844k506041n97457
43984C685456M25033o73464j770850o57024J543356K100603N78873r39452r46559
43975C345972q3185L93759L52175M26419O21844J61961j100900j876321r42885
43966A298839Q64133J513719P14554K99824J121212J552273L29852j108454j023289
43957E562663l70527r89264k119456j533580N39651J467075J37801j633269j871243
43948h10149n98957R67928J684655R28051o99842j390442l10950R04028N24637
43939A198959m36885l242J160842P65708j033620j697006m28800P70966N51682
$$ plain form
43930 848604 742878 523793 317990 49108 275829 1349250 2471612 2920109 3373429
43921 3373429 4668921 6085853 6273305 5166483 3730949 2623633 2356053 3868859
43913 3868859 7484161 11842402 14970412 15863612 14516741 11672790 9214144 9060430
43905 9060430 10597195 10987241 9178049 7471387 7685432 8276585 7398430 6394979 7543426
43896 7543426 10276967 12422605 13518912 14377490 15267338 17065537 21835048 29408604
43888 29408604 36236656 40956653 47637398 59459001 74020288 91386276 121035645
43881 121035645 168759209 217612331 235930256 210341617 161574797 121080707 99880937
43874 99880937 87751504 74988548 62912979 55171579 50193259 45064892 39896252 35376143
$$ packed form
43930H48604j05726k19085k05803k68882K26721J073421J122362M48497M53320
43921C373429J295492J416932J87452j106822j435534j107316k67580J512806
43913C868859L615302M358241L128010Q93200j346871k843951k458646j53714
43905I060430J536765L90046j809192j706662K14045N91153q78155j003451J148447
43896G543426K733541K145638J096307Q58578Q89848J798199M769511P573556
43888B9408604O828052M719997O680745J1821603J4561287J7365988K9649369
43881A21035645M7723564M8853122J8317925k5588639m8766820m0494090k1199770
43874I9880937j2129433j2762956j2075569p741400m978320n128367n168640m520109
$$ plain form
43866 35376143 30520210 25109928 20999087 19267151 18670563 17950242 17169854 16003151
43858 16003151 13281504 9216972 5845456 4343468 3837358 3548539 4073558 5632018
43850 5632018 6867355 6495118 4878287 3164891 1916567 1094912 389121 -706762 -2061046
43841 -2061046 -2117227 641056 5193063 8399319 8381071 6248749 4114120 2768509 1927029
43832 1927029 1442284 1297744 1195400 997193 1118519 1926114 3093228 3895732 3885791 3190839
43822 3190839 2444357 2295779 2597415 2350490 958532 -841412 -1869527 -1791520 -830495
43813 -830495 999136 3230848 4296839 3176435 1350173 1372367 3495937 5395061 5403220
43804 5403220 4290866 3415286 2868790 2269099 1868263 1843389 1664835 1175359 1267642 2470280
$$ packed form
43866C5376143m855933n410282m110841j731936n96588p20321p80388j166703
43858A6003151k721647m064532l371516j501988n06110k88819N25019J558460
43850E632018J235337l72237j616831j713396j248324q21655p05791j095883j354284
43841b061046n6181K758283M552007L206256j8248k132322k134629j345611q41480
43832A927029m84745j44540j02344j98207J21326Q07595J167114Q02504r941o94952
43822C190839p46482j48578L01636k46925j391958j799944j028115P8007R61025
43813h30495J829631K231712J065991j120404j826262K2194K123570J899124Q159
43804E403220j112354q75580n46496n99691m00836k4874j78554m89476R2283J202638
$$ plain form
43794 2470280 3795632 4107696 3862835 4282893 5332567 5775237 5048552 3974835 3525993
43785 3525993 3707526 3854958 3517628 2929295 2901370 4165463 6513763 8749009 9809938
43776 9809938 9757495 9342816 8922748 8313858 7511724 6928336 6866113 7223724 7799438 8481796
43766 8481796 9083743 9483267 10149129 12022958 15380153 19083436 21573195 22527660 22861309
43757 22861309 22970942 21874311 18730252 14531402 11266567 9663946 8824272 8017787
43749 8017787 7578885 7664439 7382748 6017940 4290368 3473717 3786490 4444863 4795364
43740 4795364 4581199 3576084 1891603 349636 -340060 -601434 -1441635 -3064049 -4678326
43731 -4678326 -5400738 -4715847 -2541712 287779 2060185 1765894 390636 -329347 -74466
$$ packed form
43794B470280J325352L12064k44861M20058J049674M42670p26685j073717m48842
43785C525993J81533J47432l37330n88333k7925J264093K348300K235246J060929
43776I809938n2443m14679m20068o08890q02134n83388o2223L57611N75714O82358
43766H481796O01947L99524O65862J873829L357195L703283K489759R54465L33649
43757B2861309J09633j096631l144059m198850l264835j602621q39674q06485
43749H017787m38902Q5554k81691j364808j727572q16651L12773O58373L50501
43740D795364k14165j005115j684481j541967o89696k61374q40201j622414j614277
43731d678326p22412O84891K174135K829491J772406k94291j375258p19983K54881
$$ plain form
43722 -74466 223399 237062 452102 735599 398852 -163885 345266 1811412 2297272 850453
43712 850453 -794312 -525693 1335574 2916638 3564596 4164937 5155327 5832768 5741305
43703 5741305 5442175 5444321 5251316 4090053 2191020 829083 1109361 2910738 5056352
43694 5056352 6435871 6842724 6725701 6453346 6124200 5794546 5342242 4274529 2370090
43685 2370090 508474 78018 1343294 3092770 4154615 4528426 4673707 4514890 3830136
43676 3830136 3019957 2662538 2583619 2102142 1120096 366153 482227 1268621 1969865 2110892
43666 2110892 1896386 1738203 1510036 696735 -492949 -807816 456614 2008036 1921375
43657 1921375 395323 -283589 1082925 2946033 3383057 2747067 2574317 2878439 2352852
$$ packed form
43722g4466K97865J3663K15040K83497l36747n62737N09151J466146M85860j446819
43712H50453j644765K68619J861267J581064O47958O00341R90390O77441r1463
43703E741305k99130K146j93005j161263j899033j361937K80278J801377K145614
43694E056352J379519M06853j17023k72355l29146l29654m52304j067713j904439
43685B370090j861616m30456J265276J749476J061845L73811J45281j58817o84754
43676C830136q10179l57419p8919m81477r82046p53943J16074P86394P01244J41027
43666B110892k14506j58183k28167q13301j189684l14867J264430J551422q6661
43657A921375j526052o78912J366514J863108M37024o35990j72750L04122n25587
$$ plain form
43648 2352852 937343 341746 1629303 3676593 4752692 4739947 5043640 6783482 9654871
43639 9654871 12277861 13197689 11718217 8228835 3925396 191781 -1934946 -2148794
43631 -2148794 -1089973 47842 563403 832090 1532751 2529251 3061481 2927200 2811292
43622 2811292 3343184 4414554 5588162 6566859 6954277 6165913 4167299 1999678 994581
43613 994581 1509827 2782487 3887117 4448155 4546232 4447125 4492758 4819406 5042194 4590727
43603 4590727 3496820 2447296 1866375 1408648 666668 -147815 -748402 -1477088 -2641566
43594 -2641566 -3483990 -2887138 -1133318 161204 199579 10935 710881 1792218 2101421
43585 2101421 1742898 1832602 2743422 3725727 4109578 3842001 2907422 1314882 -179229
$$ packed form
43648B352852j415509n95597J287557K047290J076099j2745L03693J739842K871389
43639I654871K622990R19828j479472l489382m303439l733615k126727k13848
43631b148794J058821J137815N15561K68687P00661R96500N32230j34281j15908
43622B811292N31892J071370J173608R78697L87418p88364j998614k167621j005097
43613I94581N15246J272660J104630N61038R8077r9107M5633L26648K22788m51467
43603D590727j093907j049524n80921m57727p41980q14483o00587p28686j164478
43594b641566q42424N96852J753820J294522L8375j88644O99946J081337L09203
43585B101421l58523Q9704R10820R82305L83851k67577r34579j592540j494111
$$ plain form
43576 -179229 -387211 813344 2057496 2117185 1481344 1775829 3766394 6354776 7744410
43567 7744410 7549619 7387498 8972986 12053214 15280159 18886314 24496064 31412461
43559 31412461 35288092 32737141 25991341 20345702 17659571 15339499 11663680 8650115
43551 8650115 8402010 9528310 9296935 7459716 5855437 5516829 6144720 7561526 9822655
43542 9822655 12281875 13908831 14223691 13123591 10623378 7688277 6213088 6874170
43534 6874170 7912517 7367146 5653205 4591723 4792901 5499803 6225680 6969965 7460680
43525 7460680 7681748 8491765 10272194 11779212 11906118 11601567 12160393 12667166 11551992
43516 11551992 9947583 10710968 14317049 18583959 22680982 28394967 36415513 43918271
$$ packed form
43576a79229k07982J200555J244152N9689o35841K94485J990565K588382J389634
43567G744410j94791j62121J585488L080228L226945L606155N609750O916397
43559C1412461L875631k550951o745800n645639k686131k320072l675819l013565
43551H650115k48105J126300k31375j837219j604279l38608O27891J416806K261129
43542I822655K459220J626956L14860j100100k500213k935101j475189O61082
43534F874170J038347n45371j713941j061482K01178P06902P25877P44285M90715
43525G460680K21068Q10017J780429J507018J26906l04551N58826N06773j115174
43516A1551992j604409P63385L606081M266910M097023N713985Q020546P502758
$$ plain form
43508 43918271 47400547 46453098 43814408 42969170 45858896 50942290 53118672 47992475
43500 47992475 37182228 27223202 22289103 20429861 18084089 15211337 13641712 12959067
43492 12959067 11236866 8472367 6325941 5237800 4351795 3604462 3457684 3222177 2149828
43483 2149828 1610044 3453617 6513389 7657959 6475129 5908542 7547615 9230902
43475 9230902 8717738 7245447 7561191 10207098 13654684 16783331 19303073 20607645
43467 20607645 20076256 18192183 16037590 14043748 12293681 11381579 11606205 11831518 10716702
43458 10716702 8929648 8649283 10805628 14260434 17970012 22378148 27797385 32552876
43450 32552876 33950167 30767163 24156633 16573802 10459482 7328601 6962264 7450796
$$ packed form
43508D3918271L482276r47449k638690q45238K889726N083394K176382n126197
43500D7992475j0810247r959026m934099j859242k345772k872752j569625o82645
43492A2959067j722201k764499k146426j088141q86005p47333j46778k35507j072349
43483B149828n39784J843573L059772J144570j182830n66587J639073J683287
43475I230902n13164j472291L15744K645907L447586L128647K519742J304572
43467B0607645n31389j884073k154593j993842j750067r12102K24626K25313j114816
43458A0716702j787054k80365K156345L454806L709578M408136N419237M755491
43450C2552876J397291l183004o610530p582831o114320l130881l66337M88532
$$ plain form
43442 7450796 6923984 5492150 4879087 5989824 7560317 7643888 5906761 3874672 3150960
43433 3150960 3912892 5100519 5653425 5458874 5270697 5746472 6589541 6870349 6241241
43424 6241241 5395171 5048438 4966135 4541730 3932279 3803213 4076286 3850472 2798467
43415 2798467 1853729 2012291 2956232 3454761 2963907 2360089 2979271 5063514 7287441
43406 7287441 8008324 7036188 5807793 5557993 5834886 5420327 4226321 3306929 3208037
43397 3208037 3424227 3528409 3681512 3804851 3453247 2914522 3200543 4354913 5029503
43388 5029503 4533625 3990407 4354261 4570933 3257615 1249661 687039 2107345 4168611
43379 4168611 5842537 7050367 7393543 6354588 4931926 4972253 6334645 6752145 5346620
$$ packed form
43442G450796n26812j431834o13063J110737J570493Q3571j737127k032089p23712
43433C150960P61932J187627N52906j94551j88177M75775Q43069K80808o29108
43424F241241q46070l46733q2303m24405o09451j29066K73073k25814j052005
43415B798467r44738J58562R43941M98529m90854o03818O19182K084243K223927
43406G287441P20883r72136j228395k49800K76893m14559j194006r19392r8892
43397C208037K16190J04182J53103J23339l51604n38725K86021J154370O74590
43388E029503m95878n43218L63854K16672j313318k007954n62622J420306K061266
43379D168611J673926J207830L43176j038955j422662M0327J362392M17500j405525
$$ plain form
43370 5346620 4211260 5159755 6810486 6824953 5630605 5613118 7341481 8947174 9106197
43361 9106197 8403371 7446980 5801604 3650397 2626035 3595692 4942981 4652221 3267677
43352 3267677 3054746 4548911 5729536 4945973 3140899 2355966 3116274 4362199 5298699
43343 5298699 6042328 6555868 6167040 4598575 2684119 1441019 879911 357608 -143088
43334 -143088 204750 1906771 4280886 6054898 6615464 6459897 6556623 7436431 8785301
43325 8785301 9689638 9306626 7575508 5433651 4155495 4204590 4758092 4617768 3584421
43316 3584421 2558920 2180264 1927923 1076393 100632 269855 1845646 3519684 3947291
43307 3947291 3200877 2352356 2235022 3098259 4903257 7248509 9288418 10352547 10494114
$$ packed form
43370E346620j135360R48495J650731J4467j194348j7487J728363J605693J59023
43361I106197p02826r56391j645376k151207j024362R69657J347289k90760j384544
43352C267677k12931J494165J180625p83563j805074p84933P60308J245925R36500
43343E298699P43629N13540l88828j568465j914456j243100n61108n22303n00696
43334a43088L47838J702021K374115J774012N60566j55567R6726Q79808J348870
43325H785301R04337l83012j731118k141857j278156M9095N53502j40324j033347
43316C584421j025501l78656k52341q51530r75761J69223J575791J674038M27607
43307C947291p46414q48521j17334Q63237J804998K345252K039909J064129J41567
$$ plain form
43298 10494114 10008349 8796755 6842710 4937164 4018544 3879488 3465768 2602169 2503589
43289 2503589 4137580 6768337 8677379 8896920 7753033 6084556 4535570 3513022
43281 3513022 3297351 3952510 5189712 6376992 6836949 6419784 5781247 5726743 6170128
43272 6170128 6158786 5186331 4060333 3973889 4913925 5571268 4940670 3566512 2890145
43263 2890145 3559632 4728230 5030751 3958490 2143122 590853 -5023 614712 2218371
43254 2218371 3951819 4803459 4656427 4559162 5452164 6846658 7353302 6464919 5201285
43245 5201285 4839768 5519989 6369722 6616868 6227198 5676695 5460898 5766207 6317900
43236 6317900 6493226 5840811 4718301 4301170 5558356 8030541 10011238 10403047 10134115
$$ packed form
43298A0494114m85765j211594j954045j905546r18620j39056m13720q63599r8580
43289B503589J633991K630757J909042K19541j143887j668477j548986j022548
43281C513022k15671O55159J237202J187280M59957m17165o38537n4504M43385
43272F170128j1342r72455j125998q6444R40036O57343o30598j374158o76367
43263B890145O69487J168598L02521j072261j815368j552269n95876O19735J603659
43254B218371J733448Q51640j47032r7265Q93002J394494N06644q88383j263634
43245E201285l61517O80221Q49733K47146l89670n50503k15797L05309N51693
43236F317900J75326o52415j122510m17131J257186K472185J980697L91809k68932
$$ plain form
43227 10134115 11084681 13744276 16755912 18748596 19479567 18863108 16319304 12158703
43219 12158703 8530171 7530253 8867117 10610699 11679615 12227157 12233093 11618032 11571748
43210 11571748 13704221 17535610 20694500 22075056 22849572 23665829 23086706 20255951
43202 20255951 17139993 16063985 16366381 15730408 13953637 12995857 13594843 14221174 13685893
43193 13685893 12677841 12009977 11136587 9488771 7968984 7870044 9055598 10278839 10809694
43184 10809694 10777088 10232678 8932930 7170935 5985797 6046681 6702548 6682769 5684953
43175 5684953 4717192 4653270 5045487 4972380 4564054 4669920 5226133 5269597 4714585 4559439
43165 4559439 4752320 3638103 820443 -1091563 372219 3753577 5400424 4441135
$$ packed form
43227A0134115R50566K659595L011636J992684P30971o16459k543804m160601
43219A2158703l628532r99918J336864J743582J068916N47542N936o15061m6284
43210A1571748K132473L831389L158890J380556P74516Q16257n79123k830755
43202B0255951l115958j076008L02396o35973j776771r57780N98986O26331n35281
43193A3685893j008052o67864q73390j647816j519787r8940J185554J223241N30855
43184A0809694l2606n44410j299748j761995j185138O0884O55867j9779r97816
43175E684953r67761o3922L92217p3107m08326J05866N56213M3464n55012j55146
43165D559439J92881j114217k817660j912006J463782L381358J646847r59289
$$ plain form
43157 4441135 3477854 4403554 6345722 8439868 11788260 16921225 21394322 22147438 19237108
43148 19237108 15425538 12858253 11830714 12153366 13808261 16270162 18637669 20544104
43140 20544104 21866951 21697774 18896912 13832855 8515881 4762551 2963660 2591544
43132 2591544 2948030 3322489 3349955 3405473 3886238 4147537 3187030 1470127 803708 1898940
43122 1898940 3245982 3244841 2475333 2698659 4177966 5304539 4889277 3724805 3457611
43113 3457611 4589671 6124827 6874095 6608387 5942779 5470483 5252246 5044448 4725520
43104 4725520 4350807 3985121 3745838 3918905 4695911 5750596 6399853 6349074 6039554
43095 6039554 6058992 6406595 6615990 6503657 6440344 6750716 7099655 6788775 5640643 4265426
$$ packed form
43157D441135r63281R25700J942168K094146L348392N132965M473097P53116k910330
43148A9237108l811570k567285j027539L22652J654895K461901K367507J906435
43140B0544104J322847j69177k800862n064057n316974l753330j798891l72116
43132B591544L56486L74459K7466N5518M80765K61299r60507j716903o66419J095232
43122A898940J347042j141p69508K23326J479307J126573m15262j164472k67194
43113C457611J132060J535156P49268k65708o65608m72296k18237k07798l18928
43104D725520l74713l65686k39283J73067P77006J054685O49257n0779l09520
43095F039554J9438L47603K09395j12333o3313L10372L48939l10880j148132j375217
$$ plain form
43085 4265426 3316086 2824443 2596023 2880876 3953262 5136281 5173983 3909073 2758381
43076 2758381 2932451 3920619 4534743 4748621 5324412 6014242 5586189 3779855 1901693
43067 1901693 994311 571536 -95726 -407543 815968 3491061 6117989 7372676 7293115
43058 7293115 7032695 7847633 10118693 13022236 15327608 16563990 16929489 16168959 13703730
43049 13703730 10306184 8269098 8786219 10230648 10418859 9626026 9570336 10163882 9660987
43040 9660987 8002474 7432490 8972843 10580555 10202088 8759719 8313128 8723661 8270007
43031 8270007 6710974 5568612 5692596 6504854 7587313 9136531 10655679 10994423 10188603
43022 10188603 9753298 10639749 12319828 14335590 17029533 19848968 20682753 18465009
$$ packed form
43085D265426r49340m91643k28420K84853J072386J183019L7702j264910j150692
43076B758381J74070R88168O14124K13878N75791O89830m28053j806334j878162
43067A901693r07382m22775o67262l11817J223511K675093K626928J254687p9561
43058G293115k60420Q14938K271060K903543K305372J236382L65499p60530k465229
43049A3703730l397546k037086N17121J444429J88211p92833n5690N93546n02895
43040I660987j658513n69984J540353J607712l78467j442369m46591M10533m53654
43031H270007j559033j142362J23984Q12258J082459J549218J519148L38744q05820
43022A0188603m35305Q86451J680079K015762K693943K819435Q33785k217744
$$ plain form
43014 18465009 15297928 14270352 15771949 17493826 17611210 16366457 14697009 12966577
43006 12966577 11358078 10191948 9370666 8474420 7747077 8019125 9258562 10169838 9819792
42997 9819792 8878957 8615606 9303509 10289776 11114479 11849448 12649538 13575767 14609410
42988 14609410 15323616 14846675 12780222 10007690 8005920 7391228 7627940 8095022 8822965
42979 8822965 9992900 11208613 11706970 11215638 10324623 9885859 10102797 10371670 10118945
42970 10118945 9624330 9738423 10846783 12427274 13589654 13677007 12441933 10314618 8655722
42961 8655722 8922478 11007502 13008539 13376534 12855629 13446962 15719599 18125139 18979570
42952 18979570 18127012 16343255 14045007 11333787 8820989 7544458 7958113 9399253
$$ packed form
43014A8465009l167081j027576J501597J721877J17384j244753j669448j730432
43006A2966577j608499j166130q21282q96246p27343K72048J239437R11276l50046
42997I819792r40835k63351O87903R86267Q24703P34969Q00090R26229J033643
42988A4609410P14206m76941k066453k772532k001770o14692K36712M67082P27943
42979H822965J169935J215713M98357m91332q91015m38764K16938K68873k52725
42970A0118945m94615J14093J108360J580491J162380Q7353j235074k127315j658896
42961H655722K66756K085024K001037L67995n20905N91333K272637K405540Q54431
42952A8979570q52558j783757k298248k711220k512798j276531M13655J441140
$$ plain form
42944 9399253 10684378 11101717 10836659 10573970 10752819 11214881 11534864 11524198 11301173
42935 11301173 11074427 11096465 11617013 12486929 12942413 12321968 11086451 10636652 11859344
42926 11859344 14136326 15970403 16356068 15457220 14280111 13847563 14396378 15208452 15448263
42917 15448263 15167672 15062266 15206556 14727118 13115921 11230498 10318104 10443494 10636940
42908 10636940 10360117 9955346 9659183 9164530 8571685 8909345 10848967 13267173 14031691
42899 14031691 12354562 9681048 7956897 7605858 7697901 7577379 7445220 7437743 7137426
42890 7137426 6424982 6054972 6679983 7745571 8095571 7411759 6308679 5198215 3944329
42881 3944329 2665626 1968226 2103716 2633707 3209816 3936733 4617806 4488267 3348029
$$ packed form
42944I399253J285125M17339k65058k62689J78849M62062L19983j0666k23025
42935A1301173k26746K2038N20548Q69916M55484o20445j235517m49799J222692
42926A1859344K276982J834077L85665q98848j177109m32548N48815Q12074K39811
42917A5448263k80591j05406J44290m79438j611197j885423r12394J25390J93446
42908A0636940k76823m04771k96163m94653n92845L37660J939622K418206P64518
42899A4031691j677129k673514j724151l51039R2043j20522j32159p477l00317
42890G137426p12444l70010O25011J065588L50000o83812j103080j110464j253886
42881C944329j278703o97400J35490N29991N76109P26917O81073j29539j140238
$$ plain form
42872 3348029 2335371 2824400 4873576 7280626 8789419 8805358 7489063 5794527 4949179
42863 4949179 5229300 5685235 5677883 6000734 7539823 9457082 10005082 8869973 7372091
42854 7372091 6406120 5579515 4597831 4099677 4530898 5283824 5608239 5517911 5248348 4696085
42844 4696085 3999421 3806378 4253978 4471297 3869045 3177251 3331846 4023415 4383626
42835 4383626 4570774 5488820 7185749 8688949 9385042 9462580 8899279 7195049 4594929
42826 4594929 2588760 2349295 3168276 3271782 2017057 511770 -30643 220531 372115
42817 372115 406103 1188089 2862221 4235042 4329844 3800212 3928493 4732869 5141498 4771982
42807 4771982 4301147 4045475 3470530 2443582 1767277 1935745 2413659 2699379 3050605
$$ packed form
42872C348029j012658M89029K049176K407050J508793J5939j316295j694536q45348
42863D949179K80121M55935p352L22851J539089J917259N48000j135109j497882
42854G372091r65971q26605r81684m98154M31221P52926L24415r0328k69563n52263
42844D696085o96664j93043M47600K17319o02252o91794J54595O91569L60211
42835D383626J87148R18046J696929J503200O96093P7538n63301j704230k600120
42826D594929k006169k39465Q18981J03506j254725j505287n42413K51174J51584
42817C72115L3988P81986J674132J372821R4802n29632J28281Q04376M08629l69516
42807D771982m70835k55672n74945j026948o76305J68468M77914K85720L51226
$$ plain form
42798 3050605 3561177 3654724 3259903 3372746 4564103 5995896 6809039 7280478 7591481
42789 7591481 6908470 5128540 4052700 4891891 5900591 4844864 2838307 2991829 5761128
42780 5761128 8561206 9949463 11099571 12592389 12853747 11040140 8815211 7679038
42772 7679038 6799455 5193827 3985320 4527924 6002174 6898096 7420115 8338198 8773320
42763 8773320 7468067 5380301 4650114 5406352 5750912 4765743 3577694 3321892 3685412
42754 3685412 3743732 3072188 1915417 1065383 1274546 2050013 1777612 -2030 -1505394
42745 -1505394 -1194461 -95271 141335 177780 1587148 3571429 4078071 3752908 5510444
42736 5510444 9907209 14153503 16468354 18206509 20326505 20848962 17980227 13425851
$$ packed form
42798C050605N10572R3547l94821J12843J191357J431793Q13143M71439L11003
42789G591481o83011j779930j075840Q39191J008700j055727k006557J53522K769299
42780E761128K800078J388257J150108J492818K61358j813607k224929j136173
42772G679038q79583j605628j208507N42604J474250Q95922N22019R18083M35122
42763H773320j305253k087766p30187P56238L44560r85169j188049k55802L63520
42754C685412N8320o71544j156771q50034K09163P75467k72401j779642j503364
42745a505394L10933J099190K36606L6445J409368J984281N06642l25163J757536
42736E510444M396765M246294K314851J738155K119996N22457k868735m554376
$$ plain form
42728 13425851 10260232 9196364 9100732 9610280 10850143 11697784 10775411 8643581 7053297
42719 7053297 6537364 6484242 6899948 8128199 9337658 9386423 9027176 10265248 13422359
42710 13422359 16576664 18051169 17832017 16430979 14131444 11784265 10710899 11105137
42702 11105137 11703273 11506992 10697420 9555265 7905471 6228074 5910953 7426595 9264959
42693 9264959 9640899 8530214 7211099 6502316 6306415 6323092 6345817 6188285 5983962
42684 5983962 6233824 7001000 7453491 6827687 5538119 4717705 4868936 5542086 6214176
42675 6214176 6908405 7838750 8777675 8997069 7930361 5963300 4348454 3978746 4415771
42666 4415771 4651481 4651525 5300863 6713396 7569768 6681392 4545572 2748298 2274938 2898138
$$ packed form
42728A3425851l165619j063868r5632N09548J239863Q47641r22373k131830j590284
42719G053297n15933n3122M15706J228251J209459M8765l59247J238072L157111
42710A3422359L154305J474505k19152j401038k299535k347179j073366L94238
42702A1105137N98136j96281q09572j142155j649794j677397l17121J515642J838364
42693I264959L75940j110685j319115p08783j95901J6677K2725j57532k04323
42684E983962K49862P67176M52491o25804j289568q20414J51231O73150O72090
42675F214176O94229R30345R38925K19394j066708j967061j614846l69708M37025
42666D415771K35710M4O49338J412533Q56372q88376k135820j797274m73360O23200
$$ plain form
42656 2898138 3781857 4163560 3783466 3094050 2778738 2838032 2650867 2177574 2320115 3514096
42646 3514096 4684318 4417775 2702803 730315 -601246 -1173792 -1043188 -263150 864506
42637 864506 2095440 3535272 4967146 5451784 4644893 4019844 5334677 7951657 9172988
42628 9172988 7537741 4446167 2093780 1169773 1287879 2312980 4060094 5579369
42620 5579369 6045749 5929881 6226646 6880771 7011514 6434503 5861553 5612557 5167339
42611 5167339 4214626 3286047 2983893 3227333 3674015 4381771 5536237 6779414 7354675
42602 7354675 7017895 6484011 6685268 7633588 8346413 8081762 7318136 7093736 7622161
42593 7622161 8164326 8139190 7630178 6840084 5938415 5534400 6298813 7985155 10050323
$$ packed form
42656B898138Q83719L81703l80094o89416l15312N9294j87165m73293J42541J193981
42646C514096J170222k66543j714972j972488j331561n72546J30604P80038J127656
42637H64506J230934J439832J431874M84638q06891o25049J314833K616980J221331
42628I172988j635247l091574k352387r24007J18106J025101J747114J519275
42620E579369M66380j15868K96765O54125J30743n77011n72950k48996m45218
42611E167339r52713r28579l02154K43440M46682P07756J154466J243177N75261
42602G354675l36780n33884K01257R48320P12825k64651p63626k24400N28425
42593G622161N42165k5136n09012p90094r01669m04015P64413J686342K065168
$$ plain form
42584 10050323 13349137 19245144 26168251 29362900 26168796 19933732 16142174 15880715
42576 15880715 16168657 15890321 17338756 21195613 23915883 22249227 17633047 13745873
42568 13745873 11763617 10443413 9230400 8665968 8759546 9312571 10992485 13835897 15567273
42559 15567273 13918522 10090844 7405326 6856704 6604200 5704653 5403013 6206823 6509022
42550 6509022 5273724 3825499 3691335 4545376 5491046 6556287 7592129 7444533 5831013
42541 5831013 4595412 5366238 7071881 7480035 6309956 5079322 4484466 3712216 2221479
42532 2221479 773707 542723 2037358 4780870 7401799 8427923 7717173 6728735 6810816
42523 6810816 7813217 8948042 10093739 11315123 11954462 11405539 10265357 9661924 9888335
$$ packed form
42584A0050323L298814N896007O923107L194649l194104o235064l791558k61459
42576A5880715K87942k78336J448435L856857K720270j666656m616180l887174
42568A3745873j982256j320204j213013n64432R3578N53025J679914K843412J731376
42559A5567273j648751l827678k685518n48622k52504q99547l01640Q03810L02199
42550F509022j235298j448225j34164Q54041R45670J065241J035842j47596j613520
42541E831013j235601P70826J705643M08154j170079j230634n94856p72250j490737
42532B221479j447772k30984J494635K743512K620929J026124p10750r88438Q2081
42523F810816J002401J134825J145697J221384O39339n48923j140182o03433K26411
$$ plain form
42514 9888335 10544068 11346130 11867792 11298240 9606895 8167688 8006064 8246608 7653444
42505 7653444 6797285 7000638 7899446 8021471 7316697 7055899 7456518 7546359 7378239 8133701
42495 8133701 9653094 10056032 8618360 7169784 7649862 9751771 11884669 13141731
42487 13141731 13443871 12938820 12132051 11642922 11222498 10058684 8507175 8190772 9697941
42478 9697941 11485102 11906192 11192904 10623037 10855445 11914917 13702236 15583062 16415204
42469 16415204 15833240 14698346 13737375 12789919 11872210 11604849 11893669 11644893 10599050
42460 10599050 9895767 9948370 9606685 8632400 8911425 11341800 13414147 12310769 9046741
42451 9046741 6974106 7188391 8068772 8591129 9168908 9475701 8431758 6709142 6545512
$$ packed form
42514I888335O55733Q02062N21662n69552j691345j439207j61624K40544n93164
42505G653444q56159K03353Q98808J22025p04774k60798M00619Q9841j68120P55462
42495H133701J519393M02938j437672j448576M80078K101909K132898J257062
42487A3141731L02140n05051q06769m89129m20424j163814j551509l16403J507169
42478I697941J787161M21090p13288n69867K32408J059472J787319J880826Q32142
42469A6415204n81964j134894r60971r47456r17709k67361K88820k48776j045843
42460A0599050p03283N2603l41685r74285K79025K430375K072347j103378l264028
42451I046741k072635K14285Q80381N22357N77779L06793j043943j722616j63630
$$ plain form
42442 6545512 8346374 9828423 9411981 8313350 8195677 8664040 8414596 7376522 6357466
42433 6357466 5637439 5122109 5108104 5854702 6847124 7125549 6052330 3744445 1417351
42424 1417351 999950 3147119 5756983 6017065 3992943 2435438 2823224 3689665 3483405
42415 3483405 2798174 2556846 2125944 944990 275032 1357621 3136448 3750582 3250145
42406 3250145 2975007 3231357 3530465 4232609 5832015 7263655 7084460 5883827 5375986
42397 5375986 5509458 4822610 3452156 3180378 4258046 4829022 4204766 4150875 5784862
42388 5784862 7540968 7722545 7021584 6726696 6234242 4491596 2596342 2593921 4330712
42379 4330712 5627577 5284370 4065604 2951493 2260820 2425481 3731822 5058331 4672546
$$ packed form
42442F545512J800862J482049m16442j098631j17673M68363k49444j038074j019056
42433F357466p20027n15330j4005P46598R92422K78425j073219k307885k327094
42424A417351m17401K147169K609864K60082k024122j557505L87786Q66441k06260
42415C483405o85231k41328m30902j180954o69958J082589J778827O14134n00437
42406C250145k75138K56350K99108P02144J599406J431640j79195j200633n07841
42397E375986J33472o86848j370454k71778J077668N70976o24256n3891J633987
42388E784862J756106J81577p00961k94888m92454j742646j895254k421J736791
42379D330712J296865l43207j218766j114111o90673J64661J306341J326509l85785
$$ plain form
42370 4672546 2791194 1718431 2733400 4327145 4486098 3484282 3223940 4614588
42362 4614588 6745492 8178761 8109060 6574477 4354356 2524247 1608055 1401801 1863413
42353 1863413 3470187 6127911 8464022 9090540 8133579 6747616 5606789 4704384 4085671
42344 4085671 3734304 3192221 2454152 2775802 5092010 7842607 8189196 5749491 3380465
42335 3380465 3482736 5125380 5980441 5685956 5643562 6371351 6963089 7004958 7287179 8216862
42325 8216862 8870001 8355349 7267687 6927567 7507490 7682010 6319862 4124525 3083083
42316 3083083 4094376 5623821 5470752 3750788 3000271 4855155 7752627 8935460
42308 8935460 7880122 6380221 5748209 5571849 5247305 5080251 5318016 5462268 5355533
$$ packed form
42370D672546j881352j072763J014969J593745J58953j001816k60342J390648
42362D614588K130904J433269o9701j534583k220121j830109r16192k06254M61612
42353A863413J606774K657724K336111O26518r56961j385963j140827r02405o18713
42344D085671l51367n42083p38069L21650K316208K750597L46589k439705k369026
42335C380465J02271J642644Q55061k94485m2394P27789N91738M1869K82221R29683
42325H216862O53139n14652j087662l40120N79923J74520j362148k195337j041442
42316C083083J011293J529445j53069j719964p50517J854884K897472J182833
42308H935460j055338j499901o32012j76360l24544j67054K37765J44252j06735
$$ plain form
42299 5355533 5829936 7264808 8367145 7603123 5383003 3637638 3407583 4001765 4588716
42290 4588716 5391489 6758485 8016702 8205710 7536857 7152702 7459218 7611610 6971395
42281 6971395 6241720 6439550 7284353 7585540 7049713 6594856 6669053 6420182 5222539
42272 5222539 4058414 4272325 5454691 5766894 4318479 2222010 1163136 1734734 3309366
42263 3309366 4757310 5079252 4117458 3016477 3342647 5318694 7415525 8081066 7434642
42254 7434642 6814449 6974760 7244952 6488830 4650705 3146792 3448195 5201037 6314746
42245 6314746 5444200 3818467 3641368 5055517 6077455 5632987 5066332 5876398 7321011
42236 7321011 7587141 6578536 6098493 7404345 9723727 11323912 11213195 9602307 7386555
$$ packed form
42299E355533M74403J434872J102337p64022k220120j745365k30055N94182N86951
42290D588716Q02773J366996J258217J89008o68853l84155L06516J52392o40215
42281F971395p29675J97830Q44803L01187n35827m54857P4197k48871j197643
42272E222539j164125K13911J182366L12203j448415k096469j058874N71598J574632
42263C309366J447944L21942r61794j100981L26170J976047K096831O65541o46424
42254G434642o20193J60311K70192p56122j838125j503913L01403J752842J113709
42245F314746q70546j625733j77099J414149J021938m44468n66655Q10066J444613
42236G321011K66130j008605m80043J305852K319382J600185j10717j610888k215752
$$ plain form
42227 7386555 5538410 4661401 4804584 5634410 6640398 7153748 6619007 5255877 4186906
42218 4186906 4447629 5945625 7653647 8623118 8569764 7834158 7167843 7181878 7495810
42209 7495810 6846296 4776260 2878519 3284379 5809168 7702465 6832256 4301650 3017984
42200 3017984 4128050 5959640 6512142 5881390 5618534 6469399 7703122 8359477 8120455
42191 8120455 6905589 4693715 2225594 986683 1734892 3610074 5357691 6793451
42183 6793451 8251477 9302875 9247310 8489375 8098525 8111457 7557818 6175807 4793455
42174 4793455 3926508 3407659 3590201 5290959 8000425 9762475 9669991 9020734 9086634
42165 9086634 9288708 8767147 8149268 8104993 7558890 5416701 3040676 2621297 3615549
$$ packed form
42227G386555j848145q77009J43183Q29826J005988N13350n34741j363130j068971
42218D186906K60723J497996J708022R69471n3354p35606o66315J4035L13932
42209G495810o49514k070036j897741M05860K524789J893297q70209k530606j283666
42200C017984J110066J831590N52502o30752k62856Q50865J233723O56355k39022
42191H120455j214866k211874k468121j238911P48209J875182J747617J435760
42183F793451J458026J051398n5565p57935l90850J2932n53639j382011j382352
42174D793455q66947n18849J82542J700758K709466J762050r2484o49257O5900
42165I086634K02074n21561o17879m4275n46103k142189k376025m19379R94252
$$ plain form
42156 3615549 3372765 1386499 346080 2115045 4817789 5316340 3160168 637266
42148 637266 -216315 671237 2184491 3306763 3665592 3558590 3563157 3876966 4196365 4357361
42138 4357361 4673479 5373694 6133097 6526013 6605714 6639646 6503357 5743391 4194009 2278519
42128 2278519 694007 -75083 67181 1010191 2591169 4415192 5750793 6119992 6021962
42119 6021962 6434404 7359606 7597296 6465881 5027179 4792475 5707899 6341530 5819248
42110 5819248 4727749 4204168 4796218 6059691 6741393 5749540 3596630 2353547 3323512
42101 3323512 5322932 6287856 5940689 5502059 5324810 4632514 3519936 3291797 4391785
42092 4391785 5649778 6133009 6188369 6024908 4911527 2767340 1095167 1107898 2046926
$$ packed form
42156C615549k42784j986266j040419J768965K702744M98551k156172k522902
42148F37266q53581Q87552J513254J122272L58829j07002M567L13809L19399J60996
42138D357361L16118P00215P59403L92916P9701L3932j36289p59966j549382j915490
42128B278519j584512p69090J42264R43010J580978J824023J335601L69199r8030
42119F021962M12442R25202K37690j131415j438702k34704R15424O33631n22282
42110E819248j091499n23581N92050J263473O81702r91853k152910j243083R69965
42101C323512J999420R64924l47167m38630j77249o92296j112578k28139J099988
42092D391785J257993M83231N5360j63461j113381k144187j672173J2731R39028
$$ plain form
42083 2046926 2535664 2537100 2682777 2672208 1925423 1155822 1570656 2722332 2779309 1095089
42073 1095089 -887567 -1685790 -1530169 -1416094 -1316442 -318450 1711450 3438747 3343467
42064 3343467 1399924 -851937 -1904193 -1663397 -1136812 -1155908 -1820650 -2835172 -3662761
42055 -3662761 -3480820 -1875183 225651 1116215 201643 -1286833 -1799028 -1091341 -15354
42046 -15354 651783 680739 269091 33705 743498 2515545 4463830 5468371 5117426
42037 5117426 3816616 2376182 1583389 1657121 1953436 1685369 969548 542875 487828
42028 487828 150428 -552291 -827904 -411957 -217133 -944257 -1925741 -2058685 -1198935 -35776
42018 -35776 748025 707239 -195390 -1160259 -1134073 -287717 62866 -519897 -891103 -330015
$$ packed form
42083B046926M88738J436J45677j0569p46785p69601M14834J151676N6977j684220
42073A095089j982656p98223J55621J14075R9652R97992K029900J727297r5280
42064C343467j943543k251861j052256K40796N26585j9096o64742j014522q27589
42055c662761J81941J605637K100834Q90564r14572j488476n12195P07687J075987
42046a5354O67137K8956m11648k35386P09793J772047J948285J004541l50945
42037E117426j300810j440434p92793P3732K96315k68067p15821m26673n5047
42028D87828l37400p02719k75613M15947J94824p27124r81484j32944Q59750J163159
42018c5776P83801m0786r02629r64869K6186Q46356L50583n82763l71206N61088
$$ plain form
42008 -330015 181296 -236863 -693919 -144020 531060 -183130 -1928091 -3112915 -3411672
41999 -3411672 -3656149 -3645982 -2228899 331496 2107266 2155139 1705229 1977506 2290856
41990 2290856 1381876 -388864 -1306107 -477584 1025326 1313041 -215106 -2035623 -2062402
41981 -2062402 -62175 2117893 2893551 2448615 1377578 -654697 -3509480 -5192046
41973 -5192046 -4017325 -1444358 -406055 -1086151 -892795 1171440 2878411 2487583 1517859
41964 1517859 2073287 3395563 3312931 1909650 1350762 2394900 3230693 2151311 -181352
41955 -181352 -1818968 -1859863 -944741 3372 698094 1150449 1052117 19893 -1617727
41946 -1617727 -2826726 -2961533 -2459546 -2047408 -1673871 -837968 359095 1268662 1652278
$$ packed form
42008c30015N11311m18159m57056N49899O75080p14190j744961j184824k98757
41999c411672k44477J0167J417083K560395J775770M7873m49910K72277L13350
41990B290856r08980j770740r17243Q28523J502910K87715j528147j820517k6779
41981b062402K000227K180068P75658m44936j071037k032275k854783j682566
41973e192046J174721K572967J038303o80096J93356K064235J706971l90828r69724
41964A517859N55428J322276q2632j403281n58888J044138Q35793j079382k332663
41955a81352j637616m0895R15122R48113O94722M52355r8332j032224j637620
41946a617727j208999j34807N01987M12138L73537Q35903J197063R09567L83616
$$ plain form
41937 1652278 1823611 1919523 1793772 1578607 1540794 1364257 406991 -1195519 -2414328
41928 -2414328 -2485169 -1641373 -688888 -337439 -732665 -1106426 -358328 1307902 2104962
41919 2104962 1140282 198786 1228265 2849023 1980325 -1147093 -2651844 -572884 2164073
41910 2164073 2129913 214606 -453050 423886 395847 -1345458 -2742272 -2305775 -1231812
41901 -1231812 -1169240 -1718559 -1370938 165265 1726308 2214877 1455896 -154939 -2026496
41892 -2026496 -3347107 -3319727 -1850541 137029 1446672 1748795 1682295 1739957 1581711
41883 1581711 839743 10728 -207351 -25038 -48587 21754 979996 2460739 3029489 2237903
41873 2237903 1405168 1834019 3176813 4076776 3721840 2467268 1567810 2280859 4414185
$$ packed form
41937A652278J71333R5912j25751k15165l7813j76537r57266j602510j218809
41928b414328p0841Q43796R52485L51449l95226l73761P48098J666230P97060
41919B104962r64680r41496J029479J620758q68698l127418j504751K078960K736957
41910B164073l4160j915307o67656Q76936k8039j741305j396814M36497J073963
41901a231812O2572n49319L47621J536203J561043M88569p58981j610835j871557
41892b026496j320611K7380J469186J987570J309643L02123o6500N7662j58246
41883A581711p41968q29015k18079J82313k3549P0341R58242J480743N68750p91586
41873B237903q32735M28851J342794Q99963l54936j254572q99458P13049K133326
$$ plain form
41864 4414185 6038728 5830790 5274321 6759927 9738856 11153697 10081975 9385680 11718571
41855 11718571 16288723 20913145 24853665 27768805 28120390 25090773 20562195 16885896
41847 16885896 13954773 10588931 7342514 5464964 4354264 2740880 1400212 1872567
41839 1872567 3263090 3303958 2185508 2300489 4205730 5751653 5491051 4252095 2960134
41830 2960134 1505461 246688 101443 556930 7995 -1361828 -1490176 187758 1837739
41821 1837739 2404427 2976491 4040999 4238085 3214167 2916772 4295575 5328457 4378724
41812 4378724 3075000 3461500 4438335 3738355 1727070 404025 -71585 -988591 -2146566
41803 -2146566 -2162977 -1207837 -762013 -883067 -203316 1387722 2405468 2272974 2044257
$$ packed form
41864D414185J624543k07938n56469J485606K978929J414841j071722o96295K332891
41855A1718571M570152M624422L940520K915140L51585l029617m528578l676299
41847A6885896k931123l365842l246417j877550j110700j613384j340668M72355
41839A872567J390523M0868j118450J14981J905241J545923k60602j238956j291961
41830B960134j454673j258773j45245M55487n48935j369823j28348J677934J649981
41821A837739N66688N72064J064508J97086j023918k97395J378803J032882r49733
41812D378724j303724L86500R76835o99980k011285j323045m75610r17006j157975
41803b146566j6411R55140M45824j21054O79751J591038J017746j32494k28717
$$ plain form
41794 2044257 2384234 2755671 2880129 3192405 3560146 3267342 2522360 2298810 2479418
41785 2479418 1933483 680785 86383 550384 1034822 1424045 3096680 6117915 8070402
41776 8070402 7266774 5334025 4793253 5547026 5786571 5233926 5216191 6125448 7038740
41767 7038740 7727157 9035348 11191557 13659010 16908977 22285465 29279699 34682448
41759 34682448 35690009 32721387 28124154 23295886 18452793 14223932 11560798 10190224
41751 10190224 8742765 6685341 4923629 4174994 3863630 3154959 2183198 1606490 1587363
41742 1587363 1823904 2086848 2159980 1700751 759649 75749 210334 586080 13637 -1805103
41732 -1805103 -3721892 -4204500 -2833926 -757956 402861 272323 105643 1019101 2252880
$$ packed form
41794B044257L39977L71437J24458L12276L67741k92804p44982k23550J80608
41785B479418n45935j252698n94402M64001M84438L89223J672635L021235J952487
41776H070402q03628j932749n40772P53773K39545n52645j7735R09257R13292
41767G038740O88417J308191K156209K467453L249967N376488O994234N402749
41759C4682448J007561k968622m597233m828268m843093m228861k663134j370574
41751A0190224j447459k057424j761712p48635l11364p08671r71761n76708j9127
41742A587363K36541K62944P3132m59229r41102o83900J34585L75746n72443j818740
41732a805103j916789m82608J370574K075970J160817j30538j66680R13458J233779
$$ plain form
41723 2252880 2229521 1146429 931749 2188460 2954148 1673940 -151659 -46132 1788967
41714 1788967 2911619 2116878 392221 -1315455 -3067487 -4473089 -4405907 -2874146 -1470179
41705 -1470179 -1222513 -1465447 -1462124 -1589805 -2124428 -2364410 -1929676 -1571562 -1694947 -1414703
41695 -1414703 -209876 755678 262735 -1088469 -1945269 -2155987 -2272656 -2012891 -797408
41686 -797408 762905 1444437 1165845 901670 1171477 1782345 2696489 3948388 4999789
41677 4999789 5322975 5327601 5596515 5557249 4148568 1605068 -596037 -1459155 -1164084
41668 -1164084 -333924 330611 53798 -1155645 -1925531 -1065766 550342 1003920 62265
41659 62265 -576583 196365 1591316 2355048 2213689 1622885 1265088 1966878 3855365
$$ packed form
41723B252880k3359j083092k14680J256711P65688j280208j825599J05527J835099
41714A788967J122652p94741j724657j707676j752032j405602O7182J531761J403967
41705a470179K47666k42934L323j27681n34623k39982M34734L58114j23385K80244
41695a414703J204827R65554m92943j351204q56800k10718j16669K59765J215483
41686g97408J560313O81532k78592k64175K69807O10868R14144J251899J051401
41677D999789L23186M626K68914l9266j408681k543500k201105q63118K95071
41668a164084Q30160O64535k76813j209443p69886Q59765J616108M53578r41655
41659F2265o38848P72948J394951P63732j41359n90804l57797P01790J888487
$$ plain form
41650 3855365 5400078 4678235 1991874 -94357 173476 1876122 3163962 3548305 3664085
41641 3664085 3909962 4345071 5165502 6346156 7287305 7460451 6939943 5887449 4201672
41632 4201672 2201517 950735 1197723 2391529 3266418 3131762 2362302 1973473 2717766
41623 2717766 4072351 4330678 2608765 571218 832483 3511487 5887909 5960750 4783912
41614 4783912 4423720 5095006 5575202 5293196 4567725 3542562 2271855 1384408 1457630
41605 1457630 2065625 2411083 2472716 2605898 2512210 1615168 65409 -1514050 -2805368
41596 -2805368 -3491658 -2918390 -1196100 54632 -527291 -1980233 -2196755 -850357 438223
41587 438223 730257 805054 1287310 1484611 925048 731755 2309746 5276238 7617352
$$ packed form
41650C855365J544713p21843k686361k086231K67833J702646J287840L84343J15780
41641C664085K45877M35109Q20431J180654R41149J73146n20508j052494j685777
41632D201672k000155j250782K46988J193806Q74889j34656p69460l88829P44293
41623B717766J354585K58327j721913k037547K61265K679004K376422P2841j176838
41614D783912l60192O71286M80196k82006p25471j025163j270707q87447P3222
41605A457630O07995L45458O1633J33182r3688q97042j549759j579459j291318
41596b805368o86290N73268J722290J250732n81923j452942k16522J346398J288580
41587D38223K92034P4797M82256J97301n59563j93293J577991K966492K341114
$$ plain form
41578 7617352 7731583 5877581 3754881 2838689 3018184 3025247 2367832 2179977 3435875
41569 3435875 5059676 5162226 3806547 2914452 3363073 3922706 3570846 3119153 3569985
41560 3569985 4343573 4418335 4066850 4011378 3729553 2210589 -55893 -1408905 -1249899
41551 -1249899 -625175 -536742 -889967 -1311902 -1870836 -2517194 -2630319 -1663001 151797
41542 151797 1944907 2733971 1935686 -14042 -1626512 -1724447 -895573 -781514 -1827465
41533 -1827465 -2704908 -2291965 -1215690 -776337 -1150125 -1486032 -1257917 -725888 -410489
41524 -410489 -767133 -1961500 -3250595 -3074920 -764604 2100388 3138577 1988920 591546
41515 591546 441270 742264 -48216 -1816616 -2995341 -2724702 -1724549 -980238 -492994
$$ packed form
41578G617352J14231j854002k122700r16192J79495P063o57415j87855J255898
41569C435875J623801J02550j355679q92095M48621N59633l51860m51693M50832
41560C569985P73588P4762l51485n5472k81825j518964k266482j353012J59006
41551a249899O24724Q8433l53225m21935n58934o46358j13125R67318J814798
41542A51797J793110P89064p98285j949728j612470r7935Q28874J14059j045951
41533a827465q77443M12943J076275M39353l73788l35907K28115N32029L15399
41524d10489l56644j194367j289095J75675K310316K864992J038189j149657j397374
41515E91546j50276L00994p90480j768400j178725K70639J000153P44311M87244
$$ plain form
41506 -492994 214648 920005 754434 -511850 -1769084 -1624422 -87240 1274148 1046603
41497 1046603 -559293 -2232367 -3041570 -2816500 -1533573 655636 2805312 3621678 2881215
41488 2881215 1658976 886479 511968 380349 863721 1931021 2576544 2139907 1436269
41479 1436269 1545566 2177467 2418063 2441853 2993598 3576962 2905504 1191024 212717
41470 212717 665432 1108779 347515 -657964 -406248 827072 1668332 1819069 2072420
41461 2072420 2595164 2653858 2004832 1293488 905575 499731 -27564 -72689 704377 1653648
41451 1653648 1912815 1457275 948253 898284 1346546 2019938 2454472 2266580 1681678 1508171
41441 1508171 2155715 2908490 2662127 1248498 -454056 -1587429 -1889777 -1311436 63374
$$ packed form
41506d92994P07642P05357j65571j266284j257234J44662J537182J361388k27545
41497A046603j605896j673074q09203K25070J282927K189209K149676Q16366p40463
41488B881215j222239p72497l74511j31619M83372J067300O45523m36637p03638
41479A436269J09297O31901K40596K3790N51745N83364o71458j714480r78307
41470B12717M52715M43347p61264j005479K51716J233320Q41260J50737K53351
41461B072420N22744N8694o49026p11344l87913m05844n27295m5125P77066R49271
41451A653648K59167m55540n09022m9969M48262O73392M34534j87892n84902j73507
41441A508171O47544P52775k46363j413629j702554j133373l02348N78341J374810
$$ plain form
41432 63374 1442164 1567453 206979 -1213307 -1215935 -16403 1125465 1713942 2052148
41423 2052148 1919908 729852 -998286 -1890995 -1774448 -1924209 -2743549 -2868004 -1470275
41414 -1470275 212644 891591 1168602 1934530 2411613 1805863 1527940 3269441 5810048
41405 5810048 6509944 5463585 5192212 6276279 6462381 4642381 2602070 1766226 1145689
41396 1145689 -73712 -743694 -351378 -664939 -2482395 -3220432 -599440 3221004 4357920
41387 4357920 2667049 1195753 1120961 781194 -468669 -1007538 -175394 366229 -339698
41378 -339698 -715318 688181 2642677 2913947 1169342 -1059305 -2299547 -2016961 -510314
41369 -510314 1152552 1839562 1641754 1686286 2284871 2416359 1661059 1344772 2674749
$$ packed form
41432F3374J378790J25289j360474j420286k628J199532J141868N88477L38206
41423B052148j32240j190056j728138q92709J16547j49761q19340j24455J397729
41414a470275J682919O78947K77011P65928M77083o05750k77923J741501K540607
41405E810048O99896j046359k71373J084067J86102j820000k040311q35844o20537
41396A145689j219401o69982L92316l13561j817456p38037K620992L820444J136916
41387D357920j690871j471296p4792l39767j249863n38869Q32144N41623p05927
41378c39698l75620J403499J954496K71270j744605k228647j240242K82586J506647
41369e10314J662866O87010j97808M4532N98585J31488p55300l16287J329977
$$ [...]
##END NTUPLES=NMR SPECTRUM
##END=
