##TITLE=31Pdec_SR21_rm
 CDcl3, 24 sc
 21.10.2020
##JCAMPDX= 6.0         $$ Bruker NMR JCAMP-DX V2.0
##DATA TYPE= NMR SPECTRUM
##DATA CLASS= NTUPLES
##ORIGIN= UXNMR, Bruker Analytische Messtechnik GmbH
##OWNER= root
$$ XWIN-NMR		Version 3.5
$$ Wed Oct 21 12:11:18 2020 Russian Standard Time (UT+4h)  she@DPX200
##.OBSERVE FREQUENCY= 81.013821
##.OBSERVE NUCLEUS= ^31P
##.ACQUISITION MODE= SIMULTANEOUS
##.ACQUISITION SCHEME= undefined
##.AVERAGES= 24
##.DIGITISER RES= 17
##SPECTROMETER/DATA SYSTEM= spect
##.PULSE SEQUENCE= zgpg30
##.SOLVENT NAME= CDCl3
##.SHIFT REFERENCE= (INTERNAL, CDCl3, 0, 182.463)
##AUDIT TRAIL= $$ (NUMBER, WHEN, WHO, WHERE, WHAT)
$$ ##TITLE= Audit trail, XWIN-NMR		Version 3.5
$$ ##JCAMPDX= 5.01
$$ ##ORIGIN= Bruker BioSpin GmbH
$$ ##OWNER= she
$$ F:/spectra/data/she/nmr/P31/1/pdata/1/auditp.txt
$$ ##AUDIT TRAIL=  $$ (NUMBER, WHEN, WHO, WHERE, WHAT)
(   1,<2020-10-21 12:10:25.73 +0400>,<she>,<DPX200>,
      <created by zg, POWCHK disabled, PULCHK disabled
       configuration hash MD5:
       00 E9 B6 7A A2 85 ED C7 34 08 36 98 17 FE 4E 26
       data hash MD5: 32K
       4A C5 37 7F 1F D8 4A 23 38 D8 9B CA 15 41 B7 65>)
(   2,<2020-10-21 12:10:27.70 +0400>,<she>,<DPX200>,
      <Start of raw data processing
       efp BC_mod = 2 LB = 1 FT_mod = 6 PKNL = 1 PHC0 = -2376.166 PHC1 = 71.40057 SI = 64K 
       data hash MD5: 64K
       C5 B5 BD 75 6C 9A BF 60 DB 2E 52 A7 49 F8 4C AF>)
(   3,<2020-10-21 12:10:48.18 +0400>,<she>,<DPX200>,
      <pk PHC0 = -10.48739 PHC1 = -10.4 
       data hash MD5: 64K
       9C 22 24 3F EE 8E 25 B8 C3 85 E0 1F 33 C7 F4 12>)
(   4,<2020-10-21 12:10:53.00 +0400>,<she>,<DPX200>,
      <abs ABSG = 5 
       data hash MD5: 64K
       D4 8F AE 8C 43 BB 83 DA 69 74 9A 69 FC 8F 89 2D>)
$$ ##END=
$$ 
$$ hash MD5
$$ E5 86 A0 CD E9 5A 88 6C 71 97 B0 83 83 27 CC 80
##$RELAX= 
##$RELAX= 
##$RELAX= 
##$RELAX= 
##$RELAX= 
##$RELAX= 
##$RELAX= 
##$RELAX= 
$$ Bruker specific parameters
$$ --------------------------
##$DU= <F:/spectra>
##$EXPNO= 1
##$NAME= <P31>
##$PROCNO= 1
##$TYPE= <nmr>
##$USER= <she>
##$AMP= (0..31)
100 100 100 100 100 100 100 100 100 100 100 100 100 100 100 100 100 100 
100 100 100 100 100 100 100 100 100 100 100 100 100 100 
##$AQSEQ= 0
##$AQ_mod= 1
##$AUNM= <au_zg>
##$AUTOPOS= <>
##$BF1= 81.014009
##$BF2= 200.13
##$BF3= 200.13
##$BF4= 200.13
##$BF5= 200.13
##$BF6= 200.13
##$BF7= 200.13
##$BF8= 200.13
##$BYTORDA= 1
##$CFDGTYP= 0
##$CFRGTYP= 5
##$CHEMSTR= <none>
##$CNST= (0..31)
1 1 145 1 1 1 1 1 1 1 1 1 1 1 1 1 1 1 1 1 1 1 1 1 1 1 1 1 1 1 1 1 
##$CPDPRG= <waltz16>
##$CPDPRG1= <>
##$CPDPRG2= <waltz16>
##$CPDPRG3= <>
##$CPDPRG4= <mlev>
##$CPDPRG5= <mlev>
##$CPDPRG6= <mlev>
##$CPDPRG7= <mlev>
##$CPDPRG8= <mlev>
##$CPDPRGB= <>
##$CPDPRGT= <>
##$D= (0..31)
0 1 0 0 0 0 0 0 0 0 0 0.03 2e-05 3e-06 0 0 0 0 0 0 0 0 0 0 0 0 0 0 0 0 
0 0 
##$DATE= 1603267825
##$DBL= (0..7)
120 120 120 11 120 120 24 19 
##$DBP= (0..7)
150 150 150 150 150 150 150 150 
##$DBP07= 0
##$DBPNAM0= <>
##$DBPNAM1= <>
##$DBPNAM2= <>
$$ [...]
##$SUBNAM3= <"">
##$SUBNAM4= <"">
##$SUBNAM5= <"">
##$SUBNAM6= <"">
##$SUBNAM7= <"">
##$SUBNAM8= <"">
##$SUBNAM9= <"">
##$SW= 369.568048894756
##$SWIBOX= (0..15)
0 1 3 0 0 0 0 0 0 0 0 0 0 0 0 0 
##$SW_h= 29940.119760479
##$TD= 32768
##$TD0= 1
##$TE= 0
##$TE2= 300
##$TE3= 300
##$TEG= 300
##$TL= (0..7)
0 120 53 12 22 120 120 120 
##$TP= (0..7)
150 150 150 150 150 150 150 150 
##$TP07= 0
##$TPNAME0= <>
##$TPNAME1= <>
##$TPNAME2= <>
##$TPNAME3= <>
##$TPNAME4= <>
##$TPNAME5= <>
##$TPNAME6= <>
##$TPNAME7= <>
##$TPOAL= (0..7)
0.5 0.5 0.5 0.5 0.5 0.5 0.5 0.5 
##$TPOFFS= (0..7)
0 0 0 0 0 0 0 0 
##$TUNHIN= 0
##$TUNHOUT= 0
##$TUNXOUT= 0
##$USERA1= <user>
##$USERA2= <user>
##$USERA3= <user>
##$USERA4= <user>
##$USERA5= <user>
##$V9= 5
##$VALIST= <valist>
##$VCLIST= <CCCCCCCCCCCCCCC>
##$VD= 0
##$VDLIST= <DDDDDDDDDDDDDDD>
##$VPLIST= <PPPPPPPPPPPPPPP>
##$VTLIST= <TTTTTTTTTTTTTTT>
##$WBST= 1024
##$WBSW= 4
##$XGAIN= (0..3)
0 0 0 0 
##$XL= 0
##$YL= 0
##$YMAX_a= 56455
##$YMIN_a= -38925
##$ZGOPTNS= <>
##$ZL1= 120
##$ZL2= 120
##$ZL3= 120
##$ZL4= 120
##$ABSF1= 182.463
##$ABSF2= -187.1042
##$ABSG= 5
##$ABSL= 3
##$ALPHA= 0
##$AQORDER= 0
##$ASSFAC= 0
##$ASSFACI= 0
##$ASSFACX= 0
##$ASSWID= 0
##$AUNMP= <proc_1d>
##$AZFE= 0.1
##$AZFW= 0.5
##$BCFW= 0
##$BC_mod= 2
##$BYTORDP= 0
##$COROFFS= 0
##$CY= -3
##$DATMOD= 1
##$DC= 0
##$DFILT= <>
##$DTYPP= 0
##$F1P= 0
##$F2P= 0
##$FCOR= 1
##$FTSIZE= 65536
##$FT_mod= 6
##$GAMMA= 0
##$GB= 0
##$INTBC= 1
##$INTSCL= 5.30512e-09
##$ISEN= 30
##$LB= 1
##$LEV0= 0
##$LPBIN= 0
##$MAXI= 10000
##$MC2= 0
##$MEAN= 0
##$ME_mod= 0
##$MI= 50
##$NCOEF= 0
##$NC_proc= -6
##$NLEV= 6
##$NOISF1= 182.463
##$NOISF2= 159.3651
##$NSP= 0
##$NTH_PI= 0
##$NZP= 0
##$OFFSET= 182.463
##$PC= 4
##$PHC0= -2386.653
##$PHC1= 61.00057
##$PH_mod= 1
##$PKNL= yes
##$PPARMOD= 0
##$PSCAL= 0
##$PSIGN= 0
##$REVERSE= no
##$SF= 81.014009
##$SI= 65536
##$SIGF1= 159.3651
##$SIGF2= -187.1042
##$SINO= 113.3802
##$SIOLD= 16384
##$SREGLST= <1H.CDCl3>
##$SSB= 0
##$STSI= 65536
##$STSR= 0
##$SW_p= 29940.119760479
##$SYMM= 0
##$S_DEV= 0
##$TDeff= 32768
##$TDoff= 0
##$TI= <>
##$TILT= no
##$TM1= 0
##$TM2= 0
##$TOPLEV= 0
##$USERP1= <user>
##$USERP2= <user>
##$USERP3= <user>
##$USERP4= <user>
##$USERP5= <user>
##$WDW= 1
##$XDIM= 65536
##$YMAX_p= 290849826
##$YMIN_p= -9190184
$$ End of Bruker specific parameters
$$ ---------------------------------
##NTUPLES= NMR SPECTRUM
##VAR_NAME=  FREQUENCY,     SPECTRUM/REAL,   SPECTRUM/IMAG
##SYMBOL=    X,             R,               I
##VAR_TYPE=  INDEPENDENT,   DEPENDENT,       DEPENDENT
##VAR_FORM=  AFFN,          ASDF,            ASDF
##VAR_DIM=   65536,         65536,           65536
##UNITS=     HZ,            ARBITRARY UNITS, ARBITRARY UNITS
##FACTOR=    0.456856943014862, 1,           1
##FIRST=     14782.0589164895, 0,            0
##LAST=      -15158.0608439895, 0,           0
##MIN=       -15158.0608439895, -9190184,    0
##MAX=       14782.0589164895, 290849826,    0
$$ Real data points
##PAGE= N=1
##DATA TABLE= (X++(R..R)), XYDATA
$$ [...]
$$ plain form
41877 2245897 2545987 3427207 3830520 4442382 6270992 8340535 8650834 7106676 5752329
41868 5752329 5980773 7012007 7489523 7260912 6963494 6864071 6882367 7154442 7842467 8612837
41858 8612837 8802967 8135133 7119774 6674890 7165047 7811536 7522478 6511609 6372683
41849 6372683 7926266 9702266 9635601 7909601 6840349 7836431 9666854 10236944 9148360
41840 9148360 7707826 6896375 6270047 5052837 3710148 3726083 5643139 7942343 8638986
41831 8638986 7746123 7073339 7452387 7543415 6176075 4554393 4655067 6205715 7036275
41822 7036275 6311328 5665326 6639709 8409024 8985104 7850227 6386646 5984289 6574699
41813 6574699 7152489 7135613 6730420 6150522 5170163 3815849 2929568 3292159 4501282
$$ packed form
41877B245897L00090Q81220M03313O11862J828610K069543L10299j544158j354347
41868E752329K28444J031234M77516k28611k97418r9423J8296K72075O88025P70370
41858H612837J90130o67834j015359m44884M90157O46489k89058j010869j38926
41849F372683J553583J776000o6665j726000j069252R96082J830423N70090j088584
41840I148360j440534q11451o26328j217210j342689J5935J917056K299204O96643
41831H638986q92863o72784L79048R1028j367340j621682J00674J550648Q30560
41822G036275p24947o46002R74383J769315N76080j134877j463581m02357N90410
41813F574699N77790j6876m05193n79898r80359j354314q86281L62591J209123
$$ plain form
41804 4501282 5581811 6393652 7270901 7543443 6116745 3702034 2525307 3143960 3559429
41795 3559429 2560679 1791194 2790907 4041786 3372524 1747563 1802078 3495628 4217483
41786 4217483 2982190 1659955 1733839 2362145 2296559 1633658 960758 473002 491934 1345723
41776 1345723 2381723 2571802 2280056 2918081 4817886 7044683 9113944 10945737 11371015
41767 11371015 9167375 5755393 4248887 5277644 6305085 5752130 5036025 5460703
41759 5460703 5898355 5147115 4077693 3593368 2710038 700562 -850111 -350041 1071664
41750 1071664 1354885 674701 642490 1451973 1958884 1813486 1608042 1525298 1442279 1718770
41740 1718770 2495215 2991098 2751945 2603233 3124396 3406118 2747099 2248276 3054911
$$ packed form
41804D501282J080529Q11841Q77249K72542j426698k414711j176727O18653M15469
41795C559429r98750p69485R99713J250879o69262j624961N4515J693550P21855
41786D217483j235293j322235P3884O28306o5586o62901o72900m87756J8932Q53789
41776A345723J036000J90079k91746O38025J899805K226797K069261J831793M25278
41767A1371015k203640l411982j506506J028757J027441n52955p16105M24678
41759E460703M37652p51240j069422m84325q83330k009476j550673N00070J421705
41750A071664K83221o80184l2211Q09483N06911j45398k05444q2744q3019K76491
41740A718770P76445M95883k39153j48712N21163K81722o59019m98823Q06635
$$ plain form
41731 3054911 4305883 4663066 4630350 5298372 5886762 4832462 2607430 1195396 1154149
41722 1154149 1249478 795695 507933 1035839 2075262 2902481 2911450 2121343 1750855 3089811
41712 3089811 5092003 5018014 2727771 1903571 4847566 8479619 8499925 5480912 3223315
41703 3223315 2647820 1513698 -562981 -1237605 209627 1632963 1811612 1948661 2581276
41694 2581276 2353758 907459 -111463 -74866 -486483 -1866690 -2362560 -890976 927352
41685 927352 1490216 1524274 2187196 3069266 3592524 4335646 5450774 5678613 4420242
41676 4420242 3001947 2507145 2150020 1168128 486769 982577 1769087 1730953 1240864
41667 1240864 951040 443618 -443251 -428591 1522951 4526537 7070402 8747640 9590365
$$ packed form
41731C054911J250972L57183l2716O68022N88390j054300k225032j412034m1247
41722A154149R5329m53783k87762N27906J039423Q27219Q969p90107l70488J338956
41712C089811K002192p3989k290243q24200K943995L632053K0306l019013k257597
41703C223315n75495j134122k076679o74624J447232J423336J78649J37049O32615
41694B581276k27518j446299j018922L6597m11617j380207m95870J471584J818328
41685I27352N62864L4058O62922Q82070N23258P43122J115128K27839j258371
41676D420242j418295m94802l57125r81892o81359M95808P86510l8134m90089
41667A240864k89824n07422q86869J4660J951542L003586K543865J677238Q42725
$$ plain form
41658 9590365 9142076 7518548 6110811 5966344 6584624 7252522 8190239 9398267 9877432
41649 9877432 9104520 7909273 6962855 5883466 4630786 4042973 4166274 3986341 3625915
41640 3625915 4505573 6298980 6391147 3902859 1589319 1790651 3048318 3011163 2265265
41631 2265265 2615046 3634160 3778623 3327401 3541637 4300531 4983077 6159098 7989249
41622 7989249 8640200 6934867 4942688 5138951 6554679 6698608 5791141 5826571 6603677
41613 6603677 6104486 4196390 2849279 2999729 3804176 4598374 5371300 5917986 6397122
41604 6397122 7703099 9727502 10998257 11549453 13471921 16783117 18442944 18109334
41596 18109334 20347546 27399006 34985007 40350959 48541785 63975339 83008011 105084882
$$ packed form
41658I590365m48289j623528j407737j44467O18280O67898R37717J208028M79165
41649I877432p72912j195247r46418j079389j252680n87813J23301j79933l60426
41640C625915Q79658J793407R2167k488288k313540K01332J257667l7155p45898
41631B265265L49781J019114J44463m51222K14236P58894O82546J176021J830151
41622G989249O50951j705333j992179J96263J415728J43929r07467L5430P77106
41613F603677m99191j908096j347111J50450Q04447P94198P72926N46686M79136
41604F397122J305977K024403J270755N51196J922468L311196J659827l33610
41596A8109334K238212P051460P586001N365952Q190826J5433554J9032672K2076871
$$ plain form
41588 105084882 143281460 206041809 269867320 290849826 251664723 182569654 126571316
41581 126571316 96815341 79264627 63606285 52920148 48424247 43695465 36243670
41574 36243670 31386728 31196055 29959969 24182465 18327558 16723242 17073822 15972161
41566 15972161 14551361 14544902 14052432 11412849 8992040 9192176 10274418 9729555 8571609
41557 8571609 8775121 9296048 8192842 6410050 6017512 6450654 5697588 3894556 2847033
41548 2847033 2981817 3343331 3812377 5012865 6607374 7665384 8194616 8629371 8480247
41539 8480247 7233012 6027217 6614775 8757249 10149760 9102338 6331283 3967220
41531 3967220 3390982 4130476 4710254 4633691 5095690 7034102 9111955 9170170 7438941
$$ packed form
41588A05084882L8196578O2760349O3825511K0982506l9185103o9095069n5998338
41581A26571316k9755975j7550714j5658342j0686137m495901m728782p451795
41574C6243670m856942j90673j236086n777504n854907j604316L50580j101661
41566A5972161j420800o459m92470k639583k420809K00136J082242n44863j157946
41557H571609K03512N20927j103206j782792l92538M33142p53066j803032j047523
41548B847033J34784L61514M69046J200488J594509J058010N29232M34755j49124
41539H480247j247235j205795N87558K142474J392511j047422k771055k364063
41531C967220n76238P39494N79778p6563M61999J938412K077853N8215j731229
$$ plain form
41522 7438941 6328752 6795823 7102634 5925682 4475379 4280751 4875258 5244702 5778233
41513 5778233 6943596 7533710 6266554 4016110 2503787 1765304 915338 499741 1773853
41504 1773853 4087266 5267531 4622675 3618252 3452129 3754914 3946462 4210532 4675804
41495 4675804 4984235 5077871 5299768 5537807 5422933 5419739 6361464 7772154 8169398 7377968
41485 7377968 6952473 7669666 8161320 7029896 5017895 3872781 4023551 4584460 4882208
41476 4882208 4746883 3914015 2462138 1489761 2090258 3809586 5239669 5937767 6510622
41467 6510622 6941538 6404667 5039634 4278469 4595892 4409283 2506550 419298 661426
41458 661426 3178355 5389901 5722929 5280017 5551790 6208371 6212401 5840649 6186182 7247510
$$ packed form
41522G438941j110189M67071L06811j176952j450303j94628N94507L69444N33531
41513E778233J165363N90114j267156k250444j512323p38483q49966m15597J274112
41504A773853K313413J180265o44856j004423j66123L02785J91548K64070M65272
41495D675804L08431R3636K21897K38039j14874l194R41725J410690L97244p91430
41485G377968m25495P17193M91654j131424k012001j145114J50770N60909K97748
41476D882208j35325q32868j451877r72377O00497J719328J430083O98098N72855
41467F510622M30916n36871j365033p61165L17423j86609j902733k087252K42128
41458F61426K516929K211546L33028m42912K71773O56581M030l71752L45533J061328
$$ plain form
41448 7247510 7784434 6952878 5254204 3942304 3944304 4996385 5470362 3808789 760664
41439 760664 -796237 674760 3065918 3315346 1563863 559480 1300301 1831975 904333
41430 904333 275240 1849489 4386731 5093870 3543086 2051277 2455740 4141954 5370211
41421 5370211 5310845 4453293 3814894 4052310 4936800 5636765 5724174 5590074 5543626 5076699
41411 5076699 3713630 2126895 1487574 1883532 2276965 2039968 1697917 1964378 2737933
41402 2737933 3387261 3577737 3495463 3485716 3653132 3694758 3132202 1902949 680133 357973
41392 357973 1193094 2607054 3811655 4516074 5100319 6192033 7944832 9648146 10245914
41383 10245914 9379355 7741557 6284576 5285923 4364626 3265463 2420873 2631436 4054546
$$ packed form
41448G247510N36924q31556j698674j311900K000J052081M73977j661573l048125
41439G60664j556901J470997K391158K49428j751483j004383P40821N31674r27642
41430I04333o29093J574249K537242P07139j550784j491809M04463J686214J228257
41421E370211n9366q57552o38399K37416Q84490O99965Q7409j34100m6448m66927
41411E076699j363069j586735o39321L95958L93433k36997l42051K66461P73555
41402B737933O49328J90476q2274r747J67416M1626n62556j229253j222816l22160
41392C57973Q35121J413960J204601P04419N84245J091714J752799J703314N97768
41383A0245914q66559j637798j456981r98653r21297j099163q44590K10563J423110
$$ plain form
41374 4054546 5583775 5754594 4520420 3436263 3503197 3726841 2966986 2341500 3850613
41365 3850613 6888844 8480876 7477413 6129372 6345256 6708981 5150591 2733444
41357 2733444 2280346 4269152 6572019 7710526 7967760 7556351 6204819 4800762 5080060
41348 5080060 7002055 8410396 8061856 7160055 7019572 7071505 6472604 6100771 7263857
41339 7263857 9398043 10711409 10634927 10190720 10136000 10059247 9464549 8716559 8449786 8578819
41329 8578819 8397873 7603325 6856556 6978689 7671287 7753009 7056369 7167079 9202964
41320 9202964 11582194 11659353 9375659 7377347 7224098 7552899 6894212 6234357 7100344
41311 7100344 8662084 8890741 7751136 7033873 7305774 7209457 6060175 5113306 5382719
$$ packed form
41374D054546J529229J70819j234174j084157O6934K23644p59855o25486J509113
41365C850613L038231J592032j003463j348041K15884L63725j558390k417147
41357B733444m53098J988806K302867J138507K57234m11409j351532j404057K79298
41348E080060J921995J408341l48540r01801j40483N1933n98901l71833J163086
41339G263857K134186J313366p6482m44207n4720p6753n94698p47990k66773J29033
41329H578819j80946p94548p46769J22133O92598Q1722o96640J10710K035885
41320I202964K379230P7159k283694j998312j53249L28801o58687o59855Q65987
41311G100344J561740K28657j139605p17263K71901r6317j149282r46869K69413
$$ plain form
41302 5382719 5780889 4748456 2858307 2388227 4423064 7433075 9031625 8534884 7309281
41293 7309281 6824914 6982881 6676358 5578471 4608825 4530291 4899583 5016413 5364287
41284 5364287 7132709 10243757 12681232 12346920 9350938 5991484 4415292 4683188
41276 4683188 5411999 5871332 6529654 7436622 7368333 5654088 3935552 4411507 6582552
41267 6582552 7619623 6275871 4509152 4385534 5255018 5431125 5059933 5344204 5996372
41258 5996372 5743208 4932209 5345742 7256908 8724968 8390222 7244814 6868940 7410577
41249 7410577 8253621 9389307 10929163 12146912 12231548 11493162 10770172 10001341 8441458
41240 8441458 6207696 4631208 4753442 5997409 6681829 5728206 3737404 2385807 2739296
$$ packed form
41302E382719L98170j032433j890149m70080K034837L010011J598550m96741j225603
41293G309281m84367J57967l06523j097887r69646p8534L69292J16830L47874
41284E364287J768422L111048K437475l34312k995982l359454j576192K67896
41276D683188P28811M59333O58322R06968o8289j714245j718536M75955K171045
41267F582552J037071j343752j766719j23618Q69484J76107l71192K84271O52168
41258E996372k53164q10999M13533J911166J468060l34746j145408l75874N41637
41249G410577Q43044J135686J539856J217749Q4636p38386p22990p68831j559883
41240H441458k233762j576488J22234J243967O84420r53623j990802j351597L53489
$$ plain form
41231 2739296 4231132 5438556 5708600 5665087 6210200 7545677 9237516 10654551 11085075
41222 11085075 9992964 7699905 5575188 5030489 6226852 7925255 8627324 7871213
41214 7871213 6544590 5978651 6679305 8007746 9114253 9840213 10439445 10833328 10719674
41205 10719674 10190933 9609628 9005572 8264676 7808166 8289695 9563812 10736008 11370005
41196 11370005 11873336 12534913 13075263 13499115 14495047 16362469 18170395 18637146 17502355
41187 17502355 15633268 14165075 13813875 14523373 15467350 15875022 16030437 16831181 18289289
41178 18289289 19462970 20149454 21379002 23540994 25334504 25746921 26006048 28098011
41170 28098011 32041145 36125700 39352787 42073095 44563974 46728893 49234578 53230310
$$ packed form
41231B739296J491836J207424K70044m3513N45113J335477J691839J417035M30524
41222A1085075j092111k293059k124717n44699J196363J698403P02069p56111
41214G871213j326623n65939P00654J328441J106507P25960N99232L93883j13654
41205A0719674n28741n81305o04056p40896m56510M81529J274117J172196O33997
41196A1370005N03331O61577N40350M23852R95932J867422J807926M66751j134791
41187A7502355j869087j468193l51200P09498R43977M07672J55415Q00744J458108
41178A8289289J173681O86484J229548K161992J793510M12417K59127K091963
41170B8098011L943134M084555L227087K720308K490879K164919K505685L995732
$$ plain form
41162 53230310 58570416 63796259 68316168 73177362 79161675 85615907 91944183 98749326
41154 98749326 106288760 113027538 117252791 119414929 121413217 123991621 126193278 127050543
41146 127050543 126358603 123891630 119427020 113847046 108754570 104354362 98979725 91628579
41138 91628579 83903322 78208027 74713943 71514122 67479902 63417580 60171416 57074759
41130 57074759 53097902 48468374 44121386 40283826 36759501 34096183 33066085 33061492
41122 33061492 32393341 30456478 28342080 26912110 25666549 24283314 23801649 24847859
41114 24847859 25762763 24356611 21076137 18504877 17693088 16953861 14913157 12938740
41106 12938740 13246338 15719567 18036364 18438563 17172569 15445193 14091592 13407180
$$ packed form
41162E3230310N340106N225843M519909M861194N984313O454232O328276O805143
41154I8749326P539434O738778M225253K162138J998288K578404K201657Q57265
41146A27050543o91940k466973m464610n579974n092476m400208n374637p351146
41138I1628579p725257n695295l494084l199821m034220m062322l246164l096657
41130E7074759l976857m629528m346988l837560l524325k663318j030098m593
41122C3061492o68151j936863k114398j429970j245561j383235m81665J046210
41114B4847859R14904j406152l280474k571260q11789p39227k040704j974417
41106A2938740L07598K473229K316797M02199j265994j727376j353601o84412
$$ plain form
41098 13407180 13469205 14218357 15431493 16693046 17379226 16964808 15530854 13672593 11810696
41089 11810696 10087196 9010622 9286940 10495910 10891510 9475992 7560450 7096944
41081 7096944 7982705 8440803 7892148 7848157 9571980 12215507 13978475 14117537 13101382
41072 13101382 11642932 10367324 9744955 9560730 9019950 8083632 7983640 9459433 11142085
41063 11142085 10990759 9059914 7474567 7596182 8543250 8872933 8453036 7970186 7647007
41054 7647007 7414564 7628626 8549880 9497011 9486741 8531794 7509895 6983017 6978260 7638142
41044 7638142 8977226 10065114 9725032 8326483 7647421 8415641 9201390 8598015 7356285
41035 7356285 7097074 7762739 7929750 7251029 6868396 7292671 7535955 6935310 6410605
$$ packed form
41098A3407180O2025P49152J213136J261553O86180m14418j433954j858261j861897
41089A1810696j723500j076574K76318J208970L95600j415518j915542m63506
41081G096944Q85761M58098n48655m3991J723823K643527J762968J39062j016155
41072A3101382j458450j275608o22369j84225n40780r36318r9992J475793J682652
41063A1142085j51326j930845j585347J21615R47068L29683m19897m82850l23179
41054G647007k32443K14062R21254R47131j0270r54947j021899n26878m757O59882
41044G638142J339084J087888l40082j398549o79062P68220P85749o03375j241730
41035G356285k59211O65665J67011o78721l82633M24275K43284o00645n24705
$$ plain form
41026 6410605 6941148 7844156 7770259 6834686 6540602 7677848 9264777 9780361 8867533
41017 8867533 7574967 7140941 7621466 7749537 6432717 4393486 3682515 5197597 7347379
41008 7347379 7864331 6469211 4904893 4615166 5331174 5954957 5949352 5551043 5192035
40999 5192035 5065389 5040751 4922365 4880135 5310120 5969012 5812364 4391706 2867625
40990 2867625 2575298 2975093 2432234 943737 373191 1508954 2648977 2191120 1128748
40981 1128748 1401893 2821395 3511921 2930265 2502793 3192777 4218394 4670439 4857479
40972 4857479 5270447 5515818 5291407 5357561 6245080 6689795 4899470 1342049 -1120942
40963 -1120942 -395983 2455960 4616838 4645779 3446782 2515239 2291982 2506455 3207396
$$ packed form
41026F410605N30543R03008p3897r35573k94084J137246J586929N15584r12828
41017H867533j292566m34026M80525J28071j316820k039231p10971J515082K149782
41008G347379N16952j395120j564318k89727P16008O23783n605l98309l59008
40999E192035j26646k4638j18386m2230M29985O58892j56648j420658j524081
40990B867625k92327L99795n42859j488497n70546J135763J140023m57857j062372
40981A128748K73145J419502O90526n81656m27472O89984J025617M52045J87040
40972D857479M12968K45371k24411O6154Q87519M44715j790325l557421k462991
40963a120942P24959K851943K160878K8941j198997r31543k23257K14473P00941
$$ plain form
40954 3207396 4548476 5866684 6023841 4942627 3969195 4170220 4993465 5406798 5668349
40945 5668349 6659778 7761856 7133283 4617613 2746784 3635844 6030840 7014174 5941536
40936 5941536 4838849 5047983 5497116 4895384 3860208 3660484 4119563 4256896 4221397
40927 4221397 4930630 6048269 5965027 4086321 1824342 787913 1032171 1709299 2466716
40918 2466716 3289514 3654203 2978886 1746402 1234555 2026215 3456480 4643218 5449865
40909 5449865 6217478 7069796 7826857 8297020 8354644 7937479 7246936 6829751 7167108 8095764
40899 8095764 8734721 8131306 6153568 3813110 2521799 2817683 3908375 4634164 4689542
40890 4689542 4595169 4704563 4853231 5052711 5844566 7489887 9182058 9647803 8509057
$$ packed form
40954C207396J341080J318208J57157j081214r73432K01025Q23245M13333K61551
40945E668349R91429J102078o28573k515670j870829Q89060K394996R83334j072638
40936E941536j102687K09134M49133o01732j035176j99724M59079J37333l5499
40927D221397P09233J117639q3242j878706k261979j036429K44258O77128P57417
40918B466716Q22798L64689o75317j232484n11847P91660J430265J186738Q06647
40909E449865P67613Q52318P57061M70163N7624m17165o90543m17185L37357R28656
40899H095764O38957o03415j977738k340458j291311K95884J090692P25789N5378
40890D689542r4373J09394J48668J99480P91855J645321J692171M65745j138746
$$ plain form
40881 8509057 6677176 5388988 5163817 5740431 6667040 7653925 8446403 8698354 8249431
40872 8249431 7516089 7289450 7835397 8313870 7544878 5509182 3692891 3579034 5017888
40863 5017888 6516541 7045659 7042141 7473375 8387743 8853863 8194660 6804336 5602679
40854 5602679 5035743 4948131 5252339 6189766 7720593 9064718 9352586 8679164 8049759
40845 8049759 8137969 8487920 8253769 7466585 7107515 7893767 9361245 10373909 10364474 9792344
40835 9792344 9389633 9286292 9147304 8981878 9284077 10149961 10716284 10060817 8558879
40826 8558879 7716098 8450309 10041521 11142288 11410313 11558120 11951998 11908548 10739150
40817 10739150 9053960 8379881 9370159 10877721 11254969 10362778 9618247 9882984 10102711
$$ packed form
40881H509057j831881j288188k25171N76614R26609R86885P92478K51951m48923
40872H249431p33342k26639N45947M78473p68992k035696j816291j13857J438854
40863E017888J498653N29118l518M31234R14368M66120o59203j390324j201657
40854E602679n66936q7612L04208R37427J530827J344125K87868o73422o29405
40845H049759Q8210L49951k34151p87184l59070P86252J467478J012664r435n72130
40835I792344m02711j03341j38988j65426L02199Q65884N66323o55467j501938
40826H558879q42781P34211J591212J100767K68025J47807L93878m3450j169398
40817A0739150j685190o74079R90278J507562L77248q92191p44531K64737K19727
$$ plain form
40808 10102711 8829545 6640475 5825274 7423470 9676915 10195836 8912699 7827709
40800 7827709 8154128 8944227 8813137 8000485 7958697 9355075 11284544 12487482 12805823
40791 12805823 13208066 14629127 16980727 19180058 20021978 19156958 17394991 15968720
40783 15968720 15314493 14692008 13279752 11472345 10502445 10706220 10952578 10270068 9268678
40774 9268678 9065928 9414684 9207270 8645366 9336481 11785414 14188695 14615160 13370347
40765 13370347 12219027 12100675 12713712 13684534 14864317 15793191 16076734 16191360 16902624
40756 16902624 18003673 18599835 18463870 18029181 17190725 15389017 12977110 11221123 10647367
40747 10647367 10584214 10687039 11615121 13580114 15462472 16264846 16452136 16885821 17302819
$$ packed form
40808A0102711j273166k189070q15201J598196K253445N18921j283137j084990
40800G827709L26419P90099j31090q12652m1788J396378J929469J202938L18341
40791A2805823M02243J421061K351600K199331Q41920q65020j761967j426271
40783A5968720o54227o22485j412256j807407r69900K03775K46358o82510j001390
40774I268678k02750L48756k07414n61904O91115K448933K403281M26465j244813
40765A3370347j151320j18352O13037R70822J179783R28874K83543J14626P11264
40756A6902624J101049N96162j35965m34689q38456j801708k411907j755987n73756
40747A0647367o3153J02825R28082J964993J882358Q02374J87290M33685M16998
$$ plain form
40738 17302819 16976892 16241424 16111089 16680043 17031770 16704839 16301303 16512885 17245138
40729 17245138 17877067 17944926 17517538 17202616 17661948 18795586 19594552 19141449 17573611
40720 17573611 15852982 14977994 15616707 17745900 20026871 20307558 17816704 14490240
40712 14490240 13036952 13865789 15014819 15014129 14478549 14517925 14872392 14549900 13571218 13058519
40702 13058519 13811689 15584710 17746732 19972555 22061406 23598786 24303795 24589561
40694 24589561 25266599 26491572 27416805 27288704 26570601 26335281 26691818 26625659 25471695
40685 25471695 23665905 21826088 20126534 19030134 19418775 21084977 22223750 21734797
40677 21734797 21135269 22594514 25743703 28392549 30172577 33201888 38571496 44203058
$$ packed form
40738A7302819l25927p35468j30335N68954L51727l26931m03536K11582P32253
40729A7245138O31929O7859m27388l14922M59332J133638P98966m53103j567838
40720A7573611j720629q74988O38713K129193K280971K80687k490854l326464
40712A4490240j453288Q28837J149030o90n35580L9376L54467l22492r78682n12699
40702A3058519P53170J773021K162022K225823K088851J537380P05009K85766
40694B4589561O77038J224973R25233j28101p18103k35320L56537o6159j153964
40685B5471695j805790j839817j699554j096400L88641J666202J138773m88953
40677B1734797n99528J459245L149189K648846J780028L029311N369608N631562
$$ plain form
40669 44203058 47379045 47949417 47665418 47330553 46094679 43178608 39081503 35062748
40661 35062748 32087524 30181245 28426300 25897643 22921018 20918282 20663882 21365511
40653 21365511 21986639 22744004 24554320 27657187 31718905 36840424 43486166 51712824
40645 51712824 61372392 72626656 84849853 94931449 98271253 92671679 80859539
40638 80859539 68331933 58718220 51665236 45028832 38224071 32789084 30031447 29177857
40630 29177857 28429874 27273441 26839255 28078761 30523429 33164659 35865802 39472726
40622 39472726 45050901 53489205 65453560 81022388 98962473 116086608 127456712
40615 127456712 128495585 118510730 102141689 85923863 73017196 62306744 52456494
$$ packed form
40669D4203058L175987N70372k83999l34865j235874k916071m097105m018755
40661C5062748k975224j906279j754945k528657k976625k002736k54400P01629
40653B1365511O21128P57365J810316L102867M061718N121519O645742Q226658
40645E1712824R659568J1254264J2223197J0081596L339804n599574j1812140
40638H0859539j2527606r613713p052984o636404o804761n434987k757637q53590
40630B9177857p47983j156433m34186J239506K444668K641230K701143L606924
40622C9472726N578175Q438304J1964355J5568828J7940085J7124135J1370104
40615A27456712J038873r984855j6369041j6217826j2906667j0710452r850250
$$ plain form
40608 52456494 44635923 40283647 38304786 36519705 34771836 34564128 36183381 38124770
40600 38124770 39289972 40199730 41969690 45319299 50638409 58115941 67945018 80869322
40592 80869322 97308073 114528688 125983120 125977130 114989214 98648315 81996645 66940188
40584 66940188 54594998 46543557 42680724 40536009 38236598 36241377 35153440 34119294
40576 34119294 32825796 32864902 35264999 38510941 40940849 43429785 47673809 53491307
40568 53491307 60250823 69523820 83250870 99575631 112972928 118615741 115119865 103931292
40560 103931292 88457032 73355338 61936758 53765518 46530836 39989175 35902164
40553 35902164 34487877 33795405 32843169 32467567 32427339 30790331 27569859 26017942 28198739
$$ packed form
40608E2456494p820571m352276j978861j785081j747869k07708J619253J941389
40600C8124770J165202R09758J769960L349609N319110P477532R829077J2924304
40592H0869322J6438751J7220615J1454432n990j0987916j6340899j6651670j5056457
40584F6940188j2345190q051441l862833k144715k299411j995221j087937j034146
40576C4119294j293498L9106K400097L245942K429908K488936M244024N817498
40568E3491307O759516R272997J3727050J6324761J3397297N642813l495876j1188573
40560A03931292j5474260j5101694j1418580q171240p234682o541661m087011
40553C5902164j414287o92472r52236l75602m0228j637008l220472j551917K180797
$$ plain form
40544 28198739 31681925 33160287 33507942 36372360 42837032 50396361 56789483 61907187
40536 61907187 65435916 65225964 59587973 50064820 40542308 33785093 29513163 25861767
40528 25861767 22179134 19737610 19455597 19812310 18374835 15161681 12666900 12101641
40520 12101641 11676865 9862859 8364353 9708902 13170055 15615974 15912539 16044513
40512 16044513 17805476 20572314 22809258 23910575 23863885 22534058 20010775 16752583
40504 16752583 13152807 9857494 8199465 8806061 9959558 9243326 6965060 5885277
40496 5885277 7127757 8615132 8413017 7313047 6740724 6301118 5301947 4882676 6313911
40487 6313911 8396128 8878224 7696047 6622994 6293281 5797812 4939082 4654077 5079635
$$ packed form
40544B8198739L483186J478362L47655K864418O464672P559329O393122N117704
40536F1907187L528729k09952n637991r523153r522512o757215m271930l651396
40528B5861767l682633k441524k82013L56713j437475l213154k494781n65259
40520A2101641m24776j814006j498506J344549L461153K445919K96565J31974
40512A6044513J760963K766838K236944J101317m6690j329827k523283l258192
40504A6752583l599776l295313j658029O06596J153497p16232k278266j079783
40496E885277J242480J487375k02115j099970n72323m39606r99171m19271J431235
40487F313911K082217M82096j182177j073053l29713m95469q58730k85005M25558
$$ plain form
40478 5079635 5162328 4505925 3953271 4049884 4422589 4859826 5493478 5756001 4773155 3067460
40468 3067460 2283166 2920280 3945595 4853243 6152715 7363252 6830896 4651541 3595835
40459 3595835 5442907 8166167 8770821 7570855 7350323 9026410 10504145 9837843 7603389
40450 7603389 5713660 5196478 5590340 5748954 5038695 4148876 4401564 5836133 6797407
40441 6797407 6236974 5394745 5876884 6993035 6743205 4827935 2738147 1240539 -39747
40432 -39747 -581600 1013426 4293842 6469244 5814462 3851824 2947429 3286392 3623168
40423 3623168 3713231 4343863 5703879 7165291 8232608 8624640 7934242 6214134 4419178
40414 4419178 3413949 3077399 3039487 3415594 4021804 4015010 3409576 3664709 5288743 6225617
$$ packed form
40478E079635Q2693o56403n52654R6613L72705M37237O33652K62523r82846j705695
40468C067460p84294O37114J025315R07648J299472J210537n32356k179355j055706
40459C595835J847072K723260O04654j199966k20532J676087J477735o66302k234454
40450G603389j889729n17182L93862J58614p10259q89819K52688J434569R61274
40441F797407n60433q42229M82139J116151k49830j915270k089788j497608j280286
40432c9747n41853J595026L280416K175402o54782j962638r04395L38963L36776
40423C623168R0063O30632J360016J461412J067317L92032o90398j720108j794956
40414D419178j005229l36550l7912L76107O06210o794o05434K55133J624034R36874
$$ plain form
40404 6225617 4673904 2337063 2225883 3926440 4184318 2226509 1104894 2772017
40396 2772017 5068719 5444527 4856388 5420522 6377296 5520257 3378891 2703073 4123519
40387 4123519 5326575 4796584 3705823 3453756 3733229 3987007 4625202 5553823 5386705
40378 5386705 3643381 2190723 2824724 4644512 5585102 5532275 5934971 6996089 7408732
40369 7408732 6749915 6093221 5981747 5624779 4624415 3873424 4042943 4588346 4986427
40360 4986427 5587080 6375252 6276866 4892599 3757483 4436140 6170701 6893778 6048941
40351 6048941 4972710 4808015 5413303 6154834 6485960 5891579 4574926 4073897 5709757
40342 5709757 8334182 9196730 7460196 5346880 5128322 6387957 7226010 6976178 6480459
$$ packed form
40404F225617j551713k336841j11180J700557K57878j957809j121615J667123
40396B772017K296702L75808n88139N64134R56774q57039k141366o75818J420446
40387D123519J203056n29991j090761k52067K79473K53778O38195R28621j67118
40378E386705j743324j452658O34001J819788R40590n2827M02696J061118M12643
40369G408732o58817o56694j11474l56968j000364p50991J69519N45403L98081
40360D986427O00653P88172r8386j384267j135116O78657J734561P23077q44837
40351F048941j076231j64695O05288P41531L31126n94381j316653n01029J635860
40342E709757K624425Q62548j736534k113316k18558J259635Q38053k49832m95719
$$ plain form
40333 6480459 6431408 6704634 7008943 7202319 7116900 6790272 6694820 7168410 7837743 8067161
40323 8067161 7683995 6887233 5913507 5261281 5675234 7218933 8761643 9078212 8205154
40314 8205154 7159869 6619861 6412462 6024653 5151837 4028551 3503584 4263283 5675136
40305 5675136 6181635 5351804 4642614 5371724 6857564 7576020 7308027 6901274 6588074
40296 6588074 5924319 4927512 3897621 2507987 526355 -884328 -211233 2082222 3795592
40287 3795592 3682263 2540613 1575909 1162022 1434122 2607186 4250185 5443775 5966755
40278 5966755 6235543 6104343 5175710 4280842 4822470 6348317 6734621 5394721 4329326
40269 4329326 5076654 6540334 7048593 6791586 6753484 6744853 6097762 5157069 4644718 4552292
$$ packed form
40333F480459m9051K73226L04309J93376q5419l26628r5452M73590O69333K29418
40323H067161l83166p96762r73726o52226M13953J543699J542710L16569q73058
40314H205154j045285n40008k07399l87809q72816j123286n24967P59699J411853
40305E675136N06499q29831p09190P29110J485840P18456k67993m06753l13200
40296F588074o63755r96807j029891j389634j981632j410683O73095K293455J713370
40287C795592j13329j141650r64704m13887K72100J173064J642999J193590N22980
40278E966755K68788j31200r28633q94868N41628J525847L86304j339900j065395
40269D329326P47328J463680N08259k57007l8102q631o47091r40693n12351r2426
$$ plain form
40259 4552292 4792080 5673757 6619722 6040676 3922743 2723204 3823014 4951166 3567643
40250 3567643 1128985 976034 3183322 4917844 5300637 6224798 8198152 9068505 7853026
40241 7853026 6543103 6622860 6662184 5225294 3720988 4119339 5640117 6055192 5117728
40232 5117728 4523275 5200310 6609023 8294829 10295347 12025462 12272978 10641260 8130960
40223 8130960 6115315 5252378 5300338 5507326 5286357 4791549 4600680 4789411 4939473
40214 4939473 5178261 6260464 8151195 9473898 9127169 7751662 6821981 6854890 7281888
40205 7281888 7625193 7991657 8587382 9297085 9681520 9266947 8172479 7417879 7957427
40196 7957427 9369007 10285425 10161764 9670773 9340874 9049300 9028975 9880489 11118005
$$ packed form
40259D552292K39788Q81677R45965n79046k117933j199539J099810J128152j383523
40250C567643k438658j52951K207288J734522L82793R24161J973354Q70353j215479
40241G853026j309923P9757L9324j436890j504306L98351J520778M15075r37464
40232E117728n94453O77035J408713J685806K000518J730115K47516j631718k510300
40223H130960k015645q62937M7960K06988k20969m94808j90869J88731J50062
40214D939473K38788J082203J890731J322703l46729j375507r29681L2909M26998
40205G281888L43305L66464N95725P09703L84435m14573j094468p54600N39548
40196G957427J411580R16418j23661m90991l29899k91574k0325Q51514J237516
$$ plain form
40187 11118005 11265279 10113579 9330518 9946571 10854632 10912134 10846773 11609448 12433118
40178 12433118 12355360 12319575 13662574 15481390 15673138 13999350 12110380 11008934 10443140
40169 10443140 10394047 11140187 12044210 12169955 11969576 12595354 13783599 14254520 13904204
40160 13904204 13598946 13109566 11558316 9824765 9962294 11904366 13255736 12935286 12549113
40151 12549113 13337070 14269828 14369785 14538191 15505033 16043299 15063541 13847347 14314570
40142 14314570 16263842 17967783 18448680 17733984 15991574 13903141 12869504 13405541
40134 13405541 14259431 14329984 14251312 14767906 15024113 14235636 13681471 14881751 16837004
40125 16837004 17378073 16505846 15999231 16201597 15722262 14245732 13161149 13096181 13074760
$$ packed form
40187A1118005J47274j151700p83061O16053R08061N7502o5361P62675Q23670
40178A2433118p7758l5785J342999J818816J91748j673788j888970j101446n65794
40169A0443140m9093P46140R04023J25745k00379O25778J188245M70921l50316
40160A3904204l05258m89380j551250j733551J37529J942072J351370l20450l86173
40151A2549113P87957R32758R9957J68406R66842N38266r79758j216194M67223
40142A4314570J949272J703941M80897p14696j742410k088433j033637N36037
40134A3405541Q53890P0553p8672N16594K56207p88477n54165J200280J955253
40125A6837004N41069q72227n06615K02366m79335j476530j084583o4968k1421
$$ plain form
40116 13074760 12599197 12414674 12515749 11501895 9022324 7082334 7494546 9268035 9982594
40107 9982594 9017200 8075529 8738361 10489767 11372177 10275013 8338851 7705506 8738729
40098 8738729 9395265 8173067 6582020 7004593 8894198 9490371 8193372 7444876 8529078
40089 8529078 9331602 7920933 5883062 5689369 6583382 6005108 4072351 3450185 4844651
40080 4844651 5724801 4363942 2520108 2586355 4059500 4775804 4387586 4437922 5419472
40071 5419472 5866345 4761628 3214812 2839431 3478996 3635003 2703840 1727495 1880609
40062 1880609 3019337 4032294 4112407 3335031 2349781 1918014 2550765 4134526 5826383
40053 5826383 6558034 5815615 4012239 2196322 1310784 1447271 1768613 1449507 749079
$$ packed form
40116A3074760m75563j84523J01075j013854k479571j939990M12212J773489P14559
40107I982594r65394r41671O62832J751406Q82410j097164j936162o33345J033223
40098H738729O56536j222198j591047M22573J889605N96173j296999p48496J084202
40089H529078Q02524j410669k037871j93693Q94013n78274j932757o22166J394466
40080D844651Q80150j360859j843834O6247J473145P16304l88218N0336R81550
40071E419472M46873j104717j546816l75381O39565J56007r31163r76345J53114
40062A880609J138728J012957Q0113p77376r85250m31767O32751J583761J691857
40053E826383P31651p42419j803376j815917q85538J36487L21342l19106p00428
$$ plain form
40044 749079 784817 2142691 4154437 5705590 6222550 5647959 4186968 2620163 2185509
40035 2185509 3341508 5043940 5953986 5940484 5680507 5382090 4954718 4957979 6019659
40026 6019659 7426092 7671061 6594222 5711276 6062302 6896694 7012979 6394175 5875754
40017 5875754 5950410 6487502 7086320 7319821 7092194 6824641 6664406 5751013 3430979
40008 3430979 1103080 1221929 4036459 6946864 7817596 7263106 6659019 5745810 3904123
39999 3904123 2277645 2362821 3303644 2924827 1219066 563696 2183246 4377216 4988151
39990 4988151 4134050 3618311 4635656 6799269 8716985 9014445 7453074 5455499 4911175
39981 4911175 6120538 7494171 7510494 6304253 5063996 4589670 4867633 5491346 6039421
$$ packed form
40044G49079L5738J357874K011746J551153N16960n74591j460991j566805m34654
40035B185509J155999J702432R10046j3502k59977k98417m27372L261J061680
40026F019659J406433K44969j076839q82946L51026Q34392J16285o18804n18421
40017E875754P4656N37092N98818K33501k27627k67553j60235r13393k320034
40008C430979k327899J18849K814530K910405Q70732n54490o04087r13209j841687
39999C904123j626478Q5176R40823l78817j705761o55370J619550K193970O10935
39990D988151q54101n15739J017345K163613J917716K97460j561371j997575n44324
39981D911175J209363J373633J6323j206241j240257m74326K77963O23713N48075
$$ plain form
39972 6039421 6378097 6823034 7646817 8391447 8251009 7240350 6293826 5989543 5927898
39963 5927898 5738911 5900363 6877307 8028860 8220138 7288407 6119199 5307123 4539310
39954 4539310 3583421 3155476 4020371 5440796 5498305 3411570 795089 -229670 326008
39945 326008 733455 321947 170224 695394 517341 -1021345 -1934060 -222604 2680624
39936 2680624 3561106 2103316 1318626 3030235 5494733 6421611 5976760 5283430 4016332
39927 4016332 1649890 -286131 269929 2604311 3828741 2995225 2489201 4479070 7627928
39918 7627928 8720765 6745139 3947835 2960606 4055564 5631305 6518121 6878915 7082153
39909 7082153 6781725 5631874 4219366 3489420 3569286 3944823 4558732 5768158 7230325
$$ packed form
39972F039421L38676M44937Q23783P44630j40438j010659r46524l04283o1645
39963E927898j88987J61452R76944J151553J91278r31731j169208q12076p67813
39954D539310r55889m27945Q64895J420425N7509k086735k616481j024759N55678
39945C26008M07447m11508j51723N25170j78053j538686r12715J711456K903228
39936B680624Q80482j457790p84690J711609K464498R26878m44851o93330j267098
39927D016332k366442j936021N56060K334382J224430q33516n06024J989869L148858
39918G627928J092837j975626k797304r87229J094958J575741Q86816L60794K03238
39909G082153l00428j149851j412508p29946P9866L75537O13909J209426J462167
$$ plain form
39900 7230325 7909503 7519781 7026585 7233619 7681966 7522863 6770803 6029184 5536416
39891 5536416 5147294 4802081 4380422 3496550 2079125 833264 523732 1048626 1743320
39882 1743320 2336598 3079031 4126228 5266157 6124432 6345269 5832420 5087034 4939681
39873 4939681 5600550 6329195 6389540 5966913 5777652 6087803 6431459 6073891 4704903
39864 4704903 3060871 2671365 4178568 6038092 6071255 4367825 3126788 3272259 3161472
39855 3161472 1640179 314746 954202 2321883 2040717 562785 540298 2599514 4492130
39846 4492130 4707980 4332619 4525165 4478666 3184857 1453987 715451 1034083 1618655
39837 1618655 2284702 3141926 3651528 3289936 2629198 2596766 2982182 2690959 1321660
$$ packed form
39900G230325O79178l89722m93196K07034M48347j59103p52060p41619m92768
39891E536416l89122l45213m21659q83872j417425j245861l09532N24894O94694
39882A743320N93278P42433J047197J139929Q58275K20837n12849p45386j47353
39873D939681O60869P28645O0345m22627j89261L10151L43656l57568j368988
39864D704903j644032l89506J507203J859524L3163j703430j241037J45471j10787
39855C161472j521293j325433O39456J367681k81166j477932k2487K059216J892616
39846D492130K15850l75361J92546m6499j293809j730870p38536L18632N84572
39837A618655O66047Q57224N09602l61592o60738l2432L85416k91223j369299
$$ plain form
39828 1321660 -328628 -1244727 -1049264 13633 1378100 2426333 2830189 2699857 2357958
39819 2357958 2105652 2116961 2217367 1906824 1122721 783943 1779580 3499677 4373797
39810 4373797 3982597 3532930 3943815 4642313 4767589 4366756 3672402 2402140 772148
39801 772148 75653 948294 1953197 1401174 -52571 -310162 984508 2009110 1691504
39792 1691504 1216196 1781799 2408624 1442939 -545453 -1035291 1178240 4312303 5836065
39783 5836065 5484662 5015523 5374577 5470358 4149671 2166143 1136083 1273339 1475481
39774 1475481 1349326 1721525 3051230 4717857 6205246 7600817 8372423 7150196 3790702
39765 3790702 475642 -557647 396159 1399104 1602689 1693127 2096468 2278559 1844427
$$ packed form
39828A321660j650288r16099J95463J062897J364467J048233M03856j30332l41899
39819B357958k52306J1309J00406l10543p84103l38778R95637J720097Q74120
39810D373797l91200m49667M10885O98498J25276m00833o94354j270262j629992
39801G72148o96495Q72641J004903n52023j453745k57591J294670J024602l17606
39792A691504m75308N65603O26825r65685j988392m89838K213531L134063J523762
39783E836065l51403m69139L59054R5781j320687j983528j030060J37256K02142
39774A475481j26155L72199J329705J666627J487389J395571P71606j222227l359494
39765C790702l315060j033289R53806J002945K03585R0438M03341J82091m34132
$$ plain form
39756 1844427 1126245 544965 287300 601296 1536692 2427500 2464518 1723462 884821 187906
39746 187906 -454157 -660479 -90540 447817 -248832 -1864196 -2774517 -2415663 -2028921
39737 -2028921 -2572473 -3304633 -3233777 -2678181 -2263694 -1412743 722777 3345361 4519446
39728 4519446 3649919 2279483 2072177 2881015 3361572 2921418 2301319 2287238 2526371
39719 2526371 2049974 690744 -606800 -973863 -576370 -103382 180441 364730 306406
39710 306406 -169504 -661523 -483795 463015 1683943 2836424 3820706 4230526 3556765
39701 3556765 2087340 856635 447001 467949 452230 603856 1281731 2269793 3010125
39692 3010125 3279969 3319912 3424096 3522283 3126438 1894320 385625 -265006 130449
$$ packed form
39756A844427p18182n81280k57665L13996R35396Q90808L7018p41056q38641o96915
39746A87906o42063k06322N69939N38357o96649j615364r10321L58854L86742
39737b028921n43552p32160P0856N55596M14487Q50951K135520K622584J174085
39728D519446q69527j370436k07306Q08838M80557m40154o20099j4081K39133
39719B526371m76397j359230j297544l67063L97493M72988K83823J84289n8324
39710C06406m75910m92019J77728R46810J220928J152481R84282M09820o73761
39701C556765j469425j230705m09634K0948j5719J51626O77875R88062P40332
39692C010125K69844L9943J04184R8187l95845j232118j508695o50631L95455
$$ plain form
39683 130449 328263 -459629 -957661 475845 3003576 3995791 2644965 979942 735538
39674 735538 1128881 783416 92378 102834 362123 -268576 -1369429 -1334761 214224 1862395
39664 1862395 2258063 1417892 219887 -421402 54706 1373869 2370373 2141396 1088515
39655 1088515 191817 -258997 -354674 369720 2272456 4369025 5170452 4647468 3984536
39646 3984536 3455073 2152923 91459 -1132161 -527159 823843 1438102 1447495 1876311
39637 1876311 2800745 3405378 3295606 2637169 1405622 -353400 -1703340 -1435461 275938
39628 275938 1720920 1526558 106025 -1065859 -1119364 -371537 333170 359204 -434492
39619 -434492 -1576926 -2089013 -1215894 636283 2043023 2064838 1364849 1268563 1851750
$$ packed form
39683A30449J97814p87892m98032J433506K527731R92215j350826j665023k44404
39674G35538L93343l45465o91038J0456K59289o30699j100853L4668J548985J648171
39664A862395L95668q40171j198005o41289M76108J319163R96504k28977j052881
39655A088515q96698m50814r5677P24394J902736K096569Q01427n22984o62932
39646C984536n29463j302150k061464j223620O05002J351002O14259R393M28816
39637A876311R24434O04633j09772o58437j231547j759022j349940K67879J711399
39628B75938J444982j94362j420533j171884n3505P47827P04707K6034p93696
39619d34492j142434n12087Q73119J852177J406740K1815o99989r6286N83187
$$ plain form
39610 1851750 1747361 33047 -2468763 -4192859 -4455490 -3585116 -2165930 -878021 -431410
39601 -431410 -735326 -637608 549713 1816202 1923053 1556173 2407437 4338270 5374277
39592 5374277 4822105 4404885 5404485 6439167 5466182 2736082 281574 -653807 -326229
39583 -326229 547484 1123398 453896 -1283125 -2167552 -794206 1365010 1772962 703478
39574 703478 965711 3395904 5083196 3347162 -491982 -3075310 -3319058 -2700096 -2073719
39565 -2073719 -609959 1911526 3818079 3564877 1859546 714423 994498 1826240 2120850
39556 2120850 1777466 1302513 973099 811541 1012210 1786950 2736085 2929890 2031710
39547 2031710 1009138 1121044 2285187 3128680 2749158 1665497 723919 -67471 -922524
$$ packed form
39610A851750j04389j714314k501810j724096k62631Q70374J419186J287909M46611
39601d31410l03916R7718J187321J266489J06851l66880Q51264J930833J036007
39592E374277n52172m17220R99600J034682r72985k730100k454508r35381L27578
39583c26229Q73713N75914o69502j737021q84427J373346K159216M07952j069484
39574G03478K62233K430193J687292j736034l839144k583328k43748O18962O26377
39565b073719J463760K521485J906553k53202j705331j145123K80075Q31742K94610
39556B120850l43384m74953l29414j61558K00669P74740R49135J93805q98180
39547B031710j022572J11906J164143Q43493l79522j083661r41578p91390q55053
$$ plain form
39538 -922524 -1245044 -294141 1422437 2510025 2438704 1956326 1654069 1159853 154248
39529 154248 -729196 -700606 19512 461281 98781 -597062 -654511 417907 1868996 2115350
39519 2115350 546879 -1306579 -1435001 -65252 716036 238062 242072 1730763 2873889
39510 2873889 1830510 4518 92634 1926012 2923173 2166239 1148943 455486 -1195454
39501 -1195454 -3769921 -4715422 -2508076 887035 2774355 2918590 2250215 543133 -2220928
39492 -2220928 -3893908 -2469534 529627 1723564 492582 -667974 -205692 707189
39484 707189 684974 -28458 -820843 -1712459 -2400615 -2136474 -1205950 -829920 -1078747 -748631
39474 -748631 126423 -194001 -2116620 -3373044 -2221273 -134161 491564 -228088 -518171
$$ packed form
39538i22524l22520R50903J716578J087588p1321m82378l02257m94216j005605
39529A54248q83444K8590P20118M41769l62500o95843n7449J072418J451089K46354
39519B115350j568471j853458j28422J369749P81288m77974M010J488691J143126
39510B873889j043379j825992Q8116J833378R97161p56934j017296o93457j650940
39501a195454k574467r45501K207346L395111J887320J44235o68375j707082k764061
39492b220928j672980J424374K999161J193937j230982j160556M62282R12881
39484G07189k2215p13432p92385q91616o88156K64141R30524L76030k48827L30116
39474g48631Q75054l20424j922619j256424J151771K087112O25725p19652k90083
$$ plain form
39465 -518171 -55882 -31569 -707102 -986674 -334721 489744 639314 -71571 -1432471 -2753057
39455 -2753057 -2865569 -1389688 349037 822887 279895 -40551 -110583 -905915 -2286065
39446 -2286065 -2870950 -2141727 -1036200 -209394 720944 1792367 2078148 1084494 -431091
39437 -431091 -1535016 -1854763 -932271 1635759 4754010 6110068 5003529 3583514 3977770
39428 3977770 5336029 5304421 3595583 2193275 2208449 2406348 1370511 -282040 -798540
39419 -798540 308623 1717176 2043880 1432432 1080506 1518671 1980514 1714771 1301379
39410 1301379 1837541 3058243 3429169 2429787 1603783 2516455 4501919 5527564 4850426
39401 4850426 3695963 3432933 4113974 4921747 5154001 4518926 3220302 2105237 2128120
$$ packed form
39465e18171M62289K4313o75533k79572O51953Q24465J49570p10885j360900j320586
39455b753057j12512J475881J738725M73850n42992l20446p0032p95332j380150
39446b286065n84885P29223J105527Q26806R30338J071423K85781r93654j515585
39437d31091j103925l19747R22492K568030L118251J356058j106539j420015L94256
39428C977770J358259l1608j708838j402308J5174J97899j035837j652551n16500
39419g98540J107163J408553L26704o11448l51926M38165M61843k65743m13392
39410A301379N36162J220702L70926r99382q26004R12672J985464J025645o77138
39401D850426j154463k63030O81041Q07773K32254o35075j298624j115065K2883
$$ plain form
39392 2128120 3282140 4520488 5073393 5366011 6163180 7190798 7277380 5842552 3683378
39383 3683378 2081042 1525571 1659625 2193548 3257408 4684473 5502894 4759240 2791636
39374 2791636 1152905 1067485 2258643 3453551 3760887 3338457 2919036 2955809 3242051
39365 3242051 3289089 2995278 2698849 2449511 1706320 329409 -514615 557109 3085073
39356 3085073 4853100 4473275 2991074 2309628 2838393 3532160 3620104 3284452 2902306
39347 2902306 2500708 1926713 1044188 -8898 -400431 920309 3663143 5843604 5970159
39338 5970159 4941813 4582528 4915836 4483285 3062012 2208276 2855676 4077240 4781926
39329 4781926 5142788 5650145 6085105 6200536 6234624 6049165 5003880 3424305 2816767
$$ packed form
39392B128120J154020J238348N52905K92618P97169J027618Q6582j434828k159174
39383C683378j602336n55471J34054N33923J063860J427065Q18421p43654j967604
39374B791636j638731q5420J191158J194908L07336m22430m19421L6773K86242
39365C242051M7038k93811k96429k49338p43191j376911q44024J071724K527964
39356C085073J768027l79825j482201o81446N28765O93767Q7944l35652l82146
39347B902306m01598n73995q82525j053086l91533J320740K742834K180461J26555
39338E970159j028346l59285L33308m32551j421273q53736O47400J221564P04686
39329D781926L60862N07357M34960J15431L4088j85459j045285j579575o07538
$$ plain form
39320 2816767 3694548 4619327 4530762 4491743 5606533 6715615 6190605 4848055 4687904
39311 4687904 5442573 4969458 2885545 1181857 894856 709746 -272997 -675135 888811
39302 888811 3377940 4666108 4225271 3220197 2751493 3019528 3553592 3514719 2445917
39293 2445917 1203540 1260385 2723360 4217319 5104317 6218971 7672879 7786868 5592782
39284 5592782 2841237 1837092 2485948 3189191 3519622 4046937 4404181 3722886 2603264
39275 2603264 2621304 3953108 5197319 5471357 5117214 4470890 3495587 2553247 2105698
39266 2105698 1803449 1177613 791418 1231151 1591890 769756 -360163 -132953 1069808
39257 1069808 1459667 878773 710873 1138363 1262475 1701589 3951422 7157736 8890589
$$ packed form
39320B816767Q77781R24779q8565l9019J114790J109082n25010j342550j60151
39311D687904P54669m73115k083913j703688k87001j85110r82743m02138J563946
39302H88811K489129J288168m40837j005074m68704K68035N34064l8873j068802
39293B445917j242377N6845J462975J493959Q86998J114654J453908J13989k194086
39284E592782k751545j004145O48856P03243L30431N27315L57244o81295j119622
39275B603264J8040J331804J244211K74038l54143o46324r75303r42340m47549
39266B105698l02249o25836l86195M39733L60739q22134j129919K27210J202761
39257A069808L89859n80894j67900M27490J24112M39114K249833L206314J732853
$$ plain form
39248 8890589 9323081 10934149 13623594 14328162 12472605 11323454 12485353 13869611
39240 13869611 15013938 18949435 26007576 31808841 35359798 42642105 56972850 73670931
39232 73670931 92682372 127731872 187335463 249152704 271442852 236774775 172157166
39225 172157166 118345049 89845624 74203666 59723043 48033198 42228293 38097045
39218 38097045 31472666 24893510 22040218 21468814 19984610 17847731 16843286 16345966
39210 16345966 14684571 12248902 10482239 9420940 8455888 8089309 8905907 9946107
39202 9946107 9932570 9281171 9336984 10240447 10893008 10639283 9901701 9315045 8910018 8087831
39192 8087831 6262421 3836619 2316038 2681506 3876106 4006466 2904337 2096853 2172945
$$ packed form
39248H890589M32492J611068K689445P04568j855557j149151J161899J384258
39240A3869611J144327L935497P058141N801265L550957P282307J4330745J6698081
39232G3670931J9011441L5049500N9603591O1817241K2290148l4668077o4617609
39225A72157166n3812117k8499425j5641958j4480623j1689845n804905m131248
39218C8097045o624379o579156k853292n71404j484204k136879j004445m97320
39210A6345966j661395k435669j766663j061299r65052l66579Q16598J040200
39202I946107j3537o51399N5813R03463O52561k53725p37582n86656m05027q22187
39192H087831j825410k425802j520581L65468J194600J30360j102129q07484P6092
$$ plain form
39183 2172945 1891089 501931 -659434 7213 2059202 3627421 3631324 2517149 1430762
39174 1430762 1426984 2906834 5082245 6432194 6262013 5387862 4910640 4963940 5140347
39165 5140347 5415380 5948635 6483444 6599188 6204514 5334020 3926175 2270801 1180535
39156 1180535 1167584 1798524 2277642 2290188 1946487 1416988 1055514 1363969 2299618 3020972
39146 3020972 2841663 2124823 1797324 2293151 3361550 4537246 5331901 5301881 4499834
39137 4499834 3724848 3831234 4762850 5578571 5484766 4652780 3908742 3672938 3449977 2658038
39127 2658038 1744430 1716115 2418795 2350141 897079 -304964 490145 2430972 3128629
39118 3128629 2020869 866869 912150 1442379 1511463 1282635 977255 156863 -1053521
$$ packed form
39183B172945k81856j389158j161365O66647K051989J568219L903j114175j086387
39174A430762l778J479850K175411J349949j70181q74151m77222N3300J76407
39165E140347K75033N33255N34809J15744l94674q70494j407845j655374j090266
39156A180535j2951O30940M79118J2546l43701n29499l61474L08455R35649P21354
39146C020972j79309p16840l27499M95827J068399J175696P94655l0020q02047
39137D499834p74986J06386R31616Q15721r3805q31986p44038k35804k22961p91939
39127B658038r13608k8315P02680o8654j453062j202043P95109J940827O97657
39118C128629j107760j154000M5281N30229O9084k28828l05380q20392j210384
$$ plain form
39109 -1053521 -1472314 -556048 659246 1182572 1380279 1825378 2214520 2405792 3100044
39100 3100044 4345236 4811746 3860918 2851828 2890253 2854780 1547028 253086 727339
39091 727339 1830967 1076952 -1080978 -1630431 215309 1681056 697599 -1241652 -1881016
39082 -1881016 -1562951 -1868938 -2440752 -1346820 1839022 5029645 5898875 4302988 2237606
39073 2237606 1701933 2637523 3050800 1406818 -1444042 -3352724 -3489898 -2851632 -2381094
39064 -2381094 -1947316 -1379451 -1143710 -1423650 -1607146 -1283999 -838250 -531421 77505
39055 77505 1249884 2494218 3407472 4182516 4746675 4423110 3162057 2089640 1921637
39046 1921637 1751230 515167 -1057350 -1215504 447271 2516032 3482147 3002906 1574488
$$ packed form
39109a053521m18793R16266J215294N23326J97707M45099L89142J91272O94252
39100C100044J245192M66510r50828j009090L8425l5473j307752j293942M74253
39091G27339J103628p54015k157930n49453J845740J465747r83457j939251o39364
39082a881016L18065l05987n71814J093932L185842L190623Q69230j595887k065382
39073B237606n35673R35590M13277j643982k850860j908682j37174O38266M70538
39064b381094M33778N67865K35741k79940j83496L23147M45749L06829O08926
39055G7505J172379J244334R13254P75044N64159l23565j261053j072417j68003
39046A921637j70407j236063j572517j58154J662775K068761R66115m79241j428418
$$ plain form
39037 1574488 -61517 -1050876 -772156 577823 2084082 2961998 3118185 2904652 2590637
39028 2590637 2180735 1720767 1702680 2796894 4783920 6099924 5276612 2846744 963234
39019 963234 953556 2121577 3190590 3842176 4251842 4146763 3285363 2248586 1852162
39010 1852162 2126351 2507865 2624407 2368316 1744870 1195717 1438179 2381919 2906767
39001 2906767 2383834 1628721 1556997 1775473 1524709 1143607 1309823 1552428 1000306 84183
38991 84183 -93986 266274 18974 -776471 -921744 -445916 -937334 -2855373 -4283160
38982 -4283160 -3444901 -1148293 453871 564460 61826 -141332 85044 498742 787253
38973 787253 721442 617429 1193634 2369781 2844002 1726326 63269 -335174 653901
$$ packed form
39037A574488j636005r89359K78720J349979J506259Q77916J56187k13533l14015
39028B590637m09902m59968j8087J094214J987026J316004q23312k429868j883510
39019I63234r678J168021J069013O51586M09666j05079q61400j036777l96424
39010A852162K74189L81514J16542k56091o23446n49153K42462R43740N24848
39001B906767n22933p55113p1724K18476k50764l81102J66216K42605n52122r16123
38991H4183j78169L60260k47300p95445j45273M75828m91418j918039j427787
38982d283160Q38259K296608J602164J10589n02634k03158K26376M13698K88511
38973G87253o5811j04013N76205J176147M74221j117676j663057l98443R89075
$$ plain form
38964 653901 1290533 322879 -1454085 -2326645 -1640021 -189473 930918 1360795 1448400
38955 1448400 1587087 1831628 2195019 3043889 4747258 6870419 8225105 8054548 6809448
38946 6809448 5415630 4229271 3265973 2996427 3927464 5379065 5697728 4206631 2268131
38937 2268131 1714738 2605945 3298840 2601097 1037063 -155592 -446370 49424 1287166
38928 1287166 3022451 4218803 3926375 2896485 3161558 5455059 8068939 9105923
38920 9105923 8867752 8672320 8067692 5277909 633408 -2517989 -1580103 1905461 4156448
38911 4156448 3701988 2415080 2265652 2859588 2797177 2057343 1813553 2481561 3180656
38902 3180656 3190795 3041266 3767918 5618414 7925506 9908683 11083370 11110260 10021253
$$ packed form
38964F53901O36632r67654j776964q72560O86624J450548J120391M29877Q7605
38955A448400J38687K44541L63391Q48870J703369K123161J354686j70557j245100
38946F809448j393818j186359r63298k69546R31037J451601L18663j491097j938500
38937B268131n53393Q91207O92895o97743j564034j192655k90778M95794J237742
38928A287166J735285J196352k92428j029890K65073K293501K613880J036984
38920I105923k38171j95432o04628k789783m644501l151397R37886L485564K250987
38911D156448m54460j286908j49428N93936o2411p39834k43790O68008O99095
38902C180656J0139j49529P26652J850496K307092J983177J174687K6890j089007
$$ plain form
38893 10021253 8832699 9223273 11864488 15241819 16828411 15636776 13267006 12320452
38885 12320452 14057661 17619422 21093938 23116530 23738267 24050959 24963852 26399397
38877 26399397 27869978 29614725 32542130 36916493 41718795 45699954 48662778 51354340
38869 51354340 54532759 58625638 63940545 70549529 78004050 85598422 92861422 99492395
38861 99492395 105102742 109583939 113537135 117540135 120819848 121405401 118155510 112265037
38853 112265037 106166640 101039440 95994449 89885627 83306771 78056070 74673591 71385101
38845 71385101 66130035 59172573 52792351 48457560 45339029 41983758 38434626 35790772
38837 35790772 34271502 32830409 30608822 27866956 25374938 23623244 22762665 22566972
$$ packed form
38893A0021253j188554L90574K641215L377331J586592j191635k369770r46554
38885A2320452J737209L561761L474516K022592O21737L12692R12893J435545
38877B6399397J470581J744747K927405M374363M802302L981159K962824K691562
38869E1354340L178419M092879N314907O608984P454521P594372P263000O630973
38861I9492395N610347M481197L953196M003000L279713N85553l249891n890473
38853A12265037o098397n127200n044991o108822o578856n250701l382479l288490
38845G1385101n255066o957462o380222m334791l118531l355271l549132k643854
38837C5790772j519270j441093k221587k741866k492018j751694q60579j95693
$$ plain form
38829 22566972 22154986 20438268 17373604 14383538 13034491 13460982 14410348 14645327 13965723
38820 13965723 12976682 12221611 11632185 10686952 9050421 7067871 5576237 5163800 5600927
38811 5600927 5988657 5517511 4225985 3037263 2868534 3676851 4639057 5259777 5799505
38802 5799505 6446818 6738984 6273478 5377838 4455030 3313494 1975095 1440762 2429315
38793 2429315 3864497 4095214 3312821 3047675 3421006 3054064 2022978 2368125 4526105
38784 4526105 5762270 4126257 1821055 1973359 3658456 3425710 1016457 -74115
38776 -74115 1921701 4413713 4537298 3042478 2368909 3045239 3973147 4645404 5070365
38767 5070365 4691507 3306794 2175498 2463474 3389689 3580351 3362018 3802886 4302839
$$ packed form
38829B2566972m11986j716718l064664k990066j349047M26491R49366K34979o79604
38820A3965723r89041p55071n89426r45233j636531j982550j491634m12437M37127
38811E600927L87730m71146j291526j188722j68729Q08317R62206O20720N39728
38802E799505O47313K92166m65506q95640r22808j141536j338399n34333R88553
38793B429315J435182K30717p82393k65146L73331l66942j031086L45147K157980
38784D526105J236165j636013k305202J52304J685097k32746k409253j090572
38776g4115J995816K492012J23585j494820o73569O76330R27908O72257M24961
38767E070365l78858j384713j131296K87976R26215J90662k18333M40868M99953
$$ plain form
38758 4302839 3442779 1831739 1607691 2959101 3619418 2487177 1410702 2145340 3503996
38749 3503996 3243139 1456119 216690 491892 1135782 857245 -189258 -1018097 -1069765
38740 -1069765 -495126 255002 768511 828986 504615 156890 290199 1108169 2041956 2134331
38730 2134331 1355930 1059391 2292850 4034924 4292212 2893207 1837510 2543478 4037201
38721 4037201 4467784 3324375 1512647 245448 466644 2280111 4237912 4320486 2422090
38712 2422090 688033 556518 939698 543116 307782 1588171 3221193 2924018 1024285
38703 1024285 245249 1784847 3967578 5100393 5405279 5468067 4895512 3582366 2607175
38694 2607175 2665150 2895501 2319098 1284067 515252 -91377 -652810 -409017 1083792
$$ packed form
38758D302839q60060j611040k24048J351410O60317j132241j076475P34638J358656
38749C503996k60857j787020j239429K75202O43890k78537j046503q28839n1668
38740a069765N74639P50128N13509O0475l24371l47725J33309Q17970R33787R2375
38730B134331p78401k96539J233459J742074K57288j399005j055697P05968J493723
38721D037201M30583j143409j811728j267199K21196J813467J957801Q2574j898396
38712B422090j734057j31515L83180l96582k35334J280389J633022k97175j899733
38703A024285p79036J539598K182731J132815L04886O2788n72555j313146r75191
38694B607175N7975K30351n76403j035031p68815o06629n61433K43793J492809
$$ plain form
38685 1083792 2757018 3351423 3296675 3977416 5563272 6839139 7013920 6574270 6314304
38676 6314304 6392688 6455247 6069430 4968368 3284654 1520828 47488 -1147014 -2000905
38667 -2000905 -2084722 -1105260 619727 2388611 3395932 2775640 231026 -3038925 -4953320
38658 -4953320 -4678045 -3403183 -2522256 -1999820 -1241781 -520270 -432904 -705172 -666539 -356622
38648 -356622 -149140 92420 428474 156477 -985987 -1616412 -315697 1945780 2733087
38639 2733087 1461970 78237 176922 1101627 1503181 1319406 1271648 1428206 1293552
38630 1293552 785702 334059 278405 625638 1115561 1230599 465739 -1140495 -2945288
38621 -2945288 -4236342 -4618657 -4027938 -2777585 -1489071 -575337 65257 539091 559184
$$ packed form
38685A083792J673226N94405n4748O80741J585856J275867J74781m39650k59966
38676F314304P8384O2559l85817j101062j683714j763826j473340j194502q53891
38667b000905q3817R79462J724987J768884J007321o20292k544614l269951j914395
38658d953320K75275J274862Q80927N22436P58039P21511Q7366k72268L8633L09917
38648c56622K07482K41560L36054k71997j142464o30425J300715K261477P87307
38639B733087j271117j383733R8685R24705M01554j83775m7758J56558j34654
38630A293552n07850m51643n5654L47233M89923J15038p64860j606234j804793
38621b945288j291054l82315N90719J250353J288514R13734O40594M73834K0093
$$ plain form
38612 559184 28928 -529811 -799569 -1278940 -2189136 -2496421 -1277691 520505 1194440
38603 1194440 774551 725951 1349871 1397374 489187 -3362 873016 2241778 2884429 2713469
38593 2713469 2109932 1256603 826862 1782483 3599283 4220612 2819039 1121990 818184
38584 818184 1164289 653508 -311772 -228627 984072 2100558 2595284 2827680 2701687
38575 2701687 1831213 797536 694358 1527420 2426403 3277835 4685921 6265199 6417542
38566 6417542 4289140 1071026 -1033387 -738969 1289067 2892816 2345236 379504
38558 379504 -358614 1386794 3629403 3709853 1804743 329201 531450 1560169 2630915
38549 2630915 4045179 5705543 6417657 5472211 3764135 2679108 2677815 3344849 4045608
$$ packed form
38612E59184n30256n58739k69758m79371r10196l07285J218730J798196O73935
38603A194440m19889m8600O23920M7503r08187m92549Q76378J368762O42651j70960
38593B713469o03537q53329m29741R55621J816800O21329j401573j697049l03806
38584H18184L46105n10781r65280Q3145J212699J116486M94726K32396j25993
38575B701687q70474j033677j03178Q33062Q98983Q51432J408086J579278J52343
38566F417542k128402l218114k104413K94418K028036J603749n47580j965732
38558C79504p38118J745408K242609Q0450j905110j475542K02249J028719J070746
38549B630915J414264J660364P12114r45446j708076j085027j293O67034P00759
$$ plain form
38540 4045608 4241872 3803700 3130425 2509215 1718873 911966 1084917 2471067 3337599
38531 3337599 2167114 403685 783478 3140248 4407399 3126103 1326452 1020373
38523 1020373 1348219 691083 -532607 -1010709 -782742 -419596 647995 2896155 4794168
38514 4794168 4300647 1868074 110912 632082 2659294 4602596 5498407 5033939 3592020
38505 3592020 2408662 2507722 3303234 3205964 1692575 -122554 -1022996 -895810 -271552
38496 -271552 460957 1005581 933786 55053 -1050241 -1175204 480491 3203050 5084663
38487 5084663 5068475 4328572 4655726 5793993 5863668 4438796 3305505 3568983 3995267
38478 3995267 3360746 2550012 2718136 3042737 2259660 1078346 954367 1603623 1981377
$$ packed form
38540D045608J96264m38172o73275o21210p90342q06907J72951J386150Q66532
38531C337599j170485j763429L79793K356770J267151j281296j799651l06079
38523A020373L27846o57136j223690m78102K27967L63146J067591K248160J898013
38514D794168m93521k432573j757162N21170K027212J943302Q95811m64468j441919
38505C592020j183358R9060P95512r7270j513389j815129r00442J27186O24258
38496b71552P32509N44624p1795q78733j105294j24963J655695K722559J881613
38487E084663j6188p39903L27154J138267O9675j424872j133291K63478M26284
38478C995267o34521q10734J68124L24601p83077j181314j23979O49256L77754
$$ plain form
38469 1981377 2666049 4678151 6712800 6479049 4543188 3861012 5286871 6479993 5858225
38460 5858225 4757916 4643846 4867480 4627294 4824531 6319219 8238649 9550053 10509873
38451 10509873 11085130 9969134 7095788 5271261 6913033 10473632 12493928 12157195
38443 12157195 11307753 10782735 9593863 7654429 6575164 7181022 8445955 9610009
38435 9610009 11374335 14023710 16074201 16097850 14762075 13790872 13625597 13273887 12070115
38426 12070115 10522292 9423293 8867622 8378515 7683547 7121951 7243073 8086312 9102862
38417 9102862 9860139 10432928 10875490 10873909 10462193 10530966 11751503 13276984 13458585 11795564
38407 11795564 9330866 7200014 5768761 5228366 5853111 7210166 8091602 7884012 7319769
$$ packed form
38469A981377O84672K012102K034649k33751j935861o82176J425859J193122o21768
38460E858225j100309j14070K23634k40186J97237J494688J919430J311404R59820
38451A0509873N75257j115996k873346j824527J641772L560599K020296l36733
38443A2157195q49442n25018j188872j939434j079265O05858J264933J164054
38435I610009J764326K649375K050491K3649j335775r71203j65275l51710j203772
38426A2070115j547823j098999n55671m89107o94968n61596J21122Q43239J016550
38417I102862P57277N72789M42562j581m11716O8773J220537J525481J81601j663021
38407A1795564k464698k130852j431253n40395O24745J357055Q81436k07590n64243
$$ plain form
38398 7319769 7307157 7726106 8086277 8702197 10174508 11955272 12505691 11113822 8795620
38389 8795620 6998359 5979734 5074838 4279419 4716710 7149198 10506764 12560174 12081450
38380 12081450 9888832 7735816 6730966 7012852 8234131 9705716 10454872 9915926
38372 9915926 8587655 7553552 7359628 7651637 7745960 7263269 6502297 6530252 8392191
38363 8392191 11604820 13945501 13660568 11575151 9988213 9710556 9488357 8412878 7379005
38354 7379005 7488425 8257520 8447535 7883609 7385930 7367485 7516531 7668558 8105489 8965157
38344 8965157 9960487 10686262 10775510 9914672 8215048 6426945 5227490 4365721 3073335
38335 3073335 1308460 -13682 -170680 526965 1302770 1849687 2275120 2422976 1870285
$$ packed form
38398G319769j2612M18949L60171O15920J472311J780764N50419j391869k318202
38389H795620j797261j018625r04896p95419M37291K432488L357566K053410m78724
38380A2081450k192618k153016j004850K81886J221279J471585P49156n38946
38372I915926j328271j034103j93924K92009R4323m82691p60972K7955J861939
38363H392191L212629K340681k84933k085417j586938k77657k22199j075479j033873
38354G379005J09420P69095J90015n63926m97679j8445J49046J52027M36931Q59668
38344H965157R95330P25775Q9248q60838j699624j788103j199455q61769j292386
38335C073335j764875j322142j56998O97645P75805N46917M25433J47856n52691
$$ plain form
38326 1870285 703680 -196208 -62713 750559 1160266 794103 509121 1158144 2311122
38317 2311122 2800410 2315346 1750922 1904020 2446465 2469568 1637547 487460 -216668
38308 -216668 -218988 87849 268229 587931 1758646 3610525 4547407 3153274 181954
38299 181954 -1913180 -1501214 847818 3384884 4676816 4140388 2264072 614156 583907
38290 583907 1746825 2391596 1916454 1444166 1688625 1805933 1252353 1188356 2609353
38281 2609353 4343612 4613418 3701211 3283187 3728351 3906648 3344663 2700906 2114057
38272 2114057 852601 -1091513 -2512628 -2451982 -1055588 1066470 3183342 4296903
38264 4296903 4042823 3622195 4319512 5271195 4556954 2455134 1355991 2066046 2666225
$$ packed form
38326A870285j166605q99888J33495Q13272M09707l66163k84982O49023J152978
38317B311122M89288m85064n64424J53098N42445K3103q32021j150087p04128
38308b16668k320L06837J80380L19702J170715J851879R36882j394133k971320
38299A81954k095134M11966K349032K537066J291932n36428j876316j649916l0249
38290E83907J162918O44771m75142m72288K44459J17308n53580o3997J420997
38281B609353J734259K69806r12207m18024M45164J78297n61985o43757n86849
38272B114057j261456j944114j421115O0646J396394K122058K116872J113561
38264D296903k54080m20628O97317R51683p14241k101820j099143P10055O00179
$$ plain form
38255 2666225 1948418 1472857 2652749 4027169 3529944 1809747 1039350 1599859 2178673
38246 2178673 2326564 2730653 3449861 3866024 4028546 4284887 4070375 2903844 2003650
38237 2003650 2768338 4057020 3398594 854123 -873210 -509902 225027 -79714 -266830
38228 -266830 912825 2256385 1926365 293381 -861744 -836279 684 1632546 3931846
38219 3931846 5514198 5027559 3319662 2574695 3364412 4177291 3929638 3275132 3012747
38210 3012747 2748830 1972580 1283156 1464644 2042168 1896766 1066795 838322 1801905
38201 1801905 2711954 2030650 232006 -447834 1129857 3289266 3583256 2078746 1342383
38192 1342383 3016533 5658541 6673526 5482482 3799127 3227443 3569412 3499873 2251202
$$ packed form
38255B666225p17807m75561J179892J374420m97225j720197p70397N60509N78814
38246B178673J47891M04089P19208M16163J62522K56341k14512j166531r00194
38237B003650P64688J288682o58426k544471j727333L63308P34929l04741j87116
38228b66830J179655J343560l30020j632984j155125K5465Q36963J631862K299300
38219C931846J582352m86639j707897p44967P89717Q12879k47653o54506k62385
38210C012747k63917p76250o89424J81488N77524j45402q29971k28473R63583
38201A801905R10049o81304j798644o79840J577691K159409K93990j504510p36363
38192A342383J674150K642008J014985j191044j683355n71684L41969o9539j248671
$$ plain form
38183 2251202 455022 -465954 259169 1951626 3408210 4443663 5788934 7464258
38175 7464258 8314444 7579255 5937729 4434038 3363779 2859094 3383389 4663127 5288486
38166 5288486 4634678 4113695 5054308 6395129 6305107 5207586 5016418 5933531 6431932
38157 6431932 6221235 6605439 7644792 7684948 6467290 6052243 7447361 8851344 8854241
38148 8854241 8935019 10618740 12327300 11848980 10415014 11172558 14320086 16901411 17408539
38139 17408539 17602848 19151907 21141613 22166038 22832815 24671156 27911412 31746950
38131 31746950 35803610 40018804 43785441 46618300 49486745 54352854 62148081 71791746
38123 71791746 81430753 90362457 99534216 110201007 122343177 134755906 146581430
$$ packed form
38183B251202j796180r20976P25123J692457J456584J035453J345271J675324
38175G464258Q50186p35189j641526j503691j070259n04685N24295J279738O25359
38166E288486o53808n20983R40613J340821r0022j097521j91168R17113M98401
38157F431932k10697L84204J039353M0156j217658m15047J395118J403983K897
38148H854241Q0778J683721J708560m78320j433966P57544L147528K581325N07128
38139A7408539J94309J549059J989706J024425O66777J838341L240256L835538
38131C1746950M056660M215194L766637K832859K868445M866109P795227R643665
38123G1791746R639007Q931704R171759J0666791J2142170J2412729J1825524
$$ plain form
38116 146581430 157914469 168426923 176268529 179368975 177385782 171366498 162017802 149717953
38108 149717953 136002915 123310918 112771950 103474771 94324685 85457540 77431142
38101 77431142 70298162 64098994 59145898 55168948 51215166 46978475 43144373 39892729
38093 39892729 36411837 32647621 29997693 29074673 28200270 25664946 22322526 20208674
38085 20208674 19526807 18920404 18034887 17682004 17754147 17123236 15710189 14662700 14191456
38076 14191456 13187384 11502634 10638882 11240140 11647217 10206706 7673939 5984940
38068 5984940 5706371 6092200 6808844 8027239 9203777 9288233 8234448 7203621 7068005
38059 7068005 7499696 7681807 7244062 6320864 5244719 4430254 4213561 4580295 5165693
$$ packed form
38116A46581430J1333039J0512454P841606L100446j983193o019284r348696j2299849
38108A49717953j3715038j2691997j0538968r297179r150086q867145q026398
38101G7431142p132980o199168m953096l976950l953782m236691l834102l251644
38093C9892729l480892l764216k649928r23020q74403k535324l342420k113852
38085B0208674o81867o06403q85517l52883P2143o30911j413047j047489m71244
38076A4191456j004072j684750q63752O01258M07077j440511k532767j688999
38068E984940k78569L85829P16644J218395J176538Q4456j053785j030827j35616
38059G068005M31691J82111m37745r23198j076145q14465k16693L66734N85398
$$ plain form
38050 5165693 5564472 5589632 5310790 4877201 4205992 3016270 1543697 974850 2329764
38041 2329764 4788158 6094835 5125011 3182974 2094606 1909092 1492666 657697 349958
38032 349958 1016185 2118594 3246741 4434273 5237785 4855731 3641715 3250373 4482697
38023 4482697 5996804 6155185 5371884 5400358 6681653 7721678 7227750 5759096 4779936
38014 4779936 4833578 5294233 5521256 5558549 5662726 5638188 4997917 3741304 2659831 2558203
38004 2558203 3227373 3652544 3452896 3551592 4767924 6139699 5748880 3414339 1454013
37995 1454013 2008423 4386164 6116372 6187534 5946039 6721347 7866732 7810770 6183796
37986 6183796 4059251 2525223 1766497 1370585 960828 578583 713638 1693266 2842520
$$ packed form
38050E165693L98779K5160k78842m33589o71209j189722j472573n68847J354914
38041B329764K458394J306677r69824j942037j088368j85514m16426q34969l07739
38032C49958O66227J102409J128147J187532Q03512l82054j214016l91342J232324
38023D482697J514107J58381p83301K8474J281295J040025m93928j468654r79160
38014D779936N3642M60655K27023L7293J04177k4538o40271j256613j081473j01628
38004B558203O69170M25171j99648R8696J216332J371775l90819k334541j960326
37995A454013N54410K377741J730208P1162k41495P75308J145385n5962j626974
37986F183796k124545j534028p58726l95912m09757l82245J35055R79628J149254
$$ plain form
37977 2842520 2868966 1614591 756776 1849211 4106896 5264885 4479521 3151665 2726407
37968 2726407 2939808 2799941 2249161 1997480 2358445 3087147 3969759 4804395 5035594
37959 5035594 4146207 2435999 928387 422475 855120 1524119 1747336 1414372 1054474
37950 1054474 1276590 2107536 3015508 3459819 3124418 1874530 111214 -991411 -493242
37941 -493242 951217 1638682 963245 75013 70589 625621 1024039 1426278 2199960 2925685
37931 2925685 3118351 3174886 3556193 3780056 3358983 2946672 3194555 3207195 1808655 -126441
37921 -126441 -489234 996056 2395054 2486360 2229242 2730473 3407185 3105641 1848690
37912 1848690 585821 86939 691508 2225333 3617928 3556007 2031469 302043 -984508
$$ packed form
37977B842520K6446j254375q57815J092435K257685J157989p85364j327856m25258
37968B726407K13401j39867n50780k51681L60965P28702Q82612Q34636K31199
37959E035594q89387j710208j507612n05912M32645O68999K23217l32964l59898
37950A054474K22116Q30946R07972M44311l35401j249888j763316j102625M98169
37941d93242J444459O87465o75437q88232m424N55032L98418M02239P73682P25725
37931B925685J92666N6535L81307K23863m21073m12311K47883J2640j398540j935096
37921a26441l62793J485290J398998R1306k57118N01231O76712l01544j256951
37912A848690j262869m98882O04569J533825J392595o1921j524538j729426j286551
$$ plain form
37903 -984508 -2323621 -3590293 -3425655 -1358635 1027647 2317958 3161676 4381297 4670817
37894 4670817 2427852 -950909 -2074422 173906 3419728 5002927 4526977 2968341
37886 2968341 1210080 128665 386840 1180535 628727 -1567154 -3185465 -2423906 -568370
37877 -568370 -132926 -1157455 -1279590 633857 2838975 3312902 2492065 2245504 2993617
37868 2993617 3340049 2534056 1930607 3242143 6047709 8011541 7449683 4884039 2030744
37859 2030744 130402 -409940 330475 1654480 2337472 1852804 1297480 2105878 3833590
37850 3833590 4289441 2304680 -464499 -1207249 963979 4195119 5909455 5088549 2651183
37841 2651183 207986 -1212658 -1460103 -832639 232375 1074807 937723 -341535 -1910335
$$ packed form
37903i84508j339113j266672J64638K067020K386282J290311Q43718J219621K89520
37894D670817k242965l378761j123513K248328L245822J583199m75950j558636
37886B968341j758261j081415K58175P93695n51808k195881j618311P61559J855536
37877e68370M35444j024529j22135J913447K205118M73927q20837k46561P48113
37868B993617L46432q05993o03449J311536K805566J963832n61858k565644k853295
37859B030744j900342n40342P40415J324005O82992m84668n55324Q08398J727712
37850C833590M55851j984761k769179p42750K171228L231140J714336q20906k437366
37841B651183k443197j420644k47445O27464J065014Q42432j37084j279258j568800
$$ plain form
37832 -1910335 -2671501 -2506304 -2244700 -2301409 -1950286 -438912 1572528 2426913 1398085
37823 1398085 -378664 -1205094 -628977 487482 1367557 2026574 2547851 2570617 2088153
37814 2088153 2046766 3143375 4314695 3609928 792839 -1932591 -2266627 -118389 2848045
37805 2848045 5073442 5813806 4836862 2525317 20144 -1598705 -2190701 -2155245 -1639457
37796 -1639457 -840543 -544238 -1342841 -2592316 -3127533 -2792484 -2254304 -1559395 -154300
37787 -154300 1650466 2625419 2414364 2158096 2735095 3428033 3104735 1921165 1010941
37778 1010941 986456 1470240 1772648 1451035 457604 -791227 -1635824 -1689339 -952313 482542
37768 482542 2229652 3128369 1948636 -928596 -3346755 -3617564 -2421081 -1780712 -2524521
$$ packed form
37832a910335p61166J65197K61604n6709L51123J511374K011440Q54385j028828
37823A398085j776749q26430N76117J116459Q80075O59017N21277K2766m82464
37814B088153m1387J096609J171320p04767k817089k725430l34036K148238K966434
37805B848045K225397P40364r76944k311545k505173j618849n91996L5456N15788
37796a639457P98914K96305p98603j249475n35217L35049N38180O94909J405095
37787a54300J804766R74953k11055k56268N76999O92938l23298j183570r10224
37778A010941k4485M83784L02408l21613r93431j248831q44597n3515P37026J434855
37768D82542J747110Q98717j179733k877232k418159k70809J196483O40369p43809
$$ plain form
37759 -2524521 -3471133 -2993308 -846520 1559545 2464185 1414854 -318370 -1193444 -1100938
37750 -1100938 -1095041 -1632287 -2042604 -1865011 -1588338 -1611753 -1548037 -1229435 -1377675 -2391058
37740 -2391058 -3363204 -3316358 -2634488 -2201757 -1880038 -1114952 -420033 -747159 -1665469 -1665136
37730 -1665136 -272598 1455048 2553689 2919025 2391428 648248 -1505900 -2218944 -862907
37721 -862907 827721 814455 -866830 -2673430 -3703817 -4135985 -4023395 -3002849 -1301148
37712 -1301148 58633 515149 726498 1497417 2384107 2108432 374241 -1403065 -1605041
37703 -1605041 -268533 1148288 1665471 1639833 1604523 1254097 307096 -376219 296156
37694 296156 1814192 2322494 1005634 -699884 -840016 670485 2010391 1579882 -331973
$$ packed form
37759b524521r46612M77825K146788K406065R04640j049331j733224q75074R2506
37750a100938N897n37246m10317J77593K76673k3415O3716L18602j48240j013383
37740b391058r72146M6846O81870M32731L21719P65086O94919l27126r18310L33
37730a665136J392538J727646J098641L65336n27597j743180k154148p13044J356037
37721h62907J690628j3266j681285j806600j030387m32168J12590J020546J701701
37712a301148J359781M56516K11349P70919Q86690k75675j734191j777306k01976
37703a605041J336508J416821N17183k5638l5310l50426r47001o83315O72375
37694B96156J518036N08302j316860j705518j40132J510501J339906m30509j911855
$$ plain form
37685 -331973 -2039871 -2340000 -1679940 -1368032 -1804481 -2019333 -1188320 20808 307850
37676 307850 -423082 -984213 -595965 270296 917875 1372570 1837501 1957150 1327658 318057
37666 318057 -308594 -412553 -527018 -937324 -1228209 -864873 127538 1226613 1918179
37657 1918179 1956959 1308789 155087 -1007916 -1595392 -1520749 -1372685 -1669483 -2063886
37648 -2063886 -1737855 -542302 813715 1765869 2410198 2806206 2560129 1616525 769899
37639 769899 687420 957366 859793 606856 945059 1847841 2518990 2562847 2343329 2246820
37629 2246820 2269171 2233274 1850324 827849 -522417 -1281570 -1264712 -1685998 -3400110
37620 -3400110 -5159320 -5107801 -3557525 -2514367 -2603495 -2459707 -1442382 -868207 -1705381
$$ packed form
37685c31973j707898l00129O60060L11908m36449k14852Q31013J209128K87042
37676C07850p30932n61131L88248Q66261O47579M54695M64931J19649o29492j009601
37666C18057o26651j03959j14465m10306k90885L63336R92411J099075O91566
37657A918179L8780o48170j153702j163003n87476P4643J48064k96798l94403
37648b063886L26031J195553J356017R52154O44329L96008k46077r43604q46626
37639G69899q2479K69946r7573k52937L38203R02782O71149M3857k19518r6509
37629B246820K2351l5897l82950j022475j350266p59153J6858m21286j714112
37620c400110j759210N1519J550276J043158q9128J43788J017325N74175q37174
$$ plain form
37611 -1705381 -2851856 -2870782 -2001510 -1231970 -636064 25248 101504 -1057060 -2663717
37602 -2663717 -3312426 -2839193 -2257020 -2193415 -2387018 -2426711 -2121147 -1427655 -713781 -668643
37592 -668643 -1307928 -1644632 -1068143 -388770 -684432 -1792120 -2851519 -3604659 -4083011
37583 -4083011 -3758893 -2361386 -1007453 -1053059 -2070251 -2355017 -1310883 17197 694024
37574 694024 770231 368486 -619042 -1608159 -1516599 -459169 -32910 -1177208 -2761675
37565 -2761675 -3146191 -2324195 -1550113 -1433009 -1542069 -1713309 -2495668 -3804711 -4077234
37556 -4077234 -1916143 1558542 3298051 1948454 -174164 -39666 1895215 2409472
37548 2409472 392839 -1423544 -606441 1404189 1803735 791952 847236 2468617 3371709
$$ packed form
37611a705381j146475j8926Q69272P69540N95906O61312P6256j158564j606657
37602b663717o48709M73233N82173O3605j93603l9693L05564O93492P13874M5138
37592f68643o39285l36704N76489O79373k95662j107688j059399p53140m78352
37583d083011L24118J397507J353933m5606j017192k84766J044134J328080O76827
37574F94024P6207m01745r87528r89117R1560J057430M26259j144298j584467
37565b761675l84516Q21996P74082J17104j09060j71240p82359j309043k72523
37556d077234K161091L474685J739509j349597k122618J34498J934881N14257
37548B409472k016633j816383Q17103K010630L99546j011783N5284J621381R03092
$$ plain form
37539 3371709 1962781 -749907 -3114241 -4602475 -4992315 -3769276 -1427246 158247
37531 158247 -86583 -860027 -188785 1969360 3729076 3423639 1094987 -1764098 -3454458
37522 -3454458 -3338634 -2157057 -978347 -127913 380542 -15970 -1715289 -3712542 -4449029
37513 -4449029 -3821355 -2987249 -2341603 -1433989 -935428 -2472365 -5737014 -7840195 -6846847
37504 -6846847 -4323626 -2974004 -3201415 -3599191 -3569067 -3565273 -3533734 -2997450 -2361865 -2504384
37494 -2504384 -3165396 -3112288 -1902266 -347623 788584 1592700 2450912 3430221 4175891
37485 4175891 3956576 2190966 -497495 -2282058 -1920734 -66565 1835940 3203089
37477 3203089 3990693 3642623 1777824 -551488 -1756594 -1735876 -1723944 -2206492 -2309528
$$ packed form
37539C371709j408928k712688k364334j488234l89840J223039K342030J585493
37531A58247k44830p73444O71242K158145J759716l05437k328652k859085j690360
37522c454458J15824J181577J178710Q50434N08455l96512j699319j997253p36487
37513d449029O27674Q34106O45646R07614M98561j536937l264649k103181R93348
37504f846847K523221J349622k27411l97776L0124L794L1539N36284O35585j42519
37494b504384o61012N3108J210022J554643J136207Q04116Q58212R79309P45670
37485D175891k19315j765610k688461j784563L61324J854169J902505J367149
37477C203089P87604l48070j864799k329312j205106K0718J1932m82548j03036
$$ plain form
37468 -2309528 -1430759 -273722 184836 -47172 -157663 466238 1535480 1907018 645760
37459 645760 -1540500 -2476326 -837191 2214951 4464230 5048144 4496002 3214448 1413487
37450 1413487 25725 12278 852679 1223148 1048581 1274588 1708379 1028673 -753875
37441 -753875 -1827584 -1254542 -258571 92108 653938 2283425 3707963 3112431 893367
37432 893367 -926302 -1455306 -1465911 -1549574 -1441034 -1199058 -1482993 -2249840 -2438053 -1538729
37422 -1538729 -515529 -483310 -1194935 -1589198 -1348595 -1081200 -1141183 -1093184 -506594 365224
37412 365224 1059957 1596310 2198974 2638174 2454314 1744608 1107698 793194 551537 382303
37402 382303 631240 1127528 1148426 687297 773409 1838071 2758691 2463356 1474200 634237
$$ packed form
37468b309528Q78769J157037M58558k32008j10491O23901J069242L71538j261258
37459F45760k186260r35826J639135L052142K249279N83914n52142j281554j800961
37450A413487j387762j3447Q40401L70469j74567K26007M33791o79706j782548
37441g53875j073709N73042R95971L50679N61830J629487J424538n95532k219064
37432H93367j819669n29004j0605q3663J08540K41976k83935p66847j88213Q99324
37422a538729J023200L2219p11625l94263K40603K67395n9983M7999N86590Q71818
37412C65224O94733N36353O02664M39200j83860p09706o36910l14504k41657j69234
37402C82303K48937M96288K0898m61129Q6112J064662R20620k95335r89156q39963
$$ plain form
37392 634237 -616361 -2888167 -4573922 -3356640 -13800 1743455 25247 -2722915
37384 -2722915 -3144010 -1169981 698909 989761 402749 96457 443097 1229890 1855458
37375 1855458 1460072 -183807 -2073755 -3034052 -3069085 -2923478 -2751209 -2187415 -1405871
37366 -1405871 -971384 -657328 519290 2768028 4778184 4956051 3136891 871089 76400
37357 76400 1245817 2824905 2689059 517184 -1745946 -2239301 -1471485 -1469122 -2940773
37348 -2940773 -4328659 -3922295 -2074157 -662451 -698304 -1233041 -878284 167520 408447
37339 408447 -634273 -1418281 -430752 1516846 2268572 1294603 289453 712875 2150936
37330 2150936 3524835 4511829 5025680 4574006 3172114 1937793 1750241 2107330 2229104
$$ packed form
37392F34237j250598k271806j685755J217282L342840J757255j718208k748162
37384b722915m21095J974029J868890K90852n87012l06292L46640P86793O25568
37375A855458l95386j643879j889948r60297l5033J45607J72269N63794P81544
37366a405871M34487L14056J176618K248738K010156J77867j819160k265802p94689
37357G6400J169417J579088j35846k171875k263130m93355P67816K363j471651
37348b940773j387886M06364J848138J411706l5853n34737L54757J045804K40927
37339D08447j042720p84008R87529J947598P51726r73969j005150M23422J438061
37330B150936J373899R86994N13851m51674j401892j234321j87552L57089J21774
$$ plain form
37321 2229104 2403231 3153350 3896203 3669555 2601621 1498960 539038 -485714 -1218793
37312 -1218793 -1271067 -1169941 -1509940 -1668923 -737876 697571 1151882 346234 -647745
37303 -647745 -1098054 -1072236 -517125 625298 1590670 1568802 1091180 1140327 1257085 370998
37293 370998 -790453 -364999 1460577 2279191 1013320 -610870 -953829 -692473 -1095511
37284 -1095511 -2012345 -2786096 -3423747 -3658201 -2573357 -439158 806269 288587 -335811
37275 -335811 328121 976877 -175130 -2434121 -3988854 -4692992 -5191987 -4771570 -2791523
37266 -2791523 -1061439 -1724518 -3528822 -3438444 -1570833 -1017922 -2551453 -3210745 -1242763
37257 -1242763 994993 901663 -465483 -664957 155089 136337 -870999 -1301147 -564346
$$ packed form
37321B229104J74127P50119P42853k26648j067934j102661r59922j024752p33079
37312a218793n2274J01126l39999j58983R31047J435447M54311q05648r93979
37303f47745m50309K5818N55111J142423R65372k1868m77622M9147J16758q86087
37293C70998j161451M25454J825576Q18614j265871j624190l42959K61356m03038
37284a095511r16834p73751o37651k34454J084844K134199J245427n17682o24398
37275c35811O63932O48756j152007k258991j554733p04138m98995M20417J980047
37266b791523J730084o63079j804304R0378J867611N52911j533531o59292J967982
37257a242763K237756r3330j367146j99474Q20046j8752j007336m30148P36801
$$ plain form
37248 -564346 374481 742213 631929 285831 62315 622762 1871359 2369839 1216534
37239 1216534 -215995 -71069 1118026 1317745 393488 343192 1907932 3206367 2596467
37230 2596467 984896 51297 -292218 -1100808 -2060687 -1703662 283214 2358663 2894559
37221 2894559 1731110 -152736 -1729868 -2430832 -2157278 -1201577 13100 1248146 2388047
37212 2388047 3114914 2941122 1712983 -48401 -1487327 -2193792 -2625094 -3543772 -4871278
37203 -4871278 -5384332 -4053460 -1602445 -30130 -301748 -1166114 -828148 689967 1652800
37194 1652800 915659 -704858 -1542905 -901792 593812 1946230 2555552 2328996 1668598
37185 1668598 1406523 2169884 3439501 3621947 1688707 -1257587 -2712093 -1425809 1159088
$$ packed form
37248e64346R38827L67732j10284l46098k23516N60447J248597M98480j153305
37239A216534j432529J44926J189095J99719r24257n0296J564740J298435o09900
37230B596467j611571r33599l43515q08590r59879L57025J986876K075449N35896
37221B894559j163449j883846j577132p00964K73554R55701J214677J235046J139901
37212B388047P26867j73792j228139j761384j438926p06465m31302r18678j327506
37203d871278n13054J330872K451015J572315k71618q64366L37966J518115R62833
37194A652800p37141j620517q38047O41113J495604J352418O09322k26556o60398
37185A668598k62075P63361J269617J82446j933240k946294j454506J286284K584897
$$ plain form
37176 1159088 2671222 2570540 2298767 2892095 3638978 3458376 2461410 1327010 42886
37167 42886 -1574148 -2694492 -2219935 -607198 399380 66455 -541072 -460588 -226211
37158 -226211 -571151 -868271 -109703 1154334 1180130 -702044 -3182006 -4491242 -4146201
37149 -4146201 -3046451 -2383907 -2582983 -2961669 -2485090 -1184490 -523569 -1701704 -3803272
37140 -3803272 -4551836 -3051940 -907093 -188431 -1013029 -1796742 -1463938 -577290 -234166
37131 -234166 -519951 -566720 -9644 218214 -957995 -3008400 -3993792 -2840102 -753787
37122 -753787 242533 -345277 -1390690 -1938416 -2004339 -1736548 -969350 149675 1042305
37113 1042305 1451641 1438588 560004 -1708056 -4354582 -5043740 -2827332 431306 2292861
$$ packed form
37176A159088J512134j00682k71773N93328P46883j80602r96966j134400j284124
37167D2886j617034j120344M74557J612737J006578l32925o07527Q0484K34377
37158b26211l44940k97120P58568J264037K5796j882174k479962j309236L45041
37149d146201J099750O62544j99076l78686M76579J300600O60921j178135k101568
37140c803272p48564J499896K144847P18662q24598p83713L32804Q86648L43124
37131b34166k85785m6769N57076K27858j176209k050405r85392J153690K086315
37122g53787R96320n87810j045413n47726o5923K67791P67198J119025Q92630
37113A042305M09336j3053q78584k268060k646526o89158K216408L258638J861555
$$ plain form
37104 2292861 2422040 2049137 1858137 1794889 2103492 2917945 3358618 2680291 1900903 2481124
37094 2481124 3641278 3117988 805642 -616560 457239 2123485 1761881 -362774
37086 -362774 -1979156 -2144600 -1851586 -1899035 -1942111 -1582040 -981361 -292724 454261 901774
37076 901774 791671 754071 1577123 2701288 2648954 1188612 -112553 -1381 819253
37067 819253 887661 56442 -520777 -98413 825723 1410802 1588185 1927082 2541025 2558313
37057 2558313 1145702 -953796 -1655872 98282 2753446 3802173 2703310 1075310
37049 1075310 158367 -501621 -1481900 -2002395 -981630 1256800 3286371 4119325 3774060
37040 3774060 2840337 2153214 2362155 3130286 3279783 2364859 1396682 1216682 1041365
$$ packed form
37104B292861J29179l72903j91000o3248L08603Q14453M40673o78327p79388N80221
37094B481124J160154n23290k312346j422202J073799J666246l61604k124655
37086c62774j616382j65444K93014m7449m3076L60071O00679O88637P46985M47513
37076I01774j10103l7600Q23052J124165n2334j460342j301165J11172Q20634
37067H19253O8408q31219n77219M22364R24136N85079J77383L38897O13943J7288
37057B558313j412611k099498p02076J754154K655164J048727j098863j628000
37049A075310r16943o59988r80279n20495J020765K238430K029571Q32954l45265
37040C774060r33723o87123K08941P68131J49497r14924r68177j80000j75317
$$ plain form
37031 1041365 -132945 -1434552 -1131270 518847 1283705 127237 -1326301 -1199902 186175
37022 186175 1247612 1421253 1359160 1509858 1625106 1391729 699289 -541180 -2166081
37013 -2166081 -3475332 -3710683 -2740938 -1011263 858650 2128815 2108383 836022 -724666
37004 -724666 -1665903 -2021669 -2246396 -2226858 -1455128 11700 1346219 1692872 862447
36995 862447 -477667 -1102084 -199822 1557145 2418170 1516174 -95989 -937099 -1001153
36986 -1001153 -1324369 -2148517 -2609185 -2132545 -1134625 -205855 604792 1475336 2336383
36977 2336383 2897432 2861869 2182457 1296783 719356 112563 -1514195 -4042801 -5534993
36968 -5534993 -4398407 -1662682 201945 317720 -161914 -327647 -543970 -1114313 -1540684
$$ packed form
37031A041365j174310j301607L03282J650117P64858j156468j453538J26399J386077
37022A86175J061437J73641o2093J50698J15248k33377o92440j240469j624901
37013b166081j309251k35351R69745J729675J869913J270165k0432j272361j560688
37004g24666r41237l55766k24727J9538P71730J466828J334519L46653q30425
36995H62447j340114o24417R02262J756967Q61025r01996j612163q41110o4054
36986a001153l23216q24148m60668M76640R97920R28770Q10647Q70544Q61047
36977B336383N61049l5563o79412q85674n77427o06793j626758k528606j492192
36968e534993J136586K735725J864627J15775m79634j65733k16323n70343m26371
$$ plain form
36959 -1540684 -1497301 -1179917 -395943 1260004 3017818 3339664 2240437 1520782 1954244
36950 1954244 2031008 609149 -937983 -801047 442443 904785 290751 -162568 -9291
36941 -9291 25640 -263449 -214023 298538 496043 -85866 -1044468 -1807317 -2036356 -1511660
36931 -1511660 -461888 280621 304213 343874 1056368 1737467 1490268 964338 1309816 1912400
36921 1912400 1118242 -902932 -2086675 -1572361 -868744 -1249981 -1856585 -1446897 -486165
36912 -486165 -184762 -573802 -847056 -837037 -932834 -1066744 -887401 -605764 -714806 -1053020
36902 -1053020 -933809 -140903 777007 1177995 939681 455569 162718 -65575 -958784
36893 -958784 -2864414 -4854694 -5500836 -4563782 -3188115 -2390151 -2230021 -2563240 -3490351
$$ packed form
36959a540684M3383L17384P83974J655947J757814L21846j099227p19655M33462
36950A954244P6764j421859j547132J36936J243490M62342o14034m53319J53277
36941i291L4931k89089M9426N12561J97505n81909r58602p62849k29039N24696
36931a511660J049772P42509K3592L9661P12494O81099k47199n25930L45478O02584
36921A912400p94158k021174j183743N14314P03617l81237o06604M09688R60732
36912d86165L01403l89040k73254J0019r5797j33910J79343K81637j09042l38214
36902a053020J19211P92906R17910M00988k38314m84112k92851k28293q93209
36893i58784j905630j990280o46142R37054J375667P97964J60130l33219r27111
$$ plain form
36884 -3490351 -4636423 -5010279 -4181617 -2790213 -1437984 -44436 1148801 1072234 -730433
36875 -730433 -3029964 -4293577 -4453166 -4326557 -3984028 -2896205 -1307209 -253311 -263040
36866 -263040 -925287 -1686022 -2305955 -2573850 -2247335 -1338934 -85543 1241967 2279702
36857 2279702 2743007 2947275 3544694 4335419 4134659 2481425 645666 -3726 91531
36848 91531 -449573 -1713999 -2476438 -2217027 -1817492 -2051170 -2462846 -2194454 -1264962 -580626
36838 -580626 -870827 -1774623 -2089535 -1221278 -185308 -340425 -1206884 -965591 477419
36829 477419 767112 -1403543 -3916625 -4232321 -3193417 -3330497 -4501243 -4283723 -2344146
36820 -2344146 -1116587 -1648677 -1918616 -483626 982288 529140 -948684 -1451395 -1007240
$$ packed form
36884c490351j146072l73856Q28662J391404J352229J393548J193237p6567j802667
36875g30433k299531j263613j59589J26609L42529J087823J588996J053898r729
36866b63040o62247p60735o19933k67895L26515R08401J253391J327510J037735
36857B279702M63305K04268N97419P90725k00760j653234j835759o49392R5257
36848I1531n41104j264426p62439K59411L99535k33678m11676K68392R29492O84336
36838e80626k90201r03796l14912Q68257J035970j55117q66459K41293J443010
36829D77419K89693k170655k513082l15696J038904j37080j170746K17520J939577
36820b344146J227559n32090k69939J434990J465914m53148j477824n02711M44155
$$ plain form
36811 -1007240 -946633 -1301004 -1053152 -194244 399009 607705 860980 740964 -472590
36802 -472590 -2103639 -2597916 -1783912 -1188835 -1929005 -3455780 -4530498 -4383332 -2811198
36793 -2811198 -226478 2098143 2734489 1455688 -597842 -2165313 -2753570 -2419044 -1455579
36784 -1455579 -429299 85387 -6197 -390074 -789762 -1048761 -1120905 -1385209 -2434694
36775 -2434694 -3953996 -4485889 -3250137 -1594356 -1438155 -2700917 -3638012 -3455161 -2991278
36766 -2991278 -2760730 -2057315 -551331 752337 994292 671245 446895 -179720 -1938393
36757 -1938393 -4301667 -6021008 -6627210 -6448585 -5612028 -4023837 -2074884 -482775 426199
36748 426199 652884 131136 -823110 -1116588 -28798 1403541 1334285 -416364 -1984257
$$ packed form
36811a007240O0607l54371K47852Q58908N93253K08696K53275j20016j213554
36802d72590j631049m94277Q14004N95077p40170j526775j074718J47166J572134
36793b811198K584720K324621O36346j278801k053530j567471n88257L34526R63465
36784a455579J026280N14686r1584l83877l99688k58999p2144k64304j049485
36775b434694j519302n31893J235752J655781J56201j262762r37095J82851M63883
36766b991278K30548P03415J505984J303668K41955l23047k24350o26615j758673
36757a938393k363274j719341o06202J78625Q36557J588191J948953J592109R08974
36748D26199K26685n21748r54246k93478J087790J432339o9256j750649j567893
$$ plain form
36739 -1984257 -1977641 -1260016 -1396112 -2189386 -2041989 -526939 763010 417151 -752659
36730 -752659 -820932 579718 1818594 1532561 215891 -931408 -1701939 -2447138 -2675387
36721 -2675387 -1470494 823407 2667489 3279958 3311805 3279050 2701203 1469973 666848
36712 666848 861436 778819 -811603 -2756348 -2923174 -1532694 -1046227 -2568574 -4354455
36703 -4354455 -4586346 -3847262 -3651335 -3905949 -3363878 -1812767 -303611 504662 969944
36694 969944 1503946 1987535 2151730 1757368 511171 -1376427 -2683968 -2192271 -271991
36685 -271991 1451155 2178342 2771908 4197175 6017220 6987344 6485074 4767252 2361688
36676 2361688 -108253 -1847032 -2372257 -2049842 -1682093 -1606047 -1565178 -1369176 -1215416
$$ packed form
36739a984257O616P17625j36096p93274J47397J515050J289949l45859j169810
36730g52659o8273J400650J238876k86033j316670j147299p70531p45199k28249
36721b675387J204893K293901J844082O12469L1847l2755n77847j231230q03125
36712F66848J94588q2617j590422j944745j66826J390480M86467j522347j785881
36703d354455k31891P39084J95927k54614N42071J551111J509156Q08273M65282
36694I69944N34002M83589J64195l94362j246197j887598j307541M91697J920280
36685b71991J723146P27187N93566J425267J820045R70124n02270j717822k405564
36676B361688k469941j738779n25225L22415L67749P6046M0869J96002J53760
$$ plain form
36667 -1215416 -1264426 -1242461 -704375 365036 1339110 1451679 611293 -349963 -437913 474423
36657 474423 1542957 1840138 1108463 -317175 -1953014 -3404034 -4434192 -4939759 -4753492
36648 -4753492 -3653475 -1910645 -553889 -382315 -783107 -420896 741035 1153189 -53150
36639 -53150 -1492044 -1142058 1050007 3110134 3248679 1397399 -1072954 -2426110 -1774542
36630 -1774542 -32652 755262 -141139 -935758 348516 2932390 4147115 2990398 1155693
36621 1155693 432892 809983 1579918 2593562 3568815 3668929 2851493 2387279 2917952
36612 2917952 3206073 2130672 793042 987678 2380940 3023960 2228563 1083167 273422
36603 273422 -654523 -1601454 -1434364 -7882 939522 82498 -1432230 -1521489 -56919
$$ packed form
36667a215416m9010K1965N38086J069411R74074J12569q40386r61256q7950R12336
36657D74423J068534K97181p31675j425638j635839j451020j030158n05567J86267
36648d753492J100017J742830J356756J71574m00792L62211J161931M12154j206339
36639e3150j438894L49986K192065K060127J38545j851280k470353j353156O51568
36630a774542J741890P87914q96401p94619J284274K583874J214725j156717j834705
36621A155693p22801L77091P69935J013644R75253J00114q17436m64214N30673
36612B917952K88121j075401j337630J94636J393262O43020p95397j145396q09745
36603B73422r27945r46931J67090J426482R47404q57024j514728q9259J464570
$$ plain form
36594 -56919 1085206 578090 -929476 -1998047 -2046994 -1471634 -728124 171702 1324491
36585 1324491 2370314 2505558 1290882 -589002 -1762622 -1556256 -598028 194238 782900
36576 782900 1682950 2807679 3370106 2945630 1985496 1095631 391491 -130147 -194786 159968
36566 159968 26858 -1435581 -3510493 -4294068 -2980640 -1040620 -440822 -1233213 -1831505
36557 -1831505 -1404747 -829394 -1035959 -1535855 -1354525 -718247 -826865 -2140328 -3708751
36548 -3708751 -4277158 -3492803 -1946322 -527599 103526 -154709 -745592 -857989 -133962
36539 -133962 1051935 2015308 2357060 2174870 1855921 1716309 1785461 1923329 2092792 2375110
36529 2375110 2727939 2939111 2854615 2440872 1659282 639920 -24958 303929 1414078
$$ packed form
36594e6919J142125n07116j507566j068571m8947N75360P43510Q99826J152789
36585A324491J045823J35244j214676j879884j173620K06366R58228P92266N88662
36576G82900R00050J124729N62427m24476r60134q89865p04140n21638o4639L54754
36566A59968j33110j462439k074912p83575J313428J940020N99798p92391n98292
36557a831505M26758N75353k06565m99896J81330O36278j08618j313463j568423
36548c708751n68407P84355J546481J418723O31125k58235n90883j12397P24027
36539a33962J185897R63373L41752j82190l18949j39612O9152J37868J69463K82318
36529B375110L52829K11172q4496m13743p81590j019362o64878L28887J110149
$$ [...]
##END NTUPLES=NMR SPECTRUM
##END=
