##TITLE=31Pdec_SR20_rm4
 , 24 sc
 26.10.2020
##JCAMPDX= 6.0         $$ Bruker NMR JCAMP-DX V2.0
##DATA TYPE= NMR SPECTRUM
##DATA CLASS= NTUPLES
##ORIGIN= UXNMR, Bruker Analytische Messtechnik GmbH
##OWNER= root
$$ XWIN-NMR		Version 3.5
$$ Mon Oct 26 11:49:04 2020 Russian Standard Time (UT+4h)  she@DPX200
##.OBSERVE FREQUENCY= 81.013821
##.OBSERVE NUCLEUS= ^31P
##.ACQUISITION MODE= SIMULTANEOUS
##.ACQUISITION SCHEME= undefined
##.AVERAGES= 24
##.DIGITISER RES= 17
##SPECTROMETER/DATA SYSTEM= spect
##.PULSE SEQUENCE= zgpg30
##.SOLVENT NAME= CDCl3
##.SHIFT REFERENCE= (INTERNAL, CDCl3, 0, 182.463)
##AUDIT TRAIL= $$ (NUMBER, WHEN, WHO, WHERE, WHAT)
$$ ##TITLE= Audit trail, XWIN-NMR		Version 3.5
$$ ##JCAMPDX= 5.01
$$ ##ORIGIN= Bruker BioSpin GmbH
$$ ##OWNER= she
$$ F:/spectra/data/she/nmr/P31/1/pdata/1/auditp.txt
$$ ##AUDIT TRAIL=  $$ (NUMBER, WHEN, WHO, WHERE, WHAT)
(   1,<2020-10-26 11:47:38.93 +0400>,<she>,<DPX200>,
      <created by zg, POWCHK disabled, PULCHK disabled
       configuration hash MD5:
       00 E9 B6 7A A2 85 ED C7 34 08 36 98 17 FE 4E 26
       data hash MD5: 32K
       5D 52 61 A3 5A 82 D3 D2 5B F7 B4 00 1C 6B F0 1E>)
(   2,<2020-10-26 11:47:44.15 +0400>,<she>,<DPX200>,
      <Start of raw data processing
       efp BC_mod = 2 LB = 1 FT_mod = 6 PKNL = 1 PHC0 = -2376.882 PHC1 = 73.00069 SI = 64K 
       data hash MD5: 64K
       2B 07 32 E4 C8 84 14 FE 0D C5 EB D5 00 0D 3C 0A>)
(   3,<2020-10-26 11:48:03.65 +0400>,<she>,<DPX200>,
      <pk PHC0 = -6.721371 PHC1 = -44.2 
       data hash MD5: 64K
       26 5E E0 67 E9 5A 31 AD 02 7C 6B 3C 40 35 6F D2>)
(   4,<2020-10-26 11:48:37.51 +0400>,<she>,<DPX200>,
      <pk PHC0 = 0.9999941 PHC1 = 0 
       data hash MD5: 64K
       75 8C 50 46 E2 FA 28 AE BA 5D 43 7C B4 AF 7B 7B>)
$$ ##END=
$$ 
$$ hash MD5
$$ 55 5D 8F FF DE 02 46 9D 5F CF C0 06 86 0A F3 9A
##$RELAX= 
##$RELAX= 
##$RELAX= 
##$RELAX= 
##$RELAX= 
##$RELAX= 
##$RELAX= 
##$RELAX= 
$$ Bruker specific parameters
$$ --------------------------
##$DU= <F:/spectra>
##$EXPNO= 1
##$NAME= <P31>
##$PROCNO= 1
##$TYPE= <nmr>
##$USER= <she>
##$AMP= (0..31)
100 100 100 100 100 100 100 100 100 100 100 100 100 100 100 100 100 100 
100 100 100 100 100 100 100 100 100 100 100 100 100 100 
##$AQSEQ= 0
##$AQ_mod= 1
##$AUNM= <au_zg>
##$AUTOPOS= <>
##$BF1= 81.014009
##$BF2= 200.13
##$BF3= 200.13
##$BF4= 200.13
##$BF5= 200.13
##$BF6= 200.13
##$BF7= 200.13
##$BF8= 200.13
##$BYTORDA= 1
##$CFDGTYP= 0
##$CFRGTYP= 5
##$CHEMSTR= <none>
##$CNST= (0..31)
1 1 145 1 1 1 1 1 1 1 1 1 1 1 1 1 1 1 1 1 1 1 1 1 1 1 1 1 1 1 1 1 
##$CPDPRG= <waltz16>
##$CPDPRG1= <>
##$CPDPRG2= <waltz16>
##$CPDPRG3= <>
##$CPDPRG4= <mlev>
##$CPDPRG5= <mlev>
##$CPDPRG6= <mlev>
##$CPDPRG7= <mlev>
##$CPDPRG8= <mlev>
##$CPDPRGB= <>
##$CPDPRGT= <>
##$D= (0..31)
0 1 0 0 0 0 0 0 0 0 0 0.03 2e-05 3e-06 0 0 0 0 0 0 0 0 0 0 0 0 0 0 0 0 
0 0 
##$DATE= 1603698458
##$DBL= (0..7)
120 120 120 11 120 120 24 19 
##$DBP= (0..7)
150 150 150 150 150 150 150 150 
##$DBP07= 0
##$DBPNAM0= <>
##$DBPNAM1= <>
$$ [...]
##$SUBNAM2= <"">
##$SUBNAM3= <"">
##$SUBNAM4= <"">
##$SUBNAM5= <"">
##$SUBNAM6= <"">
##$SUBNAM7= <"">
##$SUBNAM8= <"">
##$SUBNAM9= <"">
##$SW= 369.568048894756
##$SWIBOX= (0..15)
0 1 3 0 0 0 0 0 0 0 0 0 0 0 0 0 
##$SW_h= 29940.119760479
##$TD= 32768
##$TD0= 1
##$TE= 0
##$TE2= 300
##$TE3= 300
##$TEG= 300
##$TL= (0..7)
0 120 53 12 22 120 120 120 
##$TP= (0..7)
150 150 150 150 150 150 150 150 
##$TP07= 0
##$TPNAME0= <>
##$TPNAME1= <>
##$TPNAME2= <>
##$TPNAME3= <>
##$TPNAME4= <>
##$TPNAME5= <>
##$TPNAME6= <>
##$TPNAME7= <>
##$TPOAL= (0..7)
0.5 0.5 0.5 0.5 0.5 0.5 0.5 0.5 
##$TPOFFS= (0..7)
0 0 0 0 0 0 0 0 
##$TUNHIN= 0
##$TUNHOUT= 0
##$TUNXOUT= 0
##$USERA1= <user>
##$USERA2= <user>
##$USERA3= <user>
##$USERA4= <user>
##$USERA5= <user>
##$V9= 5
##$VALIST= <valist>
##$VCLIST= <CCCCCCCCCCCCCCC>
##$VD= 0
##$VDLIST= <DDDDDDDDDDDDDDD>
##$VPLIST= <PPPPPPPPPPPPPPP>
##$VTLIST= <TTTTTTTTTTTTTTT>
##$WBST= 1024
##$WBSW= 4
##$XGAIN= (0..3)
0 0 0 0 
##$XL= 0
##$YL= 0
##$YMAX_a= 68512
##$YMIN_a= -38788
##$ZGOPTNS= <>
##$ZL1= 120
##$ZL2= 120
##$ZL3= 120
##$ZL4= 120
##$ABSF1= 0
##$ABSF2= 0
##$ABSG= 0
##$ABSL= 0
##$ALPHA= 0
##$AQORDER= 0
##$ASSFAC= 0
##$ASSFACI= 0
##$ASSFACX= 0
##$ASSWID= 0
##$AUNMP= <proc_1d>
##$AZFE= 0.1
##$AZFW= 0.5
##$BCFW= 0
##$BC_mod= 2
##$BYTORDP= 0
##$COROFFS= 0
##$CY= -3
##$DATMOD= 1
##$DC= 0
##$DFILT= <>
##$DTYPP= 0
##$F1P= 0
##$F2P= 0
##$FCOR= 1
##$FTSIZE= 65536
##$FT_mod= 6
##$GAMMA= 0
##$GB= 0
##$INTBC= 1
##$INTSCL= 5.30512e-09
##$ISEN= 30
##$LB= 1
##$LEV0= 0
##$LPBIN= 0
##$MAXI= 10000
##$MC2= 0
##$MEAN= 0
##$ME_mod= 0
##$MI= 50
##$NCOEF= 0
##$NC_proc= -7
##$NLEV= 6
##$NOISF1= 182.463
##$NOISF2= 159.3651
##$NSP= 0
##$NTH_PI= 0
##$NZP= 0
##$OFFSET= 182.463
##$PC= 4
##$PHC0= -2382.604
##$PHC1= 28.80069
##$PH_mod= 1
##$PKNL= yes
##$PPARMOD= 0
##$PSCAL= 0
##$PSIGN= 0
##$REVERSE= no
##$SF= 81.014009
##$SI= 65536
##$SIGF1= 159.3651
##$SIGF2= -187.1042
##$SINO= 113.3802
##$SIOLD= 16384
##$SREGLST= <1H.CDCl3>
##$SSB= 0
##$STSI= 65536
##$STSR= 0
##$SW_p= 29940.119760479
##$SYMM= 0
##$S_DEV= 0
##$TDeff= 32768
##$TDoff= 0
##$TI= <>
##$TILT= no
##$TM1= 0
##$TM2= 0
##$TOPLEV= 0
##$USERP1= <user>
##$USERP2= <user>
##$USERP3= <user>
##$USERP4= <user>
##$USERP5= <user>
##$WDW= 1
##$XDIM= 65536
##$YMAX_p= 352113419
##$YMIN_p= -20931750
$$ End of Bruker specific parameters
$$ ---------------------------------
##NTUPLES= NMR SPECTRUM
##VAR_NAME=  FREQUENCY,     SPECTRUM/REAL,   SPECTRUM/IMAG
##SYMBOL=    X,             R,               I
##VAR_TYPE=  INDEPENDENT,   DEPENDENT,       DEPENDENT
##VAR_FORM=  AFFN,          ASDF,            ASDF
##VAR_DIM=   65536,         65536,           65536
##UNITS=     HZ,            ARBITRARY UNITS, ARBITRARY UNITS
##FACTOR=    0.456856943014862, 1,           1
##FIRST=     14782.0589164895, 0,            0
##LAST=      -15158.0608439895, 0,           0
##MIN=       -15158.0608439895, -20931750,   0
##MAX=       14782.0589164895, 352113419,    0
$$ Real data points
##PAGE= N=1
##DATA TABLE= (X++(R..R)), XYDATA
$$ [...]
47259 -8530451 -8901479 -10917396 -10892657 -8720163 -7615852 -7279938 -3913716 1625893 2574942
47250 2574942 -3515974 -9317771 -7334786 -433917 2848402 255655 -3213075 -4462328
47242 -4462328 -5542412 -7346002 -6533897 -1401605 3787589 3803364 -950971 -5934138 -8582518
47233 -8582518 -9780051 -10395536 -9690139 -7405135 -4952099 -3627585 -3062834 -2160055 -565360
47224 -565360 1339302 2980755 3468065 1765136 -1985712 -5712033 -7195767 -6828940 -7464702
47215 -7464702 -10650586 -13741708 -12273536 -5508852 1668831 3442478 -890713 -6494860
47207 -6494860 -8244423 -5317592 -732569 2213992 2349405 518304 -1691835 -3181211
47199 -3181211 -3996985 -4905481 -6141188 -6865551 -6181909 -4266416 -1913604 662395 3664458
47190 3664458 6453039 7673904 7236261 7141934 9170677 12236889 13541743 12539339 12238875
47181 12238875 15632799 21984854 28131856 32842378 37958610 44844582 51332878 53313645
47173 53313645 48690404 39113683 28536430 20681502 16968847 15738042 13824516 9739858
47165 9739858 5005730 1865026 569290 -107508 -703730 -1016886 -1496293 -2704684 -3653794
47156 -3653794 -2839761 -1071185 -910941 -2645357 -3277330 -911925 2118178 2567731 947186
47147 947186 310718 1487702 2434687 2111595 2076890 3453041 4667152 3624518 656800
47138 656800 -2106258 -3418628 -3729642 -3849098 -3955627 -3881111 -3625807 -3417912 -3497160 -3829510
47128 -3829510 -4014103 -3651920 -2740875 -1453456 189033 1820913 2171279 46794 -3818634
47119 -3818634 -6784193 -6839652 -4709319 -2891762 -2857433 -3698833 -3545006 -1922978 -349118
47110 -349118 -436728 -1818018 -2722266 -2579798 -2757448 -3989237 -4458494 -2038446 2378967
47101 2378967 5683668 6255510 4860811 2201746 -1693885 -5143605 -4903715 -377191
47093 -377191 4502228 5735993 3930444 2317095 1819591 1069089 278387 1434310 4294025
47084 4294025 5532052 3223712 -377330 -2189841 -2284132 -2498781 -2933475 -2576757 -2448499
47075 -2448499 -4857681 -9154622 -11214859 -8665094 -4345798 -2383341 -2485638 -1142208
47067 -1142208 2172686 3712372 1430629 -1169120 209078 4339853 6396613 5158165
47059 5158165 4475197 7189351 11054033 12040116 8978822 3364630 -2964086 -7970779
47051 -7970779 -9439530 -7340554 -4794513 -4483653 -5406863 -5329492 -4803590 -5811983 -7575457
47042 -7575457 -7199405 -4284860 -1589786 -781567 -641815 -188262 -557771 -2527033 -4697465
47033 -4697465 -5552568 -5181094 -3773913 -826245 2587007 3258714 -31930 -3699775 -3351803
47024 -3351803 547774 3664415 3689695 2388614 1755782 984101 -1577625 -5372236 -8188409
47015 -8188409 -8952458 -8477644 -7517076 -5497713 -2166322 268881 -1423044 -7124944 -12111136
47006 -12111136 -11998911 -7921188 -4397873 -2763006 -52996 5098407 9175218 8422000
46998 8422000 3916632 -561205 -3455862 -5320247 -5693008 -3720158 -1114347 -976975
46990 -976975 -3493708 -5544661 -4827951 -1980896 1469763 4723240 6920178 7197570 6199211
46981 6199211 5530551 5288905 4164613 2230615 1195410 1325938 694351 -1538953 -3552937
46972 -3552937 -3810792 -3261258 -3185876 -3073083 -2232223 -1360836 -715632 1077419 4191331
46963 4191331 5653673 2965393 -1865446 -4750215 -4810686 -4363701 -4679300 -5073256 -5685376
46954 -5685376 -7495514 -9226221 -7718520 -2484210 3025106 5894311 6693404 6525250
46946 6525250 4169399 -1273816 -7069388 -9241522 -7342312 -4364455 -2655027 -2280697
46938 -2280697 -2800906 -3968415 -4626053 -3381254 -881804 616933 442788 266524 1103419
46929 1103419 1751401 1293480 1078311 2594490 4955322 6223033 5994135 5043616 3705322
46920 3705322 2450297 2710372 4775727 6014871 4053635 1000413 1106046 4209621
46912 4209621 5277950 1563075 -3333994 -4546214 -2109036 488147 1501688 1681591
46904 1681591 1453629 498043 -569600 -678732 -27258 582718 1161741 1334949 -662176
46895 -662176 -4939326 -7362342 -3776085 3718321 8544994 7716173 4269671 1417233
46887 1417233 -1271279 -4442259 -6044591 -4502187 -1699787 -131466 503872 1477970
46879 1477970 2182857 1646559 807288 717741 371021 -1152467 -2234177 -1117645 903686
46870 903686 1429797 531102 -319951 -1172712 -2412745 -2375499 280113 3173983 3082364
46861 3082364 1208883 1331203 3260842 2940732 -530002 -2870065 -1234512 1440086
46853 1440086 1220627 -1028429 -1642279 166313 1563879 213944 -2901867 -4685857
46845 -4685857 -3278139 -528690 -619915 -4893740 -8993182 -7741428 -2322008 862899
46837 862899 -1280482 -5044790 -6008080 -4523101 -3038593 -1743306 38514 967231 -446548
46828 -446548 -3005561 -4715771 -5774597 -7118331 -7977156 -7675586 -7855153 -9724510 -10930281
46819 -10930281 -8731619 -4797338 -2947825 -3179872 -2177441 625966 1983433 464002
46811 464002 -1008490 175410 2392625 2546933 417475 -1715113 -2230391 -1271549 305416
46802 305416 1714272 2394369 2132025 974941 -752567 -2002380 -1484566 389549 1108266
46793 1108266 -909958 -3971403 -5591425 -6036099 -6942505 -7614445 -5953974 -2585720 -528255
46784 -528255 -583990 -517997 612792 887443 -514990 -1144939 1009157 4184047 5107014
46775 5107014 2728662 -1585492 -5612339 -7054962 -5145306 -2536361 -3006224 -6140689
46767 -6140689 -7312048 -4416975 -1077413 -711593 -1020680 1917215 6745706 8403875
46759 8403875 5273214 721384 -1890070 -2151998 -832358 1477624 3680291 4798871
46751 4798871 5471372 6690675 7540361 6756424 5982997 8211209 12797391 15354144 13572717
46742 13572717 10306402 9489026 11354269 13353638 13955293 13598066 12899883 11713937 9845348
46733 9845348 7709959 6120943 5612326 5905565 6204091 6145110 5896932 5126537 3105563
46724 3105563 594394 6943 2113773 4026760 2633959 -1055619 -3467666 -3479626 -2997314
46715 -2997314 -2979508 -2149576 -9429 1893516 2478386 2274495 1408897 -684033 -2602672
46706 -2602672 -1160996 3975106 8432580 8040745 3601334 -1199838 -4617509 -7220489
46698 -7220489 -9089288 -9421915 -8299586 -6624894 -4654500 -2320380 -465415 96444
46690 96444 471994 2786720 7133467 10802609 11138637 8544254 6197521 6731870 9207070
46681 9207070 9947108 7052479 3158795 2006704 3036897 2286465 -1158653 -3235472
46673 -3235472 -1122510 1968928 1188011 -3131562 -6452483 -6321189 -4148977 -1618690
46665 -1618690 972105 2834097 2658708 1153436 733060 1882090 2447532 1432874 765477
46656 765477 1836612 2775848 1291318 -1556271 -2843050 -2088503 -1677285 -3156309 -5225072
46647 -5225072 -5902773 -5104082 -4200248 -4086151 -4690782 -5687598 -6470067 -5806222 -3102376
46638 -3102376 -243165 -372742 -3799842 -6821219 -6376484 -4251404 -3925564 -4512247 -1947683
46629 -1947683 3587920 6185123 2362060 -3298279 -4135993 -96644 3635087 4580239
46621 4580239 4821583 5693702 5419596 2828568 -283104 -1736042 -1222488 828157 4053624
46612 4053624 7063675 8104416 7768337 8712316 11708509 14183118 13730849 11098636 8679909
46603 8679909 7812896 8338117 9102515 8416206 5886967 3970791 5340250 8609859 9733109
46594 9733109 8145630 7863991 11116352 14626925 14503032 11502348 8698259 6866786
46586 6866786 5380984 5166078 7081356 8980415 7910681 4333758 1306965 451408
46578 451408 1304653 3409452 6255218 8271985 8609170 8773621 9955584 10422898 8656467
46569 8656467 7114848 8801867 11566967 10638177 6263044 3781939 5729322 8706234
46561 8706234 9108059 7361369 4988049 1919292 -1105749 -1416393 1689923 5044934
46553 5044934 5958388 5551968 5594170 5225136 3530143 2376952 3497627 5140251 4814464
46544 4814464 3256312 2418316 1529159 -1130637 -3907581 -3122491 1678997 7049488 10017743
46535 10017743 10451526 9438608 7982583 7075845 6724505 5371180 2530617 961413
46527 961413 3231055 6977637 7269161 3570592 487363 917871 2338334 1506230 -540467
46518 -540467 -669624 1443669 3287648 3336359 2775456 3669141 6560509 9721064 10463805
46509 10463805 7795354 3735172 1065979 132779 -635284 -1543975 -1389434 -484127 -995236
46500 -995236 -3061398 -3131771 1808014 9846143 15747494 16065421 11564045 5650906 1528101
46491 1528101 61550 -342029 -1210992 -1632877 109318 3022549 4164711 3086053 2430772
46482 2430772 3434827 4315090 4393010 5879747 9384071 11692953 11136874 11190818 14605192
46473 14605192 17648815 15535766 10746404 9697102 12796455 14565348 13166355 12719439
46465 12719439 15214385 17166529 16734400 17675021 22465495 26947387 26536220 23723042
46457 23723042 24398291 29417541 34580569 37356179 39530479 44224984 53498836 67785216
46449 67785216 85277889 103905630 126238179 158444216 199105096 231796109 236264191
46442 236264191 208346506 164165070 123879150 95884747 77480141 64409068 55081723
46435 55081723 48598937 43525966 38773278 33906810 29141159 25765793 25000999 25574333
46427 25574333 24529648 21642809 20500522 23158384 26183712 25027567 20580191 17656518
46419 17656518 17687681 17162906 14208028 12648299 16758056 24534172 29858935 30563557 30747964
46410 30747964 34621647 41485267 48571798 55921757 65604182 78361352 94717380 117464030
46402 117464030 147203337 174787174 184529977 169048283 137540466 105912127 82057752
46395 82057752 64671571 52081344 44773288 40284562 33408861 23577415 16393270 15283166
46387 15283166 16407324 14910510 12026548 12009249 14883021 16498693 14511144 10774439
46379 10774439 8168377 7582844 8016433 8090299 7526777 7665536 9741027 12646996 14148968
46370 14148968 14333657 15226759 16588682 15538466 11647464 8670066 8979422 9876532 8367805
46361 8367805 6230171 6647930 8635924 8895090 7023243 4830597 2534297 -56049
46353 -56049 -523437 3056213 7318969 7074565 2873930 -5524 276662 474070 -964513
46344 -964513 -1221982 1340100 4103363 4669962 4044014 3463270 2331034 1288738 2953427
46335 2953427 7080848 9141703 6620776 2931889 2002794 2745791 2480864 2235165 4221729
46326 4221729 6815525 6845632 5175480 5373410 7779002 9191563 8084709 6231298 5086500
46317 5086500 4001392 2426180 1057220 379517 330451 1452741 4182008 7090527 8063458
46308 8063458 7172709 6318738 6218582 5899034 5034526 4634121 5403762 7287036 10331304
46299 10331304 14038492 16371629 15775755 13872904 13631108 15012007 15138505 12876926
46291 12876926 10328637 9136364 8152134 6041808 3927754 3878027 6163458 9067237
46283 9067237 10326699 8401069 3854730 -130013 -375363 2565355 4942857 4569782
46275 4569782 3258184 3887835 6901081 10608826 13353801 14419837 14103215 13552196 13361638
46266 13361638 12294652 9215090 6215123 7082585 11921247 16183509 16504815 14809935
46258 14809935 14689564 16185799 16685958 15102268 12479304 9780091 7623166 7161096
46250 7161096 8719484 10358264 10130771 9019344 9256369 10458433 10069256 7274918 3795115
46241 3795115 842515 -1956805 -4254924 -4367888 -2070583 135195 -97575 -2242556
46233 -2242556 -4151885 -4822319 -4878498 -5170327 -5742524 -5715803 -4002347 -931862 987613
46224 987613 -567914 -4303517 -5905899 -2972940 1981236 4521089 3276042 845711
46216 845711 532157 3311279 7547112 10630022 11058485 9669961 8803139 9928363 12358977
46207 12358977 14386197 14954597 13876290 11384021 8434106 6872007 8080456 11309620
46199 11309620 14087771 14654052 13732550 13616367 15481554 17972025 19069740 19298332 21763907
46190 21763907 28202847 36540361 44314359 53196314 66884470 85003542 103709841 123740753
46182 123740753 152166229 190677567 225163496 234525419 211650293 170917835 132969088
46175 132969088 106347127 86705709 68967974 53846096 43477996 36838443 31701998
46168 31701998 27798852 25731710 24712981 23332390 21372042 19387447 17547858 16179968
46160 16179968 16269946 17796659 18519023 16385155 12734482 11128772 12970655 16148060
46152 16148060 18322012 19611692 21179367 22893098 23745538 23403191 21963053 19118754
46144 19118754 15029451 11244760 9114648 7744055 5272355 2029932 590183 2362472
46136 2362472 5708093 7961529 8025611 6522087 4689969 3650128 3494905 2679095 -230446
46127 -230446 -3780430 -4521440 -1558675 1893913 2959056 2943558 4579566 7321903 8314907
46118 8314907 6918941 5187614 4412344 4290580 5232685 8091399 11309976 11840027 9796952
46109 9796952 8783177 10206998 10771707 7789428 3771474 2699177 4160741 4663683
46101 4663683 3294835 2669651 4901607 9437177 14410022 17772573 17842320 15238000 13558315
46092 13558315 15564716 19419251 21390998 21351990 22253518 24745463 26238595 25625508 25174299
46083 25174299 26834456 29961011 33595764 37794268 41937829 45325124 50433224 61732267
46075 61732267 80213731 103686705 133554916 173961756 219123355 248072191 241403075
46068 241403075 202322628 153979114 116124038 91021103 72091767 57111946 47820295
46061 47820295 42591754 36799863 29298146 23594075 22287317 23447173 23126037 19623141
46053 19623141 14683626 11295369 10481678 10229471 8189687 5206035 4586934 7538536
46045 7538536 11193991 12096828 9955737 6902741 4789508 4523478 6266246 8560503
46037 8560503 8856942 6800175 5377125 6526131 7278562 3501904 -3386525 -7223582
46029 -7223582 -4992235 -398756 1656985 973614 285120 225106 -821849 -2991276 -4174874
46020 -4174874 -3134571 -1084656 401467 1327563 2346418 3208937 3111393 1898377 241471
46011 241471 -900572 -688519 948377 2565228 1916932 -1749787 -6502999 -9355108 -8642494
46002 -8642494 -4548402 1572069 7383186 10145023 8776312 5081413 1656330 -903466
45994 -903466 -3151273 -3930276 -1113689 4319103 7656138 5511845 -194867 -4780364
45986 -4780364 -5768676 -3844380 -595382 2417853 3415826 1817304 -152571 721809 4892044
45977 4892044 9334174 10570384 7458005 1540074 -4019893 -6298137 -4870737 -2064604
45969 -2064604 -69329 1330194 3027748 4206374 3875705 3475491 5025180 7411977
45961 7411977 7759298 6235293 5963878 7814479 8987940 7814529 6285308 6091535 5626404
45952 5626404 3395822 1498218 2749957 6423086 9644415 11292053 11820040 10979199
45944 10979199 8783049 7358559 8514789 10290291 9191847 5411644 2549873 2296313
45936 2296313 2796922 2641561 2880868 3879936 3586846 1188491 -108409 3066311 8913239
45927 8913239 11963508 9744317 5446688 3425856 4191756 5210159 5196408 5454437 7030372
45918 7030372 8551660 8002904 5497818 2841024 855206 -1304480 -4138376 -6514130
45910 -6514130 -6870409 -4870205 -1654258 859588 1218940 76906 133116 2852591 5751509
45901 5751509 5253321 2068265 710515 3048621 5710254 5489017 4004829 4421847 6375968
45892 6375968 7426462 7385184 7564923 7228401 4634397 808261 -1517867 -2388777 -4273569
45883 -4273569 -7082171 -7356323 -3449714 1681673 4234862 3648063 1832337 660652
45875 660652 1390159 4450344 8516715 11403373 12613857 13211372 12811925 9394318 3236435
45866 3236435 -1702508 -2300786 -95961 1470547 1768196 2488562 3834932 4113657 2853264
45857 2853264 1772291 2073370 2551787 1327930 -1453402 -3522468 -2950692 -384868 1331298
45848 1331298 -47218 -3770898 -6808411 -6922892 -4595296 -1953683 -527937 -356280
45840 -356280 -701224 -1034665 -1320588 -1637178 -1892889 -2162959 -2869778 -3831533 -3499637 -598237
45830 -598237 3441170 5619130 5522048 6091658 9083387 12278518 13180747 12942452 13771966
45821 13771966 14665271 13325900 10716540 9657955 9871482 8582163 5463462 2642584
45813 2642584 155213 -3753038 -7598933 -7302812 -3133028 -766018 -3195475 -6316418
45805 -6316418 -5314838 -1189905 2155465 3413797 3116570 968840 -2381760 -3920175
45797 -3920175 -2157197 332083 1483676 3423049 7557657 9603426 5047290 -2717605
45789 -2717605 -5734333 -2168178 1915913 1579246 -1261551 -2125512 170322 3468342
45781 3468342 5309540 4905531 3821509 4698699 7768816 9848436 8941886 7802707 9598187
45772 9598187 12244570 11766987 9696142 11194366 16004965 17632449 13023613 7235567
45764 7235567 5854938 7795784 8920701 8485475 7943774 6586193 2866428 -1578727
45756 -1578727 -3112260 -676091 3464720 6724684 7674941 5646660 1543081 -1387440
45748 -1387440 -21802 5089145 10031224 11447844 9369183 6686043 6758296 10946091
45740 10946091 17492299 23217710 26946749 30631544 36508610 43927574 49674997 50801134
45732 50801134 46738839 39564854 32700254 28420771 26044140 23315759 19870941 18266858
45724 18266858 21056636 27650986 34393002 37038320 33415212 25032516 16210479 10358986
45716 10358986 7053573 3904822 624488 -883636 -60067 1501391 3063615 5571026
45708 5571026 8580599 9413368 6987060 3885561 2741602 2922744 2864028 3306666 5428330
45699 5428330 7419540 6051361 1154487 -3877535 -5896048 -4585331 -1634070 1009082
45691 1009082 2170324 1951226 1193009 162119 -1324269 -2313989 -1241070 991496 734522
45682 734522 -3650977 -8599507 -9322699 -5710794 -1741980 88096 979905 2600938 4151911
45673 4151911 3454496 -192761 -4613348 -5922073 -1963350 4688011 8471451 6806641
45665 6806641 2989460 1773523 3727667 5908488 6443006 5798808 4668785 3495604
45657 3495604 3483903 5305334 7176810 6893150 5405372 5652630 8343653 12166384 17856313
45648 17856313 27720080 39887375 47197276 44664399 35519897 27016954 22026619 17699060
45640 17699060 11355225 4473554 374939 124144 1816249 3026631 3089972 3007707 3519402
45631 3519402 3874389 3038825 1628532 1426515 2882504 4386289 4511276 3741062 3182101
45622 3182101 2723738 1680058 485595 310636 1160881 1647558 949638 91434 719060
45613 719060 3086265 5837638 7659731 8593889 9485481 10528236 10946799 10232128 9245686
45604 9245686 9742224 12876538 18215746 23876708 27414953 26973682 22265575 14952869
45596 14952869 8204284 5318957 7534989 12464716 15545417 14225366 10320233 7220343
45588 7220343 5622734 3822833 1509313 447280 1025235 1102562 -313858 -850492 1706645
45579 1706645 5686533 7732472 7251842 6105509 4848776 2111533 -2280237 -5917654
45571 -5917654 -6310916 -3652537 -607054 335560 -534714 -306994 2853524 6587185 7017388
45562 7017388 4416702 2874796 3470144 2082928 -3368747 -7805101 -5529333 1235922
45554 1235922 5571991 5504287 4747602 5059466 4086278 1114321 -835153 15310 1847974
45545 1847974 3022530 3766195 3282699 79111 -3718396 -3666799 -235401 836013 -2426636
45536 -2426636 -4861890 -3014137 -1041228 -3072538 -5527064 -3299462 1094794 1769591
45528 1769591 -566005 -774472 656655 -1733513 -7806784 -10357577 -6154193 -1091134
45520 -1091134 -1101524 -4125302 -5220581 -4483690 -4735843 -4891316 -1333691 5539596 11137757
45511 11137757 12891754 12621800 12283144 10952818 7407282 2992841 -52405 -1611687
45503 -1611687 -3113000 -4786002 -5465332 -5000990 -4869937 -5637707 -5485452 -2764507 1050680
45494 1050680 2853597 1858186 24806 -1296414 -2717871 -4321308 -4390412 -1978049 1318891
45485 1318891 3607676 4801702 5044368 3400799 318515 -865323 2108734 6490923
45477 6490923 7727747 5460471 3008070 1753513 -153581 -3547750 -6406361 -6942876
45469 -6942876 -5525734 -2956866 265550 2615809 2774210 2758695 6015680 11101561 11383580
45460 11383580 3620606 -6567305 -11075954 -8676005 -4614506 -2868061 -2689518 -2033619
45452 -2033619 -676099 487938 749794 -164822 -1444847 -1136661 1323056 3051643 655275
45443 655275 -4836196 -8506411 -7473573 -3916942 -1422294 -644688 -60622 814418 1034062
45434 1034062 328035 -178119 565619 2319147 3898867 4201549 2972787 961877 -851796
45425 -851796 -2432730 -4608037 -7288576 -8363110 -5589062 199128 4922664 5263197
45417 5263197 2304375 27667 363421 1297190 450687 -1209682 -970384 1362643 3129079
45408 3129079 2637163 949116 -655918 -2515600 -4557165 -4719794 -1619047 2629200
45400 2629200 4562342 3473265 1240584 -966612 -3206417 -4605524 -3781651 -1638308
45392 -1638308 -762617 -1360361 -735640 2072082 4159529 3062103 388104 -1207996 -2126337
45383 -2126337 -3858623 -5029793 -3185514 570409 2616321 2145854 1673435 2155239 1690925
45374 1690925 -6841 10598 3044495 5706083 4422670 371507 -2750292 -3593714 -3054120
45365 -3054120 -1602604 -94511 -1382179 -7078177 -13546746 -15161195 -11527314 -7718759
45357 -7718759 -6978900 -7019676 -4693503 -736133 2190213 3504837 4451863 5557962 6364012
45348 6364012 6615393 6278489 5235116 3781814 2376691 549025 -2325968 -4919365
45340 -4919365 -4873504 -2416367 -435698 -69053 661275 2362295 2132596 -1310360 -3812671
45331 -3812671 -1142009 4269774 6578144 5080398 4518639 7119279 9379079 7918809
45323 7918809 4283064 1912374 1439245 1129477 -104146 -1881524 -3038208 -2079195 1470034
45314 1470034 5496753 6948754 5628175 4201445 3881722 2833090 26167 -2227640
45306 -2227640 -1587057 849477 2593604 3226831 3474446 2797365 716204 -957415 -239599
45297 -239599 1672556 2203000 1801542 3182658 6325037 7833546 6078461 3672982 3328562
45288 3328562 4093494 3792956 2871111 3144740 4273872 4440828 3894443 4808624 7344147
45279 7344147 8601990 6585074 3019026 679534 -389495 -2012054 -4349190 -5554533
45271 -5554533 -4702458 -2907147 -1261358 360462 1794487 1754007 -321060 -2968266 -4533132
45262 -4533132 -5205708 -5960437 -6479867 -5609729 -3191996 -106763 2824236 4697852 4287728
45253 4287728 1738769 -279684 706950 3455800 4476175 2951855 1701542 2790161
45245 2790161 4741049 5214147 4180251 2827368 1163292 -1250202 -3311088 -3242017 -1116994
45236 -1116994 1075048 1812280 1299231 479485 -73247 -229455 -231166 -713388 -2005131
45227 -2005131 -3166135 -2483556 481582 3777196 4836605 3473273 2237779 3191342
45219 3191342 5157577 5400074 3444258 1388528 526719 51398 -319019 714498 2890235
45210 2890235 3134725 120235 -2514142 -1050582 2280895 2530467 -100770 -765842 1936916
45201 1936916 3946403 2868931 1705112 3171178 5118809 4819522 3896102 5301150
45193 5301150 8257766 9739505 8806833 6476286 3490822 1070635 1446717 4493251
45185 4493251 6160214 3612149 -301421 -1188034 639153 2031176 2807235 4892608
45177 4892608 7292544 7188414 5312590 4991916 5977975 4530165 191840 -2751250 -1869432
45168 -1869432 235335 1095319 1963348 3753534 3832245 386350 -3291075 -2768167 1276324
45159 1276324 4276102 3951292 2035411 494572 -947746 -3097397 -5066288 -4663918
45151 -4663918 -634338 5508622 9994317 10017731 6647311 3554323 2744237 2778369 1370006
45142 1370006 -1736413 -4885181 -6218446 -4981852 -2311989 -685055 -1281110 -2323457
45134 -2323457 -1689508 -312919 -504835 -1734175 -1529752 -307595 -1129914 -4008473 -4906045
45125 -4906045 -2058319 1021079 1215691 325376 796107 855173 -1988422 -5671895 -6452653
45116 -6452653 -4979367 -4828853 -6315731 -6338650 -3673838 -43644 3689884 7898650 10575544
45107 10575544 7987359 328568 -7005569 -9586032 -8537299 -7356596 -6864505 -5489002
45099 -5489002 -2759346 -212818 693420 282359 296191 1976373 4243498 4554316 2464693
45090 2464693 910322 1951819 2795181 -573797 -6507713 -8737586 -5009843 -405305
45082 -405305 -74960 -2494082 -2983395 -956339 218977 -1027828 -2774379 -3300301 -3109403
45073 -3109403 -2842138 -1878045 31726 1615114 1617193 403063 -668789 -708964 239513
45064 239513 1468010 2026157 1499740 625199 654120 1910785 3276971 3183183 1052522
45055 1052522 -1958167 -3607506 -2614506 -290901 779143 104759 -6832 1874327 3483543
45046 3483543 1801664 -2107757 -3925897 -1848217 1215595 2187533 2023506 3445736
45038 3445736 6289748 7661864 6088735 3209530 1325986 1161972 2283681 3939698
45030 3939698 4854545 3736248 984953 -1129396 -906699 954595 2715778 3857002
45022 3857002 4943170 6002864 6385284 5943505 5092059 3698903 1154423 -2091223 -4061253
45013 -4061253 -3031800 624550 4821442 7690638 8778966 8619598 7726222 6285267
45005 6285267 4599703 3329802 3028191 3715946 5194493 7310428 9347862 9814528 8039864
44996 8039864 5628580 4764615 5201994 4914904 3830288 4178318 6210374 6834568 4760318
44987 4760318 3868409 7897948 14208256 17364951 17417513 19289835 24295314 28149763 28586480
44978 28586480 29024858 31898153 33670753 30628421 25382812 22671204 21798978 18718015
44970 18718015 13704581 11296206 13212433 16609207 19424010 22316942 24598492 23536383
44962 23536383 19763185 18787410 24211876 33147571 41665242 51372783 65800672 81864736
44954 81864736 90249129 85350883 71306331 56579447 45333644 36376963 28489796 23054164
44946 23054164 20931193 19683682 16093134 10355147 5725516 4336130 5336702 7258751
44938 7258751 10004657 13574711 16665579 17916428 17369087 15707871 13440535 11781590
44930 11781590 12471103 15190180 16983731 16080615 14412957 14232051 14428326 13146923 11909225
44921 11909225 13169828 15258399 14402669 11183553 9989500 11813826 12829034 11279689
44913 11279689 10388223 12038105 12708989 9337418 4970199 4177029 6113615 6991595 7010622
44904 7010622 9403020 13646030 15078099 11765425 7239901 5209138 5211829 5084822 4708516
44895 4708516 5252562 6639575 7653492 7592746 6701559 5743394 5662941 6684700 7475823
44886 7475823 6470753 4321058 3513769 4992536 6738845 6643590 5321020 4701289 4942645
44877 4942645 4554054 3226088 2629643 3791830 5103034 4250972 1523402 -427529 -302004
44868 -302004 90445 -1102373 -2468167 -1192910 2464275 5092989 4684849 2757755 1307777
44859 1307777 302352 -551114 -279504 1086695 1182270 -1132093 -2990652 -1430213 1672191
44850 1672191 2237796 301617 -557014 431187 229864 -2015543 -2886260 -535409 1766588
44841 1766588 899525 -960628 -258838 1617063 434064 -3817965 -6519748 -5121908
44833 -5121908 -2304305 -1532602 -2624322 -3124311 -1751367 933286 3520937 4271005 2355185
44824 2355185 -253696 28854 3738595 6559675 4263437 -1766220 -6369224 -7234998
44816 -7234998 -6813671 -7448518 -7688240 -5010147 16406 4498841 6897195 7691075 7121333
44807 7121333 4824706 1887939 805759 2251099 3641099 2464472 -97865 -705623
44799 -705623 1360374 2840447 573165 -4295259 -7417766 -6318365 -3118620 -1565013
44791 -1565013 -2296165 -2669243 -1239818 -197042 -1878752 -4636370 -4780148 -1923580 618106
44782 618106 940033 841562 1849629 2107466 -433826 -4079488 -5518677 -4368314 -2701204
44773 -2701204 -1188648 1070844 3388940 3561808 1512394 -89616 352770 1488455
44765 1488455 1874605 2165532 3082119 3483198 2329511 900922 1061637 2411886 3057665
44756 3057665 2519248 2082394 2534871 3138280 3004661 2381235 2247275 3240079 5180236
44747 5180236 7324220 8904940 9404729 8443122 6090184 3805238 4079299 7632988 11446752
44738 11446752 11583343 8155050 5425890 6359083 9181210 10451526 9434915 7734828
44730 7734828 6384589 5504175 5640965 7074750 8334136 7505709 4738712 1635708 -1407311
44721 -1407311 -5135486 -8859452 -10331869 -8858664 -6642794 -6034042 -6750069 -6771768 -5043434
44712 -5043434 -2404939 -397484 277297 405375 1403506 3337639 4215148 2373698 -698242
44703 -698242 -1558583 868681 3795693 4136049 2143196 452280 655658 2104378 3361577
44694 3361577 3530742 2388374 164724 -2768197 -6209904 -9627209 -11355687 -9730518
44686 -9730518 -5733426 -2881595 -3003043 -3593431 -1508480 1919100 2480303 -426523 -2358891
44677 -2358891 15158 4339779 6132739 4558997 2177839 752014 230683 707858
44669 707858 2112748 2419607 -375939 -4251848 -4695319 -1277481 870521 -1874600 -6385320
44660 -6385320 -7545612 -5490996 -4129989 -4157914 -2345670 2118254 5117123 3156193
44652 3156193 -1769474 -4978631 -4631549 -2473795 -690382 -57991 -326230 -747029 -564906
44643 -564906 172580 856908 1658170 3362955 5474745 6230918 5312920 4594789 5073945
44634 5073945 5235266 4048468 3191215 3956694 4278693 2029334 -629895 -208300 1925092
44625 1925092 962962 -3678899 -6916576 -5461098 -2192061 -798455 -195031 2274003
44617 2274003 5269419 5400823 2931925 1151494 749404 -824305 -3966218 -4993813
44609 -4993813 -1402393 3882285 5868329 3508113 285917 -239806 2336255 5958349
44601 5958349 8317128 8313959 6584624 4940349 4639089 5031001 4382538 2065476 -608646
44592 -608646 -1880766 -1410583 -351470 204648 513672 1849506 5021401 9317446 12871521
44583 12871521 13926934 11779535 6970017 1134888 -3442431 -5026209 -3853596 -2055156
44575 -2055156 -1463335 -1544797 -181387 3397267 7269477 8902359 7904514 5899906 4146497
44566 4146497 2482104 684271 -410863 141343 2097213 4396770 6292751 7546141
44558 7546141 8199291 8884368 10541080 12740812 13061635 9706665 4402560 937670 762007
44549 762007 1843075 2210453 2557305 4276913 6747660 8185191 7996879 6744457 4809705
44540 4809705 2751164 2061786 3644114 6061931 7155500 6915412 6776589 6593637 4915668
44531 4915668 2277284 1192202 1936653 1337996 -2287849 -5467257 -3629373 2568254
44523 2568254 7886794 8926210 7157786 5552551 4934172 4593996 4373069 4606969 5101645
44514 5101645 5404701 5523436 5626069 5642627 5773840 6678058 8374949 9529932 8773327
44505 8773327 6638804 5532531 7595402 12677493 18290965 21590650 21736036 20270343
44497 20270343 18840284 16978221 13141009 7746225 3595130 2638255 3649150 4108371
44489 4108371 3285334 2207960 1556533 1271822 1774930 3727138 6420539 7974146 7573143
44480 7573143 6220979 4778765 2619056 -819357 -4166597 -5141898 -3193709 -147175
44472 -147175 1827497 2259992 2312444 3170146 4802334 6251525 6916951 7143246 7250956
44463 7250956 6447045 3610908 -755675 -4363774 -5527216 -5006174 -4632112 -4572711 -3142949
44454 -3142949 469072 4330773 5525908 3579704 1260038 1516043 4084284 5933829
44446 5933829 5126530 3308829 3630803 6644678 9220970 7682886 1553763 -5764533
44438 -5764533 -9683455 -8234926 -4023922 -2114630 -4966486 -9627543 -11062767 -7977536
44430 -7977536 -3664333 -1120592 192422 1694776 2441037 1011677 -1007746 -576295
44422 -576295 2224733 4155286 3585560 2422058 2473755 2771761 2146851 1956465 3777585
44413 3777585 6072580 5959445 3440756 1122485 159307 -583879 -1220993 39468 3280143
44404 3280143 5334973 3980528 1419650 1021093 2353070 2613413 1879437 3042958 6339408
44395 6339408 7986375 5984825 3906118 6048553 11030945 13545300 11443716 7748360
44387 7748360 5732958 5217129 4603641 3878398 3846059 4007874 3066128 960226 -896077
44378 -896077 -1232919 -69804 1564348 2667387 3216989 4094342 5646835 6646258 5604000
44369 5604000 2918978 509691 -596876 -838099 -301909 1646534 4314884 5378370
44361 5378370 3948154 2226273 2518142 4066500 4684360 4305806 4740959 6552486 8299004
44352 8299004 8749083 8148878 7385181 7350674 8928656 12108883 15202998 16217552 14784469
44343 14784469 11655594 7173973 2080428 -960751 679984 5853081 10161373 10862074
44335 10862074 9296657 7902480 6992952 5591393 3552529 1366068 -833341 -2662110
44327 -2662110 -2912344 -953275 1918061 3700161 3999391 4391218 6611828 10609817 14150661
44318 14150661 14650861 12047384 9219794 8424114 8265361 6275992 3664885 4244428 8337846
44309 8337846 11358728 9982752 6562743 5247323 6513225 8209515 9572770 10999878
44301 10999878 11702506 11095401 11251997 14340064 18315108 18856786 15500452 12315426 12132242
44292 12132242 13476489 14054104 14129559 15083510 17114939 19762091 22720274 25069231 25580189
44283 25580189 24651338 24003905 23846182 22687158 20669030 20190147 21850521 22713645 20559981
44274 20559981 17127786 14805862 12893013 10227974 9070101 12339418 18265001 21725246
44266 21725246 20431731 16347521 11614126 7029861 4462624 6339388 11576853 15742652
44258 15742652 16664689 16434885 16474350 14691804 10083198 6269172 6651692 8911561 8660181
44249 8660181 6544406 6873080 10187385 12439203 11911715 11861700 14615424 17512060 17390073
44240 17390073 15506200 14691547 14388278 12385121 9761419 9901922 13002115 15420809
44232 15420809 15033045 13871818 14240869 15069843 14091886 11705577 10386896 11076433 12088314
44223 12088314 11556735 9710210 8518150 9671382 12931624 16259806 17833070 17935003
44215 17935003 18213904 19168181 19669283 19357187 19742165 21527946 22304108 19205182 13408638
44206 13408638 9557690 10295390 13522159 15959251 17262087 18789418 19972608 18744855
44198 18744855 15349365 12914926 13212439 13999556 12381057 9396407 8898235 12229203
44190 12229203 16392649 18034163 17122896 15510792 13736288 11324166 9190835 9209146
44182 9209146 11267115 12883890 12403579 10873274 9954685 9650068 9360704 9759146 11809569
44173 11809569 14677147 16391475 16291536 15266250 13909678 12286890 11479620 13125452
44165 13125452 16677085 19198782 19254236 19248211 22051234 26686675 29781479 30579363 31782754
44156 31782754 35332644 40085948 44491315 49024941 54575458 60701730 67386210 76582600
44148 76582600 89970222 107223576 128879424 157713343 191920857 218240840 219258725
44141 219258725 190869127 148228313 111217179 87479213 72472974 60931328 51792050
44134 51792050 44352727 37116332 31335999 30086173 32394790 33091279 30034069 26732594
44126 26732594 25727135 24349645 20399594 17498610 20078443 26189311 30474764 32307992
44118 32307992 35498108 40700341 43766592 42520025 40401973 41573352 46048427 51629917
44110 51629917 57559490 64177160 71860913 82818554 101102377 126824307 151237292
44103 151237292 161573721 152134077 128982549 103399551 82645168 67622468 56758892
44096 56758892 49116335 43862990 39270846 33833823 27756628 22423489 18809207 17054515
44088 17054515 16846781 17074571 15803332 12448884 9956635 12674973 21152576 30711259
44080 30711259 36270831 37044208 35239065 32015215 27017763 20810947 15110123 10646634
44072 10646634 6875127 3877687 2649613 3261627 4520007 5797057 7466816 9052776
44064 9052776 8809473 6214475 3500814 3426280 6268688 10028721 12960824 14818216 15892675
44055 15892675 15978191 14748986 12671132 10864999 9908656 9332444 8815537 9242337 11374305
44046 11374305 13860539 14464485 13557036 14134294 17270426 19840294 18638249 14757857
44038 14757857 11467814 9481712 7361856 5383028 5413998 7216859 8269151 7626375
44030 7626375 6961047 7226503 7138136 5762417 4069184 3107290 2950698 3971392 6542320
44021 6542320 8852466 7968462 4224315 1769247 3295401 6713054 8491936 7806130
44013 7806130 5826060 3470938 1768324 2160421 4466405 6526208 7553382 9544708
44005 9544708 13481485 16710197 16698312 15326327 16671010 22020163 29422279 36416483
43997 36416483 40643255 39608368 33159155 25377897 21177442 21336357 22715518 22280913
43989 22280913 19007822 13440491 7937289 6028311 8828284 13068906 14988105 14764940
43981 14764940 14637368 14515319 12831444 10329449 9250140 9486170 9063183 7909489 7814258
43972 7814258 9178108 11039923 13575482 17134057 19737459 19476732 18599445 20904028
43964 20904028 25788629 29760907 33213822 39536054 46833254 47395040 38235070 26386446
43956 26386446 19945153 18624535 17410639 15339036 15310054 17694853 19432073 18741284
43948 18741284 16725269 14619180 12613772 11224974 11283531 12560863 14031351 15074282
43940 15074282 15374442 14820558 14550638 16299109 19312011 20033850 16747762 12445678 10883723
43931 10883723 11755430 12202493 11222998 9850752 8583634 7537681 7884131 10261836 12759282
43922 12759282 13197109 12579455 13796657 17785540 23220471 28697571 32687732 32863982
43914 32863982 28673280 23549697 21398137 21699223 21114724 18814590 16667929 15109314
43906 15109314 12930480 10886753 11291405 13652652 14653135 13155378 11550923 11403895
43898 11403895 11545172 11584834 13504821 18031567 22665931 25135105 26007942 26322544 25500416
43889 25500416 23337019 21304372 20061935 18250706 15465979 13734344 14182860 14926857
43881 14926857 14235235 13113748 12765164 12452748 12188920 14253146 18952538 22068320 20521959
43872 20521959 18067046 20787516 28542386 35540907 38539764 39777611 41876604 44481538
43864 44481538 46998481 50897776 57610210 66511524 76376635 87793469 104159337 130591037
43856 130591037 168522877 207712605 226986605 210755378 166402116 119623877 90216583
43849 90216583 76907687 67233378 55117233 43504068 35195241 29065286 24219312 21550105
43841 21550105 20615311 19444117 17923811 17605699 17894639 16298488 13059747 11594342
43833 11594342 13026041 13988685 11916483 9322480 9981477 13077810 14415842 12521053
43825 12521053 10468336 11401378 14604053 17096761 17753117 18260605 20037154 21575928
43817 21575928 20162151 15976683 12718808 13205102 15867142 17297977 17057418 17565335
43809 17565335 19841876 22185987 23250556 23575523 23371077 21755332 19645510 20566445
43801 20566445 26216389 33205670 36656019 35513014 31873198 26720006 19784432 13121296
43793 13121296 11027691 15006140 20975025 23044902 19244386 12887562 9118994 10500785
43785 10500785 15165602 18827267 18947011 16897352 15816022 17152394 20299258 24787402
43777 24787402 30976673 38270390 43995642 44982350 40298118 32572760 26517197 25122511
43769 25122511 26837339 27616118 26296800 26202137 30190024 36195573 40068744 41436129
43761 41436129 43916043 50149204 59368593 69923523 82254273 99608918 126767073
43754 126767073 165236853 206027771 229717920 220500370 181967146 134847894 97919214
43747 97919214 74972616 60493330 50847750 45406760 41848070 36971107 30969504 26474472
43739 26474472 24106485 22275854 20347565 18837954 17390731 15503656 14414205 15515404
43731 15515404 17720155 18876658 18729203 18025155 16144033 12538410 9168669 8247984
43723 8247984 8624332 7646217 5537504 4481529 4533238 4405322 5333345 9493219 14794339
43714 14794339 16217901 13099124 10394519 11346218 13296374 12713947 10377542 9168874
43706 9168874 10080095 12819573 17263972 21667819 22227434 17453722 11035884 7698976
43698 7698976 7852317 8665163 8657035 8537621 8763912 8978008 9393772 10728105 13027986
43689 13027986 15851119 19048579 22383916 25110056 26630011 26746268 25137324 22047112
43681 22047112 19321645 18408761 17345161 12999056 6922825 5002654 9550464 15660383
43673 15660383 17904104 16829855 15715429 14769735 12794779 11390661 12577083 14496866
43665 14496866 14395562 13919809 16230060 19500236 19169255 15790269 14331703 15576385
43657 15576385 14803887 10368839 7116510 8505235 10971914 9862125 6459970 4969017
43649 4969017 5942334 6968888 7424081 8437247 9720987 10020046 9655688 9743317 10012693
43640 10012693 9944380 10636600 12820721 14469841 13405840 11086398 10542091 11363947 10194842
43631 10194842 6027856 1744013 63153 864578 3031512 6175323 9590946 11847571
43623 11847571 12597591 13087105 14028519 14608865 14310945 13903845 13681505 12533140 10122647
43614 10122647 8472226 9659307 12873937 15493392 16582364 17562340 19372562 20755440
43606 20755440 20317419 19117220 19555186 21777327 22938067 21046149 18130879 17615048
43598 17615048 19275313 19615782 17644986 17032409 20563118 25245770 26178428 23595234
43590 23595234 22326078 24984383 29716799 34881255 41606305 50123700 57482098 61846193
43582 61846193 66560155 76756143 93072126 110943080 124686550 129975050 124066622
43575 124066622 107412581 85277585 64921616 50220513 40432490 33947432 30806967
43568 30806967 30906211 31986585 31108271 27433581 22687534 19279619 18342043 19201037 20526776
43559 20526776 21924557 23712480 24947927 23335143 18532022 14032241 13359019 15238723
43551 15238723 15354472 12568584 10201302 10695680 12378271 12888039 12746175 13361078 13929260
43542 13929260 12929634 11039485 9964793 9515012 8370479 7019268 7455129 10160610
43534 10160610 13411372 15463792 15762911 14339681 11866016 10124385 10533114 12096434
43526 12096434 12474885 11248528 10562922 12233020 15484785 17839567 17284616 13701705
43518 13701705 9244450 7022539 8160939 10485290 11391671 11303544 12364159 14291356
43510 14291356 14261254 11323478 8291209 8008310 9801464 11213683 11689028 12614731 14454437
43501 14454437 15723934 15079417 13367242 12927483 14898866 17641991 18495385 17104116
43493 17104116 15834317 16286877 16949556 15784484 13658065 12845136 13084226 12052610 9593194
43484 9593194 8390155 9814262 11881238 12449764 12071327 12305359 13137975 13489686 12885603
43475 12885603 11606545 10429291 10711803 13163475 16216600 17528087 17317148 17851390
43467 17851390 19340869 19301182 16753238 13819615 11944944 10017865 7980463 8510472
43459 8510472 12378491 15561466 14419565 10974085 9432431 10024277 10351468 10626556 12764066
43450 12764066 15490248 15360295 12578238 11254810 13165650 15186868 14192460 11349564
43442 11349564 10030093 11686240 15072301 17918967 18403826 16146765 12485015 9298148
43434 9298148 7646686 7746809 9196849 10778007 11727646 13710126 18832034 24753245
43426 24753245 25724155 20900149 17274560 20371048 26114967 27175388 23674934 21082983
43418 21082983 20444342 18506465 15961880 17164626 21957878 26370978 31853633 44159649
43410 44159649 60687675 68901873 62343457 49822508 42847027 41660508 40754476 40871244
43402 40871244 45948153 52582001 52675166 45298787 37460380 33344860 30365090 26361288
43394 26361288 23551822 23481382 23794173 22436453 20839213 20789311 21462716 21394456 20719747
43385 20719747 19919671 18475906 16036667 13387687 11516270 10798027 11144714 11964592 12540802
43376 12540802 13389328 15902924 19413379 20698711 18417371 15690029 15565709 16403420
43368 16403420 15356028 14174136 16927067 23184588 28235424 29731723 29733498 30235941 30909450
43359 30909450 31483609 32398747 32890013 32297914 33198246 38694245 46098892 48157758 42151219
43350 42151219 33654615 29327278 29465100 29715307 27228782 23026825 20196713 20929975
43342 20929975 23854348 24591477 21263510 18171533 20082942 24112021 23022937 16640687
43334 16640687 13153092 17059107 22533606 22503418 18474299 16420391 17532455 18630611
43326 18630611 18564346 18613320 18470224 16870262 15051838 15282413 16849292 17259823 16487755
43317 16487755 16533648 17684047 18518947 18755385 19006442 18778876 17820350 18242824 21879530
43308 21879530 26534796 28478669 28012829 28886204 32408024 35680870 35881738 33154230
43300 33154230 28930619 24324309 20821018 20101232 22252227 25476797 27630217 27098783
43292 27098783 23253990 17628179 13271248 11074216 8515116 4303900 1819587 4479564
43284 4479564 9936498 13290339 14358239 16582914 19743994 19746415 16011081 13127030 13668003
43275 13668003 14880818 14680655 15584249 19438534 22850182 21971053 18517677 16909430
43267 16909430 17833543 18627179 18308951 18314301 19078407 19296084 18419956 17386251 16961365
43258 16961365 17230835 18465653 20980277 24343847 27549514 29339513 28204740 23853101
43250 23853101 19224591 18535335 21934606 24558774 22639895 18061820 14820856 13748117
43242 13748117 13539035 14368406 16865287 19473107 20698143 22426012 26839226 31195034
43234 31195034 30343574 24211162 18194832 15753996 15203665 14857568 16532321 21479555
43226 21479555 26642233 28168763 26315524 24063482 22625871 20967785 18643917 16781789
43218 16781789 16701563 18922752 22844882 26564310 28228300 28440114 29807998 33164969
43210 33164969 36051845 36125530 34025737 31384281 28344867 25201570 24115950 26122473
43202 26122473 28138542 26499119 22552815 21149365 23885752 27442794 28834085 28703515
43194 28703515 28548492 28103169 27087082 26738813 27685850 28459091 27923153 27169244 27077139
43185 27077139 25936789 21935683 16771958 14312000 16111485 20117658 23341932 24173871
43177 24173871 22607842 20012440 18588010 19633684 22337683 25092006 27363342 29227090
43169 29227090 30000761 28907189 26483080 23837483 21158306 18501080 17232149 18638337
43161 18638337 21469269 22852594 21566418 18796353 16119413 14593474 15209511 17896819
43153 17896819 20419554 20724147 20144727 21680907 25395072 28533039 29958399 30762606
43145 30762606 30313442 26221927 19564374 15568304 16740419 19430558 19978234 20048655 22260092
43136 22260092 24659107 24370870 23418402 25331575 28360168 28134355 25684650 26469050 31715556
43127 31715556 36891493 39160864 40245006 40926101 39140634 35654240 35470024 40464205
43119 40464205 46224594 49928455 55787585 67457178 79516468 82851266 76095278 65935159
43111 65935159 57702684 51395475 46266872 43651779 44470173 48026145 53679526 60155978
43103 60155978 63526994 60205597 52285889 45698186 42495188 39285680 34099235 29793221
43095 29793221 28499110 27332937 23024295 17396918 14554286 15018130 16229575 17052174
43087 17052174 18175918 19185231 18723830 17240047 16699545 17648248 18886263 19875900 21328095
43078 21328095 23583590 26358564 29735728 33432981 35639015 34884365 32656762 31663137
43070 31663137 31875036 31232604 30110368 31421062 35556140 39252986 41468220 46431880
43062 46431880 57200407 68778081 72182998 64733758 52598592 43322887 39426739 39624802
43054 39624802 42181421 44939136 44989520 41274968 36313217 33151968 31518617 29014223
43046 29014223 25397228 23310771 24539091 27475919 29166237 28696475 27557945 27181659
43038 27181659 27219423 26676635 26090328 27235116 30010409 31036840 27521161 22142467 21142502
43029 21142502 26489486 32795419 34244230 32161268 32456876 37145949 42372569 44433404
43021 44433404 43680228 41851841 39433698 37131698 36560279 37517864 37498370 35950026 36072094
43012 36072094 39849437 44168888 45154740 44030536 44895278 48385687 51611950 53204602
43004 53204602 54006867 53298428 49194924 43415494 40960464 43353097 46148471 45261304
42996 45261304 42296598 41180824 42680349 45153467 47943988 50523288 50363443 45757945
42988 45757945 39971495 38751634 43454546 49674234 53176240 54338697 55581126 56824621
42980 56824621 55646426 51127615 45717642 42809636 43140809 44280599 43755729 41897373
42972 41897373 40775691 40997820 41195875 40612653 40234755 40855609 41947694 43189221 45054872
42963 45054872 46991206 47406635 46805318 48272055 52931469 57705127 60201320 63233155
42955 63233155 71298067 84801166 101073618 118893649 138781318 161982580 192985545
42948 192985545 237505364 289424633 323341213 312927441 260041675 196218981 151082639
42941 151082639 127498302 111735021 96878716 86281673 81416592 78944549 77975105
42934 77975105 80284967 84047282 85933205 88629272 97506928 110493017 121312933 133406581
42926 133406581 158452901 195837641 224081641 221659019 190799174 153132221 126398057
42919 126398057 113122933 108032368 106284230 103771510 97432693 88382700 80534509 74685215
42911 74685215 67765639 58789354 51208374 47547444 45452109 41630875 36996634 34984831
42903 34984831 36293584 38054182 37772540 35866869 34009883 32610936 30903531 28717158
42895 28717158 26846420 25560009 24114681 22710484 23612283 28232910 33630640 34668958
42887 34668958 30317143 25328276 24524897 27754217 31939490 35614496 39138060 42375915
42879 42375915 44881441 47254571 49938073 51445170 49699918 44324688 36272219 26877014
42871 26877014 18941466 16359357 19810913 24707059 26523860 26460383 28395819 32039292
42863 32039292 33437131 31305299 28322469 26451658 25474106 26227185 30570081 37237857
42855 37237857 42058642 43628476 45021280 48690963 53432081 57676496 62054935 67247901
42847 67247901 72951034 80365043 91797407 106057928 118068047 124727211 127031010 124701019
42839 124701019 114123329 95227168 75738180 63828180 59537128 57442093 54548415
42832 54548415 51110613 46796647 41422344 37672965 38172986 41167979 43426280 45685159
42824 45685159 50415966 55688729 56621933 52380683 46777846 42284022 38343762 35397354
42816 35397354 35285704 37066456 37326017 35572660 34763238 35559904 34828475 31306951 28157768
42807 28157768 27863419 28716699 28633031 28658556 30161132 31834270 32147431 32115153 33331489
42798 33331489 35690697 38931965 43644533 48592383 49867083 45397867 38293375 33448361
42790 33448361 32600753 34352715 36734763 37943424 37051330 36007328 38495879 44910407
42782 44910407 51154917 54268031 55797505 57149758 55742820 49827828 43555332 42047775
42774 42047775 43828891 43652878 41221706 41049935 44081327 45655780 43014321 39453659
42766 39453659 38861122 40422078 41344230 41586304 43235120 47340571 53299347 59473960
42758 59473960 63061137 61623206 56377552 51902383 50972754 51650799 51001127 49431033
42750 49431033 49257960 50875863 52795553 54281070 55710480 57182213 58719578 61120151
42742 61120151 64900496 69218012 73390192 78305166 84457242 89977700 93220592 96276973
42734 96276973 102741782 112361408 121461480 129184569 139541566 155532657 174468190 191790816
42726 191790816 207205808 223954004 243569638 264672281 286105205 307687351 327639488
42719 327639488 342483858 350400298 352113419 347661139 335145279 314232079 288438717
42712 288438717 262039867 236689602 212857662 192208318 175874391 162207746 149294254
42705 149294254 138380631 131569656 127111628 120677459 111142847 101564452 94110963 87455610
42697 87455610 79915945 71926237 64340092 57232498 51445783 48371118 47063919 44651208
42689 44651208 40863534 38794624 39541498 39814258 37261933 34438626 34177989 34337893 31238969
42680 31238969 25913114 22634786 22822409 24353474 25539512 25931663 24627254 21881339
42672 21881339 21028911 24314672 28022527 26825364 22188974 20686668 23893395 26251337
42664 26251337 24314564 21705850 22015859 22653217 20147148 17075799 18477831 23996636
42656 23996636 28523792 29319001 28288854 27865934 28254744 28733181 28983535 29040951 29647700
42647 29647700 32131557 36446642 40373997 42274037 43346550 45400890 47848853 48911914
42639 48911914 48318423 46659370 43736453 40073117 38319299 39964178 41961249 40177155
42631 40177155 35424235 32398842 33035448 34866109 36155613 38385907 42250875 44928303
42623 44928303 43707955 39923760 37100965 36826086 38091889 39188006 38700722 35988094
42615 35988094 32080930 29017508 27304260 25423876 22806792 21466283 23104016 26120752
42607 26120752 27427698 26248897 24333486 23188168 22956288 23547348 24918861 26095092
42599 26095092 25478933 22759607 19759568 18937896 21223862 25301781 29006604 31674837
42591 31674837 34759301 39246165 43001911 42653720 38371279 34441510 34050342 35861650
42583 35861650 37321164 38642745 40886829 42638387 42437316 42691874 46351030 50442900
42575 50442900 48625874 41105307 36108303 38625895 42926812 40722011 32692073 26263284
42567 26263284 24562188 24075287 22487126 22042596 23696207 23858068 20046930 15527360
42559 15527360 14884009 18043304 21961554 25587016 29501006 32581820 32945690 31322694
42551 31322694 30109985 29659595 28628915 27417095 27815526 29337733 29408644 27676735 26706880
42542 26706880 27380580 26981623 23674882 20037895 19656227 22101867 23846725 23058598 21089875
42533 21089875 19622012 18443926 16471009 13834091 12388048 14134496 18919784 24022524
42525 24022524 26953503 28411864 31031111 35292943 38654496 39118916 37540047 35651805
42517 35651805 34090232 33388575 34307849 35490185 33484683 27611376 22405877 22044987
42509 22044987 24266278 23646754 19705305 17355884 19341855 22574233 23145315 21316573
42501 21316573 19744708 19700432 21127593 24091980 27798050 29733274 28088623 24252367
42493 24252367 21270648 20629384 21937948 24723932 28628502 32253807 33675319 32427192
42485 32427192 29939141 27813881 26386699 24999841 22988936 20265322 17492216 15978206
42477 15978206 17056875 20984219 26069294 29220386 28345334 24669631 21849571 22107404
42469 22107404 24080318 25228443 25011406 24179144 22380680 19087441 16205925 16650924
42461 16650924 19977484 22278139 21198437 18437498 16420700 15380117 15097978 16557857
42453 16557857 19743312 22344071 23036866 23724959 25920778 27345300 25523556 22752329
42445 22752329 23308803 26718775 28189587 25758394 22878470 23140382 26134436 29783607
42437 29783607 33431086 36898875 39203581 39994656 40113751 39426711 36598930 32459455
42429 32459455 30611399 32374985 33875417 31257470 26559478 24606908 25528069 24849811
42421 24849811 20973110 18003121 19550441 23311756 24425466 21982220 19399766 19501622
42413 19501622 21961024 25360714 29199206 33017474 35309942 34819844 32487337 31067925
42405 31067925 32597709 36443994 39763932 39838689 36410639 32097585 30153645 31357336
42397 31357336 33450974 34165517 34089330 35211957 37014659 36267439 31654830 26502415 24882503
42388 24882503 26416013 27509759 26929009 26948233 28806056 30479303 30409762 30488453 33117973
42379 33117973 37580595 41846471 46063699 51218101 55681580 56548210 53881152 50276149
42371 50276149 46415040 40794069 34386931 31468575 33850827 37631698 38260595 36208266
42363 36208266 34727984 34260661 32647360 29592222 27182285 26387528 26504216 27966663
42355 27966663 31967966 36619903 37371810 33143183 28856769 29316013 33019388 34975641
42347 34975641 33723732 32075669 31972877 32464436 32882382 34345020 37001011 38897904
42339 38897904 39295955 40478225 44026882 47386499 46915131 43170741 40388262 41303169
42331 41303169 45209913 50840759 57964493 65280937 69516316 68381298 62891485 55576721
42323 55576721 48072661 41743486 38635354 39487200 41859939 42486182 40963896 39236644
42315 39236644 38028519 36023710 32525573 28889483 26948677 27392389 29625478 31857240
42307 31857240 31837625 29359709 27497997 29100761 32620679 34326515 34221928 35888736
42299 35888736 40122171 43486526 44958231 48948229 58277001 68916361 76932248 86627336
42291 86627336 104145961 124168993 131392261 117873419 92930730 72342853 62313148
42284 62313148 58016812 53924718 49743335 47193305 46156964 45526428 45165997 45451276
42276 45451276 45956029 45649876 44319307 43485607 45284467 49571644 52712370 51140006
42268 51140006 46228958 43298270 44980754 48085224 48467691 46367341 44527934 43322971
42260 43322971 41106989 38226502 37129506 38517869 40305407 40670097 39576332 36971529
42252 36971529 32300572 26910222 24491602 27275264 33116985 37933271 40081325 40883729
42244 40883729 41787015 43312768 47147035 56690633 72704478 88640511 93766510 83718232
42236 83718232 66511161 54704719 51841313 50349652 43360839 33676377 28101908 27363125
42228 27363125 26945076 25497347 26070012 29052272 30019956 26715861 23353696 24680734
42220 24680734 29000863 30778459 28323389 25193045 24444404 24795908 23409424 20336419
42212 20336419 18468395 19634203 22374316 24232809 24973088 25759313 25873784 23352513
42204 23352513 19668925 20065414 26469496 33227434 33954720 30278219 28715704 30419601
42196 30419601 30260874 26148719 22508331 22502722 23016023 20776356 18197683 18878258 21543763
42187 21543763 23109896 24331220 27506356 31233679 32454972 31802888 32120870 33264710
42179 33264710 33245626 33267054 36385768 41567374 44204832 43079664 42454180 46496387 55275535
42170 55275535 66512557 77212148 82948221 79877963 69268217 57074391 47848179
42163 47848179 41628357 37064571 33963435 31864747 29842768 29152294 32597772 39595790
42155 39595790 45126915 45575063 42948159 41777683 44618492 51789013 61813747 69872793
42147 69872793 69377648 58404030 42579025 29378089 21759719 18931365 19695546 22029393
42139 22029393 22618042 20490018 18654798 18908793 18135162 13823247 9954076 11787121
42131 11787121 16974323 18252938 14221262 10941742 12343087 15333750 16068009 15199996
42123 15199996 14326715 12464490 9472182 8527848 11210968 13690778 12100061 8871597
42115 8871597 9116415 12690716 14708353 12965286 10119233 8574661 7696303 6890231 7423593
42106 7423593 9623780 11489909 11877962 12365095 14001565 14675804 12244671 8579457 7680376
42097 7680376 10459637 13847904 14897635 13616683 11555993 9604440 8005425 7198686
42089 7198686 7555550 8723639 9772851 9781466 8325932 6005951 4503308 5297896 7938292
42080 7938292 10066252 9470359 5951265 1386798 -1506918 -864593 2704971 5985806
42072 5985806 5734651 1982848 -1853295 -2478616 263807 3888065 5711920 4546112
42064 4546112 1218927 -1862466 -2666095 -1731849 -1443748 -2569796 -2949323 -661494 2950712
42055 2950712 5015195 4865994 4319922 4878954 6293490 7464843 7371182 5659803 3646594
42046 3646594 3830069 6775909 9541345 9300286 7502920 7745061 10221677 11541653 10013243
42037 10013243 7681921 6476899 5709034 4637666 4365513 5430928 6243331 5814428 5540337
42028 5540337 6280813 6230352 4121220 2141101 2715818 4342512 3911031 1714400 562031
42019 562031 725419 -396128 -3385389 -5139420 -3267077 446015 2463589 1721993 81613
42010 81613 -380189 735106 2690885 5225369 8974403 13768648 17066285 15937204 11214500
42001 11214500 7642681 8479952 11790477 13819044 13948819 13767112 13180350 11033247 8578447
41992 8578447 8498397 10595745 11983480 11697850 11557920 12032881 11151296 8720732 7822920
41983 7822920 10026412 12315342 11385305 8552252 7626074 9632866 12305822 13645268
41975 13645268 13547135 12592670 11289630 10239209 9774184 9942814 11518690 15615973 21270364
41966 21270364 25263511 26083693 26344816 29104857 33335742 35787439 36337405 38310929
41958 38310929 43433227 49176333 51695355 49358013 42979754 34683330 27255514 22700063
41950 22700063 20290190 17374343 13018049 9538186 9348373 11445793 12456940 10581977
41942 10581977 7143393 4415405 3221408 2977775 3026631 3064426 2721708 1772442 955380
41933 955380 1690905 4349719 7484513 9667050 11372310 13499632 14459542 11285530 4648344
41924 4648344 263342 2748690 9322140 12659560 9988304 6224492 6858128 10478161
41916 10478161 11041866 6331661 1058150 1026252 6452831 12404753 14564917 12965103
41908 12965103 10472655 9159626 8633654 7212118 4227966 1153215 180268 1567741
41900 1567741 3239330 3724459 4358596 6952744 10234936 11226219 10034489 10080665 12593266
41891 12593266 14249332 12430253 9679767 9607374 10774403 8945814 4273087 1734750
41883 1734750 4404432 10303308 16298052 21067155 23394685 21890583 18400924 17990389
41875 17990389 22928243 29519935 33440513 35646559 40128932 47652769 54480816 56205321
41867 56205321 51030343 40817279 30611108 25262796 24576070 23553848 19033652 13611799
41859 13611799 11024776 10751669 10289621 9901171 11078924 12426671 11491174 9354624 9060148
41850 9060148 10408320 10651984 9646487 9728624 10761334 10121423 8013399 7990326 11023378
41841 11023378 13432165 12325480 9216743 6498970 4012543 1174490 -770899 -898282
41833 -898282 -308291 256283 1865701 4600036 5997026 4475234 1985591 1154719 1865423
41824 1865423 2547905 2778585 2839949 2836644 3813730 7249993 11756556 13199484 10287500
41815 10287500 6999199 6767364 7389437 5203638 1425782 -142953 199580 -1390271
41807 -1390271 -5627738 -8504594 -6804702 -1716746 3502253 6466644 5975907 2395119
41799 2395119 -1552141 -2700660 -718316 2246092 4862523 7373397 9556353 10659882
41791 10659882 11209902 12150124 12359381 9986215 6081966 3452702 1782398 -2029738
41783 -2029738 -7767180 -10539095 -7603688 -2515687 430532 2222499 5788400 9750157
41775 9750157 10533480 9096317 10014048 13669846 14600706 9445390 2264236 -936322 178686
41766 178686 1617062 1793990 2597220 4318140 4051199 542711 -2863472 -2563025 341009
41757 341009 2139114 1932754 1719206 1870664 291441 -3220122 -5062744 -2075473 4434075
41748 4434075 10597317 14205606 15426204 15074445 14340387 15152558 18604561 23273583 26463761
41739 26463761 26706292 24249472 20284382 16800183 15664291 16264433 15535142 11958694
41731 11958694 7741560 5113011 2910798 -155605 -1419780 1957042 6616617 6025563
41723 6025563 67476 -3930387 -1299340 3923006 5598312 3658536 2168264 2667189
41715 2667189 3455164 3340838 2367814 238333 -2690102 -4007351 -1964083 1341350 2412286
41706 2412286 1129193 119671 140439 -593834 -2645716 -4208181 -4196069 -3644622 -3305529
41697 -3305529 -2370644 -485579 1185625 1862732 2132757 2189180 1240764 -197749 282389
41688 282389 3471370 6408718 6214203 4704332 6122398 10478203 12396180 7922011
41680 7922011 54789 -4805545 -4707994 -3790061 -6118502 -10574009 -13122271 -12105218 -9104372
41671 -9104372 -5688570 -1989588 1460155 3024184 2137381 468747 -187200 187162 1043470
41662 1043470 2845132 5874866 8555124 8786984 6613954 4180165 3285307 4033316 5453846
41653 5453846 6330449 5839860 4506618 4090380 5390085 6718080 5929331 3486167 1887951
41644 1887951 2279769 3370381 3813753 3881532 4229022 4554976 4399200 4232200 4852966
41635 4852966 6319893 8125323 9963115 11820374 13570910 14699033 14312332 11784220
41627 11784220 7922329 4977711 4484164 5458992 5998438 6276142 8059264 11005696 11707131
41618 11707131 7850793 1806407 -1822373 -1514635 153396 624150 513223 1834818
41610 1834818 4434681 5760042 4185887 1442552 926702 3805002 7570317 8848482
41602 8848482 7131218 4962206 4515300 5003608 4139837 1489181 -877003 -1222309 -390543
41593 -390543 -274063 -958117 -1070417 -757545 -2046459 -5229466 -7002902 -4331058 1197164
41584 1197164 5440381 7224730 8659871 10303386 10002430 7576550 6538723 8618771
41576 8618771 10023939 6765714 1301848 -281794 3602743 8903335 12289404 14315449
41568 14315449 15911051 15986223 14052255 11894685 10780712 9566313 7303188 5337318
41560 5337318 4838714 4298324 1802811 -1562229 -2902394 -1498723 321604 268150 -1195328
41551 -1195328 -1462036 1208710 5307075 7275241 5930464 4669169 7212764 11932162
41543 11932162 13647610 11231453 9332117 10852939 11968091 8250200 2610468 2131820
41535 2131820 8082474 14004085 14256162 10291553 7007000 6373759 7042718 7814594 8550501
41526 8550501 8610348 7096114 4887102 4532624 7274926 11190122 13193742 12448868 10956608
41517 10956608 10955223 12718214 15132805 17303235 18707865 18680125 17075817 14987625 13417136
41508 13417136 11668919 8768242 6148522 6555482 9738748 11558240 8697605 2632629
41500 2632629 -2344758 -3651977 -1877709 705282 1737214 299973 -1707771 -960667
41492 -960667 3230195 7636634 9258881 9092583 9937413 12044236 13319020 12837063 11701905
41483 11701905 10857067 10156247 9411073 8714818 8021651 7650090 8428826 10068760 10599269
41474 10599269 9018610 7122945 6858255 7512314 7859160 9190219 12922429 16616493
41466 16616493 16388092 12855269 10721013 12210092 14690592 15474354 15286048 15670790 16219222
41457 16219222 16198113 16601053 18954425 23716904 30683667 39158371 47268163 53369755
41449 53369755 58886106 67772101 82634474 102914467 125933248 146486995 156233452
41442 156233452 148776907 127266318 103100168 85061608 72863670 62529498 53449715
41435 53449715 47323202 44358965 44360019 48418612 55711513 61258920 60692932 55099995 47825328
41426 47825328 39278156 28986827 20041844 16252697 16328193 15838319 13900876 12968485
41418 12968485 12923859 11041403 7852380 7214035 9359798 9400940 4928634 176855 -401689
41409 -401689 1425890 1312643 -753935 -1348246 401729 1897353 1794198 2176622 5260008
41400 5260008 10162036 14032915 15214190 14326760 12813947 11471404 10668023 11026829 12544618
41391 12544618 13311623 11155662 7263793 5855182 8606322 11757322 11358367 9169062
41383 9169062 9645615 12741727 14488400 14194271 15682734 20521534 25473872 28881932
41375 28881932 34467863 45324553 58558151 70506981 83820739 103369430 126155444
41368 126155444 140895235 138754911 121170969 96633993 73199077 55092005 43139531
41361 43139531 35731777 30268151 25261352 20990499 18060998 16263866 15064131 14244523
41353 14244523 13728576 13429090 13363500 13376549 12990536 12174322 11751641 12119922 12141256 10549513
41343 10549513 8021937 6401322 6057009 5536557 3889236 1885934 736724 931598
41335 931598 2478503 4756564 5853997 3893596 -102717 -2374662 -853560 1904611
41327 1904611 2032916 -251563 -788665 2982684 8804896 12750007 13738820 13363565 12485624
41318 12485624 10313520 6891490 4479931 5480753 9974295 15917360 20871043 23267510
41310 23267510 23598383 25269655 32348717 44373387 54584126 55875147 48248528 38209992
41302 38209992 31159905 27028500 23415644 19652395 16279894 13140328 10026440 7535982
41294 7535982 5617936 2929565 -689714 -2870533 -1893570 301890 586168 -1085915
41286 -1085915 -2259755 -1859877 -963148 -426396 -356102 -1413421 -3851475 -5509933 -3798678
41277 -3798678 134689 2360227 1895018 2092385 4904234 7192059 5441247 1588797
41269 1588797 647439 3707064 6768749 6431162 3600147 837781 -1201776 -3043007
41261 -3043007 -4003086 -2782959 163159 2805859 4209276 5393489 6919928 7094525
41253 7094525 4064081 -873403 -3781123 -2372899 1312890 3203867 1461365 -2105931
41245 -2105931 -4194710 -2870754 1118222 5015417 6285886 4802644 2641558 1557116
41237 1557116 1480592 1876340 3128816 5263183 6504840 5150296 2386339 1133403 2122490
41228 2122490 3298359 3486304 4269073 6964510 9673476 9276924 5435694 819945 -2251503
41219 -2251503 -3817670 -4915411 -5630585 -5145708 -3103181 -326810 1795370 2490904 2083082
41210 2083082 1253424 98108 -1621430 -3412319 -3989592 -2612821 -17766 2267007
41202 2267007 3145364 2366200 359771 -1861368 -3028407 -2380987 -146062 2724348 5024641
41193 5024641 5682480 4414128 2237194 736045 532187 1026951 1817342 3418473 5895633
41184 5895633 7634207 6782868 3865103 1757937 2497865 4776044 5360288 2799884 -987762
41175 -987762 -2876615 -1549570 1975136 5981948 9224138 10889123 10784215 9799843 9055514
41166 9055514 8322547 6637212 4896794 5929588 10558240 15198814 15522081 11655765
41158 11655765 7590316 6002751 6095174 6390803 6873416 7547848 7273898 5524542 3843211
41149 3843211 4217024 6830040 10101437 11993024 11016294 7462854 4132322 4077061 6809836
41140 6809836 8554714 7257604 5299977 5716447 7791219 8714507 8098276 8064581 9469804
41131 9469804 10709723 10354655 8771353 6812020 4831755 3593571 4496417 7900343
41123 7900343 12029316 14211384 12946614 8889861 4465392 2337185 3404447 6224527
41115 6224527 8804939 10508889 11645851 12077774 11401590 9867353 7868659 5249723
41107 5249723 2649255 2675927 7376740 14553299 19006181 18160104 14534656 11884231 10916808
41098 10916808 10129268 9080716 8814415 9767292 11025645 11623476 11517001 11283120 11478313
41089 11478313 12112699 12377629 11367512 9459817 8277796 8725554 9828929 10219999 9893856
41080 9893856 9506126 8811232 7271734 5732635 5738512 7079361 7734659 6923319 6680758
41071 6680758 9092527 12868522 14354320 12009256 8506740 7640743 9822497 11594442
41063 11594442 9729992 5256910 2833733 5882745 12569226 17237936 16201921 11569130
41055 11569130 8545532 9347583 11227278 10860712 8927513 8738249 11319112 14077521
41047 14077521 14458474 12926827 11551783 11262371 11674475 12397440 13059210 12773217 11067318
41038 11067318 9091831 8676113 10195011 12218339 13102857 12160072 9644950 6659090
41030 6659090 4876220 5253664 6989551 8653588 10164510 12477908 15388268 17148935
41022 17148935 16784326 15499415 14982191 15311881 15543040 15592977 16263584 17616440 18623008
41013 18623008 18814556 19288273 21187718 23612085 24187128 22032251 19182204 18219575 19204654
41004 19204654 20210551 20469006 21177136 22940498 24479002 24984660 25898169 28489033 31041898
40995 31041898 30834140 28280611 26596028 27298167 28479402 28163335 27129299 27122251 27893756
40986 27893756 27625459 25494092 22511884 20183492 19235331 19460150 20186546 20919315 21636216
40977 21636216 22316079 22580676 22502516 23263672 25721179 28533027 29327037 27851598 26128640
40968 26128640 25004273 22689562 18000949 13164254 11429037 12997958 15287503 16536430
40960 16536430 17152472 17780932 18154047 18285149 19106738 21050904 23059842 23887714 23744511
40951 23744511 23830214 24553710 24959820 23944953 21508374 18641818 16468674 15857326 17278644
40942 17278644 19975540 21436919 19387495 15129512 13194991 15868563 19384105 18255433
40934 18255433 12855528 9411453 11880398 17193029 20278107 20752948 21763527 24299409
40926 24299409 26242378 26393254 26161912 26923626 28179005 28917562 28888090 27973861 25951640
40917 25951640 23427824 21676874 21174620 21493423 22685316 25197114 28227946 29976266
40909 29976266 30075440 30039432 30538832 30104515 27830169 25694405 26262070 28938715 30448861
40900 30448861 28832798 25347980 22325136 20649525 19912896 19879324 20750633 22312753 23692057
40891 23692057 24230729 24268697 24694721 25720016 26475444 26161207 25362445 25600014 27399848
40882 27399848 29369969 29742722 28662124 28310701 30426706 34006805 36139541 35383433
40874 35383433 33660173 33897668 36088479 37155473 35291106 32927841 33912777 38713213
40866 38713213 44556251 50145849 57608242 68371675 78947787 83194156 78640439 68855545
40858 68855545 59191791 51625267 44736092 37729100 32569189 31439788 33187419 33859070
40850 33859070 31048576 26524711 23689761 23350826 23480792 22778081 22411716 23510375 24800514
40841 24800514 24491586 23430177 24157167 27018854 29505476 30014403 30016956 31136640 32142152
40832 32142152 31133187 29260237 29174620 30239085 28868581 24443603 21269068 22501729
40824 22501729 25255428 25052229 22853368 23370900 27371523 30437198 29921019 28536438
40816 28536438 29160931 30079786 28369480 25043265 23342493 23836971 24735040 25768392 28074502
40807 28074502 30716539 31026602 28877348 27442141 28719874 30932420 31631973 31161077
40799 31161077 31387788 32588112 33376195 32987660 32209831 32226237 33331628 34792663 35857840
40790 35857840 37074843 40099495 45330747 50277072 51813400 50070469 48527065 49968839
40782 49968839 53851753 57972375 60970489 62390790 61955353 60095304 58183492 57180191
40774 57180191 56898519 57290008 59065138 61819932 62910478 60123107 54920833 51178513
40766 51178513 50685651 51495754 51049138 49461403 48842828 50280636 52707590 54707265 56475184
40757 56475184 59381932 63919827 68841230 72577971 75021607 77555288 81731749 88164350
40749 88164350 95889880 102007786 102774350 96776210 87439805 81259698 82515510 89475891
40741 89475891 95679121 95088882 86854481 75584281 66405201 59644641 51757490 41805430
40733 41805430 34256317 33140067 35849541 36435516 33735680 31831447 32677212 33202386
40725 33202386 30954458 27909882 26243491 24378807 20464385 16419900 14808985 14419411
40717 14419411 13079379 12665359 16484135 22738097 25620983 23211220 19878432 19861692
40709 19861692 22309536 24148102 24436780 23841729 22514877 20863412 20527234 22255336
40701 22255336 24033927 23476713 21393037 21067381 24139465 28649527 31341501 30974435
40693 30974435 29071217 27853215 27794799 27442973 25687030 23541885 22928328 24137097 25523507
40684 25523507 25400555 23072819 18429021 12323973 7490891 6981492 10685534 14937778
40676 14937778 16715423 16866398 17884672 19928900 21129810 21130653 21836584 24226942 26537283
40667 26537283 26820438 25834666 25724508 26706808 27146180 26843843 27908010 31368192 35071091
40658 35071091 36936062 38746162 44030490 53184692 64103868 77208534 94849711 113664199
40650 113664199 122423697 112604911 89233586 66373013 52424308 44530978 37438383
40643 37438383 31899421 31209496 33686425 33531066 28072953 20291660 14047477 9948427
40635 9948427 6883376 5074120 5486202 7257504 8009194 7082736 6674689 8521062 10795046
40626 10795046 10446454 8098198 7739611 10829637 13739721 13053290 10681544 10549480 12186846
40617 12186846 11746153 8660417 6824278 8530688 11316547 12355149 12413788 13220089 13750535
40608 13750535 11860585 7868978 4187431 2553478 3264269 5703769 7996349 7704821
40600 7704821 4729165 2183696 2670312 5067248 6728488 7212195 7626075 7732292 6350745
40591 6350745 3874950 2003071 1428628 1709413 2658576 3911071 4139252 2996784 2766182
40582 2766182 5330763 8476108 8584474 6583167 7293159 12239512 16975573 17234589 14479921
40573 14479921 12962435 13688996 14043256 11966993 8016474 4034730 1808297 2449900
40565 2449900 5318360 7984574 8765617 8664324 9223564 9387074 6927271 2762762 940901
40556 940901 3259677 6321332 5863691 2441086 487904 2555191 6979194 11120822
40548 11120822 14150754 15785801 14964252 11811383 9102544 9296872 11155974 11776376
40540 11776376 11166875 11935882 14792542 17679854 19812912 23222614 29321921 37466076
40532 37466076 48354605 64433818 83403003 95024189 89890732 70398535 48488709
40525 48488709 33004440 23667891 17119314 13088421 12351609 13017163 12348326 10087235
40517 10087235 7447349 4681434 1889248 462962 1358969 3280201 4709936 6336102
40509 6336102 9070774 11006457 9446114 5590167 4044287 6892656 10682734 10621309
40501 10621309 6161720 962705 -1707550 -1866229 -1265137 -527007 1118033 3703265
40493 3703265 5501281 4943664 2958674 2260776 4282943 7774262 10630725 12138271
40485 12138271 12948552 13662598 14116326 13715913 12157899 10079840 8850931 9096317 9699160
40476 9699160 9199373 7840209 6931209 6582729 5977830 5751447 7534673 10550762 11535965
40467 11535965 9522331 7920520 9586223 12354580 12566967 10993304 11282440 13553754
40459 13553754 14031503 11442015 9433341 10881873 13335560 12813651 9748331 8047218
40451 8047218 9418513 11674058 12668245 13354382 15832301 19724334 21919571 19968216
40443 19968216 15076212 11200408 11079403 13606363 15512557 15109611 13518337 12573700
40435 12573700 12787928 13530945 14022867 13691882 12501087 11375540 11462847 12600472 13382571
40426 13382571 13017182 12062005 11052504 9821375 8775581 9178615 10945603 11668028 9605268
40417 9605268 6621065 6109468 8476758 10714041 10406394 8215552 6095349 4979312
40409 4979312 5059831 6704529 9701815 12448205 13234993 12185766 11082125 11288282 12401113
40400 12401113 13056340 12769963 12630442 13789579 15361576 14842536 11380466 7634505 6874325
40391 6874325 8813359 10270265 9782263 9107537 9617694 9996392 9173445 9050784 11670520
40382 11670520 15322725 16527518 15040455 13722883 13691713 12960503 10469395 8196765
40374 8196765 7836463 8133444 7458977 6812102 7959379 10147188 11005325 9749885 7471037
40365 7471037 5165840 3525693 3775492 6323175 8949652 8694923 5678601 3163760
40357 3163760 3728010 6999280 10971121 13686552 13855386 11983184 10833286 12404308
40349 12404308 14426584 12694581 7358055 3671600 5171408 9220626 11309813 10822265
40341 10822265 9792486 8519193 6050526 3546719 3382501 5397254 7337692 8693166
40333 8693166 10670337 12352182 10751431 5834136 2029126 2709053 5750702 6825062
40325 6825062 5078623 3097897 2732155 3665820 5390007 7839298 9929663 9835788 7607681
40316 7607681 5905131 6955441 9615807 10577159 8260473 4616731 2811718 3729509
40308 3729509 5440417 5955176 5430221 5040211 4772216 3912389 3258045 4696194 8050823
40299 8050823 10434706 10061014 8918724 9659805 11135721 9762625 5112203 1360042
40291 1360042 2273124 6855284 11216126 13022158 12494224 10490450 7943807 6661529
40283 6661529 8184072 11345874 12968701 11929759 10857747 12444910 15539054 16854727
40275 16854727 15664529 14351738 14344298 14054127 11753248 8312200 5611146 4018728 3289195
40266 3289195 4394704 7964698 11760437 12479599 10025676 7438511 6386739 5493314
40258 5493314 3894313 3468976 5640097 8274084 8282929 5968654 4345430 4932274 6506258
40249 6506258 7562431 7723636 6775511 4585989 2579332 3462624 8354811 14955864 19261250
40240 19261250 18885824 14831445 10490565 8615593 8720663 7950480 4890692 1285346
40232 1285346 -905029 -2345819 -4316348 -5580465 -4204184 -1435280 -271336 -544042
40224 -544042 679390 3511978 4434494 2449430 1637345 4902528 8945051 9012802 5806493
40215 5806493 3762746 4529454 6079290 6765410 6329290 4126752 427607 -1518312 886718
40206 886718 4498210 3747066 -988960 -3480365 -858631 2726484 3503727 3629648 6062128
40197 6062128 8701368 8135299 5739468 5161874 6087666 5435071 3284381 2662962 3922489
40188 3922489 3989520 1603395 -669427 -453845 1611615 3718342 4622363 3084065 -1307764
40179 -1307764 -5994223 -7150364 -4565107 -2087352 -2257658 -3374453 -3055995 -1652082
40171 -1652082 -405751 905625 2377550 2588100 1157452 410078 1930671 3573303
40163 3573303 2776679 981140 1379946 3565146 4066854 1721516 -1018398 -2170577 -2285253
40154 -2285253 -1993248 -772618 787412 430325 -2488156 -5477687 -6282177 -5720722 -5398405
40145 -5398405 -4509587 -1280040 3545632 7065589 7691501 6269862 3898231 602492
40137 602492 -3362535 -6445305 -6973611 -4848555 -1669770 444479 175115 -2183831 -5011447
40128 -5011447 -6829812 -7414045 -7068407 -5412705 -2175428 860798 462119 -4368794 -10259676
40119 -10259676 -12393707 -9333631 -3957466 61758 1438042 1010222 -65182 -983487
40111 -983487 -1151087 -491085 403080 1063577 1742180 2721063 3630898 4147513 4730544 5766128
40101 5766128 6588886 6479532 6048067 6180412 6088045 4344803 1858412 1512308 4039246
40092 4039246 6415058 5874086 3772264 3398683 5065630 5763994 3474200 -327050 -2821068
40083 -2821068 -2803806 -890779 1791042 4110589 4957031 3858888 1597327 -193200 -108101
40074 -108101 2158984 5541254 8090752 8278750 6310396 4151290 3916197 5849240 7818454
40065 7818454 7287977 4232880 1589831 1974394 4394656 5508064 3891785 1286776
40057 1286776 -564427 -2024663 -3467107 -3379123 -600504 3124540 5176353 5663399 6678466
40048 6678466 8647676 9889374 9590252 8834823 8486860 8126222 7385108 6479237 5152011
40039 5152011 2884518 389408 -888734 -970481 -1226839 -1927178 -1896063 -846094 107208
40030 107208 669400 1876534 3836311 5270769 5976484 7245120 8916162 8691054 5759125
40021 5759125 2521393 1035234 268924 -1183074 -2298426 -2080552 -2377574 -4989398 -7640481
40012 -7640481 -6387892 -1286219 3576458 5394359 5090901 4550577 4272894 4300086 5172132
40003 5172132 7060714 9225743 10700893 10781236 9334437 7521783 7106688 7772834 6660900
39994 6660900 2406997 -2117704 -3623468 -3233074 -4247779 -6474799 -6668739 -3889566
39986 -3889566 -349756 2686582 5483189 6477861 3488601 -932411 -848800 4344966 7868283
39977 7868283 5224666 907795 1347447 5548068 7907736 7089597 6297462 6616242 5893980
39968 5893980 3626714 1722528 422672 -1792578 -4055993 -3574677 -827404 315468
39960 315468 -1316205 -2533792 -1640166 -1189340 -2574717 -2495181 1548619 5835108 4879719
39951 4879719 -811347 -5580971 -5980656 -3540990 -960476 756090 1240417 -40588
39943 -40588 -2733775 -5538302 -7381461 -7442035 -4907906 -544541 2706713 3208017 3549767
39934 3549767 6876658 11310440 12090994 9015957 6962761 8013337 8099566 4028920 -694738
39925 -694738 -947817 2529424 5245109 6159833 7770547 10245129 10778641 9008964 8191208
39916 8191208 9697590 10549745 8390532 5375400 4641419 5777886 6709734 7894755 11187370
39907 11187370 15441294 16624407 12839772 6993136 3497963 3556523 4642185 4100567
39899 4100567 2230741 1286288 1953627 2372494 1438465 1266842 4040336 7557078 7398239
39890 7398239 3603969 1220709 2822502 4527170 2257430 -1564958 -1674558 2055722
39882 2055722 5051189 5394213 5771892 7776116 8992494 7426476 5022348 4325635 4333911
39873 4333911 2460249 -843064 -2032217 1221593 7267453 12058819 12759971 9899454
39865 9899454 6292606 3829720 1839731 -809069 -3090677 -3031194 -946294 728065
39857 728065 848621 588647 723168 230393 -1488690 -2985389 -2584981 -518697 1610097
39848 1610097 2412636 1487779 -71402 -59245 2137654 3540687 879078 -4170689 -6344975
39839 -6344975 -3999451 -1303729 -1882943 -4042722 -4504621 -3304993 -2072024 -549391
39831 -549391 1843459 3587728 3549653 3460919 4566843 4510041 1531955 -951859 1089915
39822 1089915 5326925 6258034 3941754 3333574 5411568 5690549 2480329 19961 1181223
39813 1181223 2993694 2435177 1368280 2130066 2950621 1871626 1053746 2579639 3577173
39804 3577173 762298 -2880741 -1683171 3928298 7885637 7293017 5414795 5326730 5572087
39795 5572087 3788530 709807 -1602348 -2725953 -3111529 -2497157 -901828 402092
39787 402092 460240 -24199 -60198 150508 204847 788120 2626819 4797747 5277171 3115395
39777 3115395 -443089 -2897956 -2493378 292536 3151233 4115759 3180126 1572558 163982
39768 163982 -676559 -433003 1165798 3492026 5694710 7472299 8355091 7385087 4935242
39759 4935242 3544343 4822474 6586515 5697043 2986239 2184194 4075211 5210872
39751 5210872 3131221 -423185 -2660255 -3011865 -1889280 688237 3383278 3537156
39743 3537156 1209732 342624 3155589 6154675 5037818 1073251 -1338970 -1352727 -1284361
39734 -1284361 -1000835 1822373 5909156 6494602 2707394 -129594 1987124 6123782
39726 6123782 7316935 5488814 3742198 2548162 101218 -2895469 -3332721 -758247
39718 -758247 1345186 363024 -2023263 -2459493 -125503 2900030 4276160 3392981 1493907
39709 1493907 529716 1416304 3068687 3562532 2301598 534658 -150983 804842 2864039
39700 2864039 4774703 5008484 2723306 -1363219 -5431182 -7844538 -7756056 -5176927 -1432718
39691 -1432718 998635 561339 -1401240 -1941436 100067 3099490 5021028 5340300 4345681
39682 4345681 2181691 -548818 -2555086 -3316667 -3772315 -4497593 -4216232 -1562454 2322916
39673 2322916 4621554 4241304 2956397 2805082 3549218 3430408 1655727 -819799 -2767727
39664 -2767727 -4035796 -5078621 -5761204 -5520581 -4791620 -5221800 -7490346 -9450138 -7961642
39655 -7961642 -2969895 1563461 1829848 -1467327 -4092556 -3290682 -566283 728595
39647 728595 -570250 -2633952 -3319280 -2549659 -1706372 -1471865 -1362804 -1417863 -2990322
39638 -2990322 -6672013 -10089338 -9555990 -4430905 1463117 3669970 1540959 -1971946
39630 -1971946 -4084916 -4458586 -4161190 -3967603 -4132727 -4736275 -5410853 -5201867 -3459591
39621 -3459591 -789096 1447599 2630982 3345380 4081658 4121213 2590657 401387 -184173
39612 -184173 1518577 3349560 3128524 1770664 1854211 3557757 4202012 2256513 -174872
39603 -174872 65485 3470278 7737000 10220434 9610394 6430326 3080467 2308544 4223325
39594 4223325 5571510 3330161 -1542607 -5144126 -4880307 -1611258 1767506 2689185
39586 2689185 558492 -2600741 -3638524 -1623619 963297 1586069 1101114 1956733 3891823
39577 3891823 4088653 1596561 -1027510 -1258041 358553 1806643 2548431 3444343 4689284
39568 4689284 5192152 3940831 1470904 -126972 905103 3593840 4450533 1218999
39560 1218999 -4121085 -7406535 -6811092 -3819637 -437931 2334107 3486648 2069892
39552 2069892 -1046446 -3423094 -3624884 -1941436 1302864 5660792 8620534 7005720
39544 7005720 1651045 -2200131 -1083333 2452188 3793034 2206636 442178 252334
39536 252334 1059286 1961615 2533887 2294277 1458852 1545560 3370010 5281598 5282901 3955387
39526 3955387 3184553 2896425 1517402 -807471 -1970458 -926000 1145166 2864668
39518 2864668 4014956 4634770 4356691 3053275 1180375 -505409 -969256 538876 2998919
39509 2998919 3932542 2610479 1579873 3204897 6193633 7859789 8307245 9404555
39501 9404555 10799547 10458958 8602539 7495834 7487603 6896232 5886504 6508888 8356890
39492 8356890 8324170 5781987 3821362 3728430 2546585 -1422032 -4887804 -4753329 -3417895
39483 -3417895 -4723340 -7318952 -6775295 -2754756 642864 1199903 931144 1849370 3160914
39474 3160914 3533028 3095931 2144605 311317 -1932473 -2972097 -2220244 -998898 -580428
39465 -580428 -854233 -1465937 -2710683 -4571856 -6091875 -6305992 -4996859 -2592478 -447270
39456 -447270 -789914 -4523562 -9097711 -10636415 -8542794 -5980780 -5375508 -5790710 -5668246
39447 -5668246 -5615921 -6661153 -7716905 -7035471 -4947386 -3024555 -1474111 419867 1893358
39438 1893358 1144982 -1786669 -4658455 -5840017 -5718997 -5031823 -3795751 -2629142 -3120588
39429 -3120588 -5422195 -6894111 -4891222 -166423 3991760 5399010 4307299 1875824
39421 1875824 -636021 -1435074 562590 3442702 3562980 337691 -2329358 -1100934
39413 -1100934 2256482 3784380 3171816 3466691 5733212 7757377 8389471 9246809 10624264
39404 10624264 9524541 4575891 -105572 264402 4307314 6587729 5644941 5395154
39396 5395154 8067483 10209061 7836315 2322859 -1587474 -1634324 682160 3235834
39388 3235834 4990213 5276778 3922131 2193655 1758754 2535564 3014772 2600602 1990794
39379 1990794 1229396 -672444 -3538604 -5142236 -3639455 116781 3566049 4854137
39371 4854137 3608046 621001 -1976422 -1412293 2859158 7261670 7025737 1466781
39363 1466781 -5096608 -8179756 -7453662 -5505965 -3879145 -1977481 852186 3986316
39355 3986316 6396312 7565311 7269062 5513103 3078998 1217517 277869 -619059 -1972845
39346 -1972845 -2673920 -1263192 1858218 4375393 4395155 2251095 -308404 -2177870 -3404792
39337 -3404792 -3817674 -2402808 982664 4092498 4250031 1931645 500177 1602083
39329 1602083 2895511 1993825 637930 2091792 5558522 6786298 4313077 1509539
39321 1509539 1323848 2280082 1550441 -764146 -2685807 -3397148 -2859328 -612444 2267719
39312 2267719 2147108 -2672424 -7917668 -7853114 -3160048 -45368 -1383087 -3278488 -1742025
39303 -1742025 1518976 2531707 1000439 -352907 -320081 44670 61619 60997 -75081 -812185
39293 -812185 -1785111 -2480041 -3554440 -5751686 -8064275 -8743510 -7593613 -5454863 -2155489
39284 -2155489 2559963 6364552 5679447 616173 -3986632 -4060511 -842968 1912972 3323366
39275 3323366 5141131 7203851 6793476 3292536 228209 603788 2560909 2504507 864443
39266 864443 971504 2683268 1692761 -3332544 -7191070 -5001465 425114 2292379 -846436
39257 -846436 -4096683 -3950051 -2129722 -1108560 -542708 37938 -826821 -3319109 -4577485
39248 -4577485 -3096023 -1852763 -3726070 -6498118 -6344803 -4180211 -3994494 -5998746
39240 -5998746 -6217978 -3060588 54755 -261551 -3122169 -5515496 -6032435 -5111206 -3667863
39231 -3667863 -2656131 -2465636 -2214350 -1097454 -247196 -1156155 -2607473 -2005457 263449
39222 263449 1098903 -295062 -1388361 -1341825 -2924852 -7245438 -10353796 -8303622 -2861718
39213 -2861718 1090895 1706602 607619 -751469 -1674222 -756595 2486092 5389204 4891484
39204 4891484 1954790 248515 1127973 2987366 4833444 6986007 8537784 7764791
39196 7764791 5315496 3638074 2887094 774709 -2969855 -5530722 -5427873 -4652540 -4988951
39187 -4988951 -5324308 -4314739 -2896071 -2227980 -1610110 -387876 261344 -682674 -2307672
39178 -2307672 -3606701 -4913479 -5883614 -4583314 -736501 2509056 2507587 647889 -535956
39169 -535956 -1482235 -3804682 -6440274 -7145954 -6472236 -6741764 -8046683 -8602396 -8166046
39160 -8166046 -7689093 -6473995 -3459313 -743316 -1697194 -5513301 -7645133 -6068788
39152 -6068788 -3171857 -909830 1571911 4282460 4774914 2355676 136772 385595
39144 385595 1109713 -85888 -1835847 -1775350 -856284 -1545003 -3593452 -4819088 -4714958
39135 -4714958 -4444169 -4537536 -5197200 -7389706 -10834830 -12398077 -9620969 -4682257 -1660833
39126 -1660833 -934904 211387 2222640 2476666 -72541 -3141911 -4684434 -5143589 -5488155
39117 -5488155 -5788976 -6321935 -7371117 -7496477 -4896417 -947712 834906 30970 -118989
39108 -118989 1510242 1719780 -1247435 -3817593 -2446940 415048 90255 -2776779 -3324772
39099 -3324772 -341524 1856682 76238 -3379118 -4661022 -3632357 -3052979 -4451338
39091 -4451338 -6813514 -8316625 -7823018 -5340371 -2217090 -485385 -1145454 -3277861
39083 -3277861 -5150183 -5733358 -5018544 -3670268 -2667993 -2431633 -1973644 91278 3245516
39074 3245516 4925392 3442924 -39370 -3415408 -6319400 -9389960 -11822799 -11870555
39066 -11870555 -9773834 -8111623 -8618916 -10346567 -11682651 -12374207 -12385674 -10668192 -7062261
39057 -7062261 -3957230 -3430367 -3566849 -778427 4167823 5932838 1724717 -4488403
39049 -4488403 -7134120 -5864894 -4268261 -3701568 -2367133 -94354 26093 -3925173
39041 -3925173 -9431193 -12387141 -11466724 -8373485 -5378653 -3979800 -4566229 -5834556
39033 -5834556 -5531676 -3224332 -1465179 -2727764 -5933357 -7736725 -6923595 -5732849
39025 -5732849 -6557477 -8878582 -10234723 -9224421 -6597458 -3878722 -1952259 -1093149
39017 -1093149 -1488496 -2978837 -4548343 -4887247 -3655109 -1611779 614066 3038531
39009 3038531 5253489 5905290 4099113 552062 -3405265 -6914218 -8736441 -6981343
39001 -6981343 -1768441 3011117 3304611 -132331 -3005005 -3390325 -3264550 -4018235 -4152517
38992 -4152517 -2687350 -1432562 -1900841 -2876281 -3205946 -4173638 -6530213 -7889604 -6235989
38983 -6235989 -3682541 -3184502 -3570006 -2002157 160518 -1126401 -5615803 -8333457
38975 -8333457 -6916453 -4760306 -5231834 -6945131 -7161532 -6273687 -5949596 -5764289 -5069383
38966 -5069383 -5859633 -9762799 -13531921 -12007919 -5698687 -1202354 -2650612 -6298388
38958 -6298388 -6205431 -2649996 -1150792 -4059648 -7245395 -6185748 -1937347 1349667
38950 1349667 2402025 2911231 2907239 200907 -4977224 -8567880 -7834760 -5115322 -4054740
38941 -4054740 -4357436 -3223848 -537982 707683 -1084557 -3979578 -5294049 -4581978
38933 -4581978 -3403003 -3371346 -4534552 -4947973 -2551876 1724519 4246864 3486423 2510734
38924 2510734 4260799 6484985 5072306 989542 -739621 1217600 2592171 307631
38916 307631 -3325174 -5014417 -5043770 -4968540 -4230950 -2060041 -97617 -55378 -725244
38907 -725244 -216420 464135 -1053322 -4596037 -7821977 -9669861 -10924913 -11916700 -12017973
38898 -12017973 -11274001 -10621563 -10447274 -10185899 -9133197 -6845897 -3525494 -861291 -1243180
38889 -1243180 -4834342 -8553275 -9343506 -7411934 -4996985 -3323856 -2413275 -2588924 -4133524
38880 -4133524 -6143280 -7379854 -7702771 -7547024 -7021024 -6601299 -7225572 -8374533 -7880639
38871 -7880639 -5337859 -3645144 -4909152 -6882063 -6347426 -4213211 -3748872 -5032757
38863 -5032757 -5015068 -2574407 310428 2416229 4539111 6403137 5958843 2994570 437297
38854 437297 555208 2156650 2808214 1762407 -449593 -3312369 -5870451 -6567719 -4867975
38845 -4867975 -2114211 -120568 237729 -980831 -2937744 -4293969 -4732878 -5755609
38837 -5755609 -8238445 -10019432 -8447816 -4748953 -2725575 -3242328 -3492900 -2101889
38829 -2101889 -1101971 -1725541 -2075391 -804624 435066 443220 955571 2917592 3427058
38820 3427058 -135002 -5302410 -7506384 -6128406 -4005119 -2380810 -286179 1862181
38812 1862181 2157696 897254 776645 2646798 4102277 3266402 1313029 19760 -819679
38803 -819679 -1991447 -2754887 -1981365 -292030 603081 83297 -1269807 -3277136 -6237803
38794 -6237803 -9092770 -9003487 -4194843 3015381 7515190 6557033 2715897 548959 1076264
38785 1076264 1412458 -371438 -2557525 -2954400 -2495919 -3613988 -6277505 -7915095 -6933115
38776 -6933115 -4409186 -2227547 -1120833 -892939 -1265621 -1838252 -1984720 -1503248 -1154508
38767 -1154508 -2066260 -4398241 -6735877 -7308347 -6119883 -5239764 -6192055 -7708472 -7396829
38758 -7396829 -5191154 -3327883 -2887785 -2415893 -528972 2027505 3728212 3931958 2466255
38749 2466255 -520991 -3398234 -3836328 -1963093 -691836 -1644228 -3008182 -2943986 -2521162
38740 -2521162 -3143155 -3619191 -2545424 -1357738 -1894596 -2847080 -2021017 -455565 -601999
38731 -601999 -1802971 -1622709 -671455 -1725768 -4464687 -5608996 -4503636 -4053143 -5301640
38722 -5301640 -5464110 -2817175 332879 1328523 492267 -791453 -2087050 -2491686 -609449
38713 -609449 2334829 2854154 652720 -27069 2886634 5112261 2254873 -3024443 -4729908
38704 -4729908 -2393756 -1222646 -3990991 -7513562 -8001077 -6172960 -5246641 -6064041 -6243108
38695 -6243108 -3743056 -127302 566678 -3206954 -7573823 -7431456 -3452720 -1729269
38687 -1729269 -5347753 -9959437 -10286795 -7717685 -7569226 -11004459 -13997714 -13331217 -9688435
38678 -9688435 -5328515 -2256849 -2195252 -4822644 -6550343 -4745260 -2576291 -5269467
38670 -5269467 -11605187 -14168300 -9247587 -1758047 1725461 625989 -1462493 -2417548
38662 -2417548 -2211323 -937617 299887 -1279127 -6527181 -11670249 -12343600 -9125921
38654 -9125921 -6147406 -5245053 -4543425 -2314669 704434 3032190 4205831 4403064 3811967
38645 3811967 2647285 985656 -1047630 -2387296 -1574135 782251 1693448 -446803
38637 -446803 -3347348 -3993917 -2728347 -1728455 -893857 1667337 5819531 9210760 10660133
38628 10660133 10807775 9512122 5726776 415348 -3288137 -3698159 -2172130 -663365
38620 -663365 62142 -401094 -1954116 -2525866 264363 4937118 6492080 2412888 -4022953
38611 -4022953 -7873038 -7840088 -6230974 -5857136 -8213248 -12412199 -14715239 -11715849 -5346488
38602 -5346488 -1799700 -3797334 -7169309 -7266110 -5138901 -4208413 -4325252 -3432958 -2506446
38593 -2506446 -4082359 -7508510 -10067926 -11315065 -11858433 -9610613 -2655751 5218300
38585 5218300 7755766 4833288 2025545 1566985 265975 -2718096 -3302000 -249378
38577 -249378 1456130 -1062373 -3174721 -604458 2938958 1927301 -1896168 -3370066
38569 -3370066 -3213745 -5879932 -10208529 -10172595 -4791401 -76169 -37034 -2001940 -2504019
38560 -2504019 -2243245 -3022618 -4456028 -5983863 -8168962 -10081244 -9351631 -6672826 -6071559
38551 -6071559 -8543563 -9798406 -7143381 -4183315 -4875713 -6944812 -6129698 -3969860
38543 -3969860 -5511831 -10484997 -12588245 -8257198 -1566263 1167469 -1498658 -5898525
38535 -5898525 -7764665 -5584065 -1191411 1740890 844005 -2634991 -5384744 -5767611
38527 -5767611 -4837632 -4038142 -3786734 -4453227 -6588574 -9259669 -9828409 -6750204 -1786520
38518 -1786520 1591532 1549337 -983496 -3970277 -6221854 -7710446 -8494332 -7976968 -5803493
38509 -5803493 -3232151 -2315682 -3161576 -3428547 -1754468 -240218 -1526351 -4501634 -5630740
38500 -5630740 -4151796 -2839711 -3191203 -3178387 -1215270 738272 336904 -1440996 -2575412
38491 -2575412 -3816366 -6670038 -9175103 -8088114 -4825067 -4381902 -7498864 -8912840
38483 -8912840 -5739263 -2735065 -5014495 -9285283 -8111215 -1132238 4233616 3435679
38475 3435679 87864 -1085891 -994134 -2556746 -4858917 -5362262 -4963750 -6129651 -7756333
38466 -7756333 -6568436 -2855396 -392264 -675369 -1280996 -417506 636002 527739 -80743
38457 -80743 -563862 -1498392 -2616180 -2465347 -1502331 -2792973 -7849077 -13891601 -16902917
38448 -16902917 -15730113 -12109473 -8586196 -7342633 -8840980 -10612631 -9724727 -7213854
38440 -7213854 -7073570 -9830855 -10940556 -7589166 -3154310 -1868675 -2724048 -2588641 -2197205
38431 -2197205 -4245210 -7676286 -8951798 -7893871 -7435851 -8126724 -7601677 -5489056 -4263307
38422 -4263307 -4632038 -4246216 -2000554 -4481 -172263 -1926384 -4096806 -6132820 -6865238
38413 -6865238 -5236751 -2896374 -2809867 -4607957 -4743861 -2094011 269991 34754 -1447759
38404 -1447759 -2725805 -4733263 -7485975 -8091559 -5055531 -1546878 -1214085 -3137184
38396 -3137184 -3907641 -2551905 -446233 1606598 3102161 2414716 -1105451 -4930004
38388 -4930004 -6305419 -6267254 -7706926 -10481572 -11699164 -10400046 -8883542 -9302442 -11349350
38379 -11349350 -13312755 -13398336 -10351631 -4924935 -435508 248106 -1928773 -3679745
38371 -3679745 -3606821 -2832752 -2126398 -1112727 -213912 -620782 -1904767 -2082320 -718268
38362 -718268 182377 -768818 -2193437 -1816140 787698 3974898 5494403 3878286 -343388
38353 -343388 -4440818 -5706529 -4291190 -2828019 -3090728 -4213987 -4465003 -3497806 -2244466
38344 -2244466 -1428874 -862986 -62390 536461 -749494 -4895047 -9622788 -10660925 -6912035
38335 -6912035 -2545603 -1714654 -2821283 -1266499 3006035 4847337 1464943 -3235930
38327 -3235930 -3927512 -655191 2241059 2196322 597281 -405436 -631046 -940109 -1275015
38318 -1275015 -729245 825460 2037978 1576810 206661 367693 3000763 5785936 5912390
38309 5912390 3917368 2929756 4297890 6018594 5829376 3853641 1464355 -553101
38301 -553101 -1583770 -670211 1973841 4098212 3797063 2164347 1949089 3687428 4641132
38292 4641132 2082139 -3169632 -7127653 -6461202 -1683896 3511664 5885281 5256682
38284 5256682 3560965 2171299 943027 -455716 -1294281 -338894 2411628 4725754
38276 4725754 3571841 -1438299 -6395957 -6682816 -2582766 761822 -83782 -2748323
38268 -2748323 -3234824 -1570828 -367857 121497 1571145 3262357 2457185 -860168 -3524250
38259 -3524250 -3972464 -3754844 -3541749 -1652711 1889775 3711120 1898920 -702992 -775577
38250 -775577 485238 -302965 -3303759 -5567163 -5497286 -4351218 -3649999 -3380803 -2802469
38241 -2802469 -1482125 542868 2777500 4594657 5756270 5911533 3863470 -908923
38233 -908923 -5915883 -7227766 -4199395 -410280 988646 469951 -275047 -1056877 -1950154
38224 -1950154 -2186404 -2172145 -3733615 -6208840 -5519699 -99068 5336560 5705554 2726572
38215 2726572 1882756 4122490 5342833 3237520 -82146 -2363440 -3916504 -5439576
38207 -5439576 -6595175 -7414942 -8273123 -8176171 -5850933 -2546958 -787697 -412865 776719
38198 776719 2305098 824761 -4354947 -9189697 -10097817 -8259546 -6716536 -5632952
38190 -5632952 -2863717 2090977 6753039 7969027 4797434 -337070 -3297240 -2081551
38182 -2081551 1035689 2317357 973790 -835692 -1620509 -1827425 -1928902 -1931862 -2734857
38173 -2734857 -5158982 -7406115 -6455357 -2643563 46434 -706898 -2628538 -2476240 -239553
38164 -239553 1742934 2000380 905466 -248513 -282109 786112 1707542 2202273 4087018
38155 4087018 7884466 9707256 5406088 -2597884 -7053100 -4923430 -223888 3055619
38147 3055619 5777650 9290108 11212822 9251688 5779860 4916793 7309081 10645900
38139 10645900 13063940 13522357 11315242 7860959 6574728 8399573 9861348 7961444
38131 7961444 4325771 2027358 1304182 1224518 2347954 4413255 4602654 1840575 -320098
38122 -320098 875014 2411596 721973 -1430515 809324 5700425 7075767 4005592
$$ [...]
##END NTUPLES=NMR SPECTRUM
##END=
