##TITLE=31Pdec_SR20_rm3
 CDcl3, 24 sc
 21.10.2020
##JCAMPDX= 6.0         $$ Bruker NMR JCAMP-DX V2.0
##DATA TYPE= NMR SPECTRUM
##DATA CLASS= NTUPLES
##ORIGIN= UXNMR, Bruker Analytische Messtechnik GmbH
##OWNER= root
$$ XWIN-NMR		Version 3.5
$$ Wed Oct 21 12:15:40 2020 Russian Standard Time (UT+4h)  she@DPX200
##.OBSERVE FREQUENCY= 81.013821
##.OBSERVE NUCLEUS= ^31P
##.ACQUISITION MODE= SIMULTANEOUS
##.ACQUISITION SCHEME= undefined
##.AVERAGES= 24
##.DIGITISER RES= 17
##SPECTROMETER/DATA SYSTEM= spect
##.PULSE SEQUENCE= zgpg30
##.SOLVENT NAME= CDCl3
##.SHIFT REFERENCE= (INTERNAL, CDCl3, 0, 182.463)
##AUDIT TRAIL= $$ (NUMBER, WHEN, WHO, WHERE, WHAT)
$$ ##TITLE= Audit trail, XWIN-NMR		Version 3.5
$$ ##JCAMPDX= 5.01
$$ ##ORIGIN= Bruker BioSpin GmbH
$$ ##OWNER= she
$$ F:/spectra/data/she/nmr/P31/1/pdata/1/auditp.txt
$$ ##AUDIT TRAIL=  $$ (NUMBER, WHEN, WHO, WHERE, WHAT)
(   1,<2020-10-21 12:14:38.28 +0400>,<she>,<DPX200>,
      <created by zg, POWCHK disabled, PULCHK disabled
       configuration hash MD5:
       00 E9 B6 7A A2 85 ED C7 34 08 36 98 17 FE 4E 26
       data hash MD5: 32K
       77 40 FF 9C 90 D1 C6 2A 6E 3D 4B 94 67 41 3C 4F>)
(   2,<2020-10-21 12:14:40.81 +0400>,<she>,<DPX200>,
      <Start of raw data processing
       efp BC_mod = 2 LB = 1 FT_mod = 6 PKNL = 1 PHC0 = -2386.653 PHC1 = 61.00058 SI = 64K 
       data hash MD5: 64K
       F7 D6 DE 1F DD BE 14 6E 23 B4 8C 13 05 25 E4 AF>)
(   3,<2020-10-21 12:15:01.79 +0400>,<she>,<DPX200>,
      <pk PHC0 = -5.254019 PHC1 = 3.799997 
       data hash MD5: 64K
       62 3C D6 E1 12 5B FC D9 83 0C 74 C1 EA BA AD 61>)
(   4,<2020-10-21 12:15:05.96 +0400>,<she>,<DPX200>,
      <abs ABSG = 5 
       data hash MD5: 64K
       39 13 D4 4A 5B 24 28 A5 A8 58 AE 17 D9 A6 A3 2D>)
(   5,<2020-10-21 12:15:17.89 +0400>,<she>,<DPX200>,
      <abs ABSG = 5 
       data hash MD5: 64K
       28 C7 72 76 40 D7 D9 73 97 01 F2 D3 A8 48 88 39>)
$$ ##END=
$$ 
$$ hash MD5
$$ 02 E8 E1 CF E3 9E 75 71 40 6E 75 41 13 E6 B3 2E
##$RELAX= 
##$RELAX= 
##$RELAX= 
##$RELAX= 
##$RELAX= 
##$RELAX= 
##$RELAX= 
##$RELAX= 
$$ Bruker specific parameters
$$ --------------------------
##$DU= <F:/spectra>
##$EXPNO= 1
##$NAME= <P31>
##$PROCNO= 1
##$TYPE= <nmr>
##$USER= <she>
##$AMP= (0..31)
100 100 100 100 100 100 100 100 100 100 100 100 100 100 100 100 100 100 
100 100 100 100 100 100 100 100 100 100 100 100 100 100 
##$AQSEQ= 0
##$AQ_mod= 1
##$AUNM= <au_zg>
##$AUTOPOS= <>
##$BF1= 81.014009
##$BF2= 200.13
##$BF3= 200.13
##$BF4= 200.13
##$BF5= 200.13
##$BF6= 200.13
##$BF7= 200.13
##$BF8= 200.13
##$BYTORDA= 1
##$CFDGTYP= 0
##$CFRGTYP= 5
##$CHEMSTR= <none>
##$CNST= (0..31)
1 1 145 1 1 1 1 1 1 1 1 1 1 1 1 1 1 1 1 1 1 1 1 1 1 1 1 1 1 1 1 1 
##$CPDPRG= <waltz16>
##$CPDPRG1= <>
##$CPDPRG2= <waltz16>
##$CPDPRG3= <>
##$CPDPRG4= <mlev>
##$CPDPRG5= <mlev>
##$CPDPRG6= <mlev>
##$CPDPRG7= <mlev>
##$CPDPRG8= <mlev>
##$CPDPRGB= <>
##$CPDPRGT= <>
##$D= (0..31)
0 1 0 0 0 0 0 0 0 0 0 0.03 2e-05 3e-06 0 0 0 0 0 0 0 0 0 0 0 0 0 0 0 0 
0 0 
$$ [...]
##$SUBNAM3= <"">
##$SUBNAM4= <"">
##$SUBNAM5= <"">
##$SUBNAM6= <"">
##$SUBNAM7= <"">
##$SUBNAM8= <"">
##$SUBNAM9= <"">
##$SW= 369.568048894756
##$SWIBOX= (0..15)
0 1 3 0 0 0 0 0 0 0 0 0 0 0 0 0 
##$SW_h= 29940.119760479
##$TD= 32768
##$TD0= 1
##$TE= 0
##$TE2= 300
##$TE3= 300
##$TEG= 300
##$TL= (0..7)
0 120 53 12 22 120 120 120 
##$TP= (0..7)
150 150 150 150 150 150 150 150 
##$TP07= 0
##$TPNAME0= <>
##$TPNAME1= <>
##$TPNAME2= <>
##$TPNAME3= <>
##$TPNAME4= <>
##$TPNAME5= <>
##$TPNAME6= <>
##$TPNAME7= <>
##$TPOAL= (0..7)
0.5 0.5 0.5 0.5 0.5 0.5 0.5 0.5 
##$TPOFFS= (0..7)
0 0 0 0 0 0 0 0 
##$TUNHIN= 0
##$TUNHOUT= 0
##$TUNXOUT= 0
##$USERA1= <user>
##$USERA2= <user>
##$USERA3= <user>
##$USERA4= <user>
##$USERA5= <user>
##$V9= 5
##$VALIST= <valist>
##$VCLIST= <CCCCCCCCCCCCCCC>
##$VD= 0
##$VDLIST= <DDDDDDDDDDDDDDD>
##$VPLIST= <PPPPPPPPPPPPPPP>
##$VTLIST= <TTTTTTTTTTTTTTT>
##$WBST= 1024
##$WBSW= 4
##$XGAIN= (0..3)
0 0 0 0 
##$XL= 0
##$YL= 0
##$YMAX_a= 67264
##$YMIN_a= -48571
##$ZGOPTNS= <>
##$ZL1= 120
##$ZL2= 120
##$ZL3= 120
##$ZL4= 120
##$ABSF1= 182.463
##$ABSF2= -187.1042
##$ABSG= 5
##$ABSL= 3
##$ALPHA= 0
##$AQORDER= 0
##$ASSFAC= 0
##$ASSFACI= 0
##$ASSFACX= 0
##$ASSWID= 0
##$AUNMP= <proc_1d>
##$AZFE= 0.1
##$AZFW= 0.5
##$BCFW= 0
##$BC_mod= 2
##$BYTORDP= 0
##$COROFFS= 0
##$CY= -3
##$DATMOD= 1
##$DC= 0
##$DFILT= <>
##$DTYPP= 0
##$F1P= 0
##$F2P= 0
##$FCOR= 1
##$FTSIZE= 65536
##$FT_mod= 6
##$GAMMA= 0
##$GB= 0
##$INTBC= 1
##$INTSCL= 5.30512e-09
##$ISEN= 30
##$LB= 1
##$LEV0= 0
##$LPBIN= 0
##$MAXI= 10000
##$MC2= 0
##$MEAN= 0
##$ME_mod= 0
##$MI= 50
##$NCOEF= 0
##$NC_proc= -7
##$NLEV= 6
##$NOISF1= 182.463
##$NOISF2= 159.3651
##$NSP= 0
##$NTH_PI= 0
##$NZP= 0
##$OFFSET= 182.463
##$PC= 4
##$PHC0= -2391.907
##$PHC1= 64.80058
##$PH_mod= 1
##$PKNL= yes
##$PPARMOD= 0
##$PSCAL= 0
##$PSIGN= 0
##$REVERSE= no
##$SF= 81.014009
##$SI= 65536
##$SIGF1= 159.3651
##$SIGF2= -187.1042
##$SINO= 113.3802
##$SIOLD= 16384
##$SREGLST= <1H.CDCl3>
##$SSB= 0
##$STSI= 65536
##$STSR= 0
##$SW_p= 29940.119760479
##$SYMM= 0
##$S_DEV= 0
##$TDeff= 32768
##$TDoff= 0
##$TI= <>
##$TILT= no
##$TM1= 0
##$TM2= 0
##$TOPLEV= 0
##$USERP1= <user>
##$USERP2= <user>
##$USERP3= <user>
##$USERP4= <user>
##$USERP5= <user>
##$WDW= 1
##$XDIM= 65536
##$YMAX_p= 481217054
##$YMIN_p= -39319504
$$ End of Bruker specific parameters
$$ ---------------------------------
##NTUPLES= NMR SPECTRUM
##VAR_NAME=  FREQUENCY,     SPECTRUM/REAL,   SPECTRUM/IMAG
##SYMBOL=    X,             R,               I
##VAR_TYPE=  INDEPENDENT,   DEPENDENT,       DEPENDENT
##VAR_FORM=  AFFN,          ASDF,            ASDF
##VAR_DIM=   65536,         65536,           65536
##UNITS=     HZ,            ARBITRARY UNITS, ARBITRARY UNITS
##FACTOR=    0.456856943014862, 1,           1
##FIRST=     14782.0589164895, 0,            0
##LAST=      -15158.0608439895, 0,           0
##MIN=       -15158.0608439895, -39319504,   0
##MAX=       14782.0589164895, 481217054,    0
$$ Real data points
##PAGE= N=1
##DATA TABLE= (X++(R..R)), XYDATA
$$ [...]
41425E5446107r648127q385775o393163n223677l903140k651989k811401l624549
41417A2804286k711976o4717J352317k23117k776308l170197r66520J367142J380922
41408F991832p61362k435936j503650Q64723J408082p19529k483118j334016J082710
41399A109736J943999J864234K895248L468568K73713m897691n745990o49616
41391B62201L969377K646130j346961j642960J458512K461576j66059k277726
41383E364090j088139J548272L450494M763634N203692L249333k80887j941512
41375B0268977o89776P30792J125129L127033P785996J1571853J2057995J1830204
41367F7808203J2410681R200803j258749j2794865j6126686j1932167r120633
$$ y = [55446107, 45797980, 37412205, 31019042, 25795365, 21892225, 19240236, 16428835, 12804286, 10092310, 10027593, 11379910, 11156793, 8380485, 5210288, 4243768, 5610910, 6991832, 6230470, 3794534, 2290884, 3155607, 4563689, 3844160, 1361042, 27026, 1109736, 3053735, 4917969, 7813217, 11281785, 11555498, 6657807, 911817, 262201, 4231578, 6877708, 5530747, 3887787, 5346299, 7807875, 7641816, 5364090, 4275951, 5824223, 9274717, 14038351, 19242043, 22491376, 22210489, 20268977, 19579201, 20309993, 21435122, 24562155, 32348151, 43920004, 55977999, 67808203, 80218884, 89419687, 88160938, 75366073, 59239387, 47307220, 38186587]
41360C8186587j0557684r647884l002270K733349J526154k194791j123901K926202
41352A8845762K540760k737626n578261k286818K245211K669289L93131k78869
41344A5812579R68476J147725o48647k149378j792629r51815j435396k434202
41336H516713j675667O73814J385764j221960l851849k207111K393574M125352
41328H138630Q88189k657324k087289P28487J560202L68754k714Q27437J016287
41319H780659M51462M37709P36222O71995J599863M189179N161131J796498j895633
41310B1929085L83832P271170J0933605Q625558N904804O565832O667497K107803
41302G0389186m293460p901237r133913j0186513r516781n313004r13088p59165
$$ y = [38186587, 27628903, 17981019, 14978749, 17712098, 19238252, 17043461, 15919560, 18845762, 21386522, 18648896, 13070635, 10783817, 13029028, 15698317, 16091448, 15812579, 16781055, 17928780, 17280133, 15130755, 13338126, 12386311, 10950915, 8516713, 6841046, 7514860, 8900624, 7678664, 3826815, 1619704, 4013278, 8138630, 9026819, 6369495, 4282206, 5010693, 6570895, 6939649, 6936935, 7764372, 8780659, 9232121, 9669830, 10406052, 11078047, 12677910, 16867089, 22028220, 23824718, 21929085, 22312917, 29584087, 40517692, 49143250, 55048054, 61613886, 68281383, 70389186, 66095726, 58194489, 49060576, 38874063, 29357282, 24044278, 23131190, 22372025]
41294B2372025l326138l771114j775104j028547k174477k187770n42878l10706
41286G255291k283763k950838P1178M343452N980199M002406K39249k789972l232675
41277A0634527j293888L68782m36352k336941k339964k27642J613139K046752
41269H028413J798715Q49059j194758k417683l00910L570235M554933J537673
41261A6425677j501639j642365o83330r24370j318379m38107J13078j549551l796988
41252D684026l568399p67898J992244K912862K186127O89831p12799j404431j732656
41243D278907k454303k839376j179673J964064L391713J585112r05260j144038
41235B697146L45049J387533J602986J727386J484431O84955P42322K442736L722257
$$ y = [22372025, 19045887, 15274773, 13499669, 12471122, 10296645, 8108875, 7565997, 7255291, 4971528, 2020690, 2091868, 6435320, 12415519, 16417925, 16657174, 13867202, 10634527, 9340639, 9709421, 9273069, 6936128, 4596164, 4368522, 5981661, 8028413, 9827128, 10676187, 9481429, 7063746, 6762836, 10333071, 14888004, 16425677, 14924038, 13281673, 12598343, 11673973, 10355594, 9917487, 10030565, 8481014, 4684026, 1115627, 347729, 2339973, 5252835, 7438962, 8128793, 7415994, 6011563, 4278907, 1824604, -1014772, -2194445, -230381, 3161332, 4746444, 3841184, 2697146, 3042195, 4429728, 6032714, 7760100, 9244531, 9929486, 10671808, 13114544, 16836801]
41226A6836801K458317J90613J17502K362901M306030N052614O398881R144115
41218D6867774J1115405R575104L997481l661940j0070654j2267486r994282o152483
41210B9408919l741821k978129k547401k244808k430918k312897j278961p59050
41202A1114934j957145k855905q66201K273992K242967j098191k891160m28847
41194E534444K777498K235705j329190l710158l003676q66200P46480J493687
41186C878590J770080J930576K324185K781546K310115M16306j629401k067469
41178A1714528j041255m68513j281084j971863q17406J112597P94078k337662
41170E703420m465309j877700L403083N377125J890475k481242k958091p36046
$$ y = [16836801, 19295118, 19485731, 19603233, 21966134, 26272164, 31324778, 37723659, 46867774, 57983179, 67558283, 71555764, 67893824, 57823170, 45555684, 35561402, 29408919, 25667098, 22688969, 20141568, 17896760, 15465842, 13152945, 11873984, 11114934, 9157789, 6301884, 5435683, 7709675, 9952642, 8854451, 5963291, 5534444, 8311942, 10547647, 9218457, 5508299, 2504623, 1638423, 2384903, 3878590, 5648670, 7579246, 9903431, 12684977, 14995092, 15411398, 13781997, 11714528, 10673273, 10204760, 8923676, 6951813, 6134407, 7247004, 8041082, 5703420, 1238111, -639589, 2763494, 8140619, 10031094, 7549852, 4591761, 3855715]
41162C855715J87939n12754l25881O91740L17465o21389J265302N479069O808837
41153A7146043K926603j735604k473966o98667l16727j100101j76585J877451
41145A5448447J412120k034567m194793j923459K493470M475089K607731o03326
41137A7680712k187465j330136Q98362K840165K929166L42052l738017n903599
41129A1531240l357482K311159N758437L672805j322776m158781l294344r59483
41121A0180775J114758K823014L136691M15885m020414o164827m423102j472042
41113A590738R9600Q56655J825670K036815Q17669k34853K81537J456494K115563
41104A0845888K503607K487897J057695q89358p78767R30594N25363k213637k181511
$$ y = [3855715, 4043654, 3530900, 3205019, 3896759, 4214224, 3592835, 4858137, 10337206, 17146043, 20072646, 18337042, 15863076, 15164409, 14847682, 13747581, 13570996, 15448447, 16860567, 14826000, 10631207, 8707748, 11201218, 15676307, 18284038, 17680712, 15493247, 14163111, 15061473, 17901638, 20830804, 21172856, 17434839, 11531240, 8173758, 10484917, 16243354, 19916159, 18593383, 14434602, 11140258, 10180775, 11295533, 14118547, 17255238, 17671123, 13650709, 7485882, 3062780, 1590738, 1690338, 2546993, 4372663, 6409478, 7227147, 6992294, 7273831, 8730325, 10845888, 13349495, 15837392, 16895087, 16005729, 15226962, 16157556, 16682919, 14469282, 12287771]
41095A2287771K551878N907824K745115k414715k374116J241830J564472j424863
41087B0085196j636539J449761J633088k549843m665559j373310K064293J223808
41079A6230895k94327J775855M471958L069982p22485k245336j602496j829203
41071A8854843k528290j456917j01448j509702l989455k966540J347860L719866
41063A1370217J688983j248516j157741J634483M352475M891046K250958k912892
41055B0869013p062753o040840j41236N178252N116184O34890l256257l057919
41047A2239334K97133L144465K856837J90766j880894j586101N7650J196465J301211
41038A7816866O36172p97766k441185k800397j501891l04165m12639m99892N73005
$$ y = [12287771, 14839649, 20747473, 23492588, 21077873, 18703757, 19945587, 21510059, 20085196, 18448657, 19898418, 21531506, 18981663, 14316104, 12942794, 15007087, 16230895, 15936568, 17712423, 22184381, 25254363, 24531878, 22286542, 20684046, 18854843, 16326553, 14869636, 14768188, 13258486, 9269031, 6302491, 7650351, 11370217, 13059200, 11810684, 10652943, 12287426, 16639901, 21530947, 23781905, 20869013, 13806260, 7765420, 7624184, 12802436, 17918620, 18553510, 15297253, 12239334, 12536467, 15680932, 18537769, 18728535, 16847641, 15261540, 15319190, 16515655, 17816866, 18453038, 17655272, 15214087, 12413690, 10911799, 10607634, 10194995, 9695103, 10268108]
41029A0268108J088307o18975k436702j371499J066434P37419k157863k688021
41021C887208J251138N359411M961926J108246j858782k064827o93949J043282
41013A2993653K521439K559523N99215j450933j077354J136539J883763l25010
41005A8840835k837656k100504J847657N261841M765672P26842l434650m675126
40997A8394911k850148l45167L43133j067303k360329j270478J436706K348115
40989A4629440o3911k583020j178557L004899M810778K380638m74715m76510N88955
40980B0637997R5641n22264J005590K729473J476418j118597q81205J635789J734000
40971B6792842j575979l882879k536566j87167O16325J307766L140614L716881
$$ y = [10268108, 11356415, 10737440, 8300738, 6929239, 7995673, 8733092, 6575229, 3887208, 5138346, 10497757, 15459683, 16567929, 14709147, 12644320, 11950371, 12993653, 15515092, 18074615, 18673830, 17222897, 16145543, 17282082, 19165845, 18840835, 16003179, 13902675, 15750332, 21012173, 25777845, 26504687, 23070037, 18394911, 15544763, 15199596, 15542729, 14475426, 12115097, 10844619, 12281325, 14629440, 14565529, 11982509, 10803952, 13808851, 18619629, 21000267, 20525552, 20049042, 20637997, 20733638, 20211374, 21216964, 23946437, 25422855, 24304258, 23423053, 25058842, 26792842, 25216863, 21333984, 18797418, 18610251, 19226576, 20534342, 23674956, 27391837]
40963B7391837J218505j467596p65406J988077K746320P33317j367228j918897
40955B8558929j626775j042315J61766J587807K153388J674369P22322o39455
40947C1550036k392509l457027k675848n03519J462861K059522R53275j276181
40939B5720610k649484j226271J726395K150317j419440n068792m429376l73597
40931A4430362K892001L493230K494075O06083j842045k719488j10229L662929
40923B2906918M101286R67106j299354l45814J015657L5535j678617j672932j084552
40914B2945233k111049l347210j640181K309177M114563J891758j034721j024557
40906B2103013Q10749P20449j873737l493561j727931J279229J981070M03885
$$ y = [27391837, 28610342, 27142746, 26377340, 28365417, 31111737, 31845054, 30477826, 28558929, 26932154, 25889839, 26051605, 27639412, 29792800, 31467169, 32189491, 31550036, 29157527, 25700500, 23024652, 22521133, 23983994, 26043516, 26996791, 25720610, 23071126, 21844855, 23571250, 25721567, 24302127, 19233335, 14803959, 14430362, 17322363, 20815593, 23309668, 23915751, 22073706, 19354218, 19243989, 22906918, 27008204, 27975310, 26675956, 26330142, 27345799, 27381334, 25702717, 24029785, 22945233, 20834184, 17486974, 15846793, 18155970, 22270533, 24162291, 23127570, 22103013, 22913762, 23634211, 21760474, 18266913, 16538982, 17818211, 19799281, 20203166]
40898B0203166l74624Q54183J753332L46376j857710k275799j010539r5592p6948
40889A7465845L17904J462787K068238J474731Q31391J200126J855694J518531
40881B8195247M65276J96844J048853J209702j009325m272556n022396j904577
40873A8907068K022327L122221K016739K049877L663708L851847J631606J40445
40865C7405838J642402M160203N523924P103599R956795J0501320M915904l878114
40857G7331871q751390p531221n039014n598323p701980p345847l453515J435530
40849C3346111L836058K055540j997079l923377j672717J569644J735673l12686
40841C4637167q04798M67892L62962j442294j764267N4813P49625q59689j666190
$$ y = [20203166, 19828542, 20682725, 22436057, 22782433, 20924723, 18648924, 17638385, 17542793, 17465845, 17783749, 19246536, 21314774, 22789505, 23620896, 24821022, 26676716, 28195247, 28660523, 28857367, 29906220, 31115922, 30106597, 25834041, 20811645, 18907068, 20929395, 24051616, 26068355, 28118232, 31781940, 35633787, 37265393, 37405838, 39048240, 43208443, 48732367, 55835966, 65792761, 76294081, 81209985, 77331871, 68580481, 61049260, 56010246, 50411923, 42709943, 35364096, 31910581, 33346111, 37182169, 39237709, 37240630, 33317253, 31644536, 33214180, 34949853, 34637167, 33832369, 34300261, 34663223, 33220929, 31456662, 31511475, 32261100, 31401411, 29735221]
40832B9735221j22997P93579p95533j945432k41923J559449L76964j568554o64065
40823B7126709J645685J420104r22873j564465M5950N80539j209719k478253j013829
40814B3629848J555765K445602J166858o23993j074543N23788L117758M551738
40806C5292821L692616J462609p63949k529867l344148k273149J99317J797154
40798C3533404J361992J54223r26901k608093m146394k638646J847593M255586
40790C0832764J458646k352355j850024J193978J571394k38824M40866L302318
40782C4358763K997619j348147l922585j373056K316311K750679J279476J058120
40774C8117180J773501J758895J475679J632146J165436p0225R1699K184987L272865
$$ y = [29735221, 29612224, 30405803, 29610270, 27664838, 27422915, 28982364, 29359328, 27790774, 27126709, 28772394, 30192498, 29269625, 27705160, 27751110, 28331649, 27121930, 24643677, 23629848, 25185613, 27631215, 28798073, 28174080, 27099537, 27623325, 30741083, 35292821, 38985437, 40448046, 39684097, 37154230, 33810082, 31536933, 31736250, 33533404, 34895396, 35049619, 34122718, 31514625, 27368231, 24729585, 26577178, 30832764, 32291410, 29939055, 28089031, 29283009, 30854403, 30615579, 31056445, 34358763, 37356382, 36008235, 32085650, 30712594, 33028905, 35779584, 37059060, 38117180, 39890681, 41649576, 43125255, 44757401, 45922837, 45852612, 45944311, 48129298, 51402163]
40765E1402163J863237R62134K928211M961180L681844R15727M24895J636942
40757F8776333J533437O49617J902550M672213N352539L433839K079481K582902
40749I0982911L096860L309391N271246Q238804P858050L156240k22771K203334
40741A23894065N952804K526500q936786j9605421k1183296j4649109p412337
40734F0586420m585392n351209o300575n503218l267640j059344m64400j898764
40726C2155878l655935l420135j354143j66404j064344j522287Q58306L898856
40718B5729792L400793n25397l379677k929740k036614l174183l882786q68662
40710A2333526L961957N589175K987523K40072L36338J363707K51983k324711
$$ y = [51402163, 53265400, 54227534, 57155745, 62116925, 65798769, 66714496, 67139391, 68776333, 70309770, 70959387, 72861937, 77534150, 82886689, 86320528, 88400009, 90982911, 94079771, 97389162, 102660408, 110899212, 118757262, 121913502, 121690731, 123894065, 129846869, 132373369, 123436583, 103831162, 82647866, 67998757, 60586420, 56001028, 50649819, 44349244, 38846026, 35578386, 34519042, 34054642, 32155878, 28499943, 25079808, 23725665, 23559261, 22494917, 20972630, 21830936, 25729792, 29130585, 28605188, 25225511, 22295771, 20259157, 17084974, 13202188, 12333526, 16295483, 21884658, 24872181, 25112253, 25448591, 26812298, 27064281, 24739570]
40702B4739570l075273r89967J207143Q45224j024366j059615J680588M113722
40694B6437026L015790p56293l521496l495081k167566j185420l53733O35339
40686A8608566R03831J37049k81950O19861J696624J490308L38015o43471j246958
40677B1621875j569557j239688m81340k01469J59704K446477N736528N504363
40669C1976893j09899n864567n403489N1492L650307K633149Q90816J536767K403578
40660C1765047R58769r85446p17985N86856K31882r74174K26423M419140Q675128
40651D4185640J0425385R346678N628414m99852o823608r663645q072761n478967
40643C9047284n162345n809180m192173r93214j86148k444280l399222m17673
$$ y = [24739570, 21664297, 20674330, 21881473, 22726697, 21702331, 20642716, 22323304, 26437026, 29452816, 28696523, 25175027, 21679946, 19512380, 18326960, 17973227, 18608566, 19512397, 19649446, 19367496, 19987357, 21683981, 23174289, 23512304, 22868833, 21621875, 20052318, 18812630, 18331290, 18129821, 18289525, 20736002, 26472530, 31976893, 31866994, 26002427, 20598938, 20650430, 24300737, 26933886, 27824702, 29361469, 31765047, 32723816, 31738370, 31020385, 31607241, 31839123, 30864949, 31091372, 35510512, 44185640, 54611025, 63957703, 69586117, 69086265, 62262657, 52599012, 44526251, 39047284, 33884939, 28075759, 23883586, 22890372, 22704224, 20259944, 16860722, 16443049]
40635A6443049K809435J927748j065463j315931O03239L2895k864590k633732
40627A3936650J678043L493283r95384n962891m573514P60313K919363Q69210
40619A2125073r18079r98016j611186k336976m44983K735992K802370L5207n81481
40610A0807921J940154K661698o61850l561653k270128O37866J382569P40746
40602A1677323J011023J412937J96328j916483l387402l981556l127590K38155
40594B122735M247739M760566J621620m04079P19725J203683r54888j525504K200339
40585A3991936N331704L025115j203558j605829K49155k61221j318276J659881
40577A9868907N890706M496786j487378m171769j779520p30863l540840m470625
$$ y = [16443049, 19252484, 21180232, 20114769, 18798838, 19402077, 19434972, 16570382, 13936650, 15614693, 19107976, 18112592, 12149701, 7576187, 8336500, 11255863, 12125073, 11206994, 10208978, 8597792, 6260816, 5815833, 8551825, 11354195, 11389402, 10807921, 12748075, 15409773, 14747923, 11186270, 8916142, 9554008, 10936577, 11677323, 12688346, 14101283, 14297611, 12381128, 8993726, 5012170, 1884580, 2122735, 6370474, 11131040, 12752660, 12348581, 13068306, 14271989, 13317101, 11791597, 13991936, 19323640, 22348755, 21145197, 19539368, 19788523, 19527302, 18209026, 19868907, 25759613, 30256399, 28769021, 24597252, 22817732, 22086869, 18546029, 14075404]
40569A4075404k72409L686155K361774j478881l374364l980582m784529l344604
40561B887964J431710M659793K346489j510363j041482K003655J727932j623081
40553A0882617k150761J816133N127611L752115j72834k558048k419184j214938
40545A3062711k32716k3006m15486l28610J049914K920464L882507L499161J669411
40536B5084350j811995n167504m416044J627030P997325R049951N957198M413465
40528D2733776N601246M569467j529668q387864j0098898o502415k381804j343933
40520B2659907k729607l480802j519275K100979L819010J264697l552726o106698
40512A2455485m438666p87573J790174K411119J787804Q63123O38236J481696
$$ y = [14075404, 13802995, 17489150, 19850924, 18372043, 14997679, 11017097, 6232568, 2887964, 4319674, 8979467, 11325956, 9815593, 8774111, 10777766, 12505698, 10882617, 8731856, 10547989, 15675600, 19427715, 19254881, 16696833, 14277649, 13062711, 12829995, 12806989, 12391503, 12062893, 13112807, 16033271, 19915778, 23414939, 25084350, 23272355, 18104851, 13688807, 15315837, 23313162, 32363113, 38320311, 42733776, 48335022, 52904489, 51374821, 42986957, 32888059, 26385644, 24003840, 22659907, 19930300, 16449498, 14930223, 17031202, 20850212, 22114909, 18562183, 12455485, 8016819, 7229246, 9019420, 11430539, 13218343, 14081466, 14719702, 16201398]
40504A6201398K063337P32546j748000k821788j746330l84191j12426m20118r65762
40495A0798666k161881k973292j284011K263003L943649K177511J1088L56348
40487A3131081J837487J874046Q98017M95035R2665j111938j436186L38269J635079
40478A7753555j07390k408441j314231J725041K030385k89652o47903J683281
40470A8424645K118738r58659k918008o14488K431989K276716Q31114J450931
40462B3042978K617789J189075j360486j403515M34593P20008n13863k42580J712334
40453B6196333K463442J338874N84428Q98954R74423J556260M993488R938769
40445D8944971J1192378O261869j699792q352276j1676871j0683263n550287k17662
$$ y = [16201398, 18264735, 18997281, 17249281, 14427493, 12681163, 12296972, 12184546, 11764428, 10798666, 8636785, 5663493, 4379482, 6642485, 10586134, 12763645, 12774733, 13131081, 14968568, 16842614, 17740631, 18235666, 18328331, 17216393, 15780207, 16118476, 17753555, 17646165, 15237724, 13923493, 15648534, 17678919, 17389267, 16741364, 18424645, 20543383, 19584724, 16666716, 16052228, 18484217, 20760933, 21592047, 23042978, 25660767, 26849842, 25489356, 24085841, 24520434, 25240442, 24726579, 24483999, 26196333, 28659775, 29998649, 30583077, 31482031, 32456454, 34012714, 39006202, 48944971, 60137349, 66399218, 64699426, 56347150, 44670279, 33987016, 28436729, 28219067]
40437B8219067K93868l055384l990882n26712J904957k74003k767793j107146
40429A8695972J674258R75314r88734J67537K130691k05179m620069m043216J760830
40420A5547404N479918L714464J137834J651070K856728J938016N04751M76129
40412C3306314O85445N25573J775088L988511L405593m08307k232247Q07375M144724
40403D5998069K968080m26462j291616J16362J022349J832347L448089K661476
40395E6328694l089170r188463r114636m394015k211069m236273n205529k514153
40387A6375386K05662K63785j35773Q39033J375354M14842Q5015J244237J402240
40378B2069781m22303j435063k83134J42636j847655l109169j082432J495572
$$ y = [28219067, 28512935, 25457551, 21466669, 20939957, 22844914, 22570911, 19803118, 18695972, 20370230, 21345544, 20356810, 20524347, 22655038, 22449859, 17829790, 13786574, 15547404, 21027322, 24741786, 25879620, 27530690, 30387418, 32325434, 32830185, 33306314, 33991759, 34517332, 36292420, 40280931, 43686524, 43278217, 41045970, 41853345, 45998069, 48966149, 48539687, 47248071, 47364433, 48386782, 50219129, 53667218, 56328694, 53239524, 44051061, 34936425, 30542410, 28331341, 24095068, 18889539, 16375386, 16581048, 16844833, 16709060, 17548093, 18923447, 19338289, 19423304, 20667541, 22069781, 21647478, 20212415, 19929281, 20071917, 18224262, 15115093, 14032661, 15528233]
40370A5528233J474638Q65392K650032M486910K303859k175282l535967j109827
40362B0487988O61185k0902k28616J228976J211368j651183l443315r75022K641096
40353A9911575K473039q71198k669510j267175O18954J283226K186193L848072
40345B5513176L728068M37716l051752l337931j502232p86705j050487L07667
40337B0257520K585419J914336j818967l232387N48577M539748K901482j967404
40329B5728324k910958J012711L233279k15900n036394n262382j074773K800652
40321A8274559L328854J028769k029784l552597k125507R36283K395235J194614
40313A9450426k49812k02345l65875k437981m587797m105526j447103J127454
$$ y = [15528233, 17002871, 17868263, 20518295, 25005205, 27309064, 25133782, 21597815, 20487988, 21149173, 21128271, 20899655, 22128631, 23339999, 21688816, 18245501, 17270479, 19911575, 22384614, 21513416, 18843906, 17576731, 18195685, 19478911, 21665104, 25513176, 29241244, 29678960, 26627208, 23289277, 21787045, 21000340, 19949853, 20257520, 22842939, 24757275, 22938308, 19705921, 20254498, 24794246, 27695728, 25728324, 22817366, 23830077, 27063356, 26847456, 21811062, 16548680, 15473907, 18274559, 21603413, 22632182, 20602398, 17049801, 14924294, 15860577, 18255812, 19450426, 19200614, 18998269, 18632394, 16194413, 11606616, 7501090, 6053987, 7181441]
40305G181441K980184M279391L751413O43616k547425k795795r11349J35600N0741
40296A2767817O29782J317662k72225l480406m603913k466094K8182R65705K091976
40287F978486M668231O319877M612565J112013q69571p68641m50117o38884j22446
40278B0841513J966645M931174P429855Q393426P198189L877798p26880n229645
40270D8682075q016540p859666n209067k463199j558396j565950l27311J864766
40262B3546712K492802Q28005r33178j327595j705204l116722l589454r10434
40254A5284932L334529N033583K496278j664853l563102j808858J680030L896729
40246B4689268L737880K772611K703277K903734K064371J509957L864805P883256
$$ y = [7181441, 10161625, 14441016, 18192429, 18836045, 16288620, 13492825, 12581476, 12717076, 12767817, 13397599, 14715261, 14443036, 10962630, 6358717, 3892623, 3920805, 4886510, 6978486, 11646717, 17966594, 22579159, 23691172, 22821601, 22052960, 21602843, 20963959, 20841513, 22808158, 27739332, 35169187, 43562613, 50760802, 54638600, 53911720, 48682075, 40665535, 32805869, 27596802, 25133603, 23575207, 22009257, 21681946, 23546712, 26039514, 26867519, 25934341, 24606746, 22901542, 19784820, 16195366, 15284932, 18619461, 23653044, 26149322, 24484469, 20921367, 19112509, 20792539, 24689268, 28427148, 31199759, 33903036, 36806770, 38871141, 40381098, 44245903, 52129159]
40238E2129159Q048823J500491p163849j0806571p956442l401136j667362k793985
40230B7889128m277565m456666l297490j604865l42461m6070n99726j707461l006564
40221H550260l493890k071132O42174K400198K143278J215714P77634l6365j828969
40212H298902k932838j877639N2477J195797K405952M500086M953223J381782
40204A7977742l067293k916969J216324K793266r43894m751348l370352Q84898
40196G822374K185817m68059l014924k490006K59280K903651L643519J754553
40188A2596205j343336k528070p62972R12631l11346k460970j924656L42719K39311
40179D759516k237103k234626K122592N814642L744115j869177m549613k160641
$$ y = [52129159, 60177982, 61678473, 54514624, 43708053, 35751611, 32350475, 30683113, 27889128, 23611563, 19154897, 15857407, 14252542, 13910081, 13864011, 13264285, 11556824, 8550260, 5056370, 2985238, 3627412, 6027610, 8170888, 9386602, 10164236, 10127871, 8298902, 5366064, 3488425, 3540902, 4736699, 7142651, 11642737, 16595960, 17977742, 14910449, 11993480, 13209804, 16003070, 15059176, 10307828, 6937476, 7822374, 10008191, 9540132, 6525208, 4035202, 4294482, 7198133, 10841652, 12596205, 11252869, 8724799, 7961827, 8874458, 8563112, 6102142, 4177486, 4520205, 4759516, 2522413, 287787, 2410379, 8225021, 11969136, 10099959, 5550346, 3389705]
40171C389705J247097J654597j71659r20330M71229J774884P00513j871714k621957
40162C652365l2036L081561K871782j68626j727197p3422J266636q10321l723501
40153D337241l056265M99714K379942J313535M88242J440541J776130L53714j22242
40144I410552J722452K533059l72123l821758l412579n20382K89712j108889r42082
40135C777962J211735J709546j67154m36751K618444N088821L695727O96455o41325
40126A7553460j120808k365024k499721J81436K444223M18135l508314l800482
40118G302905m73820J298546j46966r97919N22120J004420j493008l330306j285917
40109B400055J946498K288631O06355J64436P36226Q36j282242m83698J631053
$$ y = [3389705, 4636802, 6291399, 6119740, 5199410, 5670639, 7445523, 8146036, 6274322, 3652365, 3620329, 6701890, 9573672, 9405046, 7677849, 7604427, 8871063, 8060742, 4337241, 1280976, 1780690, 4160632, 5474167, 5962409, 7402950, 9179080, 9532794, 9410552, 11133004, 13666063, 13293940, 9472182, 6059603, 5539221, 5828933, 4720044, 3777962, 4989697, 6699243, 6532089, 6095338, 8713782, 13802603, 17498330, 18194785, 17553460, 16432652, 14067628, 11567907, 11749343, 14193566, 14611701, 11103387, 7302905, 6829085, 8127631, 7980665, 6982746, 7504866, 8509286, 7016278, 3685972, 2400055, 4346553, 6635184, 7241539, 7405975, 8142201, 8143037, 6860795, 6377097, 8008150]
40100H008150J755129j27583m79475J752582L262973J749369p45971j509800q45166
40091A2820208k77473m2092k34425j608712l184258k001773K159930M698257K115841
40082A4445503k446878l570728j449681o25256j960244j577367J625505L224076
40074G664930M94225k562479j244909K434151K925249m90056l250423k493553
40066C477135l1060J606683K054189J494732j66768j538808m76011K183627K730590
40057A1334309j02605k998973l006528j524200j014387q10337O23074J859766
40049D360119Q64256o49203M37900K921743K518024j208187l810192k746285o89661
40040A998514k85034O2622K213964L767599J599571k277777k840371O74332L709698
$$ y = [8008150, 9763279, 9635696, 9156221, 10908803, 14171776, 15921145, 15175174, 13665374, 12820208, 12542735, 12500643, 12266218, 10657506, 7473248, 5471475, 7631405, 12329662, 14445503, 11998625, 8427897, 6978216, 6352960, 4392716, 2815349, 4440854, 7664930, 8159155, 5596676, 4351767, 6785918, 9711167, 9221111, 5970688, 3477135, 3446075, 5052758, 7106947, 8601679, 8434911, 6896103, 6420092, 8603719, 11334309, 11231704, 8232731, 5226203, 3702003, 2687616, 1877279, 2500353, 4360119, 5224375, 4575172, 5013072, 7934815, 10452839, 9244652, 5434460, 2688175, 1998514, 1713480, 1776102, 3990066, 7757665, 9357236, 7079459, 4239088, 4913420, 8623118]
40031H623118K980443N89732K96620K358315L924844K993872K35415k337442l172652
40022A6492265k071884l17627K66281q90542k347124k205464l14733J563443J825014
40013A1999629Q51085M54232J525960K640696J602386j540485l897601k991261
40005A0644641o2167J245918l87903k132201q86288K320137L688182J959484j6747
39996A6373056J86292P92678j195136m603751m965115j105149K486197J806293
39988I775365q49925n18029K558130L067103r74410m499341k600155K003451K758340
39979A0720529j225760m231960k610678L65418L72416j252711m61366K268202
39971C944090K468974q69559l208475j347085J711198J719231j50749K37612K630656
$$ y = [8623118, 11603561, 12193293, 12489913, 14848228, 18773072, 21766944, 22002359, 19664917, 16492265, 14420381, 14102754, 14369035, 13478493, 11131369, 8925905, 8611172, 10174615, 11999629, 12850714, 13304946, 14830906, 17471602, 19073988, 17533503, 13635902, 10644641, 10582474, 11828392, 11440489, 9308288, 8422000, 10742137, 14430319, 16389803, 16373056, 16559348, 17352026, 16156890, 11553139, 6588024, 5482875, 7969072, 9775365, 8925440, 8407411, 10965541, 14032644, 13058234, 8558893, 5958738, 7962189, 10720529, 9494769, 5262809, 2652131, 3017549, 3389965, 2137254, 1675888, 3944090, 6413064, 5543505, 2335030, 987945, 2699143, 4418374, 4267625, 4505237, 7135893]
39962G135893K493736j354614m147367k191957J585516K336248N18088K80305
39954F655848K287788K887890N03431j675432j043128Q3888j615902m620256m331650
39945h67523l2760L604465K991702O31131J205729M378549M993896O88332m255696
39936A3337825m752386j813080j72801q52421p50473P49529L51868k402727k685443
39927A009891J688489N002424J811012l590113k959829K842137M851411J61480
39919A0816902l488271j00030N262367M636510r82861m148888j959948J610944
39911A1646725K846871K211893J287001K25432j016847j850842k013198j558628
39903A1778407k20952J629623K389159J375677K42692K30980k49373k657680m684722
$$ y = [7135893, 9629629, 8275015, 4127648, 1935691, 3521207, 5857455, 6375543, 6655848, 8943636, 11831526, 12334957, 10659525, 9616397, 9700285, 8084383, 3464127, -867523, -900283, 2704182, 5695884, 6327015, 7532744, 11911293, 16905189, 17593521, 13337825, 8585439, 6772359, 6599558, 5747137, 4996664, 5746193, 6098061, 3695334, 1009891, 2698380, 7700804, 9511816, 5921703, 2961874, 5804011, 10655422, 10816902, 7328631, 7228601, 12490968, 17127478, 16144617, 11995729, 10035781, 11646725, 14493596, 16705489, 17992490, 18217922, 17201075, 15350233, 13337035, 11778407, 11557455, 13187078, 15576237, 16951914, 17194606, 17425586, 17176213, 14518533, 9833811]
39894I833811k997249J371681L889757K479266m83684j972033j290005O40533
39886A1472077K354611K242476Q2261k154378k869175l028807l617705k907228
39878A574132M28352L467933K646025k94534q73021P46005O25870j233264o38000
39869F449498K681870L667202O66035j278737R15858L011865J110980j444284
39861A5780287m06778J456543n01294l849786k819296J533692K803146k8892j164346
39852A2803276J935630M302099J646682l134151m872655l102325p69620O65647
39844I474583J524678J670776R92559N81224J060873J060791o61356k842205l356444
39835I505479k164843q52950j79141J30340j29749j433407k915737k632537N7959
$$ y = [9833811, 6836562, 8208243, 12098000, 14577266, 14093582, 12121549, 10831544, 11472077, 13826688, 16069164, 16151425, 13997047, 11127872, 8099065, 4481360, 1574132, 2002484, 5470417, 8116442, 7821908, 6948887, 7694892, 8320762, 7087498, 6449498, 9131368, 12798570, 13464605, 12185868, 13101726, 16113591, 17224571, 15780287, 15373509, 16830052, 16328758, 12478972, 9659676, 11193368, 13996514, 13967622, 12803276, 14738906, 19041005, 20687687, 17553536, 12680881, 9578556, 8808936, 9474583, 10999261, 12670037, 13662596, 14243820, 15304693, 16365484, 15704128, 12861923, 9505479, 7340636, 6487686, 6308545, 6438885, 6309136, 4875729, 1959992, -672545, -614586]
39826f14586L270215M394063K940034J060367P95065J185974m41684l844657m719630
39817D025161m65735M658286M061859j696281m690217o82248M294317K455079
39809A1960221m092191o182451j071262L560315J033474m639328m935756Q87552
39801c479426N406597L957860K48419l64274J482148J429409j502395l921419
39793C256919l276204p67017J160941J721995J470920Q74199J60065l38822l20001
39784C942995L47800J438484J928525O62791j606158k209785k98132R86820j180864
39775D012476m168941l004967J760584M130122J664337o49972J714807N581849
39767A1040295M933155j45376m220469m412247k717337j213326L80195K063578
$$ y = [-614586, 2655629, 7049692, 9989726, 11050093, 11845158, 13031132, 12589448, 8744791, 4025161, 3559426, 8217712, 12279571, 10583290, 5893073, 5210825, 9505142, 11960221, 7868030, 1685579, 614317, 4174632, 5208106, 568778, -4366978, -3479426, 1927171, 5885031, 6133450, 5769176, 7251324, 8680733, 7178338, 3256919, -19285, -786302, 374639, 2096634, 3567554, 4441753, 4601818, 4262996, 3942995, 4290795, 5729279, 7657804, 8320595, 6714437, 4504652, 4206520, 5193340, 4012476, -156465, -3161432, -1400848, 2729274, 4393611, 3743639, 5458446, 11040295, 15973450, 15828074, 11607605, 7195358, 4478021, 3264695, 3644890, 5708468]
39759E708468K499641J524243O76008M80979j39107j245023j334299l5441J101072
39750I236541J072322M56145k16620o81124L37489L446953N538244K448891m185881
39741A7452960p016266k347266M289151N255675N93825l241933k472483N44669
39733A3058332K277629K215848J442706L94096n08667k45135J215470K067588
39725B1917867P42769j972088l908927m038834l077703j890819l69792J677296
39717I079769L199382K557945j47816k322444j516211J455196L212938J787761
39709A7306520j175990k584029j385746O11391Q72534j228509l540252l078726
39701E797193N02836L839229L402624k56834l330771l480472j733419K53690K131437
$$ y = [5708468, 8208109, 9732352, 10408360, 10889339, 10750232, 9505209, 8170910, 8135469, 9236541, 10308863, 10765008, 10548388, 9867264, 10204753, 13651706, 19189950, 21638841, 17452960, 10436694, 8089428, 12378579, 17634254, 18228079, 14986146, 12513663, 13058332, 15335961, 17551809, 18994515, 19388611, 18879944, 18634809, 19850279, 21917867, 22660636, 20688548, 16779621, 12740787, 9663084, 7772265, 7402473, 9079769, 12279151, 14837096, 14689280, 12366836, 10850625, 12305821, 15518759, 17306520, 16130530, 13546501, 12160755, 12772146, 13644680, 12416171, 8875919, 5797193, 6300029, 10139258, 13541882, 13285048, 9954277, 6473805, 4740386, 4994076, 7125513]
39692G125513L274193K122697j032584k899326j214294J711739K050562j80624
39684A0957876j694047j179670p39568j763767k490065j127187Q76630P97634
39676C637836j275089k451635r89944J564613K767022K450530K262838K639123
39668A0605294J972490o55858l386371l644836j609524K67n02753j936444k199340
39659a357075o60115J772599L647566L603693J381521j195067j628035Q8435J104159
39650F757681m41997k565246j980960J253150L358677J285986l464890o077145
39642a874744l531868J772750M381018K193047r42358n85350K014564K110990
39634E538049r22432k530063l36772K039217J046307r75640Q0256L036841L237317
$$ y = [7125513, 10399706, 12522403, 11489819, 8590493, 7376199, 9087938, 11138500, 10957876, 9263829, 8084159, 7344591, 5580824, 3090759, 1963572, 2840202, 3637836, 2362747, -88888, -1078832, 485781, 3252803, 5703333, 7966171, 10605294, 12577784, 11921926, 8535555, 4890719, 3281195, 3281462, 2778709, 842265, -1357075, -2017190, -244591, 3402975, 7006668, 8388189, 7193122, 5565087, 5653522, 6757681, 6315684, 3750438, 1769478, 3022628, 6381305, 7667291, 4202401, -1874744, -5406612, -3633862, 747156, 2940203, 1997845, 1412495, 3427059, 5538049, 4615617, 2085554, 1748782, 3787999, 4834306, 3858666, 3938922, 6975763, 10213080]
39625A0213080J2258k470077j802457l95534q49486j955075j366397K54645L46671
39616A987628j295225j743399J071972M935717N370194J253804l134643l188497
39608E257551Q7025J797529K57666j276240n48642K79552p82472j679984l17255
39599C074730J149329J49486j206579K83742K662834J720203j392696j571637
39591D869412J589876K796041m26705l996125l856545j211008J047982K562253
39583C375181L518312K438408r57989l674351l049194k29176K012678K665461
39575F099330K051221N08262r09650q80956k19833j115747l058926k976065n40597
39566a042961P95369k40071l71281K114118L702678J642943r40150k89499J665333
$$ y = [10213080, 10225338, 7755261, 5952804, 5557270, 4707784, 2752709, 1386312, 1640957, 1987628, 692403, -1050996, 20976, 4956693, 10326887, 11580691, 8446048, 5257551, 5344576, 7142105, 7399771, 6123531, 5574889, 5854441, 5071969, 3391985, 3074730, 4224059, 4373545, 3166966, 3450708, 6113542, 7833745, 6441049, 4869412, 6459288, 9255329, 8828624, 4832499, 975954, -235054, 812928, 3375181, 6893493, 9331901, 8373912, 4699561, 1650367, 1421191, 3433869, 6099330, 8150551, 8658813, 7749163, 6868207, 6648374, 5532627, 2473701, -502364, -1042961, -247592, -487663, -858944, 1255174, 4957852, 6600795, 5660645, 5371146, 7036479]
39557G036479J231267k95472O18716K951536K970776R71162K70070P96503l62079
39548A6188958k760139k955646r86724n93217k464109k998103q70846O97607j22945
39539C134836q03860M06411J237159o151r55149M90162J987943N01068k476626
39530C515793l035185n12101K045531K088455q3601k389760k742167o17309K009974
39521B79630K388652L86184j338726j151038m16730p93359j733211j921117j220794
39512e520509K7115J733852K999740K367223K34461j102279q22142n97103j213485
39503a893127j070858M40282J167888n9752q72845Q43073L206367L259999J331694
39494F352721m48812j759345l034435k898035k26470K800334L259274J780233
$$ y = [7036479, 8267746, 7972274, 8590990, 11542526, 14513302, 15484464, 15754534, 16551037, 16188958, 13428819, 10473173, 9486449, 8893232, 6429123, 3431020, 2560174, 3257781, 3134836, 2330976, 2737387, 3974546, 3968395, 3013246, 3503408, 5491351, 5992419, 3515793, 480608, -31493, 2014038, 4102493, 4018892, 1629132, -1113035, -1730344, 279630, 2668282, 3054466, 1715740, 564702, 147972, -645387, -2378598, -4299715, -5520509, -5493394, -3759542, -759802, 1607421, 1841882, 739603, -82539, -679642, -1893127, -2963985, -2523703, -1355815, -1415567, -2288412, -1445339, 1761028, 5021027, 6352721, 5903909, 4144564, 1110129, -1787906, -2014376, 785958, 4045232, 5825465]
39486E825465Q40099K17489j909526m400141m020463o24583K511892L483470L052683
39477D976385J319385k501415o385192o098319j126101L740430M579545K802817
39469A307535J574838J069742j46608j584152j540982J22090K082964L246999
39461F132426K851387M82539k461074l066652m84628K337479K358427M25304m42525
39452H132683N44442J482409Q84966q48839k608336l408646k435591R6950K388039
39443D228077K763484J677047P56613L21246o70509k433791l665571l248641j493008
39434a765053O09978K460899L763613L964084K435809n37878l152686l226339
39426D552427o48188J895895J786758l35642j672592j205426n67996r35490j355484
$$ y = [5825465, 6665564, 6883053, 4973527, 573386, -3447077, -4071660, -1559768, 1923702, 4976385, 6295770, 3794355, -2590837, -8689156, -9815257, -6074827, -1495282, 1307535, 2882373, 3952115, 3805507, 2221355, 680373, 802463, 2885427, 6132426, 8983813, 9466352, 7005278, 3938626, 3453998, 5791477, 8149904, 8575208, 8132683, 8677125, 10159534, 11044500, 10195661, 7587325, 4178679, 1743088, 1840038, 4228077, 6991561, 8668608, 9425221, 9746467, 9075958, 6642167, 2976596, -272045, -1765053, -1155075, 1305824, 5069437, 9033521, 11469330, 10931452, 7778766, 4552427, 3904239, 5800134, 7586892, 7251250, 5578658, 4373232, 3805236, 2869746, 1514262]
39417A514262q45639M0235O57901J165445J055052p72090l223770l037995N57906
39408b888693L870860L710443J693351Q61875P77354m16055j517192l87151J148678
39399F853470l75893l583552l505292L91358K882589J057064j522015j119385
39391A078344M72323L826j313107k85978K307057K774743N22800j093442o9779
39382D396787J412215M47947k452293l991825k011196K031312M465453L230597
39374G528997M9722j747054j160612n8082l9615o52374j031747j265338j327941
39365B95956n95511N91206P59228k38623n63322O11261J548331Q74353j30745
39356C152134j6722J78119j025663k675824k934043j918162p06725Q49310K883021
$$ y = [1514262, 668623, 708858, 1366759, 2532204, 3587256, 2815166, -408604, -3446599, -2888693, 982167, 4692610, 6385961, 7247836, 8025190, 7609135, 6091943, 5704792, 6853470, 6477577, 2894025, -611267, -219909, 2662680, 3719744, 2197729, 1078344, 1550667, 1554493, 241386, -44592, 2262465, 5037208, 5560008, 4466566, 4396787, 5809002, 6256949, 3804656, -187169, -2198365, -167053, 4298400, 7528997, 7578719, 5831665, 4671053, 4612971, 4573356, 3920982, 2889235, 1623897, 295956, -299555, 291651, 1050879, 812256, 248934, 860195, 2408526, 3282879, 3152134, 3135412, 3313531, 2287868, -387956, -3321999, -5240161, -5946886, -5097576, -2214555]
39347b214555L798381K530278Q84081P34943O86217j120007k762794j380336J184629
39338B340837O42259k384993k830491L94972K197892m89980l577796k115458K465330
39329c357428N178934M403924K086842n63118l475563n199950l888216m53598
39321e268173K189009K762502K154037R67423q24337k145207j442001O99386J745495
39312H38134M30295j887261l235455k820377q01580J963603L699724K917966L73484
39303A478533j490362j462998o60535l00998J60008J734287L758284M263299K277594
39294I757112r96376l323671l382671j623728M15100J370122P25129j214930l378677
39285a652590m076922k047305K031357N485715N756334K656757j500949l821229
$$ y = [-2214555, 1583826, 4114104, 4998185, 5733128, 6419345, 5299338, 2536544, 1156208, 2340837, 2983096, 598103, -2232388, -1837416, 360476, -129504, -3707300, -5822758, -3357428, 1821506, 6225430, 8312272, 7749154, 4273591, -926359, -4814575, -5268173, -3079164, -316662, 1837375, 2804798, 1980461, -164746, -1606747, -907361, 838134, 1268429, -618832, -3854287, -6674664, -7476244, -5512641, -1812917, 1105049, 1478533, -11829, -1474827, -2135362, -2436360, -2276352, -542065, 3216219, 7479518, 9757112, 8760736, 5437065, 2054394, 430666, 845766, 2215888, 2941017, 1726087, -1652590, -5729512, -7776817, -5745460, -259745, 5496589, 8153346, 6652397, 2831168]
39277B831168k980223q1216K359251K578371Q91687j108393k146538j715073R2513
39268G21547K113365K354703K86971j776759j489448K9065j3467j340022j033429
39259a47474J151142J969546L92611k68511J630453K373775r08888m273699k534279
39250f15324J980539K600306j076208k724663J85062K594248Q49873j271772K84101
39241B806162K311103k47326n118586n559154p57562L102292K246269j78865m00970
39232a796637N12854K12407k17468J139775K553849R35434k767774m378780k375455
39223f181795M46338J419297R86016N20122R0684k97363K67518J677076K012122
39214I40015M93230p38031Q3722J129955k20966k774781k957447k57503K080172
$$ y = [2831168, -149055, -230271, 2128980, 4707351, 5599038, 4490645, 2344107, 629034, 721547, 2834912, 5189615, 5476586, 3699827, 2210379, 2239444, 2225977, 885955, -147474, 1003668, 2973214, 3365825, 3097314, 4727767, 7101542, 6192654, 1918955, -615324, 1365215, 3965521, 2889313, 164650, 349712, 2943960, 3793833, 2522061, 2806162, 5117265, 4869939, -248647, -5807801, -6565363, -3463071, -1216802, -1395667, -1796637, -1283783, -1071376, -1288844, -149069, 2404780, 3340214, 572440, -3806340, -6181795, -5735457, -4316160, -3330144, -2810022, -2719338, -3016701, -2749183, -1072107, 940015, 1433245, 695214, 778936, 1908891, 1687925, -1086856, -4044303, -4301806, -2221634]
39205b221634J904836N81052k9256j11821m01149n78209l01025J29580Q70119
39196a57507K250175K998496J379335j341039j716218N67350J713617k11776k121223
39187C361210j211194L38717n38421k279376j533426R65089J979114J410040J524234
39178D015987J779633l95490l984295m725643j734664R00911L72107j193872r69389
39169e934715M11288J024952R98136J378964J774458J168713k07610j215371j125800
39160a726985o9156R16161N34696q21086p56793J550211K966120O55716k713925
39151E34959k247174J461410K909376K39465k165497j004747J277692J495931
39143B501415O20977O48687O67629n58299j480124o54473J08075j246875l310824
$$ y = [-2221634, -316798, 264254, 234998, 123177, -277972, -856181, -1157206, -1027626, -157507, 2092668, 5091164, 6470499, 5129460, 3413242, 3980592, 5694209, 5482433, 3361210, 2150016, 2488733, 1950312, -329064, -1862490, -897401, 1081713, 2491753, 4015987, 5795620, 5400130, 1415835, -3309808, -5044472, -4143561, -3771454, -4965326, -5934715, -5523427, -4498475, -3500339, -2121375, -346917, 821796, 614186, -601185, -1726985, -1796141, -879980, -345284, -1166370, -1923163, -372952, 2593168, 3248884, 534959, -1712215, -250805, 2658571, 2898036, 732539, -272208, 1005484, 2501415, 3122392, 3771079, 4438708, 3880409, 2400285, 1745812, 1853887, 607012, -2703812]
39134b703812l478547j655216Q12406L353384M941420L661235J82270j534562
39126C578578Q5357J354104n34633k425649o86156J951736O01997l438628m612625
39117d125919j729790J279919K299865K816973L052696J129417k267662l600654
39109a145155j962027m06733p44851j119241M2634J392684J288952M1026j329401
39100c942112j948184o37200K503510M483308K785435l24552q47281M30003n39092
39091A963835l408955l327013O76026L385235J603419j098714p61761J017457
39083D9529J043302o6932k86618k56384j106843j365201L07940K083557J988649
39074B390999J178183J084386M43149j450414j923877N64921K331452l40999m563323
$$ y = [-2703812, -6182359, -7837575, -7025169, -3671785, 1269635, 4930870, 5113140, 3578578, 3663935, 5018039, 4483406, 2057757, 1371601, 3323337, 3925334, 486706, -4125919, -5855709, -4575790, -2275925, 541048, 3593744, 4723161, 2455499, -1145155, -3107182, -3513915, -4258766, -5378007, -5335373, -3942689, -2653737, -2612711, -3942112, -5890296, -6527496, -4023986, 459322, 3244757, 2920205, 2072924, 2502927, 1963835, -1445120, -4772133, -4096107, -710872, 892547, -206167, -967928, 49529, 1092831, 1025899, 739281, 482897, -623946, -1989147, -1681207, 402350, 2390999, 3569182, 4653568, 5096717, 3646303, 1722426, 2287347, 4618799, 4277800, -285523]
39065b85523m669539q09428J762234R17379l04147L34445J442521J698563J840981
39056A927486K063621J262023k78056q13135k58195l2869L21849K446671M729937
39047A1369332L160163k026529n094182k571580J687649K207163o59730k499452
39039E572834j583336J5740O77202R30230J276374J272418Q45248L63123m53183
39030H916650j817916k539639j458997K19466L47369p10985p10873L29462j98564
39021B375973k711915l669527q17877K613505K265374o59101j122876J934431
39013B07987L997518K101221p45675o59242J120643Q55772j410499k312680q50973
39004B304072M92257K89759j9351M62187M17744o66426r85924L55301J404027
$$ y = [-285523, -4955062, -5764490, -4002256, -3084877, -3389024, -3054579, -1612058, 86505, 1927486, 3991107, 5253130, 4975074, 4161939, 3903744, 3870875, 4192724, 6639395, 11369332, 14529495, 12502966, 7408784, 4837204, 6524853, 8732016, 8072286, 5572834, 3989498, 4005238, 4682440, 5612670, 6889044, 8161462, 9006710, 9369833, 8916650, 7098734, 4559095, 3100098, 3319564, 3666933, 2955948, 2245075, 2574537, 2375973, -335942, -4005469, -4823346, -2209841, 55533, -603568, -1726444, 207987, 4205505, 6306726, 5561051, 4901809, 6022452, 6878224, 5467725, 3155045, 2304072, 2796329, 3086088, 3066737, 3528924, 3946668, 3280242, 2294318, 2649619, 4053646]
38995D053646P12447J28720J678569L607978K504101j619548n078275n059951
38987I27687k285270P29031K232127J964615P65019j52089j10071P62922K031763
38978F865734K935440K217642l01673k101908n04867K690662K478343j983028
38970A2296345n079129k667687J365765P85112l527476n151791j842630K016631
38962a804860K722191J588912Q49541J20648j040645j138393L10958J094835j24282
38953B578905j406729q86402K32561L20573K81674J276951J930876P04756r81241
38944D051924j003357j42084k71553n15028J174027L584699L380191O12284p76427
38935A0094676J154357L408902K711378L08993k98050J270656J922288j73942
$$ y = [4053646, 4766093, 4894813, 6573382, 10181360, 12685461, 11065913, 5987638, 927687, -1357583, -628552, 1603575, 3568190, 4333209, 4181120, 4071049, 4833971, 6865734, 9801174, 12018816, 11717143, 9615235, 9110368, 11801030, 14279373, 12296345, 7217216, 4549529, 5915294, 6700406, 3172930, -1978861, -3821491, -1804860, 917331, 2506243, 3355784, 3476432, 2435787, 1297394, 1608352, 2703187, 2578905, 1172176, 285774, 518335, 838908, 1120582, 2397533, 4328409, 5033165, 4051924, 3048567, 2906483, 2634930, 2119902, 3293929, 6878628, 10258819, 10871103, 10094676, 11249033, 14657935, 17369313, 17678306, 17380256, 18650912, 20573200, 20399258]
38927B0399258k801298k567324N88187L132273K309383l47984j002384J391430
38919B1101541L646868K591909q22408k993484k105079O12889L346460N442130
38911C0820826O786423P285837P360134P661511Q117761Q449157R491262J2356761
38903I8329672J6245553J9103412K0993492K4777126L2466768M2662300N2367321
38896C06945644N8804559N7782068M3471743J4213040k1797045n0382642o2388679
38889C46648688n9484050m9551977l9225825l1366602k6282752k2698598j8778713
38882I9260171j4107123j0099165p756970o436984n654167o066759p193710o407837
38874C5537456k631974P73449q3632l883023n586121l297308k02021O50141N0109
$$ y = [20399258, 17597960, 15030636, 15618823, 18751096, 21060479, 20712495, 19710111, 21101541, 24748409, 27340318, 26517910, 23524426, 21419347, 22032236, 25378696, 30820826, 37607249, 44893086, 52253220, 59914731, 68032492, 76481649, 85972911, 98329672, 114575225, 133678637, 154672129, 179449255, 211916023, 254578323, 306945644, 365750203, 423532271, 467004014, 481217054, 459420009, 409037367, 346648688, 287164638, 237612661, 198386836, 167020234, 140737482, 118038884, 99260171, 85153048, 75053883, 67296913, 60859929, 55205762, 49139003, 41945293, 35537456, 32905482, 33678931, 33595299, 29712276, 24126155, 20828847, 20626826, 21276967, 21327076]
38865B1327076n7147M7598q93974k466567l091888k130383l13573R88996M77174
38856A3887312j695037l019398j150479K267922K878197l45626l223120k236701
38848G363070N62468R94336j257382l050454k521071m51259J878737L352889K560204
38839I431538m60140k822600j962496N47314J249497Q6348K4532J729977K436591
38830A0260561P44348j049940q06016K77202J47879p59441o85310N24378J514660
38821A0168321J505992Q23082o2946r49903j676811k026513j654049k82844J418007
38812G262336J714488j78819k379029k237386J51125J992143J403738o32896k072552
38803E023148j983962p34254N52498N84775p53440j808261j240811j21773j68516
$$ y = [21327076, 21269929, 21317527, 20423553, 17956986, 14865098, 12734715, 12421142, 13410138, 13887312, 12192275, 9172877, 8022398, 10290320, 13168517, 12822891, 9599771, 7363070, 7925538, 8919874, 7662492, 4612038, 2090967, 1639708, 3518445, 6871334, 9431538, 8971398, 6148798, 4186302, 4733616, 5983113, 6069461, 6093993, 7823970, 10260561, 11004909, 9954969, 9148953, 9426155, 9574034, 8814593, 8129283, 8653661, 10168321, 11674313, 12497395, 12434449, 11484546, 9807735, 7781222, 6127173, 5844329, 7262336, 8976824, 8798005, 6418976, 4181590, 4332715, 6324858, 7728596, 7095700, 5023148, 3039186, 2304932, 2857430, 3442205, 2688765, 880504, -360307, -482080, -650596]
38794f50596o68991L78397K527979L178821J637519n2417o83554j273349k216275
38785B177534k099218m87365Q41140O96722P2014j65663p16307j874775k507347
38776d063265j993876q81725Q65648L369175M376076J347702l157008l079881
38768c217154K187144N677358K860307j512554j242678J470683L85573l915190
38760B693489m903501o91008L371757L194688Q81814k47572k82389l53389m9920
38751C613969M54612p37724l791979n342448k669573K220262M843915L370053
38743A961087j8690j984571j233262N86146R36079k22381q7959K643184M815870
38734G395503K938677j160625k692773j246050j017883l236714l623144M16053
$$ y = [-650596, -1319587, -941190, 1586789, 4765610, 6403129, 6350712, 5667158, 4393809, 2177534, 78316, -409049, 432091, 1128813, 1200827, 1035164, 318857, -1555918, -4063265, -6057141, -6938866, -6073218, -2704043, 1672033, 3019735, -137273, -3217154, -1030010, 4647348, 7507655, 5995101, 4752423, 6223106, 6608679, 2693489, -2210012, -2901020, 470737, 3665425, 4547239, 4299667, 4017278, 3663889, 3613969, 4068581, 3330857, -461122, -5803570, -8473143, -6252881, -1408966, 1961087, 1942397, -42174, -1275436, -689290, 246789, 24408, -63551, 2579633, 7395503, 10334180, 9173555, 6480782, 5234732, 4216849, 980135, -2643009, -2226956]
38726b226956M816915M544338O52988k204252k532319k081915j310796N62308
38718B20311J967023J82402l653705m939272j985668J611549K363844J321683
38710b911833J070323J204042k03090k335230k206058P63605L499284L158201
38702B039244L28320k293848k826782j089834J902341M219148L953345J210798
38694G442732j521357k123327j275540r73500j448198j266234n0427Q85005P46778
38685D15932K64771N8580k80180q60900q89755j85017K42414K0772K91053J641968
38675G19638K644846J832363o6766j313884j549381j514436j307246n66998K09935
38666i11929K17198k9366Q18740K593130L011371K69178m046729n535888j505339
$$ y = [-2226956, 2589959, 7134297, 7787285, 5583033, 3050714, 968799, -341997, 220311, 2187334, 2369736, -1283969, -6223241, -8208909, -6597360, -4233516, -2911833, -1841510, -637468, -840558, -3175788, -5381846, -4618241, -1118957, 2039244, 2367564, 73716, -2753066, -3842900, -1940559, 2278589, 6231934, 7442732, 5921375, 3798048, 2522508, 1549008, 100810, -1165424, -1215851, -330846, 415932, 680703, 739283, 459103, -401797, -1291552, -1476569, -1234155, -1213383, -922330, 719638, 3364484, 5196847, 5130081, 3816197, 2266816, 752380, -554866, -1121864, -911929, -694731, -724097, 94643, 2687773, 5699144, 5968322, 1921593, -3614295, -5119634]
38657e119634N049965P676751L858665j648106l047196j044085m90866k107137
38649C128357j986738O24089J373082j358892k814890K65063L558143J841319
38641D629533k603178l773415q28941K341920L653231L365984P38872l877845
38633C646161n891775j882868L593452L398127j380952l312156m64348J643330
38625f51029J47437j447336j094620j500730l107542j795168K897737M873373
38617a677878J248334k044303K30337L917733K643292j642849k402212R15171
38609A187625L138056K016811J31330o50103j003101j054647j81910N07760o06867
38600C484954k502951k831132j488690J0597J321210K490539K132959m41207k913421
$$ y = [-5119634, -69669, 7607082, 11465747, 9817641, 6770445, 5726360, 5235494, 3128357, 1141619, 1765708, 3138790, 1779898, -1034992, -769929, 2788214, 4629533, 2026355, -1747060, -2576001, -234081, 3419150, 6785134, 7524006, 3646161, -2245614, -4128482, -535030, 2863097, 1482145, -1830011, -2294359, -651029, -503592, -1950928, -3045548, -4546278, -7653820, -9448988, -6551251, -1677878, -429544, -2473847, -2243510, 1674223, 4317515, 2674666, 272454, 1187625, 4325681, 6342492, 6473822, 5823719, 4820618, 3765971, 3584061, 4091821, 3484954, 982003, -1849129, -3337819, -3327222, -2006012, 484527, 2617486, 2176279, -737142]
38591g37142k831217j049508M89245K001418L704239L305052k70999l291402j996618
38582f76932J295528J823876O0975J74002K198971J806091k233058n843407n526236
38573f920190k002991K273662N131123M399663K2770l720685k598184J223739
38565b191093J999520p60782j894518O06157K537581R00887j398188r43007R63642
38556a79801J523075R16037N42638J24837o57385n96260M63525L01992k006281
38547D32377l817577k732670j66037J243598J379482J447540J322538N77233K30188
38538h3328J056780J722824P35448j103911j988834j545141n23358N42286J120989
38529f6245O19714m32701p07034k47585l45849p80622J54776K150092K604409
$$ y = [-737142, -3568359, -4617867, -4128622, -2127204, 1577035, 4882087, 4611088, 1319686, -676932, 618596, 2442472, 2503447, 2677449, 4876420, 6682511, 4449453, -1393954, -6920190, -8923181, -6649519, -1518396, 2881267, 2904037, -816648, -3414832, -2191093, -191573, -952355, -2846873, -2240716, 296865, 1197752, -200436, -1143443, -179801, 1343274, 2259311, 2801949, 2926786, 2269401, 1673141, 2136666, 2438658, 432377, -3385200, -6117870, -6283907, -5040309, -3660827, -2213287, -890749, -313516, -83328, 973452, 2696276, 3431724, 2327813, 338979, -1206162, -1729520, -1187234, -66245, 553469, 120768, -586266, -833851, -1179700, -1960322, -1805546, 344546, 2948955]
38520B948955J082229M95151J942774K152344j039062m155336k967846O86614
38512A145823J519910j147698k598725j1655L547184L677800M05295k356390j799037
38503B382507P95489K028069O69088r04134k02487J498557Q53423k282835m130367
38494G07310k331700P87323J853889Q38132k28808q05074j642314k402050j858726
38485e082018M7308J913333K214146L40381k586705l661371r03368L432742M677617
38476C92065J752052j387876j503060j39331j31254j266052j957519k330550k707668
38467i279193j584019J718845M568547M381567K504660J617855J295050l92043
38459D831269k597707k715810n35319J822471L002903K707818N75314k288585
$$ y = [2948955, 4031184, 4526335, 6469109, 8621453, 7582391, 3427055, 459209, 1145823, 2665733, 1518035, -1080690, -1092345, 2454839, 6132639, 6537934, 4181544, 2382507, 3177996, 5206065, 5875153, 4971019, 4768532, 6267089, 7120512, 4837677, 707310, -1624390, -837067, 1016822, 1854954, 1626146, 821072, -821242, -3223292, -5082018, -5034710, -3121377, -907231, -566850, -3153555, -6814926, -7718294, -4285552, 392065, 2144117, 756241, -746819, -886150, -1017404, -2283456, -4240975, -6571525, -9279193, -10863212, -9144367, -4575820, -194253, 2310407, 3928262, 5223312, 4831269, 2233562, -482248, -1017567, 804904, 3807807, 6515625, 7090939, 4802354]
38451D802354k725173J66087K405424O87143j942096p39532K678259K787587o79315
38442G440738k473247o23290R39722m27805k242980k090260j394560j713017j751427
38433d336126m60227P24977Q68971J267296K387187K545901J252526L15556J90476
38424D756537q62433k482609j537155K134186L886965J039226k774370l218076
38416I42271j215395J67818Q42823J719559J296262j244076k655990j37415L408384
38407C124241L487420J015774K3092M57099q71840l398617l085438L97966K649313
38398C799010J546999o2698l8846k36719k079575l349107k047326J51825R88190
38389a328247J064940J538689J208550j005016k874190j501774K066433L863851
$$ y = [4802354, 2077181, 2243268, 4648692, 5335835, 3393739, 2654207, 5332466, 8120053, 7440738, 4967491, 4344201, 5283923, 4856118, 2613138, 522878, -871682, -2584699, -4336126, -4796353, -4071376, -3202405, -1935109, 452078, 2997979, 4250505, 4566061, 4756537, 3894104, 1411495, -125660, 2008526, 5895491, 6934717, 4160347, 942271, -273124, -105306, 737517, 2457076, 3753338, 2509262, -146728, -284143, 3124241, 6611661, 7627435, 7650527, 8107626, 7235786, 3837169, 751731, 1149697, 3799010, 5346009, 5283311, 5244465, 5007746, 2928171, -420936, -2468262, -2316437, -1328247, -263307, 1275382, 2483932, 1478916, -1395274, -2897048, -830615, 3033236]
38381C033236K113714j054925k660761j670169R45525L128006K828392j84548
38373F478470l477140m132489j918918O10411J156402k7748r39117l10989Q92276
38364a668842N05270j949099l757614j788904L001233N803326L905060M40421
38356D490851J4558K205048K657213P387k256857j687832o14126j583643k525358
38347G07241l81778K622647J393035l636363n788389j543118L962142M095442
38339A430859j09347k319894l20724J993021J620258L97002O79718J377178O83852
38330E431923m09053j98567L52443o70152k437834k360782r8206K059838K570389
38321D239999K026882J199624R963j103278q45676R95362K678094K485817O96306
$$ y = [3033236, 5146950, 4092025, 1431264, -238905, 706620, 3834626, 6663018, 6478470, 3001330, -1131159, -3050077, -2439666, -1283264, -1311012, -2250129, -2561118, -1668842, -1163572, -3112671, -6870285, -8659189, -5657956, 145370, 4050430, 4490851, 4505409, 6710457, 9367670, 9375057, 7118200, 5430368, 4816242, 3232599, 707241, 325463, 2948110, 4341145, 704782, -5083607, -6626725, -2664583, 1430859, 1321512, -998382, -1319106, 673915, 2294173, 2691175, 3370893, 4748071, 5431923, 5022870, 4824303, 5176746, 4506594, 2068760, -292022, -390228, 1669610, 4239999, 6266881, 7466505, 7476468, 6373190, 5527514, 6522876, 9200970, 11686787, 12383093]
38312A2383093j075067j791330j695616j571465j748655j755672j001166J55221
38304A899343N73555p2978o71159k93698M69412P65437J038678J946156K629342
38295H284088J835800J49132p89930q13558r36091r55213K36083K023558K406665
38286A1440534J257338M86322M12999q80497l397555l858124p11247K547363K134918
38277I432051l58224o91102J365598K219829N78737r14453n42280k9567q98765
38268A0161824j668644o43051J001329J058374m58030j804050k001971j262896
38260D382885l7658R14978N77946q28406j440592k01025J371820J340864J86203
38251F267015k46740L01018N93262L56502N48134J295421J482135N58934p99522
$$ y = [12383093, 11308026, 9516696, 7821080, 6249615, 4500960, 2745288, 1744122, 1899343, 2472898, 2399920, 1728761, 1435063, 1904475, 2669912, 3708590, 5654746, 8284088, 10119888, 10269020, 9479090, 8665532, 7729441, 6774228, 7010311, 9033869, 11440534, 12697872, 13184194, 13597193, 12716696, 9319141, 5461017, 4749770, 7297133, 9432051, 9073827, 8382725, 9748323, 11968152, 12546889, 11632436, 11090156, 11060589, 10161824, 8493180, 7850129, 8851458, 9909832, 9451802, 7647752, 5645781, 4382885, 4345227, 5260205, 5838151, 5009745, 3569153, 3368128, 4739948, 6080812, 6267015, 6020275, 6321293, 6914555, 7271057, 7819191, 9114612, 10596747, 11155681, 10356159]
38242A0356159j938791k673522k540763j185424N17702J377603J841678L068197
38234H822839M058000K337434j694624l863728j517729K397130K969752k76620
38226A3232454l159162k435312P93437L359666L645579K319968R07393M07542
38218A9071565O55872O69913m3467p74242p75940n95089j181310k060692j734091
38209A3232519J22772K113217K893524K315488P10210j542710l295119k961528
38201A3588373n59308J628504J590673J42696k19149J342647L052263L004302
38193B3571001J480565J50761l74007j162584k962867m420198l285269N25612
38185A3523014M032647M142309J083978j991790k701178j635987o33214q3037
$$ y = [10356159, 8417368, 5743846, 3203083, 2017659, 2535361, 3912964, 5754642, 8822839, 12880839, 15218273, 13523649, 9659921, 8142192, 10539322, 13509074, 13232454, 10073292, 7637980, 8431417, 11791083, 15436662, 17756630, 18664023, 19071565, 19727437, 20397350, 20353883, 19579641, 18803701, 18208612, 17027302, 14966610, 13232519, 13355291, 15468508, 18362032, 20677520, 21387730, 19845020, 16549901, 13588373, 13029065, 14657569, 16248242, 16390938, 16171789, 17514436, 20566699, 23571001, 25051566, 25202327, 24828320, 23665736, 20702869, 16282671, 12997402, 13523014, 17555661, 21697970, 22781948, 20790158, 18088980, 16452993, 15819779, 15736742]
38177A5736742R22382K385856K909669J763967K37011M279Q76071J301362P09446
38168B6846785l4492m69560j170621k016928j599634M41566K058987J453865k40378
38159B5269590r50813j037254j999810k861824j379868J332882J404178j722775
38151A8054306l814872k175745M01383N33760n01702J63224J655339J200217p30589
38142A4785321j333422k97470K58143j80467k87037L2127r3323l4337Q35486L70792
38132A4055813l201649o449460m388952J346418L899071J354491p32853J333659
38124G216538L901141K825950k6006j207019j572333k973662l250553J56891M587461
38115I658408N366170K553379j29891j140228j382158o58724J316559K017134
$$ y = [15736742, 16659124, 19044980, 21954649, 23718616, 23955627, 23959906, 24835977, 26137339, 26846785, 26812293, 26342733, 25172112, 23155184, 21555550, 21997116, 24056103, 25509968, 25269590, 24318777, 23281523, 21281713, 18419889, 17040021, 18372903, 19777081, 18054306, 14239434, 12063689, 12465072, 12998832, 12497130, 12660354, 14315693, 15515910, 14785321, 13451899, 13154429, 13412572, 13232105, 12945068, 12977195, 12883872, 12849535, 13685021, 14055813, 10854164, 4404704, 15752, 1362170, 5261241, 6615732, 5882879, 7216538, 11117679, 13943629, 13917623, 12710604, 11138271, 8164609, 4914056, 5070947, 9658408, 15024578, 17577957, 17448066, 16307838, 14925680, 14266956, 15583515, 17600649]
38107A7600649p36028l938026k943565R23739J773840j864040m940412l651912
38099B224245k59261J443573J124797M21301K5963K56515J645019L226769K720695
38090A2829616j16377k481887k021912N21417K710656K604642k90102l936386
38082I819667m337608l45180L062754O48710m602978m579688J888624O691890
38074H246191M440119J7151o7375K237358J099858l035740m859817l226386j824254
38065C027105j848667n83323K435646L720825J554587j351951k350272j945945
38057B658005j089538O37787K450243J733519j755342m183322k591859R67015
38049a173492K637572J831564N35582m14818j354655j473514K14824K047834J044906
$$ y = [17600649, 16864621, 12926595, 9983030, 10906769, 12680609, 10816569, 5876157, 2224245, 1964984, 3408557, 4533354, 4954655, 4980618, 5237133, 6882152, 10108921, 12829616, 12713239, 10231352, 8209440, 8730857, 11441513, 14046155, 13756053, 9819667, 5482059, 5136879, 8199633, 8848343, 4245365, -334323, 1554301, 8246191, 12686310, 12703461, 12636086, 14873444, 15973302, 12937562, 8077745, 4851359, 3027105, 1178438, 595115, 3030761, 6751586, 8306173, 6954222, 4603950, 2658005, 1568467, 2206254, 4656497, 6390016, 4634674, 451352, -2140507, -1173492, 1464080, 3295644, 3831226, 3416408, 2061753, 588239, 803063, 2850897, 3895803]
38040C895803k510531m545569k327536K006220M464692M023547K521823R77229
38032H505678j304488l917203m504722k240117k6140p98934k938413k432383Q30937
38023h825785K653699J217136J38522K393176M844460K938696j619017l063619
38015F77268m78579J212285k23475p77630K256858M678906J838645l280493m117941
38006A785844m88259J568151o96806l416309l210446j853272j513844m83265K674495
37997e633711M787674K530574j483535k011383R64798K686197J232492m72623
37989B600483n43731p55166j843007j254557J757815L281766O63814k385039j126043
37980C96335K438911K410422j665829l913126j094816K579313J680574l009457
$$ y = [3895803, 1385272, -3160297, -5487833, -3481613, 983079, 5006626, 7528449, 8505678, 7201190, 3283987, -1220735, -3460852, -3486992, -4285926, -7224339, -9656722, -8825785, -6172086, -4954950, -4816428, -2423252, 2421208, 5359904, 3740887, 677268, 198689, 1410974, 1187499, 409869, 2666727, 7345633, 9184278, 5903785, 1785844, 1297585, 2865736, 2168930, -1247379, -4457825, -6311097, -7824941, -8308206, -5633711, -846037, 1684537, 201002, -1810381, -845583, 1840614, 3073106, 2600483, 2056752, 1301586, -541421, -1795978, -38163, 3243603, 3907417, 1522378, 396335, 2835246, 5245668, 3579839, -333287, -1428103, 1151210, 2831784, -177673]
37972a77673n965846l860339J163358M254350K684429j455037l162738j55673
37964f675169L893154L726126l71867k865218p48111K501677K311125q39267l077387
37955b144937k530202l43213J973739L541623L579618K204177Q97164M00814n45415
37946G033368k528976l349571j191307J687682J644627r77011k549415j662093
37938a892696l57484M8730O17768J593134J203726q76847j959984j32451K760747
37929A004643L784192K589990P25637q32574j665673j220673q0925l41378k660296
37920A302943m345565k584782J554169M529245M662503K828501J1692k973528
37912D985178m117969j931216J423552J986776l95519j537176Q98246L889296
$$ y = [-177673, -6143519, -10003858, -8840500, -4586150, -1901721, -3356758, -6519496, -6675169, -2782015, 944111, 572244, -2292974, -3041085, -539408, 1771717, 932450, -2144937, -4675139, -5018352, -3044613, 497010, 4076628, 6280805, 7177969, 7578783, 7033368, 4504392, 1154821, -36486, 1651196, 3295823, 2318812, -230603, -1892696, -2250180, -2201450, -1583682, 9452, 1213178, 336331, -1623653, -1756104, 1004643, 4788835, 7378825, 8104462, 7271888, 5606215, 4385542, 4304617, 3963239, 1302943, -3042622, -5627404, -4073235, 456010, 5118513, 7947014, 7958706, 4985178, 867209, -1064007, 359545, 2346321, 1950802, 413626, 1311872, 5201168]
37904E201168L632309P60325j546205k313192k595480k277273n03689J546224
37896A904187J704021L84931j4982P94195Q10454j27792L07916K423380K988678
37887A1174988J34496l394503m204209k741754j338770m06760N16511L87856j286234
37878a158379k155037n21001Q46495j253078m251166k857780K432217N572356
37870c345373L994393J536398J105485N05868j831876k780052j21419K644084
37862A707508J771742m58429o7121J426066m5404l358904l736203q47754R30938
37853b677561K24202L56071K415909K708009o07580l570261k311655J167042K583455
37844B87631J575980O85986N14867k78552j485713j479438m50368m59057k010857
$$ y = [5201168, 8833477, 9593802, 8047597, 5734405, 3138925, 861652, 357963, 1904187, 3608208, 3993139, 3978157, 4772352, 5582806, 5455014, 5762930, 8186310, 11174988, 11309484, 7914981, 3710772, 969018, -369752, -776512, -260001, 127855, -1158379, -3313416, -3834417, -2987922, -4241000, -8492166, -11349946, -8917729, -3345373, 649020, 2185418, 3290903, 3796771, 1964895, -815157, -936576, 1707508, 3479250, 3020821, 2953700, 4379766, 4334362, 975458, -2760745, -3608499, -2677561, -2453359, -2097288, 318621, 3026630, 2419050, -1151211, -3462866, -2295824, 287631, 1863611, 2549597, 3064464, 2785912, 1300199, -179239, -629607, -1088664, -3099521]
37835c099521k981165j639335Q95109K066508R14552j002168j532415m00779O63219
37826f115995M45619L7625J001737K529467K453262R29589N06033J787542J865993
37817E440872j058614l938505k701105J533321L430818O23696l168652l259652
37809c097821J25673K894771K610594P32686m89023j159197k527218l932160l161405
37800h003100p9858K241718J463024n20987k05032K289855L395773J548883n69183
37791A561093l40692R92077P96267q35742j878178j756192j266527j58049K199669
37782f86274M067545K483834k117819n224105l641990M46039K501683J198509
37774i72578q74141j100076M96557K149286K304103O86620j349277j634161M32732
$$ y = [-3099521, -6080686, -7720021, -6824912, -4758404, -3843852, -4846020, -6378435, -6779214, -6115995, -5670376, -5632751, -4631014, -2101547, 351715, 1281304, 1787337, 3574879, 5440872, 4382258, 443753, -2257352, -724031, 2706787, 3330483, 161831, -3097821, -2972148, -77377, 2533217, 3265903, 2776880, 1617683, -909535, -4841695, -8003100, -8082958, -5841240, -4378216, -4899203, -5104235, -2814380, 581393, 2130276, 1561093, 1220401, 2212478, 3008745, 2173003, 294825, -1461367, -2727894, -2885943, -686274, 3381271, 5865105, 3747286, -1476819, -5118809, -4672770, -2171087, -972578, -1846719, -2946795, -2450238, -300952, 2003151, 2689771, 1340494, -293667, 139065]
37765A39065K471244J602126j575067l283714j466738J482120K142529N27165
37757B038730q20288r28139j000513j300508k94242K329727M147866K945082l48128
37748F769587k993132l529683k338546l34225J468545J984318J102774J22559
37740B252197M639m2964j017950k039154j402835P54198K392806K044116J93108
37731C138161j603186k061488j027555K40537K85968m46353L5507J951838K642906
37722C156335M66191k108318j819040M79746J278560k02089j437476r98865q5837
37713a270793M64634J335944K325607J926976J79638r17190p34177r73534k331892
37704E213k990849j656955M29923J706202K110161J758321L94783r43023n76168
$$ y = [139065, 2610309, 4212435, 2637368, -646346, -2113084, -630964, 1511565, 2038730, 1218442, 290303, -710210, -2010718, -2304960, 24767, 4172633, 7117715, 6769587, 3776455, 246772, -2091774, -2425999, -957454, 1026864, 2129638, 2252197, 2256836, 2213872, 1195922, -843232, -2246067, -1491869, 900937, 2945053, 3138161, 1534975, -526513, -1554068, -1313531, -1027563, -1473916, -1438409, 513429, 3156335, 3622526, 1514208, -304832, 174914, 1453474, 1251385, -186091, -1184956, -1270793, -806159, 529785, 2855392, 4782368, 4962006, 4044816, 3310639, 2337105, 5213, -2985636, -4642591, -4212668, -2506466, -396305, 1362016, 1756799, 813776, 237608]
37695B37608N88704k14521k547199k374704J347742L885254J497166k762543l676040
37686d018533j107444J388160K445317K975209K547209L53485j615275q21143
37678B146985J392425J774179M77397O6395L14221j088719l225218k710083M1655
37669h10763P79378j373695k164879M98793K890464J977158O50045K418520M828372
37660I693393L108238j977165m916329l211551K1316J208184L15378r58395j875881
37651A407188k324673j976336j054977m76710k58284Q45976L039299M090125J887411
37642E179019k140989l988503j868958J400547J875212o34650k707421j974976
37634d860719K44096J434717J175466O85368M21303j52108r71567j158739l82449
$$ y = [237608, 826312, 611791, -1935408, -4310112, -2962370, 922884, 2420050, -342493, -4018533, -5125977, -3737817, -1292500, 1682709, 4229918, 4583403, 2968128, 2146985, 3539410, 5313589, 5790986, 5857381, 6171602, 5082883, 1857665, -852418, -810763, -31385, -1405080, -3569959, -3071166, -180702, 1796456, 2446501, 4865021, 9693393, 12801631, 10824466, 5908137, 2696586, 2717902, 3926086, 4241464, 3283069, 1407188, -917485, -2893821, -3948798, -4425508, -4683792, -3837816, -798517, 3291608, 5179019, 3038030, -950473, -2819431, -1418884, 456328, -178322, -2885743, -4860719, -4616623, -3181906, -2006440, -1321072, -899769, -1051877, -2023444, -3182183, -3564632]
37625c564632O23051R23928K00980r82040j379761l21632R16544L71844j404950
37616d616668j417890J245627L319675J985085p23756j244775k02907p00094k185997
37607d541700j054073K572677L914466R35737k116901j221222J421368J355994
37599A266346j247355k671942j675864m19248k62538l15023n1953j93191o07122
37590f177890l7346J409687J795516L06845j179517o48194J310601K550279K217034
37581A547015J241588M82833k32445j072631j388272o86840K43517K05328o13093
37572b73000q62442k19275j1883r74541j765149j044368J40164m3646r43682j69416
37562f167238K289358L228152O90750k647555k457951J630096N203905M154144
$$ y = [-3564632, -2941581, -2017653, -1816673, -2798713, -4178474, -4500106, -3583562, -3211718, -4616668, -6034558, -4788931, -1469256, 515829, -207927, -1452702, -1655609, -2355703, -4541700, -5595773, -3023096, 891370, 1827107, -289794, -1511016, -89648, 1266346, 18991, -2652951, -4328815, -4748063, -5010601, -5325624, -5377577, -5570768, -6177890, -6215236, -4805549, -3010033, -2703188, -3882705, -4530899, -3220298, -670019, 1547015, 2788603, 3271436, 3038991, 1966360, 578088, -108752, 134765, 340093, -273000, -1135442, -1354717, -1366600, -2341141, -4106290, -5150658, -5010494, -5054140, -5997822, -6167238, -3877880, -649728, 41022, -2606533, -5064484, -3434388, 1769517, 5923661]
37554E923661n17320l840232k600398J140339K954391J500915o85295j438434
37546B437627j311650j035140K25729K142839J830105j701344m264989j720756
37538c397579L387518N076772K572988L84936J87030j202783m662737n886877
37530c540732k451901J664334K314116J336745K279242L946701L077176L81242
37522I006923j192510j865247l413838m026543p15737L883899L483024k175723
37514B984248n516936j481640N137253O232502R10264m495427n073788k014223
37506c317747R55349K203339K213109J451718J65743o34036J96530K204857L472126
37497H910988K860668J149942m88748j919261l102956l132289j699673l31646
$$ y = [5923661, 5406341, 1566109, -1034289, 106050, 3060441, 4561356, 3876061, 2437627, 1125977, 90837, 316566, 2459405, 4289510, 2588166, -1676823, -3397579, -10061, 5066711, 7639699, 8024635, 8211665, 7008882, 2346145, -3540732, -5992633, -4328299, -2014183, -677438, 1601804, 5548505, 8625681, 9006923, 7814413, 5949166, 2535328, -1491215, -2206952, 1676947, 5159971, 2984248, -2532688, -4014328, 1122925, 7355427, 8265691, 3770264, -1303524, -3317747, -2362398, -159059, 2054050, 3505768, 3671511, 3037475, 3234005, 5438862, 8910988, 11771656, 12921598, 12432850, 10513589, 7410633, 4278344, 2578671, 2247025]
37489B247025k71540k92166J009726J959099J28178k856726k946216j63436J161055
37480b5001l81653q91938J749918L514277P25255l376147l460541m12773O15617
37471a942986j317590j930782J112527M784896N181701K085936j600783k765500
37463C607419n58131K272146J635280k394896m455114j053284L765080L957857
37455F776357L19954j422093J98790J080984q71403k918986l021060k572959k273664
37446d704080o09998J783809J531415j399009k154156J424413M509218K440607
37438B822219j971302k854406J21412K394126J763077K07224o13072j255638j863987
37429a250347j327036K22261Q12633n20272k156269k018819j00688J793639K146601
$$ y = [2247025, 1975485, 1683319, 2693045, 4652144, 4780322, 1923596, -1022620, -1186056, -25001, -406654, -1298592, 451326, 3965603, 4690858, 1314711, -2145830, -2558603, -1942986, -3260576, -5191358, -4078831, 706065, 5887766, 7973702, 6372919, 3607419, 3049288, 5321434, 6956714, 4561818, 106704, -946580, 2818500, 6776357, 7096311, 5674218, 5873008, 6953992, 6082589, 3163603, 142543, -2430416, -4704080, -5314078, -3530269, -1998854, -3397863, -5552019, -4127606, 381612, 2822219, 850917, -2003489, -1882077, 512049, 2275126, 2482350, 1869278, 613640, -1250347, -2577383, -2355122, -1542489, -2062761, -4219030, -6237849, -6338537, -4544898, -2398297]
37420b398297J080781j74766p94536q35550j69443J759789M024799L633968p52832
37411E373913n528442n700084j498420J989148K006734J073911J742291K549682
37403B008733J386138o69930j649841j944795k429584j969487J37616J607957
37395c523193M63641j076258L12624L443571L950538O79950k847001l483162j930890
37386d010180o81448q60659j725481j694631K66020L019303L558761N89774k881366
37377d419907k698007R94982L762685K636375k65605q45776J630733L694814K110033
37368F600327j743004l035804M37300M715004M232834p47963m277462k627513
37360C553719J322430K940418J644778m17737k311040l781407l271460l5271L350197
$$ y = [-2398297, -1317516, -1492282, -2286818, -3122368, -3291811, -1532022, 2492777, 6126745, 5373913, -154529, -5854613, -7353033, -5363885, -3357151, -2283240, -540949, 2008733, 3394871, 2724941, 1075100, -869695, -3299279, -5268766, -5131150, -3523193, -3059552, -4135810, -3823186, -379615, 3570923, 4250873, 1403872, -2079290, -4010180, -4691628, -5552287, -7277768, -8972399, -8706379, -5687076, -2128315, -1538541, -4419907, -7117914, -6122932, -2360247, 276128, 10523, -835253, 795480, 4490294, 6600327, 4857323, 1821519, 2258819, 6973823, 11206657, 10458694, 6181232, 3553719, 4876149, 7816567, 9461345, 9043608, 6732568, 2951161, -320299, -355570, 2994627]
37351B994627L843295K008396L94139m50519j225174j097429N45234J282368j099523
37342G195414l905940k828718R50447K164541k62234j915238n13251Q60639j76605
37333A569055j412386p28858J89648r8429M68617L025873M187914J287384k179500
37324F309318j419941J758244J505297k761294n384997l188705J96140N03982
37316b481956j103580j036778P78297J463471J80453q24096j1943J340749J509965
37307a85418P77527L57834K69322k19294q20192o41001j35727p12749j978014
37298c287712j421008J838131M706112L587362p54247m065063l956342k056611
37290e409378p00157M0488R92957J574006N96641j443393k372006o76966K690789
$$ y = [2994627, 6837922, 8846318, 9240457, 8789938, 7564764, 6467335, 7012569, 8294937, 7195414, 3289474, 460756, 1411203, 3575744, 3313510, 1398272, 885021, 1745660, 1569055, 156669, -572189, -382541, -480970, -12353, 3013520, 7201434, 8488818, 6309318, 4889377, 6647621, 8152918, 5391624, 6627, -3182078, -2985938, -2481956, -3585536, -4622314, -3844017, -2380546, -2200093, -3024189, -3036132, -1695383, -185418, 592109, 949943, 1219265, 999971, 179779, -461222, -596949, -1309698, -3287712, -4708720, -2870589, 1835523, 5422885, 4668638, 603575, -3352767, -5409378, -6109535, -6069047, -5076090, -3502084, -2905443, -4348836, -6720842, -7397808, -4707019]
37281d707019M884715L682793j42241l285479l376102j446187l4295K80614P65150
37272c378051J617006J530031K76229o40389m91102k63963l23652N21698K350402
37263A198209K803817L42618k875911l483652j142231J605202K745684K151304
37255C345040L88041j691852k575324j374004N08322P27047r35975k487556k733734
37246f829995k497927k390693j349073J352497M071393M498114K768183J170771
37238G93270Q07266L02242j442455k816685j573422J338663K247060l81696l506459
37229d232216l381090m97503J332255K35820j579322j227010J186497L175335
37221d987234K976931J122472m83337m61574P22965J244417J55598j198034r38385
$$ y = [-4707019, 177696, 3860489, 3718248, 432769, -2943333, -4389520, -4423815, -4143201, -3378051, -1761045, -231014, 45215, -595174, -1086276, -1350239, -1673891, -1152193, 1198209, 4002026, 4344644, 1468733, -2014919, -3157150, -1551948, 1193736, 3345040, 3733081, 2041229, -534095, -1908099, -1399777, -672730, -1608705, -4096261, -6829995, -9327922, -11718615, -13067688, -11715191, -7643798, -3145684, -377501, 793270, 1600536, 1902778, 460323, -2356362, -3929784, -2591121, -344061, -725757, -4232216, -7613306, -8110809, -6778554, -6542734, -8122056, -9349066, -8162569, -4987234, -2010303, -887831, -1371168, -1832742, -1109777, 134640, 290238, -907796, -1846181]
37212a846181N52482J083591p3400j078082k95401J321038J625425Q2579j786714
37203d14663k219770q68141R65423J567742P41509J41643P93873J048766j090378
37194F66004m023232l721742M88927M158966L394566m2184j602938j89584J216180
37185C44963L42616j654307k374630j025848J374378L252781L493906K130682
37177E884541L49855o61632p70906m73962n4764J72121m08653j655899j987622
37168C93079j36911K641711L532176J579492r26533j044133J386739L450664K318184
37159A3194468j508575m515852m075798j497677k02451j157065j773000J27706
37151a408244K906179L061690k31256l958218m536159j420930K526435L855953
$$ y = [-1846181, -1293699, -210108, -283508, -1361590, -1656991, -335953, 1289472, 1372051, -414663, -2634433, -3502574, -2537151, -969409, -227900, -86257, 707616, 1756382, 666004, -3357228, -7078970, -6590043, -2431077, 963489, 921305, -681633, -871217, 344963, 687579, -966728, -3341358, -4367206, -2992828, 259953, 3753859, 5884541, 6234396, 5572764, 4801858, 4327896, 4273132, 4445253, 4036600, 2380701, 393079, 256168, 2897879, 6430055, 8009547, 7083014, 6038881, 7425620, 10876284, 13194468, 11685893, 7170041, 3094243, 1596566, 1394115, 237050, -1535950, -1408244, 1497935, 4559625, 4328369, 370151, -4166008, -5586938, -3060503, 795450]
37143G95450J814797j072704j889172m05840J356496J971223J629734P71153m14223
37134D556914j079914l07654J101508J358771M16919k64954p98773k700442m998060
37125b715685m137713M99552M498208M287797J863298O93333K49461j417857k531264
37116A289130j27520L780528L957108k56025l686463k515220J384878M159260
37108G985676M328400K402828m70074k253523j390359M53243j57048l213030m547455
37099C138658j739447K177961K845657J33364k452374k357300l04564J014562
37091B456517k59382k816502k946523O63892L843266J790929l517246n126124
37083e911173q49029L733201L813927J707215J362212J438950j125463m200436
$$ y = [795450, 2610247, 1537543, -351629, -757469, 599027, 2570250, 4199984, 4971137, 4556914, 3477000, 3169346, 4270854, 5629625, 6046544, 5781590, 4982817, 2282375, -2715685, -6853398, -6353846, -1855638, 2432159, 4295457, 4988790, 5238251, 3820394, 1289130, 1161610, 4942138, 8899246, 8643221, 4956758, 2441538, 3826416, 7985676, 12314076, 14716904, 14246830, 11993307, 10602948, 11056191, 10899143, 7686113, 3138658, 1399211, 3577172, 6422829, 6556193, 4103819, 1746519, 1441955, 2456517, 2197135, -619367, -3565890, -2901998, 941268, 2732197, -785049, -5911173, -6760202, -3027001, 786926, 2494141, 3856353, 5295303, 4169840, -30596]
37075c0596l146223J265908L507869J539586r86236j251226q77073j498265j314709
37066b790965J308619M123996L906171J080906j225788j509265r03331n92864
37058C397479l17632N51579J798430K397822J279840j483896l829149l096715
37050F97758O16021L436439J781799k842662n088012k322910J948980K622390
37042H49803n16279l032475j990528Q27269K368782K265895J696752N97490j387390
37033A679319k640443j328335J200077J884986O85636N46833K254145K876741
37025G158959N81237k390133l438979l188328k966403j700640J504004M082614
37017c57669L076538J7513j044636M37208J252234n1193j209613m06102R71934
$$ y = [-30596, -3176819, -1910911, 1596958, 3136544, 2150308, 899082, 22009, -1476256, -2790965, -1482346, 2641650, 6547821, 7628727, 6402939, 4893674, 3990343, 3397479, 3079847, 3631426, 5429856, 7827678, 9107518, 7623622, 3794473, 697758, 1313779, 4750218, 6532017, 3689355, -1398657, -3721567, -1772587, 849803, 333524, -2698951, -4689479, -3862210, -1493428, 772467, 2469219, 3066709, 1679319, -961124, -2289459, -1089382, 795604, 1481240, 2028073, 4282218, 7158959, 7740196, 5350063, 1911084, -1277244, -4243647, -5944287, -4440283, -357669, 2718869, 2736382, 1691746, 2128954, 3381188, 3329995, 2120382, 1714280, 2686214]
37008B686214R80588l923m05478L02376J466468K087726J362256l68599j336702
36999F770926n65531J47678j359697l765843l735007j158058N00645k47816o50854
36990d063557J435470L801134L344818O04680j786994l030507l807767l738864
36982g241587k092682N2919J006972J058590J585476K412383K364091J636403
36974G82565J197871N57526j249977k962949k238855N18478K266132J596873K59958
36965G27622j32300j86741m80844J31588K207845L684168K255878j269811l764694
36956C172711l336834q32812J587533K213432P13096j473886j960043L37113L783815
36947D204125N455651L862233M0359l507737m615714k960795m53022M02112q72278
$$ y = [2686214, 3666802, 3662879, 3257401, 3559777, 5026245, 7113971, 8476227, 8107628, 6770926, 6205395, 6353073, 4993376, 1227533, -2507474, -3665532, -3164887, -3412703, -4063557, -2628087, 1173047, 4517865, 5122545, 3335551, 305044, -3502723, -7241587, -9334269, -9281350, -8274378, -7215788, -5630312, -3217929, -853838, 782565, 1980436, 2537962, 1287985, -1674964, -3913819, -3395341, -1129209, 467664, 727622, 595322, 408581, -72263, 59325, 2267170, 5951338, 8207216, 6937405, 3172711, -164123, -996935, 590598, 2804030, 3517126, 2043240, 83197, 420310, 4204125, 9659776, 13522009, 13562368, 10054631, 5438917, 2478122, 2025100, 2427212, 1554934]
36938A554934k203622j543994O53123K151008J604794j40040j113817j71255J810423
36929B601554K575151R26135j529196k097735m79335R56148O57043k82893o36297
36920B690575j166450k548603l200225j632579N23287O97210l83316J93541K552034
36911b274526L577644J868768j15150J6619J303733J561966M78759r41934k004062
36902C471817j968001j43206K151331J915480j384848m146914l272592l55443
36894c732376J300206J595170K180058K011972j128500n342238n716365j526175
36886a0358248K122791J612136k50707O77098L232457L208056K74328j592374
36878a074463k70354J726876J578726K80266N14156K162959K347955k98125l432441
$$ y = [1554934, -648688, -2192682, -1539559, 611449, 2216243, 2076203, 962386, 791131, 2601554, 5176705, 6102840, 4573644, 2475909, 1996574, 2952722, 3609765, 3326872, 2690575, 1524125, -1024478, -4224703, -5857282, -5333995, -4636785, -5020101, -4826560, -2274526, 1303118, 3171886, 3056736, 3073355, 4377088, 5939054, 6417813, 5475879, 3471817, 1503816, 1360610, 3511941, 5427421, 4042573, -104341, -3376933, -3732376, -2432170, -837000, 1343058, 3355030, 2226530, -3115708, -8832073, -10358248, -8235457, -6623321, -6874028, -6196930, -2964473, 243583, 517911, -1074463, -1344817, 382059, 1960785, 2241051, 2755207, 4918166, 7266121, 6967996, 3535555]
36869C535555l990463k187117r56619j594727j875973M03201L549212L844290
36861G27359Q89867j434604j63591K690281K930577j73861l016923k297277J015165
36852A166993K930885J025414k794637m286425j621865K393895L566851J294229
36844C675340j130407j175375l5784L91q09676o27364N46497Q23186m26669j608735
36834g68596j478726p67501m63365j16905R70280K076810J984677Q79574j5481
36825B300767k97786n41702q12243m96611K45144M03165j6839L05964J483183
36816B573042J395263j001105k952287j317604K162805K639872n29417k334608
36808F35961L01136L540070K528139j082497k150994m43806m09794l056182l963801
$$ y = [3535555, -454908, -2642025, -3598644, -5193371, -7069344, -6666143, -3116931, 727359, 1617226, 182622, 19031, 2709312, 5639889, 5466028, 2449105, 151828, 1166993, 4097878, 5123292, 2328655, -1957770, -3579635, -1185740, 2381111, 3675340, 2544933, 1369558, 1333774, 1334165, 524489, -102875, 443622, 1266808, 840139, -768596, -2247322, -3014823, -3478188, -3595093, -2624813, -548003, 1436674, 2316248, 2300767, 2002981, 1461279, 649036, 152425, 397569, 800734, 783895, 1089859, 2573042, 3968305, 2967200, 14913, -1302691, 860114, 3499986, 2970569, 635961, 937097, 4477167, 7005306, 5922809, 3771815, 3328009, 2918215, -137967, -4101768]
36799d101768p31704K963335L349520K060696K209457K730381R37115j906296
36791G510736k337962p13487p66811l275079m479253j839286K068259L123980
36783g08903R06219j411761j224352Q72115K276554J459755m18143j229762q76648
36774c54926j156737k372004k284981J67868K443356K027714M62904O16580J611211
36765A160985M87688j926417j514440K258852M617770K419440j152286j525955
36757D825637O94872J346991j044797l879875m454580k566355N16448L323897
36749a237762M280313K485045q48693k781296j352934K144238M042870K021862
36741H753643j983334l645448j639968M83508m86069k291854o53311L323043L903314
$$ y = [-4101768, -4833472, -1870137, 1479383, 3540079, 5749536, 8479917, 9417032, 7510736, 5172774, 4459287, 3692476, 417397, -4061856, -5901142, -3832883, -708903, 197316, -1214445, -2438797, -1566682, 709872, 2169627, 1751484, 521722, -354926, -1511663, -3883667, -6168648, -6000780, -3557424, -1529710, -1066806, -450226, 1160985, 1648673, -277744, -1792184, 466668, 5084438, 7503878, 6351592, 4825637, 5520509, 6867500, 5822703, 1942828, -2511752, -5078107, -4561659, -1237762, 3042551, 5527596, 4678903, 1897607, 544673, 2688911, 6731781, 8753643, 6770309, 3124861, 1484893, 1968401, 1482332, -809522, -1462833, 1860210, 5763524]
36732E763524n46540m578475l581265j42913Q68585k98488k05003J304554J589399
36723A73378N88317O74454J776877J454840j97117m35774Q10844K19261l025791
36714B039289n058400l146070K04757J474221J049413J025523J084619k842r90650
36705b320140Q3157K143278K529446J273804N99979P40975k85330k616788l523619
36696a375238j323670K142450L939617L141478Q62365j154085j505722k46426
36688D480769P55756J60406m26525J342399M231060M581871K270515J538073M141976
36679B3076300N770057K526848k512192l775496j839459k105247n662586p405684
36671H072541m356874m10656n0110j660641r05035K117654L383091J380412r34248
$$ y = [5763524, 5216984, 638509, -2942756, -3085669, -2217084, -2515572, -2720575, -1416021, 173378, 761695, 1436149, 3213026, 4667866, 4470749, 4034975, 4845819, 5065080, 2039289, -3019111, -6165181, -5960424, -4486203, -3436790, -2411267, -1326648, -1329490, -2320140, -2236983, -93705, 2435741, 3709545, 4309524, 5050499, 4765169, 2148381, -1375238, -2698908, -556458, 3383159, 6524637, 7387002, 6232917, 4727195, 4480769, 5236525, 5396931, 4970406, 6312805, 10543865, 15125736, 17396251, 18934324, 23076300, 28846357, 31373205, 28861013, 25085517, 23246058, 21140811, 15478225, 8072541, 3715667, 3305011, 3254901, 1594260, 689225, 2806879, 6189970, 7570382, 6636134]
36662F636134p61046R83707J569681L0081k053024k454294o11760J623720J866437
36653F829636Q7564j360824j116216n84151j163649j607816l59689J018533j68231
36644A575157k918650l094348O08857M289954L922886N20754j754287j208552
36636A941771o4946n66829j710036r53917J710399L194884J545156q35717l93785
36627C866980J874614J339781k889679n526114k675853J830766J996636j174249
36619a357118j682817J563292L276347Q06718j731086o55888J550950J186471
36611B956869n66581o07578N05053L07951p99235p83823l6268j81219m80225O43371
36601I58315J934355J122502q73591j580677j499238k526828l017399K33756N278145
$$ y = [6636134, 5875088, 6858795, 8428476, 8458557, 6405533, 3951239, 3339479, 4963199, 6829636, 6917200, 5556376, 4440160, 3856009, 2692360, 1084544, 724855, 1743388, 1575157, -1343493, -4437841, -3828984, 460970, 4383856, 4904610, 3150323, 1941771, 1876825, 1309996, -400040, -1353957, 356442, 3551326, 5096482, 4260765, 3866980, 5741594, 7081375, 4191696, -1334418, -4010271, -2179505, -182869, -1357118, -3039935, -1476643, 1799704, 2606422, 875336, 219448, 1770398, 2956869, 2390288, 1782710, 2287763, 2595714, 1796479, 1012656, 976388, 795169, 314944, 958315, 2892670, 4015172, 3141581, 1560904, 61666, -2465162, -5482561, -5248805, 29340]
36592B9340O078841J375586l043541k939774j181741j662809k620714n61217K731329
36583a794700K505117j261519l536736j450156K320486L926587K776327O82688
36575D168094p52406p93074M15715J499414J031525l35188n30674O10525P11690
36566F025621j337698k965677j323072K231239L576666J410844j140234r96830
36558E480859J067172K336834K018391J280694O18596m82828j555801j182960
36550I580957M76091J201403k34576k048604j666197J107731M176349N469253
36542A8062407M278344J360253j243108j540185J00982R71383n67166k923224
36534A8499686l774011l130375k086615k28426K971871N357311M066301R4472
$$ y = [29340, 6108181, 7483767, 4440226, 1500452, 318711, -1344098, -3964812, -4526029, -1794700, 710417, -551102, -4087838, -5537994, -3217508, 709079, 3485406, 4168094, 3415688, 2622614, 3038329, 4537743, 5569268, 5234080, 4703406, 5313931, 6025621, 4687923, 1722246, 399174, 2630413, 6207079, 7617923, 6477689, 5480859, 6548031, 8884865, 10903256, 12183950, 12802546, 12319718, 10763917, 9580957, 10057048, 11258451, 11023875, 8975271, 7309074, 8416805, 12593154, 18062407, 22340751, 23701004, 22457896, 20917711, 21018693, 21990076, 21422910, 18499686, 14725675, 11595300, 9508685, 9280259, 12252130, 17609441, 21675742, 21770214]
36526B1770214k437386j955561j162187k233450l481532k431679M25736K937944
36518A1432099M250143M450050L063957J47829k382536k675892j442461q00981
36510A6042208j363598j991145j692269l76015J459628K572161J686293k96499
36502A6040764l97030K254803M125337J898209k148923l042237o33656J66858
36494A8264125k736728n078485k758865J886425L719413K086424N22087N96723
36486A6501119L32702j253600k056937o16380J205173J217544K91404N28951J666656
36477A7816632J751985N21838l38639p1886K53331p2045l01079J47985O82919
36468B0391041Q31015J016852J297857Q33953m28964j017599j01693R26456N31920
$$ y = [21770214, 19332828, 17377267, 16215080, 13981630, 10500098, 8068419, 8494155, 11432099, 15682242, 20132292, 23196249, 23344078, 20961542, 18285650, 16843189, 16042208, 14678610, 12687465, 10995196, 10619181, 12078809, 14650970, 16337263, 16040764, 15643734, 17898537, 22023874, 23922083, 21773160, 18730923, 18097267, 18264125, 15527397, 10448912, 7690047, 9576472, 13295885, 15382309, 15904396, 16501119, 16833821, 15580221, 13523284, 12906904, 14112077, 15329621, 15621025, 16149976, 17816632, 19568617, 20090455, 19751816, 19679930, 19933261, 19861216, 19560137, 19708122, 20391041, 21222056, 22238908, 23536765, 24370718, 23941754, 22924155, 22822462, 23748918, 24280838]
36459B4280838m48090j51907J238331J738069N37082j173560k367188l329740
36451B0323835m187769l875462j539959J780633L702470K709739k41423k424565
36443A6247499k178605r66560j383018k986897k363967J462188M384202K646533
36435A4861375j343042k449214n53865r5084k197722k701113N70731L743439K960902
36426A2796407K98389o0261J656849K155827O70812q60310j672729k318102k046872
36417A0620010R4533K275833J807211l21182n72123J602795L188389K726895J996409
36408B3418770J913391R10959j221507j901504k11193Q88937o19684k149887q21796
36399B0206486J497380J233524j073504k179920j828454k432465l672749k269930
$$ y = [24280838, 23832748, 23680841, 24919172, 26657241, 27194323, 26020763, 23653575, 20323835, 16136066, 12260604, 10720645, 12501278, 16203748, 18913487, 18672064, 16247499, 14068894, 13102334, 11719316, 8732419, 6368452, 7830640, 12214842, 14861375, 13518333, 11069119, 10515254, 10420170, 8222448, 5521335, 6092066, 9835505, 12796407, 13094796, 13034535, 14691384, 16847211, 17518023, 16657713, 14984984, 12666882, 10620010, 10714543, 12990376, 14797587, 14476405, 13904282, 15507077, 18695466, 21422361, 23418770, 25332161, 26243120, 25021613, 23120109, 22908916, 23797853, 23178169, 21028282, 20206486, 21703866, 22937390, 21863886, 19683966, 17855512, 15423047, 11750298, 9480368]
36391I480368K134477N308074M353423J645404O74965J107710O82357n10015q64218
36382B4012545p43297j771763l366552l107259o11728J555453J264860q38301
36374A6393958k644012k573951l24622K619046L422927Q60849k442030l035163
36366A2277002j491145j169335k324583j582076J752871L482442J063676j921968
36358A0086884j425019O94711M39950j335184j153384J69427q47813k920699j175672
36349B533201L787161N122603J68759m943211m515284j176801k3011r8630K348551
36340C203338N831409N560005J664278r34731m81008k77516j980591k523518K97304
36331A0358970L530433L110527n76266l649443l534883r46972J659653K235265
$$ y = [9480368, 11614845, 16922919, 21276342, 22921746, 23596711, 24704421, 25386778, 24876763, 24012545, 23269248, 21497485, 18130933, 15023674, 14411946, 15967399, 17232259, 16393958, 13749946, 11175995, 10851373, 13470419, 16893346, 17754195, 15312165, 12277002, 10785857, 9616522, 7291939, 5709863, 7462734, 10945176, 12008852, 10086884, 8661865, 9356576, 9796526, 8461342, 7307958, 7477385, 6629572, 3708873, 2533201, 6320362, 11442965, 11611724, 6668513, 2153229, 976428, 953417, 854787, 3203338, 9034747, 14594752, 16259030, 15324299, 14843291, 14565775, 12585184, 10061666, 10358970, 13889403, 16999930, 16423664, 12774221, 9239338, 8292366, 9952019, 12187284]
36323A2187284P01503q15857l51858R75491K6179l757021o659085m953807L61732
36314b285439M528315M159365L60773k962991l101404q18048R98666P09790n10018
36305A079009o71343L77509J237133J185299P54288L68600j77657p80264p30338
36296B642236L33575J840657K678352J829414p53104l304147l294477m13361K488717
$$ y = [12187284, 12888787, 12072930, 11721072, 12696563, 12722742, 8965721, 2306636, -2647171, -2285439, 2242876, 6402241, 6763014, 3800023, 698619, -119429, 879237, 1589027, 1079009, 407666, 785175, 2022308, 3207607, 3961895, 4330495, 4152838, 3372574, 2642236, 2975811, 4816468, 7494820, 9324234, 8571130, 5266983, 1972506, 1559145, 4047862]
$$ [...]
##END NTUPLES=NMR SPECTRUM
##END=
