##TITLE=31Pdec_SR20_2
 , 24 sc 11-51
 20.10.2020
##JCAMPDX= 6.0         $$ Bruker NMR JCAMP-DX V2.0
##DATA TYPE= NMR SPECTRUM
##DATA CLASS= NTUPLES
##ORIGIN= UXNMR, Bruker Analytische Messtechnik GmbH
##OWNER= root
$$ XWIN-NMR		Version 3.5
$$ Tue Oct 20 11:53:12 2020 Russian Standard Time (UT+4h)  she@DPX200
##.OBSERVE FREQUENCY= 81.013821
##.OBSERVE NUCLEUS= ^31P
##.ACQUISITION MODE= SIMULTANEOUS
##.ACQUISITION SCHEME= undefined
##.AVERAGES= 24
##.DIGITISER RES= 17
##SPECTROMETER/DATA SYSTEM= spect
##.PULSE SEQUENCE= zgpg30
##.SOLVENT NAME= D2O
##.SHIFT REFERENCE= (INTERNAL, D2O, 0, 182.463)
##AUDIT TRAIL= $$ (NUMBER, WHEN, WHO, WHERE, WHAT)
$$ ##TITLE= Audit trail, XWIN-NMR		Version 3.5
$$ ##JCAMPDX= 5.01
$$ ##ORIGIN= Bruker BioSpin GmbH
$$ ##OWNER= she
$$ F:/spectra/data/she/nmr/P31/1/pdata/1/auditp.txt
$$ ##AUDIT TRAIL=  $$ (NUMBER, WHEN, WHO, WHERE, WHAT)
(   1,<2020-10-20 11:51:16.17 +0400>,<she>,<DPX200>,
      <created by zg, POWCHK disabled, PULCHK disabled
       configuration hash MD5:
       00 E9 B6 7A A2 85 ED C7 34 08 36 98 17 FE 4E 26
       data hash MD5: 32K
       27 6B A1 85 D1 27 33 6B 6F 6D 58 76 F4 2D 8E BE>)
(   2,<2020-10-20 11:51:53.10 +0400>,<she>,<DPX200>,
      <Start of raw data processing
       efp BC_mod = 2 LB = 1 FT_mod = 6 PKNL = 1 PHC0 = -2786.686 PHC1 = 134.2014 SI = 64K 
       data hash MD5: 64K
       F9 9A 56 6D 59 14 64 13 0F FB 6F E2 00 2C F7 D3>)
(   3,<2020-10-20 11:52:08.37 +0400>,<she>,<DPX200>,
      <pk PHC0 = 14.25734 PHC1 = -9.200001 
       data hash MD5: 64K
       ED EC E6 12 46 08 42 D5 C3 E8 13 F6 5F 95 74 C0>)
(   4,<2020-10-20 11:52:24.71 +0400>,<she>,<DPX200>,
      <pk PHC0 = -1.600005 PHC1 = 0 
       data hash MD5: 64K
       DA 3F 5F DF 0C 04 81 E7 C1 0C 07 64 B0 86 66 34>)
$$ ##END=
$$ 
$$ hash MD5
$$ C1 B8 37 74 98 DA C8 9F 7A 1B 49 6E 8E 80 A7 F8
##$RELAX= 
##$RELAX= 
##$RELAX= 
##$RELAX= 
##$RELAX= 
##$RELAX= 
##$RELAX= 
##$RELAX= 
$$ Bruker specific parameters
$$ --------------------------
##$DU= <F:/spectra>
##$EXPNO= 1
##$NAME= <P31>
##$PROCNO= 1
##$TYPE= <nmr>
##$USER= <she>
##$AMP= (0..31)
100 100 100 100 100 100 100 100 100 100 100 100 100 100 100 100 100 100 
100 100 100 100 100 100 100 100 100 100 100 100 100 100 
##$AQSEQ= 0
##$AQ_mod= 1
##$AUNM= <au_zg>
##$AUTOPOS= <>
##$BF1= 81.014009
##$BF2= 200.13
##$BF3= 200.13
##$BF4= 200.13
##$BF5= 200.13
##$BF6= 200.13
##$BF7= 200.13
##$BF8= 200.13
##$BYTORDA= 1
##$CFDGTYP= 0
##$CFRGTYP= 5
##$CHEMSTR= <none>
##$CNST= (0..31)
1 1 145 1 1 1 1 1 1 1 1 1 1 1 1 1 1 1 1 1 1 1 1 1 1 1 1 1 1 1 1 1 
##$CPDPRG= <waltz16>
##$CPDPRG1= <>
##$CPDPRG2= <waltz16>
##$CPDPRG3= <>
##$CPDPRG4= <mlev>
##$CPDPRG5= <mlev>
##$CPDPRG6= <mlev>
##$CPDPRG7= <mlev>
##$CPDPRG8= <mlev>
##$CPDPRGB= <>
##$CPDPRGT= <>
##$D= (0..31)
0 1 0 0 0 0 0 0 0 0 0 0.03 2e-05 3e-06 0 0 0 0 0 0 0 0 0 0 0 0 0 0 0 0 
0 0 
##$DATE= 1603180275
##$DBL= (0..7)
120 120 120 11 120 120 24 19 
##$DBP= (0..7)
150 150 150 150 150 150 150 150 
##$DBP07= 0
##$DBPNAM0= <>
##$DBPNAM1= <>
$$ [...]
##$SUBNAM2= <"">
##$SUBNAM3= <"">
##$SUBNAM4= <"">
##$SUBNAM5= <"">
##$SUBNAM6= <"">
##$SUBNAM7= <"">
##$SUBNAM8= <"">
##$SUBNAM9= <"">
##$SW= 369.568048894756
##$SWIBOX= (0..15)
0 1 3 0 0 0 0 0 0 0 0 0 0 0 0 0 
##$SW_h= 29940.119760479
##$TD= 32768
##$TD0= 1
##$TE= 0
##$TE2= 300
##$TE3= 300
##$TEG= 300
##$TL= (0..7)
0 120 53 12 22 120 120 120 
##$TP= (0..7)
150 150 150 150 150 150 150 150 
##$TP07= 0
##$TPNAME0= <>
##$TPNAME1= <>
##$TPNAME2= <>
##$TPNAME3= <>
##$TPNAME4= <>
##$TPNAME5= <>
##$TPNAME6= <>
##$TPNAME7= <>
##$TPOAL= (0..7)
0.5 0.5 0.5 0.5 0.5 0.5 0.5 0.5 
##$TPOFFS= (0..7)
0 0 0 0 0 0 0 0 
##$TUNHIN= 0
##$TUNHOUT= 0
##$TUNXOUT= 0
##$USERA1= <user>
##$USERA2= <user>
##$USERA3= <user>
##$USERA4= <user>
##$USERA5= <user>
##$V9= 5
##$VALIST= <valist>
##$VCLIST= <CCCCCCCCCCCCCCC>
##$VD= 0
##$VDLIST= <DDDDDDDDDDDDDDD>
##$VPLIST= <PPPPPPPPPPPPPPP>
##$VTLIST= <TTTTTTTTTTTTTTT>
##$WBST= 1024
##$WBSW= 4
##$XGAIN= (0..3)
0 0 0 0 
##$XL= 0
##$YL= 0
##$YMAX_a= 76296
##$YMIN_a= -56895
##$ZGOPTNS= <>
##$ZL1= 120
##$ZL2= 120
##$ZL3= 120
##$ZL4= 120
##$ABSF1= 0
##$ABSF2= 0
##$ABSG= 0
##$ABSL= 0
##$ALPHA= 0
##$AQORDER= 0
##$ASSFAC= 0
##$ASSFACI= 0
##$ASSFACX= 0
##$ASSWID= 0
##$AUNMP= <proc_1d>
##$AZFE= 0.1
##$AZFW= 0.5
##$BCFW= 0
##$BC_mod= 2
##$BYTORDP= 0
##$COROFFS= 0
##$CY= -3
##$DATMOD= 1
##$DC= 0
##$DFILT= <>
##$DTYPP= 0
##$F1P= 0
##$F2P= 0
##$FCOR= 1
##$FTSIZE= 65536
##$FT_mod= 6
##$GAMMA= 0
##$GB= 0
##$INTBC= 1
##$INTSCL= 5.30512e-09
##$ISEN= 30
##$LB= 1
##$LEV0= 0
##$LPBIN= 0
##$MAXI= 10000
##$MC2= 0
##$MEAN= 0
##$ME_mod= 0
##$MI= 50
##$NCOEF= 0
##$NC_proc= -4
##$NLEV= 6
##$NOISF1= 182.463
##$NOISF2= 159.3651
##$NSP= 0
##$NTH_PI= 0
##$NZP= 0
##$OFFSET= 182.463
##$PC= 4
##$PHC0= -2774.029
##$PHC1= 125.0014
##$PH_mod= 1
##$PKNL= yes
##$PPARMOD= 0
##$PSCAL= 0
##$PSIGN= 0
##$REVERSE= no
##$SF= 81.0140089999434
##$SI= 65536
##$SIGF1= 159.3651
##$SIGF2= -187.1042
##$SINO= 113.3802
##$SIOLD= 16384
##$SREGLST= <1H.CDCl3>
##$SSB= 0
##$STSI= 65536
##$STSR= 0
##$SW_p= 29940.119760479
##$SYMM= 0
##$S_DEV= 0
##$TDeff= 32768
##$TDoff= 0
##$TI= <>
##$TILT= no
##$TM1= 0
##$TM2= 0
##$TOPLEV= 0
##$USERP1= <user>
##$USERP2= <user>
##$USERP3= <user>
##$USERP4= <user>
##$USERP5= <user>
##$WDW= 1
##$XDIM= 65536
##$YMAX_p= 357828615
##$YMIN_p= -6281724
$$ End of Bruker specific parameters
$$ ---------------------------------
##NTUPLES= NMR SPECTRUM
##VAR_NAME=  FREQUENCY,     SPECTRUM/REAL,   SPECTRUM/IMAG
##SYMBOL=    X,             R,               I
##VAR_TYPE=  INDEPENDENT,   DEPENDENT,       DEPENDENT
##VAR_FORM=  AFFN,          ASDF,            ASDF
##VAR_DIM=   65536,         65536,           65536
##UNITS=     HZ,            ARBITRARY UNITS, ARBITRARY UNITS
##FACTOR=    0.456856943014862, 1,           1
##FIRST=     14782.0589164792, 0,            0
##LAST=      -15158.0608439998, 0,           0
##MIN=       -15158.0608439998, -6281724,    0
##MAX=       14782.0589164792, 357828615,    0
$$ Real data points
##PAGE= N=1
##DATA TABLE= (X++(R..R)), XYDATA
$$ [...]
$$ plain form
41696 10586 94378 433674 857213 1129093 1115484 860108 491281 103272 -244286 -471608
41686 -471608 -502478 -342810 -90451 135416 252422 235789 142793 102801 204368 376343
41676 376343 452660 383166 309681 392233 625922 874318 1010017 968465 758372 511235
41666 511235 427056 541867 630017 497192 292105 299755 453560 347240 -174364 -710575
41656 -710575 -790519 -472782 -209142 -206989 -199551 120593 648551 968004 839351 494521
41646 494521 402460 734037 1128375 1094894 608865 137401 61380 281117 464052 447141
41636 447141 257796 -20339 -192054 11739 557540 948189 769863 279922 88965 328602
41626 328602 536059 373193 37917 -154755 -212155 -270435 -261170 -37707 340444 678117
$$ packed form
41696A0586Q3792L39296M23539K71880j3609k55376l68827l88009l47558k27322
41686d71608l0870J59668K52359K25867J17006j6633r2996l9992J01567J71975
41676C76343P6317o9494p3485Q2552K33689K48396J35699m1552k10093k47137
41666E11235q4179J14811Q8150j32825k05087P650J53805j06320n21604n36211
41656g10575p9944L17737K63640K153P438L20144N27958L19453j28653l44830
41646D94521r2061L31577L94338l3481m86029m71464p6021K19737J82935j6911
41636D47141j89345k78135j71715K03793N45801L90649j78326m89941j90957K39637
41626C28602K07457j62866l35276j92672n7400n8280R265K23463L78151L37673
$$ plain form
41616 678117 891727 1014757 1048965 960876 771321 548563 353671 228531 171659 133292
41606 133292 132248 317455 732007 1074264 962584 446741 -30562 -223142 -316023 -486008
41596 -486008 -580390 -421229 -133039 56512 107854 64379 -104814 -347937 -442311 -277680
41586 -277680 -29323 120084 191707 190789 -2328 -304782 -347669 -4181 351459 429483 466215
41575 466215 673086 687288 154694 -498945 -578096 -161936 101293 81243 223997 563973
41565 563973 571425 142817 -115501 100899 289594 60157 -177317 21908 325850 230106
41555 230106 -27640 129467 642757 965166 981181 1087529 1430538 1696801 1692495 1588874
41545 1588874 1511574 1349039 1080045 905550 933471 1036104 1103607 1165590 1205436 1119911
$$ packed form
41616F78117K13610J23030L4208q8089j89555k22758j94892j25140n6872l8367
41606A33292j044J85207M14552L42257j11680n15843m77303j92580r2881j69985
41596d86008r4382J59161K88190J89551N1342m3475j69193k43123r4374J64631
41586b77680K48357J49407P1623r18j93117l02454m2887L43488L55640P8024L6732
41575D66215K06871J4202n32594o53639p9151M16160K63229k0050J42754L39976
41565E63973P452m28608k58318K16400J88695k29437k37474J99225L03942r5744
41555B30106k57746J57107N13290L22409J6015J06348L43009K66263m306j03621
41545A588874p7300j62535k68994j74495K7921J02633O7503O1983L9846q5525
$$ plain form
41535 1119911 916752 718480 557210 410440 416147 735174 1167093 1235019 769380 153324
41525 153324 -120250 73701 515923 899341 976659 689893 275270 69688 143580 291042
41515 291042 385049 490370 593239 526582 270490 34791 -93054 -284867 -582870 -686683
41505 -686683 -389931 32364 184517 96148 70609 150389 130385 36305 160339 546548
41495 546548 818864 706153 457098 482806 755242 840414 494428 -15674 -253426 -112201
41485 -112201 144163 249919 196450 126174 109331 99640 27064 -143151 -369512 -470209 -204485
41474 -204485 430229 1056819 1274449 1132257 1028293 1129761 1168707 919856 607670 607216
41464 607216 905676 1125775 1036991 830698 872772 1307532 1898030 2174807 1804446 928602
$$ packed form
41535A119911k03159j98272j61270j46770N707L19027M31919O7926m65639o16056
41525A53324k73574J93951M42222L83418P7318k86766m14623k05582P3892J47462
41515B91042R4007J05321J02869o6657k56092k35699j27845j91813k98003j03813
41505f86683K96752M22295J52153q8369k5539P9780k0004r4080J24034L86209
41495E46548K72316j12711k49055K5708K72436Q5172l45986n10102k37752J41225
41485a12201K56364J05756n3469p0276j6843r691p2576j70215k26361j00697K65724
41474b04485O34714O26590K17630j42192j03964J01468L8946k48851l12186m54
41464F07216K98460K20099q8784k06293M2074M34760N90498K76777l70361q75844
$$ plain form
41454 928602 96034 -242853 -127371 94443 214722 285231 388788 495351 530479 435998
41444 435998 183704 -140392 -315448 -205009 47618 207886 280107 445313 700471 806824
41434 806824 648074 429478 427959 683295 996646 1118865 928948 573470 431201 758531
41424 758531 1349360 1729990 1698823 1454594 1189914 868388 502059 322869 460284 681908
41414 681908 684608 472446 252190 136987 157476 374090 737742 1004553 1028387 969003
41404 969003 971597 867420 518775 224448 325627 564527 383589 -167754 -414938 -52879
41394 -52879 426662 543063 508762 717855 1018997 1010006 737659 536846 361803 -104570
41384 -104570 -693763 -726048 57292 1012523 1345217 1016535 582606 384354 290866 144762
$$ packed form
41454I28602q32568l38887J15482K21814J20279P0509J03557J06563L5128r4481
41444D35998k52294l24096j75056J10439K52627J60268P2221J65206K55158J06353
41434H06824j58750k18596j519K55336L13351J22219j89917l55478j42269L27330
41424G58531N90829L80630l1167k44229k64680l21526l66329j79190J37415K21624
41414F81908K700k12162k20256j15203K0489K16614L63652K66811K3834n9384
41404I69003K594j04177l48645k94327J01179K38900j80938n51343k47184L62059
41394e2879M79541J16401l4301K09093L01142q991k72347k00813j75043m66373
41384a04570n89193l2285P83340R55231L32694l28682m33929j98252r3488j46104
$$ plain form
41374 144762 45059 87420 120623 -36126 -279235 -328907 -114767 112593 84310 -181409
41364 -181409 -416546 -371422 -25258 381215 499612 185418 -273517 -365454 99005 758140
41354 758140 1125133 1089515 830569 440627 -41937 -364485 -278391 -43523 -232401 -864010
41344 -864010 -1192430 -662499 308676 897959 919210 832076 915993 981261 875816 775822
41334 775822 856223 1036162 1169096 1203991 1093239 829956 633093 789964 1244418 1648590
41324 1648590 1883770 2172075 2579192 2829518 2806668 2802555 2970615 2952956 2484550 2025362
41314 2025362 2233160 2995000 3588221 3769200 4071141 4855279 5633537 5695604 5031704 4216152
41304 4216152 3608020 3120335 2696607 2535177 2700035 2856115 2645106 2145446 1721031
$$ packed form
41374A44762r9703M2361L3203j56749k43109m9672K14140K27360k8283k65719
41364a81409k35137M5124L46164M06473J18397l14194m58935r1937M64459O59135
41354G58140L66993l5618k58946l89942m82564l22548Q6094K34868j88878o31609
41344h64010l28420N29931R71175N89283K1251q7134Q3917O5268j05445r9994
41334G75822Q0401J79939J32934L4895j10752k63283j96863J56871M54454M04172
41324A648590K35180K88305M07117K50326k2850m113J68060j7659m68406m59188
41314B025362K07798P61840N93221J80979L01941P84138P78258O2067o63900q15552
41304D216152o08132m87685m23728j61430J64858J56080k11009m99660m24415
$$ plain form
41295 1721031 1533537 1472112 1502302 1738900 2085442 2142413 1725462 1239999 1206907 1535727
41285 1535727 1630616 1197762 585915 258749 266823 379861 450811 468293 473226 577947 851615
41274 851615 1072727 892113 411030 245396 733158 1410848 1643982 1462673 1302030 1191160
41264 1191160 826213 330057 233266 598157 810832 494568 69710 55867 294731 321121
41254 321121 164143 262009 738084 1229327 1405848 1297496 1093434 914982 835555 911308
41244 911308 1134241 1451356 1779685 1918736 1627138 999608 603142 924696 1752098 2411639
41234 2411639 2578342 2510670 2483245 2400305 2127897 1851315 1821128 1951981 1950216 1727077
41224 1727077 1446657 1236606 1080154 973564 980611 1093099 1193106 1216230 1248388 1389805
$$ packed form
41295A721031j87494o1425L0190K36598L46542N6971m16951m85463l3092L28820
41285A535727R4889m32854o11847l27166Q074J13038P0950J7482M933J04721K73668
41274H51615K21112j80614m81083j65634M87762O77690K33134j81309j60643j10870
41264A191160l64947m96156r6791L64891K12675l16264m24858j3843K38864K6390
41254C21121j56978R7866M76075M91243J76521j08352k04062j78452p9427P5753
41244I11308K22933L17115L28329J39051k91598o27530l96466L21554Q27402O59541
41234B411639J66703o7672k7425q2940k72408k76582l0187J30853j765k23139
41224A727077k80420k10051j56452j06590P047J12488J00007K3124L2158J41417
$$ plain form
41214 1389805 1577875 1619431 1421252 1176854 1267935 1889507 2758236 3297952 3189264 2673212
41204 2673212 2254535 2190649 2350794 2465527 2363810 2030938 1611982 1350509 1370861 1524808
41194 1524808 1601511 1663818 1977063 2606382 3336206 4038156 4812084 5616082 6096104 6087746
41184 6087746 6012562 6337816 6783216 6574430 5508740 4264601 3493672 3082717 2610069
41175 2610069 2107762 1906758 1974542 1925405 1630770 1364612 1309544 1323646 1294934 1359485
41165 1359485 1601399 1840961 1921788 1956023 2064406 2098376 1888265 1596529 1513044 1589410
41155 1589410 1507566 1214333 1056342 1256468 1519265 1386561 859400 422240 449554 787812
41145 787812 1005761 910956 671047 503404 453082 512204 743523 1119185 1373691 1258663
$$ packed form
41214A389805J88070M1556j98179k44398R1081O21572Q68729N39716j08688n16052
41204B673212m18677o3886J60145J14733j01717l32872m18956k61473K0352J53947
41194A524808P6703O2307L13245O29319P29824P01950P73928Q03998M80022q358
41184F087746p5184L25254M45400k08786j065690j244139p70929m10955m72648
41175B610069n02307k01004O7784m9137k94635k66158n5068J4102k8712O4551
41165A359485K41914K39562Q0827L4235J08383L3970k10111k91736q3485P6366
41155A589410q1844k93233j57991K00126K62797j32704n27161m37160K7314L38258
41145G87812K17949r4805k39909j67643n0322N9122K31319L75662K54506j15028
$$ plain form
41135 1258663 925656 829979 1202671 1803050 2255579 2434345 2413529 2250999 2013863 1874897
41125 1874897 1961787 2175767 2337225 2437780 2565366 2671016 2655118 2637727 2857867 3280403
41115 3280403 3590221 3657975 3723837 3972600 4210866 4212817 4170054 4480312 5196415 6008228
41105 6008228 6755748 7659568 8977303 10668699 12504793 14359959 16344274 18790722
41097 18790722 22138674 26710496 32690002 40517271 50955104 63850870 76442338 83760001
41089 83760001 81979950 71748967 57767282 44954397 35303678 28181518 22549182 18128381
41081 18128381 14933859 12701095 11044083 9751843 8732811 7889397 7144188 6439548
41073 6439548 5703638 4966318 4444320 4288315 4289530 4100398 3741821 3600348 3852204 4155586
$$ packed form
41135A258663l33007r5677L72692O00379M52529J78766k0816j62530k37136j38966
41125A874897Q6890K13980J61458J00555J27586J05650j5898j7391K20140M22536
41115C280403L09818O7754O5862K48763K38266J951m2763L10258P16103Q11813
41105F008228P47520R03820J317735J691396J836094J855166J984315K446448
41097A8790722L347952M571822N979506P827269J0437833J2895766J2591468P317663
41089H3760001j780051j0230983j3981685j2812885r650719p122160n632336m420801
41081A8128381l194522k232764j657012j292240j019032q43414p45209p04640
41073F439548p35910p37320n21998j56005J215j89132l58577j41473K51856L03382
$$ plain form
41063 4155586 4046685 3458237 2737257 2300353 2343995 2724534 3031694 2919818 2432047 1873829
41053 1873829 1389477 909310 530230 584184 1134536 1706385 1805542 1508389 1250981 1204089
41043 1204089 1196726 1162612 1283036 1648683 2088853 2428066 2668994 2825098 2808623 2634693
41033 2634693 2535831 2660801 2784738 2574745 2123663 1951108 2355032 2964871 3160994 2835812
41023 2835812 2446787 2300823 2151257 1731726 1372631 1629646 2382614 2811883 2423445
41014 2423445 1685005 1366939 1570766 1793176 1763540 1748937 1993552 2264273 2184289 1804555
41004 1804555 1560920 1683919 1887056 1768332 1381469 1170270 1328172 1509654 1361953
40995 1361953 1096295 1192278 1665487 2046479 2084489 2031870 2119320 2182923 2035359 1830799
$$ packed form
41063D155586j08901n88448p20980m36904M3642L80539L07160j11876m87771n58218
41053A873829m84352m80167l79080N3954N50352N71849R9157k97153k57408m6892
41043A204089p363l4114J20424L65647M40170L39213K40928J56104j6475j73930
41033B634693r8862J24970J23937k09993m51082j72555M03924O09839J96123l25182
41023B835812l89025j45964j49566m19531l59095K57015P52968M29269l88438
41014B423445p38440l18066K03827K22410k9636j4603K44615K70721p9984l79734
41004A804555k43635J22999K03137j18724l86863k11199J57902J81482j47701
40995A361953k65658R5983M73209L80992L8010n2619Q7450O3603j47564k04560
$$ plain form
40985 1830799 1771781 1761134 1650338 1558684 1619270 1658770 1484868 1272137 1282979 1393029
40975 1393029 1297332 1040898 926782 999931 1040094 1003464 1061305 1224576 1307205 1246358 1120520
40964 1120520 910767 611265 497385 858219 1498677 1930909 2020887 1998060 1887080 1485766
40954 1485766 936186 727684 993781 1341109 1524374 1738843 2057000 2164555 1943080
40945 1943080 1760987 1839673 1855430 1573051 1370665 1635458 2046024 2003643 1505326 1097053
40935 1097053 1168581 1706199 2511835 3261639 3577734 3434871 3268846 3342912 3334222 2938681
40925 2938681 2466522 2296744 2155224 1637316 1117411 1295646 2006488 2377968 2170883
40916 2170883 2042671 2327908 2483187 2110055 1693937 1773479 2033947 1877546 1430198 1307023
$$ packed form
40985A830799n9018j0647j10796r1654O0586L9500j73902k12731J0842J10050
40975A393029r5697k56434j14116P3149M0163l6630N7841J63271Q2629o0847j25838
40964A120520k09753k99502j13880L60834O40458M32232Q9978k2827j10980m01314
40954A485766n49580k08502K66097L47328J83265K14469L18157J07555k21475
40945A943080j82093P8686J5757k82379k02386K64793M10566m2381m98317m08273
40935A097053P1528N37618Q05636P49804L16095j42863j66025P4066q690l95541
40925B938681m72159j69778j41520n17908n19905J78235P10842L71480k07085
40916B170883j28212K85237J55279l73132m16118P9542K60468j56401m47348j23175
$$ plain form
40906 1307023 1661192 2094960 2351340 2511293 2572574 2375373 1986678 1710429 1634080 1542726
40896 1542726 1368621 1342286 1533256 1598924 1273842 859997 873190 1313699 1674960 1703008
40886 1703008 1743764 2126992 2553099 2493538 2020042 1731540 1838459 1842716 1341464 686247
40876 686247 474660 730205 1030852 1210358 1426885 1650281 1602857 1245434 899278 814460
40866 814460 963779 1295923 1815548 2335030 2509230 2250228 1842052 1581026 1565065 1821952
40856 1821952 2281431 2603998 2461170 2067809 2011074 2443227 2887523 2971128 2853655 2743559
40846 2743559 2543409 2278480 2320038 2743540 2956983 2506950 1859134 1783716 2272569 2702935
40836 2702935 2849182 3028336 3317982 3337841 2914643 2384560 2071524 1939047 1911700 2083534
$$ packed form
40906A307023L54169M33768K56380J59953O1281j97201l88695k76249p6349r1354
40896A542726j74105k6335J90970O5668l25082m13845J3193M40509L61261K8048
40886A703008M0756L83228M26107n9561m73496k88502J06919M257n01252o55217
40876F86247k11587K55545L00647J79506K16527K23396m7424l57423l46156q4818
40866H14460J49319L32144N19625N19482J74200k59002m08176k61026j5961K56887
40856A821952M59479L22567j42828l93361n6735M32153M44296Q3605j17473j10096
40846B743559k00150k64929M1558M23502K13443m50033o47816p5418M88853M30366
40836B702935J46247J79154K89646J9859m23198n30083l13036j32477k7347J71834
$$ plain form
40826 2083534 2396202 2502308 2203354 1747554 1494483 1524004 1718850 1958612 2070681 1877490
40816 1877490 1507129 1407836 1815823 2420591 2812930 3074635 3606552 4465058 5200286 5390968
40806 5390968 5092099 4660093 4316104 4030487 3753596 3577443 3598723 3713002 3678227 3397617
40796 3397617 3027166 2752086 2576151 2427924 2349228 2407030 2490110 2397275 2128933 1914705
40786 1914705 1921310 2082658 2256537 2405501 2553906 2667871 2652795 2432368 2018973 1550576
40776 1550576 1233960 1181968 1324865 1524580 1703172 1795653 1707794 1468696 1316532 1440884
40766 1440884 1708788 1838635 1781070 1718454 1747911 1806677 1880232 2030834 2220982 2352249
40756 2352249 2479773 2736682 3042645 3158553 3050442 2921147 2858022 2747922 2569102 2433507
$$ packed form
40826B083534L12668J06106k98954m55800k53071K9521J94846K39762J12069j93191
40816A877490l70361r9293M07987O04768L92339K61705N31917Q58506P35228J90682
40806E390968k98869m32006l43989k85617k76891j76153K1280J14279l4775k80610
40796C397617l70451k75080j75935j48227p8696N7802Q3080r2835k68342k14228
40786A914705O605J61348J73879J48964J48405J13965j5076k20427m13395m68397
40776A550576l16616n1992J42897J99715J78592R2481q7859k39098j52164J24352
40766A440884K67904J29847n7565o2616K9457N8766P3555J50602J90148J31267
40756B352249J27524K56909L05963J15908j08111j29295o3125j10100j78820j35595
$$ plain form
40746 2433507 2295730 2001124 1704125 1805710 2320156 2758981 2870898 3017761 3491911
40737 3491911 3956937 4047732 4100888 4660781 5511299 5857088 5377219 4502314 3681788 2978269
40727 2978269 2444666 2305032 2546844 2769295 2645585 2224709 1693084 1209710 1042781
40718 1042781 1417038 2080991 2461613 2406977 2318604 2382924 2234737 1690895 1239951 1322506
40708 1322506 1605272 1535067 1213458 1086072 1100959 921877 764949 1178221 1991668 2319440
40698 2319440 1799545 1106525 948658 1205087 1407052 1463254 1447245 1185461 610246 152013
40688 152013 231515 631642 876229 965347 1186018 1423969 1300427 894474 689003 781776
40678 781776 757352 441316 198369 287818 450513 407560 322958 458347 736641 974212
$$ packed form
40746B433507j37777k94606k96999J01585N14446M38825J11917J46863M74150
40737C491911M65026R0795N3156N59893Q50518L45789m79869q74905q20526p03519
40727B978269n33603j39634K41812K22451j23710m20876n31625m83374j66929
40718A042781L74257O63953L80622n4636q8373O4320j48187n43842m50944Q2555
40708A322506K82766p0205l21609j27386J4887j79082j56928M13272Q13447L27772
40698B319440n19895o93020j57867K56429K01965N6202j6009k61784n75215m58233
40688A52013P9502M00127K44587Q9118K20671K37951j23542m05953k05471R2773
40678G81776k4424l16036k42947Q9449J62695m2953q4602J35389K78294K37571
$$ plain form
40668 974212 1234917 1611649 1905081 1865610 1578637 1303794 1085243 812051 535019 441501
40658 441501 599656 944168 1400926 1825689 1974472 1770660 1463270 1299587 1212403 1074703
40648 1074703 1046551 1326853 1727712 1889624 1832158 1908500 2260132 2682427 3003334 3244343
40638 3244343 3439019 3645468 4071882 4763028 5213813 4831759 3857959 3271939 3585256
40629 3585256 4255778 4585639 4688010 5121575 5948323 6687551 7027663 7108923 7152943 7188642
40619 7188642 7151474 6978742 6588209 5935614 5071405 4058620 2984123 2146166 1945291
40610 1945291 2338705 2664450 2355514 1637445 1144077 1023565 898434 619570 497613
40601 497613 678403 785473 436491 -224548 -773046 -1042806 -1183782 -1365389 -1635849 -1930895
$$ packed form
40668I74212K60705L76732K93432l9471k86973k74843k18551k73192k77032r3518
40658D41501J58155L44512M56758M24763J48783k03812l07390j63683q7184j37700
40648A074703k8152K80302M00859J61912n7466P6342L51632M22295L20907K41009
40638C244343J94676K06449M26414O91146M50785l82054r73800n86020L13317
40629C585256O70522L29861J02371M33565Q26748P39228L40112Q1260M4020L5699
40619G188642l7168j72732l90533o52595q64209j012785j074497q37957k00875
40610A945291L93414L25745l08936p18069m93368j20512j25131k78864j21957
40601D97613J80790J07070l48982o61039n48498k69760j40976j81607k70460k95046
$$ plain form
40591 -1930895 -2040758 -1724103 -1055185 -510072 -465033 -712368 -742387 -442170 -188242 -209449
40581 -209449 -225688 60530 403307 322237 -140176 -408146 -198360 66481 -75803 -400413
40571 -400413 -351670 85608 380809 280985 110454 141254 174307 -6717 -203044 -153778
40561 -153778 31936 148102 270601 469560 469315 93513 -213738 93415 770280 1045677
40551 1045677 741834 468228 618648 854130 813830 701566 795724 924277 900570 1043619
40541 1043619 1705121 2550741 2872165 2497222 1923450 1625335 1650590 1839544 2016025 1965871
40531 1965871 1625624 1317782 1416940 1740864 1679737 1043426 383065 274145 629346 980884
40521 980884 1144178 1268596 1436497 1584290 1730415 1932227 2037590 1811887 1352487 1061572
$$ packed form
40591a930895j09863L16655O68918N45113M5039k47335l0019L00217K53928k1207
40581b09449j6239K86218L42777q1070m62413k67970K09786K64841j42284l24610
40571d00413M8743M37278K95201r9824j70531L0800L3053j81024j96327M9266
40561a53778J85714J16166J22499J98959k45l75802l07251L07153O76865K75397
40551A045677l03843k73606J50420K35482m0300j12264R4158J28553k3707J43049
40541A043619O61502Q45620L21424l74943n73772k98115K5255J88954J76481n0154
40531A965871l40247l07842R9158L23924o1127o36311o60361j08920L55201L51538
40521I80884J63294J24418J67901J47793J46125K01812J05363k25703m59400k90915
$$ plain form
40511 1061572 1109091 1222279 1161127 1097892 1265215 1482813 1396152 1035903 737536 578416
40501 578416 355272 146257 363643 1039386 1560635 1482802 1187549 1258793 1553586 1503318
40491 1503318 1126048 1020610 1355106 1579213 1329950 975258 936555 1037889 959792 871880
40481 871880 1084550 1393499 1332273 901258 522996 370681 247462 110947 214892 626873
40471 626873 1019038 1112767 1042062 1115177 1426299 1826123 2105161 2115950 1865808 1557114
40461 1557114 1409535 1419081 1423216 1378366 1386685 1460968 1481312 1406878 1319929 1235257 1094447
40450 1094447 995907 1180837 1678227 2164572 2303170 2075127 1690174 1343615 1167681 1247132
40440 1247132 1521649 1768221 1805787 1660312 1467172 1302578 1176984 1107202 1124398 1247649
$$ packed form
40511A061572M7519J13188o1152o3235J67323K17598q6661l60249k98367j59120
40501E78416k23144k09015K17386O75743N21249p7833k95253P1244K94793n0268
40491A503318l77270j05438L34496K24107k49263l54692l8703J01334p8097q7912
40481H71880K12670L08949o1226m31015l78262j52315j23219j36515J03945M11981
40471F26873L92165R3729p0705P3115L11122L99824K79038J0789k50142l08694
40461A557114j47579R546M135m4850Q319P4283K0344p4434q6949q4672j40810
40450A094447r8540J84930M97390M86345J38598k28043l84953l46559j75934P9451
40440A247132K74517K46572L7566j45475j93140j64594j25594o9782J7196J23251
$$ plain form
40430 1247649 1440640 1537179 1305954 760162 320504 413113 925818 1346486 1441499 1447068
40420 1447068 1523601 1449936 1090720 787728 923200 1333281 1529566 1364734 1144230 1181916
40410 1181916 1555365 2194542 2868295 3148042 2758689 1989001 1433305 1294714 1258443 1088368
40400 1088368 973131 1135595 1442510 1644945 1758795 1933356 2107655 2080941 1845507 1597339
40390 1597339 1450733 1376038 1417599 1719756 2237668 2620224 2562947 2204589 2007980 2247759
40380 2247759 2750591 3174832 3401839 3533861 3614773 3568661 3431308 3420615 3642953 3893586
40370 3893586 3956168 4009055 4467092 5389941 6301233 6733631 6767876 6830421 7072280 7214619
40360 7214619 7022268 6662646 6437533 6340276 6131444 5800648 5663742 5902038 6242457 6296380
$$ packed form
40430A247649J92991R6539k31225n45792m39658R2609N12705M20668R5013N569
40420A447068P6533p3665l59216l02992J35472M10081J96285j64832k20504L7686
40410A181916L73449O39177O73753K79747l89353p69688n55696j38591l6271j70075
40400A088368j15237J62464L06915K02435J13850J74561J74299k6714k35434k48168
40390A597339j46606p4695M1561L02157N17912L82556n7277l58358j96609K39779
40380B247759N02832M24241K27007J32022Q0912m6112j37353j0693K22338K50633
40370C893586O2582N2887M58037R22849R11292M32398L4245O2545K41859J42339
40360G214619j92351l59622k25113r7257k08832l30796j36906K38296L40419N3923
$$ plain form
40350 6296380 6060373 5832559 5736032 5645829 5580156 5785719 6285217 6679926 6675574 6546353
40340 6546353 6718122 7056643 7008911 6433765 5836765 5636136 5596501 5275327 4740294 4455258
40330 4455258 4574365 4747013 4657525 4413997 4259285 4175830 4021080 3885767 4016683 4409889
40320 4409889 4747306 4794042 4647231 4521999 4513678 4684272 5135376 5789336 6326590 6633896
40310 6633896 7125461 8230558 9675214 10740526 11226723 11640851 12321738 12957471 13265276
40301 13265276 13603760 14424320 15514467 16346509 16891607 17471315 17977041 17910353 17189798
40292 17189798 16296478 15545258 14791512 13967594 13297804 12764978 11956212 10764570 9716227
40283 9716227 9204035 8868776 8208363 7388104 6894571 6697476 6366959 5842576 5467339
$$ packed form
40350F296380k36007k27814r6527r0203o5673K05563M99498L94709m352j29221
40340F546353J71769L38521m7732n75146n97000k00629l9635l21174n35033k85036
40330D455258J19107J72648q9488k43528j54712q3455j54750j35313J30916L93206
40320D409889L37417M6736j46811j25232q321J70594M51104O53960N37254L07306
40310F633896M91565J105097J444656J065312M86197M14128O80887O35733L07805
40301A3265276L38484Q20560J090147Q32042N45098N79708N05726o6688p20555
40292A7189798q93320p51220p53746q23918o69790n32826q08766j191642j048343
40283I716227n12192l35259o60413q20259m93533j97095l30517n24383l75237
$$ plain form
40274 5467339 5320204 5114673 4805570 4732685 5011566 5276443 5254311 5173384 5310072 5468450
40264 5468450 5272802 4781216 4442271 4495448 4718004 4809009 4789237 4876858 5068516 5034222
40254 5034222 4519881 3767203 3344602 3496166 3822022 3752502 3216825 2639658 2350297 2252327
40244 2252327 2106524 1902455 1818568 1939700 2148115 2271954 2274823 2272360 2348549 2401766 2286535
40233 2286535 2091527 2064319 2191947 2133439 1756604 1446248 1554780 1808305 1722992 1449597
40223 1449597 1627750 2396870 3158333 3494231 3745746 4341228 5033156 5282114 5095390
40214 5095390 4968833 5117354 5219320 4929528 4300953 3651668 3267530 3282717 3650022 4148359
40204 4148359 4505526 4541065 4207870 3634655 3164639 3113077 3334716 3273223 2668686 1984979
$$ packed form
40274E467339j47135k05531l09103p2885K78881K64877k2132q0927J36688J58378
40264E468450j95648m91586l38945N3177K22556R1005j9772Q7621J91658l4294
40254E034222n14341p52678m22601J51564L25856o9520n35677n77167k89361r7970
40244B252327j45803k04069q3887J21132K08415J23839K869k463P6189N3217j15231
40233B286535j95008k7208J27628n8508l76835l10356J08532K53525q5313k73395
40223A449597J78153P69120P61463L35898K51515N95482O91928K48958j86724
40214E095390j26557J48521J01966k89792o28575o49285l84138J5187L67305M98337
40204D148359L57167L5539l33195n73215m70016n1562K21639o1493o04537o83707
$$ plain form
40194 1984979 1827352 2132224 2324829 2163969 1980851 2067340 2264132 2299002 2196675 2156835
40184 2156835 2245676 2379370 2471052 2487839 2476151 2550723 2692919 2581493 1895905 840174
40174 840174 67950 -39102 254883 528493 749335 1081581 1433060 1577297 1593566 1786407
40164 1786407 2163334 2344222 2093170 1668121 1484801 1627168 1876181 2092780 2338558
40155 2338558 2627831 2785771 2686089 2523262 2665706 3210231 3815879 4064199 3897243 3599995
40145 3599995 3428556 3399533 3407025 3374673 3268670 3108334 3003624 3045473 3117863 2973181
40135 2973181 2569403 2188854 2127581 2395065 2808723 3221468 3514488 3530230 3234807 2858673
40125 2858673 2652470 2553556 2321869 1973874 1806434 1939460 2109920 2064664 1934493 2005096
$$ packed form
40194A984979j57627L04872J92605j60860j83118Q6489J96792L4870j02327l9840
40184B156835Q8841J33694R1682J6787j1688P4572J42196j11426o85588j055731
40174H40174p72224j07052K93985K73610K20842L32246L51479J44237J6269J92841
40164A786407L76927J80888k51052m25049j83320J42367K49013K16599K45778
40155B338558K89273J57940r9682j62827J42444N44525O05648K48320j66956k97248
40145C599995j71439k9023P492l2352j06003j60336j04710M1849P2390j44682
40135B973181m03778l80549o1273K67484M13658M12745K93020J5742k95423l76134
40125B858673k06203r8914k31687l47995j67440J33026J70460m5256j30171P0603
$$ plain form
40115 2005096 2258683 2386855 2208809 1855095 1537131 1345030 1317809 1501371 1809005 1975258
40105 1975258 1816483 1466916 1217063 1176811 1236661 1293195 1322144 1257491 1032480 791047
40095 791047 830734 1214388 1620074 1717748 1536820 1315120 1164596 1092758 1184053 1469287
40085 1469287 1704222 1585613 1168302 787583 582440 402901 199849 146995 283215 396351
40075 396351 429866 654375 1188155 1659676 1665073 1318578 1005256 794424 496140 157547
40065 157547 54118 215103 377435 442891 582338 818683 919645 843252 879210 1125514
40055 1125514 1217551 904681 563370 706895 1202970 1462291 1306300 1136239 1213199 1294748
40045 1294748 1168748 1062932 1185292 1247353 920126 523608 686245 1344338 1658201 1115057
$$ packed form
40115B005096K53587J28172j78046l53714l17964j92101k7221J83562L07634J66253
40105A975258j58775l49567k49853m0252N9850N6534K8949o4653k25011k41433
40095G91047L9687L83654M05686R7674j80928k21700j50524p1838R1295K85234
40085A469287K34935j18609m17311l80719k05143j79539k03052n2854J36220J13136
40075C96351L3515K24509N33780M71521N397l46495l13322k10832k98284l38593
40065A57547j03429J60985J62332O5456J39447K36345J00962p6393L5958K46304
40055A125514R2037l12870l41311J43525M96075K59321j55991j70061P6960Q1549
40045A294748j26000j05816J22360O2061l27227l96518J62637O58093L13863n43144
$$ plain form
40035 1115057 250062 -42358 424124 1102966 1485905 1471501 1133203 614015 248788 337806
40025 337806 694955 797670 511310 297315 531707 992925 1289977 1457833 1758902 2134801
40015 2134801 2287226 2206775 2218787 2493570 2833147 2988856 2931663 2761032 2569487 2446138
40005 2446138 2423352 2379335 2156767 1792978 1474611 1277083 1129807 1022637 1035649 1150200
39995 1150200 1236134 1259850 1321701 1458819 1579286 1600847 1495276 1234889 894455 730166
39985 730166 870664 985282 641088 24422 -124905 528027 1398300 1676761 1247679 647967
39975 647967 363754 463217 746437 964885 987475 951665 1131142 1500774 1632133 1227931
39965 1227931 557518 124633 106095 377247 851471 1428645 1787237 1665687 1299974 1193771
$$ packed form
40035A115057q64995k92420M66482O78842L82939j4404l38298n19188l65227Q9018
40025C37806L57149J02715k86360k13995K34392M61218K97052J67856L01069L75899
40015B134801J52425q0451J2012K74783L39577J55709n7193j70631j91545j23349
40005B446138k2786m4017k22568l63789l18367j97528j47276j07170J3012J14551
39995A150200Q5934K3716O1851J37118J20467K1561j05571k60387l40434j64289
39985G30166J40498J14618l44194o16666j49327O52932Q70273K78461m29082n99712
39975F47967k84213R9463K83220K18448K2590l5810J79477L69632J31359m04202
39965A227931o70413m32885j8538K71152M74224N77174L58592j21550l65713j06203
$$ plain form
39955 1193771 1461496 1744751 1764995 1591162 1335727 965970 516776 168131 -5244 -89174
39945 -89174 -55249 265605 818976 1241259 1309111 1215048 1207791 1195930 944379 503640 201376
39934 201376 260965 578292 842028 806942 511877 248793 225678 301684 229208 92184
39924 92184 201969 541629 680538 378280 -68836 -286999 -313654 -367958 -416617 -291063
39914 -291063 -32252 205202 437441 738569 999133 1114205 1260518 1622911 1957843 1838850
39904 1838850 1309623 896525 931546 1212234 1387765 1344925 1136623 864768 747521 980889
39894 980889 1381499 1460849 1037441 520479 395390 662471 986339 1165607 1196666 1060599
39884 1060599 756918 474006 461916 745626 1138786 1493947 1762867 1862970 1698000 1336800
$$ packed form
39955A193771K67725K83255K0244j73833k55435l69757m49194l48645j73375q3930
39945h9174L3925L20854N53371M22283O7852r4063p257j1861k51551m40739l02264
39934B01376N9589L17327K63736l5086k95065k63084k3115P6006p2476j37024
39924I2184J09785L39660J38909l02258m47116k18163k6655n4304m8659J25554
39914b91063K58811K37454K32239L01128K60564J15072J46313L62393L34932j18993
39904A838850n29227m13098L5021K80688J75531m2840k08302k71855j17247K33368
39894I80889M00610P9350m23408n16962j25089K67081L23868J79268L1059j36067
39884A060599l03681k82912j2090K83710L93160L55161K68920J00103j64970l61200
$$ plain form
39874 1336800 1019677 940182 1088373 1293756 1358111 1203146 981239 979725 1298791 1667440
39864 1667440 1701585 1328663 857715 640210 733773 877662 747705 276433 -251442 -501547
39854 -501547 -492307 -529371 -697583 -679958 -252712 305411 595248 685996 938403 1354393
39844 1354393 1554705 1426388 1345365 1603121 1983809 2127474 2021285 1893547 1852387 1868183
39834 1868183 1923724 1950003 1786959 1450092 1275415 1520828 1930852 1986078 1542047 964131
39824 964131 645627 628456 704394 668932 443300 136983 30634 332503 909070 1390501
39814 1390501 1558374 1489896 1323370 1073942 746973 467574 370791 425310 449934 299845
39804 299845 29398 -124465 26744 384101 658056 759378 923568 1309522 1680239 1744398
$$ packed form
39874A336800l17123p9495J48191K05383O4355j54965k21907j514L19066L68649
39864A667440L4145l72922m70948k17505R3563J43889j29957m71272n27875k50105
39854e01547R240l7064j68212J7625M27246N58123K89837R0748K52407M15990
39844A354393K00312j28317q1023K57756L80688J43665j06189j27738m1160J5796
39834A868183N5541K6279j63044l36867j74677K45413M10024N5226m44031n77916
39824I64131l18504j7171P5938l5462k25632l06317j06349L01869N76567M81431
39814A390501J67873o8478j66526k49428l26969k79399r6783N4519K4624j50089
39804B99845k70447j53863J51209L57357K73955J01322J64190L85954L70717O4159
$$ plain form
39794 1744398 1651203 1776876 2081694 2102337 1652254 1129122 958135 1069450 1145526 1092869
39784 1092869 1000513 859811 629462 448905 516395 817040 1162476 1423150 1565995 1573772
39774 1573772 1495633 1470615 1545890 1593755 1549348 1554435 1684178 1740833 1574886 1416048 1562559
39763 1562559 1891558 2044754 2002076 2063578 2278304 2302143 1900714 1255063 685636 377440
39753 377440 428733 810938 1172572 1061882 539067 236635 579396 1239674 1625970 1629786
39743 1629786 1563548 1593708 1640676 1727611 2007606 2412243 2616132 2467581 2216365 2172190
39733 2172190 2289314 2244725 1878625 1430487 1280766 1488002 1692124 1572687 1300040 1300057
39723 1300057 1588729 1677638 1289192 825969 814486 1138745 1263767 1097075 1108452 1520099
$$ packed form
39794A744398r3195J25673L04818K0643m50083n23132j70987J11315P6076n2657
39784A092869r2356j40702k30349j80557O7490L00645L45436K60674J42845P777
39774A573772p8139k5018P5275M7865m4407N087J29743N6655j65947j58838J46511
39763A562559L28999J53196m2678O1502K14726K3839m01429o45651n69427l08196
39753C77440N1293L82205L61634j10690n22815l02432L42761O60278L86296L816
39743A629786o6238L0160M6968Q6935K79995M04637K03889j48551k51216m4175
39733B172190J17124m4589l66100m48138j49721K07236K04122j19437k72647J7
39723A300057K88672Q8909l88446m63223j1483L24259J25022j66692J1377M11647
$$ plain form
39713 1520099 1876018 1687428 1151958 870818 1047645 1331923 1371113 1162844 849921 509119
39703 509119 268213 352437 796230 1273718 1438365 1325436 1195907 1085153 820454 474812
39693 474812 417592 753372 1058571 972132 775102 973680 1471833 1664867 1354401 1034276
39683 1034276 1089661 1212182 964384 538503 464933 766471 930709 720423 538814 830055
39673 830055 1452228 1877472 1831009 1509310 1233525 1077077 891368 620189 464076 636975
39663 636975 1014318 1218041 1105927 953227 1002566 1077642 923506 742727 990962 1673955
39653 1673955 2257812 2373624 2254258 2294765 2479139 2500720 2259087 1952820 1747340 1597531
39643 1597531 1435440 1375505 1628673 2220564 2855760 3156279 3067993 2905842 2897859 2859435
$$ packed form
39713A520099L55919j88590n35470k81140J76827K84278L9190k08269l12923l40802
39703E09119k40906Q4224M43793M77488J64647j12929j29529j10754k64699l45642
39693D74812n7220L35780L05199q6439j97030J98578M98153J93034l10466l20125
39683A034276N5385J22521k47798m25881p3570L01538J64238k10286j81609K91241
39673H30055O22173M25244m6463l21699k75785j56448j85709k71179j56113J72899
39663F36975L77343K03723j12114j52700M9339P5076j54136j80779K48235O82993
39653A673955N83857J15812j19366M0507J84374K1581k41633l06267k05480j49809
39643A597531j62091n9935K53168N91891O35196L00519q8286j62151p983l8424
$$ plain form
39633 2859435 2545413 2165509 2176266 2594264 2939352 2945038 2894372 3064575 3273983 3298659
39623 3298659 3354759 3723877 4170069 4245205 4037086 4074999 4493793 4813749 4678331 4348162
39613 4348162 4224485 4245517 4071376 3643297 3234171 3031658 2934965 2767298 2520822 2351346
39603 2351346 2385696 2536413 2534971 2246759 1925332 1961913 2339900 2569238 2297827 1781134
39593 1781134 1546008 1751739 2121753 2381957 2475505 2392248 2103560 1732568 1531832 1574252
39583 1574252 1651626 1585125 1461128 1439447 1497547 1517933 1480955 1390720 1143265 701786 322953
39572 322953 336801 694907 995699 1023857 1017579 1266247 1653777 1805558 1566179 1125654
39562 1125654 735429 493976 396817 423549 539549 707702 894018 992264 828925 394419
$$ packed form
39633B859435l14022l79904J0757M17998L45088N686n0666J70203K09408K4676
39623C298659N6100L69118M46192P5136k08119L7913M18794L19956j35418l30169
39613D348162j23677K1032j74141m28079m09126k02513r6693j67667k46476j69476
39603B351346L4350J50717j442k88212l21427L6581L77987K29338k71411n16693
39593A781134k35126K05731L70014K60204R3548q3257k88688l70992k00736M2420
39583A574252P7374o6501j23997k1681N8100K0386l6978r0235k47455m41479l78833
39572C22953J3848L58106L00792K8158o278K48668L87530J51781k39379m40525
39562A125654l90225k41453r7159K6732J16000J68153J86316R8246j63339m34506
$$ plain form
39552 394419 -3117 -25921 272783 538706 617360 681635 806151 762081 439990 173135
39542 173135 311549 661925 721750 386811 51795 15142 164397 324017 526861 759187
39532 759187 793946 577520 513042 971632 1660651 1894127 1483507 965604 855044 1043576
39522 1043576 1146524 1129955 1264758 1623398 1971498 2127907 2140820 2094034 2014127 2022385
39512 2022385 2291488 2715677 2883839 2601414 2254193 2389165 3034265 3695601 3974750
39503 3974750 3912008 3717447 3463637 3157273 2878977 2685778 2520594 2352459 2271184 2312883
39493 2312883 2339144 2258412 2234039 2452581 2768451 2833054 2573507 2302784 2300188 2494847
39483 2494847 2656637 2704757 2684170 2595347 2438931 2335923 2398712 2520603 2499689 2373360
$$ packed form
39552C94419l97536k2804K98704K65923P8654O4275J24516m4070l22091k66855
39542A73135J38414L50376N9825l34939l35016l6653J49255J59620K02844K32326
39532G59187L4759k16426o4478M58590O89019K33476m10620n17903j10560J88532
39522A043576J02948j6569J34803L58640L48100J56409J2913m6786p9907Q258
39512B022385K69103M24189J68162k82425l47221J34972O45100O61336K79149
39503C974750o2742j94561k53810l06364k78296j93199j65184j68135q1275M1699
39493B312883K6261q0732k4373K18542L15870O4603k59547k70723k596J94659
39483B494847J61790M8120k0587q8823j56416j03008O2789J21891k0914j26329
$$ plain form
39473 2373360 2399303 2629019 2740254 2482187 2104249 2056546 2336544 2468054 2191994 1850122
39463 1850122 1878140 2164869 2218826 1858694 1425283 1309650 1537049 1869129 2091848 2116409
39453 2116409 1972796 1796797 1705189 1658076 1594187 1680246 2157602 2873213 3265166 2993732
39443 2993732 2340248 1775097 1382162 993906 672819 662863 935655 1150625 1081855 802755
39433 802755 462667 185031 179363 585774 1117334 1208783 695701 64231 -155681 26568
39423 26568 295556 555699 891254 1185901 1173379 844974 495451 335338 308559 325340
39413 325340 422995 609730 758216 771837 712595 676407 680993 749817 928791 1095159 936695
39402 936695 342306 -288934 -383386 157689 845665 1171569 1100454 944152 929101 1016292
$$ packed form
39473B373360K5943K29716J11235k58067l77938m7703K79998J31510k76060l41872
39463A850122K8018K86729N3957l60132m33411j15633K27399L32080K22719K4561
39453B116409j43613j75999r1608m7113o3889Q6059M77356P15611L91953k71434
39443B993732o53484n65151l92935l88256l21087r956K72792K14970o8770k79100
39433H02755l40088k77636n668M06411N31560R1449n13082o31470k19912J82249
39423B6568K68988K60143L35555K94647j2522l28405l49523j60113k6779J6781
39413C25340R7655J86735J48486J3621n9242l6188M586O8824J78974J66368j58464
39402I36695n94389o31240r4452N41075O87976L25904p1115j56302j5051Q7191
$$ plain form
39392 1016292 1034880 874392 610474 499642 736011 1146456 1291685 995510 596033 486617
39382 486617 599984 632906 617083 845206 1253411 1346172 886273 264876 -41381 -41941 14801
39371 14801 143639 494767 920083 1077280 906452 675127 588880 641441 791613 987848
39361 987848 1066218 942820 871562 1154285 1587951 1595172 1003353 322270 79156 207791
39351 207791 316590 272607 227325 249206 240696 164388 121860 208072 421622 701977 963478
39340 963478 1119216 1131693 1016509 799726 546669 405914 489169 705841 850195 835449
39330 835449 695651 427889 70052 -125955 72024 461425 587134 390214 258792 321176
39320 321176 192262 -300601 -637253 -311771 340698 564337 210844 -203104 -348643 -424727
$$ packed form
39392A016292J8588j60488k63918j10832K36369M10445J45229k96175l99477j09416
39382D86617J13367L2922j5823K28123M08205R2761m59899o21397l06257n60N6742
39371A4801J28838L51128M25316J57197j70828k31325q6247N2561J50172J96235
39361I87848P8370j23398p1258K82723M33666P221n91819o81083k43114J28635
39351B07791J08799m3983m5282K1881q510p6308m2528Q6212K13550K80355K61501
39340I63478J55738J2477j15184k16783k53057j40755Q3255K16672J44354j4746
39330H35449j39798k67762l57837j96007J97979L89401J25709j96920j31422O2384
39320C21176j28914m92863l36652L25482O52469K23639l53493m13948j45539p6084
$$ plain form
39310 -424727 -621755 -767362 -666884 -423163 -247724 -211867 -288676 -409865 -424658 -247407
39300 -247407 -77799 -187506 -436746 -335042 281135 934007 1066639 689267 255738 81472
39290 81472 117893 190904 224709 237980 275805 371751 502481 576199 515166 357192 252845
39279 252845 333879 551601 677589 567093 408340 522302 860329 957034 556724 30156
39269 30156 -117303 58709 104186 -122362 -332138 -343623 -287317 -242171 -103331 98495
39259 98495 161351 116090 248891 561306 645231 338932 93122 357970 949814 1378997
39249 1378997 1500269 1453217 1245764 871539 652372 944308 1549532 1888838 1784466 1646701
39239 1646701 1810832 2104202 2234081 2240214 2301271 2345342 2168165 1831792 1647453 1737726
$$ packed form
39310d24727j97028j45607J00478K43721J75439L5857p6809j21189j4793J77251
39300b47407J69608j09707k49240J01704O16177O52872J32632l77372m33529j74266
39290H1472L6421P3011L3805J3271L7825R5946J30730P3718o1033j57974j04347
39279B52845Q1034K17722J25988j10496j58753J13962L38027R6705m00310n26568
39269C0156j47459J76012M5477k26548k09776j1485N6306M5146J38840K01826
39259I8495O2856m5261J32801L12415Q3925l06299k45810K64848N91844M29183
39249A378997J21272m7052k07453l74225k19167K91936O05224L39306j04372j37765
39239A646701J64131K93370J29879O133O1057M4071j77177l36373j84339R0273
$$ plain form
39229 1737726 1846280 1698779 1406583 1325501 1552354 1786326 1776080 1683765 1788920 1996405
39219 1996405 1970193 1706895 1597401 1847059 2196913 2360244 2375725 2321610 2051971 1537017
39209 1537017 1148746 1201456 1426132 1325636 895552 551815 452472 370653 212981 171605
39199 171605 292432 353950 314784 458852 896411 1299587 1392028 1386902 1633695 2055959
39189 2055959 2257074 2055559 1637409 1246977 957080 711996 421681 34590 -363837
39180 -363837 -575343 -510596 -308124 -132285 40125 300563 585221 744694 774472 806373
39170 806373 901746 1000117 1042059 1000117 826775 537317 315832 336254 460012 335116
39160 335116 -114384 -507830 -476835 -147565 62923 16144 -65446 -60095 -151914 -433468 -583897
$$ packed form
39229A737726J08554j47501k92196q1082K26853K33972j0246r2315J05155K07485
39219A996405k6212k63298j09494K49658L49854J63331J5481n4115k69639n14954
39209A537017l88271N2710K24676j00496m30084l43737r9343q1819j57672m1376
39199A71605J20827O1518l9166J44068M37559M03176R2441n126K46793M22264
39189B055959K01115k01515m18150l90432k89897k45084k90315l87091l98427
39180c63837k11506O4747K02472J75839J72410K60438K84658J59473K9778L1901
39170H06373R5373R8371M1942m1942j73342k89458k21485K0422J23758j24896
39160C35116m49500l93446L0995L29270K10488m6779q1590N351r1819k81554j50429
$$ plain form
39149 -583897 -219251 560281 1238197 1455558 1293807 1020465 808255 735317 817605 947933
39139 947933 980915 943578 985895 1084618 1024756 747534 465092 319831 200444 52314
39129 52314 80938 410244 791775 935140 915261 950284 973257 777014 445556 277097
39119 277097 358215 541641 757624 1010647 1164086 1105252 1048602 1261165 1532895 1387913
39109 1387913 856451 552649 844056 1366451 1552574 1286873 842890 492527 385851
39100 385851 549674 803201 876002 736104 597736 552675 472178 325895 263765 301603
39090 301603 286107 264877 485416 891693 1056846 808064 490256 396887 389085 326350 389419
39079 389419 652165 806884 687506 601670 738710 740485 347365 -18814 106497 465827
$$ packed form
39149e83897L64646P79532O77916K17361j61751k73342k12210p2938Q2288J30328
39139I47933L2982l7337M2317R8723n9862k77222k82442j45261j19387j48130
39129E2314K8624L29306L81531J43365j9879L5023K2973j96243l31458j68459
39119B77097Q1118J83426K15983K53023J53439n8834n6650K12563K71730j44982
39109A387913n31462l03802K91407N22395J86123k65701m43983l50363j06676
39100C85851J63823K53527P2801j39898j38368m5061q0497j46283o2130L7838
39090C01603j5496k1230K20539M06277J65153k48782l17808r3369p802o2735O3069
39079C89419K62746J54719j19378q5836J37040J775l93120l66179J25311L59330
$$ plain form
39069 465827 599015 685731 1112761 1583671 1540763 1215938 1305234 1716746 1648248 957470
39059 957470 453050 606233 903507 811973 540615 431456 366468 255657 421439 972567
39049 972567 1399905 1325240 1100356 1136239 1197055 955881 721575 922294 1298569 1339212
39039 1339212 1167914 1231950 1391042 1157576 711307 807167 1598375 2307320 2256510 1616790
39029 1616790 939884 507032 381237 617082 1111714 1567057 1816762 1934208 1927257 1675576
39019 1675576 1285801 1118584 1270960 1376176 1130956 715721 475352 469029 565115 718112
39009 718112 902514 991286 940072 906768 984305 1019575 908366 842974 1004731 1213076 1183443
38998 1183443 980199 892858 970682 1018031 1004024 1130624 1446433 1676087 1533653 1027788
$$ packed form
39069D65827J33188Q6716M27030M70910m2908l24825Q9296M11512o8498o90778
39059I57470n04420J53183K97274r1534k71358j09159o4988j10811J65782N51128
39049I72567M27338p4665k24884L5883O0816k41174k34306K00719L76275M0643
39039A339212j71298O4036J59092k33466m46269R5860P91208P08945n0810o39720
39029A616790o76906m32852j25795K35845M94632M55343K49705J17446o951k51681
39019A675576l89775j67217J52376J05216k45220m15235k40369o323R6086J52997
39009G18112J84402Q8772n1214l3304P7537L5270j11209o5392J61757K08345k9633
38998A183443k03244q7341P7824M7349j4007J26600L15809K29654j42434n05865
$$ plain form
38988 1027788 411608 185 47384 577827 1259669 1626884 1529934 1241541 1069582 1038545
38978 1038545 1030126 1029909 1060662 1018075 794116 506456 399495 519614 670021 714495 743008
38967 743008 849977 906814 716538 332674 68156 173040 601370 1109948 1495781 1706046
38957 1706046 1798726 1860226 1933886 2001259 2055691 2172211 2413660 2661123 2681129 2451955
38947 2451955 2292695 2499206 2918436 3090583 2822444 2404199 2168449 2040874 1733280
38938 1733280 1273881 1069459 1371941 1885200 2077114 1816149 1522729 1655146 2179359
38929 2179359 2640636 2668090 2266864 1659397 1057972 681424 778119 1364528 1985722 2029462
38919 2029462 1408175 741075 679827 1170922 1596280 1577559 1365334 1372189 1597733 1733763
$$ packed form
38988A027788o16180m11423M7199N30443O81842L67215r6950k88393j71959l1037
38978A038545q419k17L0753m2587k23959k87660j06961J20119J50407M4474K8513
38967G43008J06969N6837j90276l83864k64518J04884M28330N08578L85833K10265
38957A706046R2680O1500P3660O7373N4432J16520K41449K47463K0006k29174
38947B451955j59260K06511M19230J72147k68139m18245k35750j27575l07594
38938A733280m59399k04422L02482N13259J91914k60965k93420J32417N24213
38929B179359M61277K7454m01226o07467o01425l76548R6695N86409O21194M3740
38919B029462o21287o67100o1248M91095M25358j8721k12225O855K25544J36030
$$ plain form
38909 1733763 1674378 1624757 1720871 1827113 1805710 1748606 1776491 1803734 1740946 1795896 2254897
38898 2254897 2968461 3365356 3086414 2365765 1659316 1146437 806373 751635 1130668 1761541
38888 1761541 2208223 2289159 2244144 2296875 2311607 2078007 1746367 1702317 2051392 2473075
38878 2473075 2634271 2555811 2473248 2495611 2570108 2695913 2947366 3249600 3337901 3085667
38868 3085667 2747543 2685226 2901150 3053563 2950913 2807520 2901972 3174925 3351817 3340581
38858 3340581 3272306 3180282 2895858 2363486 1875096 1797085 2101608 2345766 2191736 1840616
38848 1840616 1809412 2301655 2975853 3403420 3554777 3637617 3625340 3299282 2749543 2439536
38838 2439536 2606687 2916249 2956614 2828968 2945368 3417017 3968948 4364755 4608910 4783004
$$ packed form
38909A733763n9385m9621R6114J06242k1403n7104K7885K7243o2788N4950M59001
38898B254897P13564L96895k78942p20649p06449n12879l40064n4738L79033O30873
38888A761541M46682Q0936m5015N2731J4732k33600l31640m4050L49075M21683
38878B473075J61196p8460q2563K2363P4497J25805K51453L02234Q8301k52234
38868C085667l38124o2317K15924J52413j02650j43393R4452K72953J76892j1236
38858C340581o8275r2024k84424n32372m88390p8011L04523K44158j54030l51120
38848A840616l1204M92243O74198M27567J51357Q2840j2277l26058n49739l10007
38838B439536J67151L09562M0365j27646J16400M71649N51931L95807K44155J74094
$$ plain form
38828 4783004 4962156 5249142 5631321 5877730 5867777 5921002 6415444 7124465 7392384 7037340
38818 7037340 6619460 6652551 6992088 7252089 7418866 7699436 8064400 8324932 8470171 8591597
38808 8591597 8641404 8591035 8671754 9113745 9766219 10316915 10781578 11411167 12193334 12855411
38798 12855411 13365021 14027053 15013283 16169556 17411805 18962412 21005598 23401795
38790 23401795 25968755 28807000 32091032 35719913 39472237 43438730 48045893 53662111
38782 53662111 60398566 68330654 77728148 88992778 102527452 118811568 138545081
38775 138545081 162571298 191579855 225729925 264024835 303233779 337087033 357408643
38768 357408643 357828615 337836972 303499226 263760519 225558970 191845850 163029238
$$ packed form
38828D783004J79152K86986L82179K46409r953N3225M94442P09021K67919l55044
38818G037340m17880L3091L39537K60001J66777K80570L64964K60532J45239J21426
38808H591597M9807n0369Q0719M41991O52474N50696M64663O29589P82167O62077
38798A2855411N09610O62032R86230J156273J242249J550607K043186K396197
38790B3401795K566960K838245L284032L628881L752324L966493M607163N616218
38782E3662111O736455P932088R397494J1264630J3534674J6284116J9733513
38775A38545081K4026217K9008557L4150070L8294910L9208944L3853254K0321610
38768C57408643M19972j9991643l4337746l9738707l8201549l3713120k8816612
$$ plain form
38761 163029238 138965205 119355334 103328394 89751611 78053638 68313723 60519896
38754 60519896 54113931 48395142 43114924 38476688 34653248 31478271 28616791 25910578
38746 25910578 23456996 21379108 19644563 18165000 16944326 15982086 15113323 14151913
38738 14151913 13177687 12446544 11959595 11361842 10406256 9316380 8493709 8008282 7601387
38729 7601387 7110722 6658187 6419223 6396900 6457372 6449501 6263190 5893269 5479882 5189680
38719 5189680 5038984 4922691 4806460 4754832 4745845 4617187 4293902 3955114 3840362 3945540
38709 3945540 4050677 4042355 4057867 4231044 4401339 4234118 3646164 2971353 2592462 2481793
38699 2481793 2273009 1805661 1412133 1516168 2045501 2451090 2332023 1863024 1509605
$$ packed form
38761A63029238k4064033j9609871j6026940j3576783j1697973r739915p793827
38754F0519896o405965n718789n280218m638236l823440l174977k861480k706213
38746B5910578k453582k077888j734545j479563j220674r62240q68763r61410
38738A4151913r74226p31143m86949n97753r55586j089876q22671m85427m06895
38729G601387m90665m52535k38964k2323O0472p871j86311l69921m13387k90202
38719E189680j50696j16293j16231n1628q987j28658l23285l38788j14752J05178
38709C945540J05137q322J5512J73177J70295j67221n87954o74811l78891j10669
38699B481793k08784m67348l93528J04035N29333M05589j19067m68999l53419
$$ plain form
38690 1509605 1467377 1554779 1586964 1622018 1766889 1923639 1895575 1670954 1434588 1310586
38680 1310586 1250053 1203166 1248812 1462056 1755684 1962032 2019955 1997205 1976520 2000695 2084022
38669 2084022 2189028 2220682 2122060 1951197 1800263 1681363 1563090 1463701 1411326 1355249
38659 1355249 1225459 1061132 990232 1103241 1412154 1862173 2276251 2371700 2004191 1378657
38649 1378657 876418 687760 731583 865659 986967 968792 737180 442443 351209 516599
38639 516599 720939 763381 619669 315576 -119870 -530696 -705438 -642453 -519786 -362646
38629 -362646 -29569 402148 593981 452453 325581 462263 620993 522069 360749 471563
38619 471563 743311 829789 767735 893090 1226465 1428571 1355591 1200139 1058001 809470
$$ packed form
38690A509605m2228Q7402L2185L5054J44871J56750k8064k24621k36366j24002
38680A310586o0533m6887M5646K13244K93628K06348N7923k2750k0685K4175Q3327
38669B084022J05006L1654r8622j70863j50934j18900j18273r9389n2375n6077
38659A355249j29790j64327p0900J13009L08913M50019M14078R5449l67509o25534
38649A378657n02239j88658M3823J34076J21308j8175k31612k94737r1234J65390
38639E16599K04340M2442j43712l04093m35446m10826j74742O2985J22667J57140
38629c62646L33077M31717J91833j41528j26872J36682J58730r8924j61320J10814
38619D71563K71748Q6478o2054J25355L33375K02106p2980j55452j42138k48531
$$ plain form
38609 809470 490498 331190 338923 297043 260597 509813 846714 587228 -367215 -1074424
38599 -1074424 -759081 28308 218760 -160682 -117871 640070 1204998 916532 380053 446310
38589 446310 893301 918434 482167 257610 440238 550320 471327 732664 1419606 1672509
38579 1672509 902162 -147413 -349306 208352 463322 23566 -394699 -258935 -2684
38570 -2684 -134223 -353862 -148633 298767 462425 363423 428438 675700 712506 465404
38560 465404 279353 259697 104133 -281298 -523121 -347603 20634 265020 422804 658450
38550 658450 873169 823323 460120 -52970 -514351 -729729 -559998 -83933 423419 777290
38540 777290 989412 1044139 847669 533006 504749 926991 1400187 1435090 1078012 771118
$$ packed form
38609H09470l18972j59308P733m1880l6446K49216L36901k59486r54443p07209
38599a074424L15343P87389J90452l79442M2811P57941N64928k88466n36479O6257
38589D46310M46991K5133m36267k24557J82628J10082p8993K61337O86942K52903
38579A672509p70347j049575k01893N57658K54970m39756m18265J35764K56251
38570b684j31539k19639K05229M47400J63658r9002O5015K47262L6806k47102
38560D65404j86051j9656j55564l85431k41823J75518L68237K44386J57784K35646
38550F58450K14719m9846l63203n13090m61381k15378J69731M76065N07352L53871
38540G77290K12122N4727j96470l14663k8257M22242M73196L4903l57078l06894
$$ plain form
38530 771118 721171 726014 574402 311537 80997 -51080 -48261 138223 474334 798616
38520 798616 934678 830374 599342 432294 404047 369258 165577 -89344 -111466 95902
38510 95902 184121 1803 -113292 139355 475239 401204 -20401 -238626 -8044 341750
38500 341750 494834 551954 659307 651162 393514 200316 496126 1165178 1613372 1499968
38490 1499968 1093482 808028 673191 473852 219676 157960 335647 459295 332682 200586
38480 200586 413962 888189 1196938 1172789 1082199 1129247 1127574 872214 553749 491169 625562
38469 625562 627809 438129 339089 454360 506900 230418 -202919 -363841 -78073 393667
38459 393667 653978 551299 275921 139337 283134 600604 906674 1107354 1188848 1150430
$$ packed form
38530G71118m9947M843j51612k62865k30540j32077K819J86484L36111L24282
38520G98616J36062j04304k31032j67048k8247l4789k03681k54921k2122K07368
38510I5902Q8219j82318j15095K52647L35884p4035m21605k18225K30582L49794
38500C41750J53084N7120J07353q145k57648j93198K95810O69052M48194j13404
38490A499968m06486k85454j34837j99339k54176o1716J77687J23648j26613j32096
38480B00586K13376M74227L08749k4149r0590M7048j673k55360l18465o2580J34393
38469F25562K247j89680r9040J15271N2540k76482m33337j60922K85768M71740
38459C93667K60311j02679k75378j36584J43797L17470L06070K00680Q1494l8418
$$ plain form
38449 1150430 1021797 857548 641561 310962 -31600 -92141 238892 607903 549603 81789
38439 81789 -295806 -215621 161615 410276 306679 -34384 -330744 -369535 -196522 -111920
38429 -111920 -347911 -714586 -719227 -118794 756920 1318933 1295458 944305 727123 794200
38419 794200 804274 340354 -467622 -918310 -506564 431434 1086997 1100843 831129 747430
38409 747430 893638 1011551 894713 498212 -65508 -517965 -601710 -384756 -206211 -252448
38399 -252448 -383377 -426094 -388360 -294799 -86579 176276 273278 159223 114332 380560
38389 380560 855644 1310182 1674480 1923659 1928168 1656143 1308328 1018618 652053 156425
38379 156425 -154438 -20143 288247 319796 104213 6399 40944 -128915 -489495 -534479
$$ packed form
38449A150430j28633j64249k15987l30599l42562o0541L31033L69011n8300m67814
38439H1789l77595Q0185L77236K48661j03597l41063k96360l8791J73013Q4602
38429a11920k35991l66675m641O00433Q75714N62013k3475l51153k17182O7077
38419G94200J0074m63920q07976m50688M11746R37998O55563J3846k69714q3699
38409G47430J46208J17913j16838l96501n63720m52457q3745K16954J78545m6237
38399b52448j30929m2717L7734R3561K08220K62855R7002j14055m4891K66228
38389C80560M75084M54538L64298K49179M509k72025l47815k89710l66565m95628
38379A56425l10863J34295L08390L1549k15583r7814L4545j69859l60580m4984
$$ plain form
38369 -534479 -29012 537370 579839 206944 43316 411208 979726 1193711 854535 263660
38359 263660 -105647 -57695 193627 354677 430298 633726 980565 1208735 1144437 919607
38349 919607 724111 546672 308511 84911 7946 53653 106584 173355 354698 617638
38339 617638 755445 628031 358330 226358 377644 662796 790706 649487 431906 405973
38329 405973 631343 985749 1374643 1732867 1873060 1608938 1110396 876936 1171848 1666592
38319 1666592 1868033 1757822 1735891 2001681 2308026 2372484 2237885 2085889 1939975 1778652
38309 1778652 1775346 2121824 2629914 2790382 2342505 1618625 1199739 1339451 1840593 2386295
38299 2386295 2811308 3069942 3115890 2906119 2485383 2031069 1792741 1909528 2240638 2473337
$$ packed form
38369e34479N05467N66382M2469l72895j63628L67892N68518K13985l39176n90875
38359B63660l69307M7952K51322J61050P5621K03428L46839K28170o4298k24830
38349I19607j95496j77439k38161k23600p6965M5707N2931O6771J81343K62940
38339F17638J37807j27414k69701j31972J51286K85152J27910j41219k17581k5933
38329D05973K25370L54406L88894L58224J40193k64122m98542k33460K94912M94744
38319A666592K01441j10211k1931K65790L06345O4458j34599j51996j45914j61323
38309A778652l306L46478N08090J60468m47877p23880m18886J39712N01142N45702
38299B386295M25013K58634M5948k09771m20736m54314k38328J16787L31110K32699
$$ plain form
38289 2473337 2490249 2519709 2779773 3100298 3146207 2958935 2965595 3392683 3959547 4284307
38279 4284307 4348447 4395182 4585371 4953838 5529455 6279163 7055233 7784740 8585575 9519142
38269 9519142 10388566 11009374 11540795 12293637 13324970 14491787 15785118 17261239 18671340
38260 18671340 19523222 19601252 19168867 18581138 17924455 17110217 16104353 14958126 13757422
38251 13757422 12598891 11499481 10351998 9132545 8083362 7435829 6996013 6341496
38243 6341496 5473230 4906884 4956906 5239356 5119044 4444347 3619362 3095193 2981347 3048030
38233 3048030 2949529 2522874 1965594 1628906 1601455 1667891 1712647 1889198 2240426 2428749
38223 2428749 2123866 1510670 1127747 1237969 1566698 1660090 1360738 923792 736721 912179
$$ packed form
38289B473337J6912K9460K60064L20525M5909j87272O660M27088N66864L24760
38279D284307O4140M6735J90189L68467N75617P49708P76070P29507Q00835R33567
38269I519142Q69424O20808N31421P52842J031333J166817J293331J476121J410101
38260A8671340Q51882P8030m32385n87729o56683q14238j005864j146227j200704
38251A3757422j158531j099410j147483j219453j049183o47533m39816o54517
38243F341496q68266n66346N0022K82450j20312o74697q24985n24169j13846O6683
38233C048030r8501m26655n57280l36688k7451O6436M4756J76551L51228J88323
38223B428749l04883o13196l82923J10222L28729R3392k99352m36946j87071J75458
$$ plain form
38213 912179 1159833 1144357 927623 859551 1031629 1120163 875222 490577 317374 445618
38203 445618 752650 1133073 1464786 1564596 1422353 1300724 1377248 1475006 1370360 1146186
38193 1146186 985548 863553 752042 859777 1268642 1577753 1404146 1054616 1128396 1553153
38183 1553153 1669930 1312772 1102375 1432852 1814428 1636759 1079755 751935 772072 774997
38173 774997 651460 715972 1128099 1611015 1866702 1932263 1969245 1959975 1815644 1629045
38163 1629045 1598149 1731766 1806236 1658623 1404007 1269302 1283008 1271996 1160002 1089288
38153 1089288 1159880 1225317 1129909 1026451 1212343 1683213 2090670 2167085 1979557 1730010
38143 1730010 1530951 1456172 1593174 1907813 2207278 2361193 2445468 2577810 2732414 2803579
$$ packed form
38213I12179K47654j5476k16734o8072J72078Q8534k44941l84645j73203J28244
38203D45618L07032L80423L31713R9810j42243j21629P6524R7758j04646k24174
38193A146186j60638j21995j11511J07735M08865L09111j73607l49530P3780M24757
38183A553153J16777l57158k10397L30477L81576j77669n57004l27820K0137K925
38173G74997j23537O4512M12127M82916K55687O5561L6982r270j44331j86599
38163A629045l0896J33617P4470j47613k54616j34705J3706j1012j11994p0714
38153A089288P0592O5437r5408j03458J85892M70870M07457P6415j87528k49547
38143A730010j99059p4779J37002L14639K99465J53915Q4275J32342J54604P1165
$$ plain form
38133 2803579 2737323 2530363 2224217 1956001 1859462 1849972 1694001 1392229 1290243 1645456
38123 1645456 2245503 2636284 2608005 2301844 1979614 1873184 2117579 2586179 2866946 2650862
38113 2650862 2136531 1852478 2079674 2618249 3103844 3356358 3393343 3287256 3094297 2827409
38103 2827409 2455935 1996154 1590662 1413319 1520952 1882163 2473035 3185340 3704500
38094 3704500 3721886 3322637 2973373 3041372 3466968 3962798 4347006 4564128 4562079 4354184
38084 4354184 4115677 4022037 4028573 3988395 3957853 4157816 4579883 4862284 4722000 4358539
38074 4358539 4212945 4401727 4644098 4768645 5012379 5644575 6479368 7019923 7050015 6858857
38064 6858857 6835257 7013073 7113719 6930662 6560063 6284416 6306366 6604613 7013257 7395361
$$ packed form
38133B803579o6256k06960l06146k68216r6539r490j55971l01772j01986L55213
38123A645456O00047L90781k8279l06161l22230j06430K44395M68600K80767k16084
38113B650862n14331k84053K27196N38575M85595K52514L6985j06087j92959k66888
38103B827409l71474m59781m05492j77343J07633L61211N90872P12305N19160
38094C704500J7386l99249l49264O7999M25596M95830L84208K17122k049k07895
38084D354184k38507r3640O536m0178l0542J99963M22067K82401j40284l63461
38074D358539j45594J88782K42371J24547K43734O32196Q34793N40555L0092j91158
38064F858857k3600J77816J00646j83057l70599k75647K1950K98247M08644L82104
$$ plain form
38054 7395361 7689603 7812116 7651955 7247458 6841966 6618491 6480554 6287918 6218155 6606781
38044 6606781 7411618 8131544 8375021 8272216 8177806 8185928 8146197 8005681 7901847 7972907
38034 7972907 8242122 8647076 9066565 9381933 9605376 9852832 10107770 10171599 9989945 9849776
38024 9849776 10027594 10369816 10482804 10266578 9993468 9891763 9930246 10038396 10273740 10681327
38014 10681327 11175634 11629869 11927664 11920700 11563907 11141869 11094499 11479212 11834076 11757932
38004 11757932 11431732 11337406 11614031 11974628 12183592 12296764 12388937 12343988 12076190 11754728
37994 11754728 11595618 11537698 11341542 10970383 10651708 10522845 10409961 10059354 9453779
37985 9453779 8799244 8317287 8148125 8311286 8608088 8699934 8483419 8265622 8321613 8405118
$$ packed form
38054G395361K94242J22513j60161m04497m05492k23475j37937j92636o9763L88626
38044F606781Q04837P19926K43477j02805r4410Q122l9731j40516j03834P1060
38034G972907K69215M04954M19489L15368K23443K47456K54938O3829j81654j40169
38024I849776J77818L42222J12988k16226k73110j01705L8483J08150K35344M07587
38014A0681327M94307M54235K97795o964l56793m22038m7370L84713L54864p6144
38004A1757932l26200r4326K76625L60597K08964J13172R2173m4949k67798l21462
37994A1754728j59110n7920j96156l71159l18675j28863j12884l50607o05575
37985I453779o54535m81957j69162J63161K96802R1846k16515k17797N5991Q3505
$$ plain form
37975 8405118 8060839 7386246 7035965 7340323 7843000 7972554 7811042 7824429 8081038 8184950
37965 8184950 7904604 7457768 7127730 6911152 6653693 6334234 6101753 6102963 6292323 6386397
37955 6386397 6103053 5516143 5025638 4873170 4888226 4864773 4916020 5177733 5422173 5369748
37945 5369748 5206356 5323772 5631895 5629019 5171431 4683711 4503014 4463015 4283700 3971144
37935 3971144 3645421 3330358 3103687 3120355 3294721 3282497 2968639 2647417 2533506 2467062
37925 2467062 2340129 2404545 2799470 3124706 2923928 2357548 1969111 1959673 2106189 2252056
37915 2252056 2444301 2655690 2767805 2796009 2789547 2581544 2020019 1394202 1202539 1475539
37905 1475539 1752675 1801907 1912939 2294505 2602055 2393818 1793268 1343310 1325615 1541345
$$ packed form
37975H405118l44279o74593l50281L04358N02677J29554j61512J3387K56609J03912
37965H184950k80346m46836l30038k16578k57459l19459k32481J210J89360R4074
37955F386397k83344n86910m90505j52468J5056k3453N1247K61713K44440n2425
37945E369748j63392J17416L08123k876m57588m87720j80697l9999j79315l12556
37935C971144l25723l15063k26671J6668J74366j2224l13858l21222j13911o6444
37925B467062j26933O4416L94925L25236k00778n66380l88437r438J46516J45867
37915B252056J92245K11389J12115K8204o462k08003n61525o25817j91663K73000
37905A475539K77136M9232J11032L81566L07550k08237o00550m49958j7695K15730
$$ plain form
37895 1541345 1720068 1830189 1909953 1860897 1623685 1426709 1574706 1953925 2025668 1500016
37885 1500016 797261 534868 696543 720717 386350 119256 285116 673608 955934 1184366
37875 1184366 1442293 1432951 962792 512474 674358 1184442 1199185 524824 -98751 -63004
37865 -63004 375186 651534 647453 566772 480303 352469 251025 237706 245920 253556 349439
37854 349439 482102 424352 152418 -42883 -7399 37593 -79026 -164868 -60930 -17581
37844 -17581 -313656 -759447 -951689 -818133 -551698 -208459 227473 532337 425749 13880
37834 13880 -299959 -296347 -36418 394856 874271 1079486 780354 272925 104592 343486
37824 343486 521974 338090 -18904 -317601 -584245 -770585 -579739 63335 706855 878549
$$ packed form
37895A541345J78723J10121P9764m9056k37212j96976J47997L79219P1743n25652
37885A500016p02755k62393J61675K4174l34367k67094J65860L88492K82326K28432
37875A184366K57927r342m70159m50318J61884N10084J4743o74361o23575L5747
37865f3004M38190K76348m081q0681q6469j27834j01444j3319Q214P636R5883
37854C49439J32663n7750k71934j95301L5484M4992j16619q5842J03938M3349
37844a7581k96075m45791j92242J33556K66435L43239M35932L04864j06588m11869
37834A3880l13839L612K59929M31274M79415K05215k99132n07429j68333K38894
37824C43486J78488j83884l56994k98697k66644j86340J90846O43074O43520J71694
$$ plain form
37814 878549 651414 392526 200151 -18540 -97442 266480 931166 1292276 1011896 460962
37804 460962 238119 471317 826545 1047538 1179389 1264281 1117329 581516 -139707 -617024
37794 -617024 -650444 -432935 -241799 -124170 38198 290650 562557 784796 918117 902476
37784 902476 698809 374321 65169 -122395 -116133 130075 522130 772938 640223 216134
37774 216134 -163659 -291963 -218763 -29880 271809 584652 630303 255418 -282147 -517654
37764 -517654 -266568 218307 581841 732705 812382 893740 855750 592739 230504 5796
37754 5796 -32570 -53774 -166849 -286188 -340040 -419956 -576759 -640037 -456751 -189876 -125455
37743 -125455 -249084 -293092 -193061 -194452 -428015 -652789 -573425 -217552 163830 424640
$$ packed form
37814H78549k27135k58888j92375k18691p8902L63922O64686L61110k80380n50934
37804D60962k22843K33198L55228K20993J31851Q4892j46952n35813p21223m77317
37794f17024l3420K17509J91136J17629J62368K52452K71907K22239J33321j5641
37784I02476k03667l24488l09152j87564O262K46208L92055K50808j32715m24089
37774B16134l79793j28304P3200J88883L01689L12843M5651l74885n37565k35507
37764e17654K51086M84875L63534J50864P9677Q1358l7990k63011l62235k24708
37754E796l8366k1204j13075j19339n3852p9916j56803o3278J83286K66875O4421
37743a25455j23629m4008J00031j391k33563k24774P9364L55873L81382K60810
$$ plain form
37733 424640 583802 653442 580347 352941 69094 -129651 -190806 -225639 -388787 -619797
37723 -619797 -613672 -205279 313516 490960 273356 -10136 -191913 -438612 -809543 -1027768
37713 -1027768 -891372 -593491 -382202 -174441 204264 632082 875821 985491 1145518
37704 1145518 1251875 1026544 528963 182126 218830 394955 357592 76004 -202166 -263655
37694 -263655 -107642 80032 81542 -140859 -386221 -447126 -345849 -224554 -91103 137372
37684 137372 395454 499297 415267 293739 218190 117383 -36793 -124104 -19275 296981
37674 296981 779530 1316420 1685272 1692590 1385521 981086 607946 304634 226796 565263
37664 565263 1196867 1684383 1744612 1513722 1256543 1041043 829903 671008 609954 561709
$$ packed form
37733D24640J59162O9640p3095k27406k83847j98745o1155l4833j63148k31010
37723f19797O125M08393N18795J77444k17604k83492j81777k46699l70931k18225
37713a027768J36396K97881K11289K07761L78705M27818K43739J09670J60027
37704A145518J06357k25331m97581l46837L6704J76125l7363k81588k78170o1489
37694b63655J56013J87674J510k22401k45362o0905J01277J21295J33451K28475
37684A37372K58082J03843q4030j21528p5549j00807j54176q7311J04829L16256
37674B96981M82549N36890L68852P318l07069m04435l73140l03312p7838L38467
37664E65263O31604M87516O0229k30890k57179k15500k11140j58895o1054m8245
$$ plain form
37654 561709 429673 235307 21664 -209186 -336209 -95564 571255 1274693 1508272 1169938
37644 1169938 589420 110812 -164420 -262224 -179734 83142 437286 730470 873498 936817
37634 936817 1068296 1252730 1237873 856591 352977 138310 233983 278547 162591 271294
37624 271294 861391 1537168 1710220 1361786 948949 687416 375547 -62315 -289492 5388
37614 5388 635513 1067756 947043 389432 -164165 -357736 -252401 -219383 -429244 -570240
37604 -570240 -257870 381201 808232 745618 480610 438482 689889 984266 1080480 915172
37594 915172 569338 186544 -130278 -378412 -554437 -542330 -266235 55029 33509 -406506
37584 -406506 -842390 -793470 -259793 297691 460330 228564 -82774 -217962 -182477 -101157
$$ packed form
37654E61709j32036j94366k13643k30850j27023K40645O66819P03438K33579l38334
37644A169938n80518m78608k75232r7804Q2490K62876L54144K93184J43028O3319
37634I36817J31479J84434j4857l81282n03614k14667R5673M4564j15956J08703
37624B71294N90097O75777J73052l48434m12837k61533l11869m37862k27177K94880
37614E388O30125M32243j20713n57611n53597j93571J05335L3018k09861j40996
37604e70240L12370O39071M27031o2614k65008m2128K51407K94377R6214j65308
37594I15172l45834l82794l16822k48134j76025J2107K76095L21264k1520m40015
37584d06506m35884M8920N33677N57484J62639k31766l11338j35188L5485Q1320
$$ plain form
37574 -101157 -169 149505 244629 131964 -92601 -132954 42392 79351 -202886 -444763
37564 -444763 -285346 7126 -78597 -463270 -611169 -452298 -526764 -1062519 -1509695 -1301242
37554 -1301242 -615207 -40869 137202 -11857 -374519 -768391 -895395 -708400 -595421
37545 -595421 -837649 -1122861 -994035 -558666 -298652 -336392 -374645 -279991 -231489 -285069
37535 -285069 -248067 -57058 105161 134177 89521 -77879 -479097 -893701 -873321 -423997
37525 -423997 -164327 -510431 -1034183 -994479 -306214 382239 499779 137514 -178814 -78173
37515 -78173 345199 690829 674667 407973 221433 233765 233451 26208 -274382 -421559 -373126
37504 -373126 -315095 -419961 -688407 -969497 -1056466 -834883 -411483 -22932 238303 505128
$$ packed form
37574a01157J00988J49674R5124j12665k24565m0353J75346L6959k82237k41877
37564d44763J59417K92472q5723l84673j47899J58871p4466n35755m47176K08453
37554a301242O86035N74338J78071j49059l62662l93872j27004J86995J12979
37545e95421k42228k85212J28826M35369K60014l7740l8253R4654M8502n3580
37535b85069L7002J91009J62219K9016m4656j67400m01218m14604K0380M49324
37525d23997K59670l46104n23752L9704O88265O88453J17540l62265l16328J00641
37515g8173M23372L45630j6162k66694j86540J2332l14k07243l00590j47177M8433
37504c73126N8031j04866k68446k81090q6969K21583M23400L88551K61235K66825
$$ plain form
37494 505128 883202 1247459 1382317 1196602 700585 -66935 -918932 -1466249 -1423908 -947482
37484 -947482 -492034 -359744 -521223 -795440 -986344 -886957 -422754 153723 444513 367309
37474 367309 225086 231246 224306 24894 -190645 -171862 -60878 -189515 -485633 -528663 -262558
37463 -262558 -183472 -577962 -996167 -888798 -462340 -368824 -690008 -840913 -538856 -248311
37453 -248311 -385178 -607096 -354528 251210 584574 418355 119183 -18200 -108662 -249094
37443 -249094 -234221 44895 266855 86667 -296657 -308118 294643 1124709 1619134 1619067 1413185
37432 1413185 1307263 1292904 1174204 917904 742408 853600 1217058 1633641 1910527 1897787
37422 1897787 1530449 977273 605665 625360 874752 1105170 1302650 1513095 1555385 1260569
$$ packed form
37494E05128L78074L64257J34858j85715m96017p67520q51997n47317M2341M76426
37484i47482M55448J32290j61479k74217j90904R9387M64203N76477K90790p7204
37474C67309j42223O160o940j99412k15539J8783J10984j28637k96118m3030K66105
37463b62558P9086l94490m18205J07369M26458R3516l21184j50905L02057K90545
37453b48311j36867k21918K52568O05738L33364j66219k99172j37383r0462j40432
37443b49094J4873K79116K21960j80188l83324j1461O02761Q30066M94425o7k05882
37432A413185j05922j4359j18700k56300j75496J11192L63458M16583K76886j2740
37422A897787l67338n53176l71608J9695K49392K30418J97480K10445M2290k94816
$$ plain form
37412 1260569 882995 870908 1234802 1516868 1420913 1119646 901704 892017 1176220 1770032
37402 1770032 2336194 2382337 1957814 1726137 2063067 2494976 2398795 1891570 1568373 1624956
37392 1624956 1740889 1684771 1550150 1439494 1339327 1310432 1440757 1600617 1564637 1374074
37382 1374074 1270629 1284034 1207773 988082 806693 744515 687495 622326 703374 935179
37372 935179 1091213 1065036 1026341 1100946 1159784 1076843 957259 938583 967862 939298 857823
37361 857823 692642 272276 -429667 -1034001 -1059313 -488618 155827 343219 30270 -395382
37351 -395382 -573662 -508633 -461638 -576544 -709267 -660206 -454391 -270262 -181864 -138191
37341 -138191 -132857 -187790 -197439 -24096 231775 290221 68475 -234312 -485951 -779215 -1118530
$$ packed form
37412A260569l77574j2087L63894K82066r5955l01267k17942r687K84203N93812
37402A770032N66162M6143m24523k31677L36930M31909r6181n07225l23197N6583
37392A624956J15933n6118j34621j10656j00167k8895J30325J59860l5980j90563
37382A374074j03445J3405p6261k19691j81389o2178n7020o5169Q1048K31805
37372I35179J56034k6177l8695P4605N8838q2941j19584j8676K9279k8564q1475
37361H57823j65181m20366p01943o04334k5312N70695O44445J87392l12949m25652
37351c95382j78280O5029M6995j14906j32723M9061K05815J84129Q8398M3673
37341a38191N334n4933r649J73343K55871N8446k21746l02787k51639k93264l39315
$$ plain form
37330 -1118530 -1239610 -972777 -571223 -404091 -459699 -429743 -204835 -7257 -48763 -306586
37320 -306586 -655130 -985219 -1142373 -975334 -561868 -215809 -131223 -142607 14552 302294
37310 302294 423056 231109 -92535 -311733 -392425 -379847 -194675 226514 659594 731438
37300 731438 389317 6839 -97109 -47351 -147941 -399497 -526912 -401487 -172127 9285
37290 9285 140514 214242 162707 58727 150564 521303 852894 733632 164938 -403734
37280 -403734 -572163 -406822 -294922 -446777 -663861 -645786 -419077 -303441 -468975 -724418
37270 -724418 -818710 -756192 -663423 -521932 -264449 -28156 -40111 -255747 -340348 -67049
37260 -67049 403884 680505 514782 71059 -143723 217102 814180 867176 149843 -565540
$$ packed form
37330a118530j21080K66833M01554J67132n5608K9956K24908J97578m1506k57823
37320c06586l48544l30089j57154J67039M13466L46059Q4586j1384J57159K87742
37310C02294J20762j91947l23644k19198q0692J2578J85172M21189M33080P1844
37300G31438l42121l82478j03948M9758j00590k51556j27415J25425K29360J81412
37290I285J31229P3728n1535j03980R1837L70739L31591j19262n68694n68672
37280d03734j68429J65341J11900j51855k17084J8075K26709J15636j65534k55443
37270g24418r4292O2518R2769J41491K57483K36293j1955k15636q4601K73299
37260f7049M70933K76621j65723m43723k14782L60825N97078N2996p17333p15383
$$ plain form
37250 -565540 -447275 278881 703085 568178 534579 1031924 1560572 1470753 876353 339987
37240 339987 44194 -224427 -496062 -514434 -171925 296546 583006 588115 447526 372676
37230 372676 417399 411715 275097 311485 854211 1619708 1863913 1320465 546348 141596
37220 141596 78072 49771 -34 -50533 -237146 -503422 -462213 -52304 139844 -234761
37210 -234761 -559114 -115186 716454 965983 536638 231620 391995 477405 156049 -102228
37200 -102228 116428 460397 416629 74201 -154215 -144111 2621 264326 568498 651642
37190 651642 392697 61723 -20302 150734 414005 679743 826596 676604 295486 30077
37180 30077 37475 69486 -80105 -248208 -250654 -203718 -209941 -59328 400547 853542 840627
$$ packed form
37250e65540J18265P26156M24204j34907l3599M97345N28648q9819n94400n36366
37240C39987k95793k68621k71635j8372L42509M68471K86460N109j40589p4850
37230C72676M4723n684j36618L6388N42726P65497K44205n43448p74117m04752
37220A41596o3524k8301m9805n0499j86613k66276M1209M09909J92148l74605
37210b34761l24353M43928Q31640K49529m29345l05018J60375Q5410l21356k58277
37200a02228K18656L43969m3768l42428k28416J0104J46732K61705L04172Q3144
37190F51642k58945l30974q2025J71036K63271K65738J46853j49992l81118k65409
37180C0077P398L2011j49591j68103k446M6936o223J50613M59875M52995j2915
$$ plain form
37169 840627 342245 -237833 -517335 -370191 58299 374446 238225 -160380 -242116 138407
37159 138407 423811 217451 -45747 234581 876502 1207971 1024527 652539 274667 -151785
37149 -151785 -426379 -248409 159330 215266 -145541 -363764 -151276 112287 93873 29527
37139 29527 191008 321348 38464 -525107 -907581 -940265 -832473 -785071 -826361 -928523
37129 -928523 -1035816 -1056195 -1003744 -1034957 -1192947 -1284654 -1189035 -1082753 -1117759 -1075449 -670714
37118 -670714 -68897 283989 317727 428887 834441 1210716 1188141 916929 835633 1039301
37108 1039301 1223148 1223032 1252679 1469587 1593961 1239039 504186 -52784 -57766 288187
37098 288187 527608 471119 299020 285540 547361 965510 1243261 1124026 652299 148027
$$ packed form
37169H40627m98382n80078k79502J47144M28490L16147j36221l98605q1736L80523
37159A38407K85404k06360k63198K80328O41921L31469j83444l71988l77872m26452
37149a51785k74594J77970M07739N5936l60807k18223K12488K63563j8414o4346
37139B9527J61481J30340k82884n63571l82474l2684J07792M7402m1290j02162
37129i28523j07293k0379N2451l1213j57990r1707R5619J06282l5006M2310M04735
37118f70714O01817L52886L3738J11160M05554L76275k2575k71212q1296K03668
37108A039301J83847j16K9647K16908J24374l54922p34853n56970m982L45953
37098B88187K39421n6489j72099j3480K61821M18149K77751j19235m71727n04272
$$ plain form
37088 148027 -136039 -209542 -143825 103860 492004 726608 568395 192703 -41837 -95262
37078 -95262 -191305 -314061 -172593 240487 456865 134054 -447698 -776947 -773898 -717029
37068 -717029 -652232 -313407 310465 730711 533918 -26197 -313525 -92794 276528 421555
37058 421555 385982 343251 214772 -116431 -430750 -414833 -192177 -179226 -406720 -456179
37048 -456179 -186276 -16662 -227025 -458745 -320456 -68868 -148530 -367594 -179917 362350
37038 362350 618310 324742 -99709 -328987 -567804 -971516 -1218439 -1050505 -789019 -862798
37028 -862798 -1133595 -1134964 -775905 -387281 -187704 -80021 67022 238399 361378 359486
37018 359486 161005 -176760 -445978 -559409 -695564 -951725 -1018112 -525282 347081 945496
$$ packed form
37088A48027k84066p3503O5717K47685L88144K34604j58213l75692k34540n3425
37078i5262r6043j22756J41468M13080K16378l22811n81752l29249L049N6869
37068g17029O4797L38825O23872M20246j96793n60115k87328K20731L69322J45027
37058D21555l5573m2731j28479l31203l14319J5917K22656J2951k27494m9459
37048d56179K69903J69614k10363k31720J38289K51588p9662k19064J87677N42267
37038C62350K55960k93568m24451k29278k38817m03712k46923J67934K61486p3779
37028h62798k70797j369L59059L88624J99577J07683J47043J71377J22979j892
37018C59486j98481l37765k69218j13431j36155k56161o6387M92830Q72363N98415
$$ plain form
37008 945496 871035 378953 1661 4628 291257 626549 803203 713309 431946 235267
36998 235267 432288 1088297 1882198 2300941 2092318 1532304 1122336 1002889 829763 294143
36988 294143 -429783 -905362 -955208 -782174 -659358 -674202 -737649 -708098 -523981 -286353
36978 -286353 -158277 -154677 -161192 -197845 -449071 -913992 -1262678 -1242688 -1025973 -912683 -884727
36967 -884727 -755678 -606455 -695641 -984923 -1120999 -930781 -627119 -451569 -385294 -319699
36957 -319699 -286041 -370773 -537065 -655192 -670202 -702124 -975776 -1564407 -2171763 -2357577
36947 -2357577 -2099826 -1887490 -2026927 -2132471 -1686069 -881313 -401070 -453169 -591730 -517097
36937 -517097 -455717 -584636 -655685 -486514 -329608 -386792 -387928 -88103 173384 -77338
$$ packed form
37008I45496p4461m92082l77292K967K86629L35292J76654q9894k81363j96679
36998B35267J97021O56009P93901M18743k08623n60014m09968j19447j73126n35620
36988B94143p23926m75579m9846J73034J22816j4844o3447K9551J84117K37628
36978b86353J28076L600o515l6653k51226m64921l48686J9990K16715J13290K7956
36967h84727J29049J49223q9186k89282j36076J90218L03662J75550O6275O5595
36957c19699L3658q4732j66292j18127j5010l1922k73652n88631o07356j85814
36947b357577K57751K12336j39437j05544M46402Q04756M80243n2099j38561P4633
36937e17097O1380j28919p1049J69171J56906n7184j136K99825K61487k50722
$$ plain form
36927 -77338 -664522 -942381 -656287 -170253 107705 94561 -157493 -581933 -948295 -962721
36917 -962721 -650909 -357470 -251000 -104901 281832 694978 750786 393365 -45266 -222076
36907 -222076 -86628 153534 264320 183610 46617 32033 196645 480197 823073 1191042
36897 1191042 1488556 1545292 1250084 685625 105910 -245922 -329150 -296876 -250245 -63912
36887 -63912 407399 991455 1300178 1225978 1091327 1169390 1294265 1154341 769273 422763
36877 422763 284753 370939 719141 1271508 1682016 1610420 1192520 889986 886227 970207
36867 970207 1004410 1093846 1210482 1071636 582229 53421 -236661 -403356 -647414 -858126
36857 -858126 -794634 -472412 -128851 50744 5082 -214193 -368734 -192333 187545 267267
$$ packed form
36927g7338n87184k77859K86094M86034K77958j3144k52054m24440l66362j4426
36917i62721L11812K93439J06470J46099L86733M13146N5808l57421m38631j76810
36907b22076J35448K40162J10786q0710j36993j4584J64612K83552L42876L67969
36897A191042K97514N6736k95208n64459n79715l51832q3228L2274M6631J86333
36887f3912M71311N84056L08723p4200j34651P8063J24875j39924l85068l46510
36877D22763j38010Q6186L48202N52367M10508p1596m17900l02534l759Q3980
36867I70207L4203Q9436J16636j38846m89407n28808k90082j66695k44058k10712
36857h58126O3492L22222L43561J79595m5662k19275j54541J76401L79878P9722
$$ plain form
36847 267267 -153622 -618118 -651410 -430489 -384702 -422823 -140379 356136 496234 160642
36837 160642 -74976 194070 624225 696256 431592 198519 133839 120853 126142 224242 412920
36826 412920 643604 896164 1031045 776216 119047 -483109 -593844 -357449 -243487 -344252
36816 -344252 -302583 77975 526527 700334 594919 431972 360270 399873 510983 588618
36806 588618 518087 343460 262353 346859 385570 147721 -255412 -428732 -144133 358507
36796 358507 599261 385235 37133 9590 320931 524589 317675 -9041 60694 547594
36786 547594 904958 704829 139259 -297255 -424852 -465279 -612350 -764008 -725337 -498449
36776 -498449 -249218 -71067 78474 217096 257503 154619 19573 -28922 -39874 -100117
$$ packed form
36847B67267m20889m64496l3292K20921M5787l8121K82444M96515J40098l35592
36837A60642k35618K69046M30155P2031k64664k33073o4680j2986N289R8100J88678
36826D12920K30684K52560J34881k54829o57169o02156j10735K36395J13962j00765
36816c44252M1669L80558M48552J73807j05415j62947p1702L9603J11110P7635
36806E88618p0531j74627q1107Q4506L8711k37849m03133j73320K84599N02640
36796C58507K40754k14026l48102k7543L11341K03658k06914l26716O9735M86900
36786E47594L57364k00129n65570m36514j27597m0427j47071j51658L8671K26888
36776d98449K49231J78151J49541J38622M0407j02884j35046m8495j0952o0243
$$ plain form
36766 -100117 -106112 94372 341952 252880 -224892 -643813 -643740 -422801 -339413 -317155 -63070
36755 -63070 298386 328566 -3345 -224523 -102700 11632 -171527 -346423 -105164 342569
36745 342569 401477 -80159 -620405 -734414 -424314 15405 408110 766385 1082342 1192519
36735 1192519 899472 247984 -370850 -534074 -235338 137328 309031 370851 418516 245959
36725 245959 -303960 -886347 -945063 -427817 123320 238675 717 -211701 -198958 -25692
36715 -25692 178629 327252 365370 300838 253468 392492 757445 1126714 1155158 775148
36705 775148 401443 491885 884070 914613 361099 -131464 76218 663425 814442 442788
36695 442788 279748 715449 1238176 1274440 987347 833585 796631 574875 229429 100137
$$ packed form
36766a00117n995K00484K47580q9072m77772m18921P3K20939Q3388K2258K54085
36755f3070L61456L0180l31911k21178J21823J14332j83159j74896K41259M47733
36745C42569N8908m81636n40246j14009L10100M39719L92705L58275L15957J10177
36735A192519k93047o51488o18834j63224K98736L72666J71703O1820M7665j72557
36725B45959n49919n82387n8716N17246N51137J15355k37958k12418J2743J73266
36715b5692K04321J48623L8118o4532m7370J39024L64953L69269K8444l80010
36705G75148l73705R0442L92185L0543n53514m92563K07682N87207J51017l71654
36695D42788j63040M35701N22727L6264k87093j53762l6954k21756l45446j29292
$$ plain form
36685 100137 221869 326808 364482 522421 692783 413754 -450713 -1333313 -1547721 -1056930
36675 -1056930 -418523 -89506 -20805 96430 391932 690296 728211 427401 -35605 -396653
36665 -396653 -516339 -432037 -257706 -87889 32376 120956 245151 440230 650018 802378
36655 802378 908167 987628 928326 584858 80741 -157700 162567 801025 1198647 1091827
36645 1091827 743389 521775 437635 244110 -119165 -389197 -300122 95690 472574 535491
36635 535491 284383 38534 151537 601546 929120 735464 179465 -233922 -306343 -278777
36625 -278777 -299048 -165006 215834 495574 341299 -58567 -299284 -330337 -326419 -225946
36615 -225946 93109 331814 67480 -481365 -611428 -167798 203724 71340 -135708 103779
$$ packed form
36685A00137J21732J04939L7674J57939J70362k79029q64467q82600k14408M90791
36675a056930O38407L29017O8701J17235K95502K98364L7915l00810m63006l61048
36665c96653j19686Q4302J74331J69817J20265Q8580J24195J95079K09788J52360
36655H02378J05789P9461n9302l43468n04117k38441L20267O38458L97622j06820
36645A091827l48438k21614q4140j93525l63275k70032Q9075L95812L76884O2917
36635E35491k51108k45849J13003M50009L27574j93656n55999m13387p2421K7566
36625b78777k0271J34042L80840K79740j54275l99866k40717l1053L918J00473
36615b25946L19055K38705k64334n48845j30063M43630L71522j32384k07048K39487
$$ plain form
36605 103779 525302 535046 195219 130599 578481 1075221 1106535 677119 196944 73504
36595 73504 393686 786785 707278 95897 -409954 -235154 363948 699247 629843 594774
36585 594774 760175 802447 651459 768946 1355454 1853812 1729842 1335105 1418249 2007935
36575 2007935 2380681 2102311 1560895 1352560 1575230 1939347 2254369 2534988 2814548
36566 2814548 3123266 3574416 4246474 4997217 5587560 6014413 6539903 7296091 7992816
36557 7992816 8169710 7697630 6896026 6161607 5626298 5220281 4903492 4676558 4431171
36548 4431171 3976530 3266092 2492420 1890011 1507922 1248032 1074968 1059681 1178301 1203607
36538 1203607 962967 661730 705135 1098117 1278458 812242 76849 -142930 301539 746324
$$ packed form
36605A03779M21523R744l39827o4620M47882M96740L1314m29416m80175j23440
36595G3504L20182L93099p9507o11381n05851J74800N99102L35299o9404l5069
36585E94774J65401M2272j50988J17487N86508M98358j23970l94737Q3144N89686
36575B007935L72746k78370n41416k08335K22670L64117L15022K80619K79560
36566B814548L08718M51150O72058P50743N90343M26853N25490P56188O96725
36557G992816J76894m72080q01604p34419n35309m06017l16789k26934k45387
36548D431171m54641p10438p73672o02409l82089k59890j73064j5287J18620K5306
36538A203607k40640l01237M3405L92982J80341m66216p35393k19779M44469M44785
$$ plain form
36528 746324 698658 499295 665366 991884 869843 329679 145648 780574 1704395 2031503
36518 2031503 1552489 854219 569918 779197 1123355 1293695 1297045 1304938 1378868 1448509
36508 1448509 1516471 1705705 2036389 2321705 2404911 2349337 2261006 2109492 1912870 1881894
36498 1881894 2082049 2131783 1632302 820656 374880 552370 917485 986150 754266 485286
36488 485286 354025 444021 738443 959397 786442 402638 400222 908056 1291420 1090552
36478 1090552 766676 943481 1307122 1043739 206624 -244817 87694 399397 -42778
36469 -42778 -696962 -548246 297934 701754 138499 -565731 -440115 342792 891369 865314
36459 865314 670222 568615 306948 -257898 -757367 -828197 -606007 -392335 -200357 10404
$$ packed form
36528G46324m7666j99363J66071L26518j22041n40164j84031O34926R23821L27108
36518B031503m79014o98270k84301K09279L44158J70340L350P893P3930O9641
36508A448509O7962J89234L30684K85316Q3206n5574q8331j51514j96622l0976
36498A881894K00155M9734m99481q11646m45776J77490L65115O8665k31884k68980
36488D85286j31261Q9996K94422K20954j72955l83804k416N07834L83364k00868
36478A090552l23876J76805L63641k63383q37115m51441L32511L11703m42175
36469d2778o54184J48716Q46180M03820n63255p04230J25616P82907N48577k6055
36459H65314j95092j01607k61667n64846m99469p0830K22190K13672J91978K10761
$$ plain form
36449 10404 -2919 -401890 -815960 -773504 -422744 -277638 -345220 -126746 476199 895978
36439 895978 735503 311754 83739 26481 -78650 -142661 34109 348759 556320 639102
36429 639102 706446 718664 585111 353591 81541 -251795 -503660 -355059 185368 598681
36419 598681 523016 284687 363076 636594 647902 374679 197785 259815 396106 604800
36409 604800 1035506 1533283 1717779 1556137 1398804 1411548 1413749 1316239 1275156 1347047 1401131
36398 1401131 1422438 1504858 1538744 1348309 1126158 1206869 1391515 1117504 421835 69538
36388 69538 467586 1095218 1372014 1464718 1741043 1988033 1820133 1477102 1522437 1946988
36378 1946988 2209608 2080781 1868293 1812744 1780840 1632715 1463667 1365011 1269106 1136406
$$ packed form
36449A0404j3323l98971m14070M2456L50760J45106o7582K18474O02945M19779
36439H95978j60475m23749k28015n7258j05131o4011J76770L14650K07561Q2782
36429F39102O7344J2218j33553k31520k72050l33336k51865J48601N40427M13313
36419E98681p5665k38329P8389K73518J1308k73223j76894O2030J36291K08694
36409F04800M30706M97777J84496j61642j57333J2744K201r7510m1083P1891N4084
36398A401131K1307Q2420L3886j90435k22151Q0711J84646k74011o95669l52297
36388F9538L98048O27632K76796R2704K76325K46990j67900l43031M5335M24551
36378A946988K62620j28827k12488n5549l1904j48125j69048r8656r5905j32700
$$ plain form
36368 1136406 1053969 1083542 1196595 1356851 1492284 1453966 1216442 1030058 1131300 1407353
36358 1407353 1628672 1885360 2415606 3066602 3359243 3131614 2717630 2403234 2109637
36349 2109637 1768007 1611995 1831094 2208266 2371537 2224733 1929349 1657758 1566209 1793436
36339 1793436 2221377 2408510 2060178 1468343 1203877 1436127 1829293 2060294 2124856 2109290
36329 2109290 1981046 1730489 1470475 1238832 903950 439604 112346 174546 496569 746857
36319 746857 855892 1025334 1297638 1432667 1304735 1133811 1136143 1174793 1011714 750585
36309 750585 719216 960014 1148270 1068851 903140 916466 1070690 1126544 1011192 901615
36299 901615 970802 1175844 1311458 1223321 968514 767879 768262 877220 905781 833569 792014
$$ packed form
36368A136406q2437K9573J13053J60256J35433l8318k37524j86384J01242K76053
36358A407353K21319K56688N30246O50996K92641k27629m13984l14396k93597
36349B109637l41630j56012K19099L77172J63271j46804k95384k71591r1549K27227
36339A793436M27941J87133l48332n91835k64466K32250L93166K31001O4562j5566
36329B109290j28244k50557k60014k31643l34882m64346l27258O2200L22023K50288
36319G46857J09035J69442K72304J35029j27932j70924K332L8650j63079k61129
36309G50585l1369K40798J88256p9419j65711J3326J54224N5854j15352j09577
36299I01615O9187K05042J35614q8137k54807k00635L83J08958K8561p2212m1555
$$ plain form
36288 792014 788666 635579 234402 -213553 -395370 -198656 232388 647145 832416 745823
36278 745823 607186 722285 1085751 1287077 987569 411332 165766 574189 1330810 1842562
36268 1842562 1818870 1495010 1317374 1432239 1529512 1267616 791580 614983 937905 1340720
36258 1340720 1339391 1031096 903861 1118622 1312331 1141441 744562 546815 769840 1252669
36248 1252669 1666184 1807586 1710423 1517416 1283768 975670 667932 583880 804855 1057814
36238 1057814 992028 624893 312701 273786 335235 213456 -107312 -373435 -360628 -101449
36228 -101449 160468 225869 162671 232739 554721 911137 975677 669052 191888 -220368
36218 -220368 -441830 -423646 -202849 46885 126348 19985 -96571 -81302 13789 22838 -132352
$$ packed form
36288G92014l348j53087m01177m47955j81817J96714M31044M14757J85271q6593
36278G45823j38637J15099L63466K01326k99508n76237k45566M08423P56621N11752
36268A842562k3692l23860j77636J14865R7273k61896m76036j76597L22922M02815
36258A340720j329l08295j27235K14761J93709j70890l96879j97747K23025M82829
36248A252669M13515J41402r7163j93007k33648l08098l07738q4052K20975K52959
36238A057814o5786l67135l12192l8915O1449j21779l20768k66123J2807K59179
36228a01449K61917O5401o3198P0068L21982L56416O4540l06625m77164m12256
36218b20368k21462J8184K20797K49734P9463j06363j16556J5269R5091R049j55190
$$ plain form
36207 -132352 -314519 -256514 133208 552545 575518 211138 -30148 219237 704567 941236
36197 941236 859047 738291 692990 620859 559386 640991 712793 469844 31293 -95747 208988
36186 208988 403272 60673 -463923 -517944 -38608 437943 522517 367532 339908 573651
36176 573651 887761 1001353 816689 542649 465222 565696 533737 237635 -35982 29024
36166 29024 346407 587180 605262 477448 260890 -25034 -252273 -274936 -147186 -49207
36156 -49207 -15690 83055 310452 580069 783352 851863 722502 398070 35342 -156576
36146 -156576 -101837 137291 470500 777270 872599 635435 161253 -300067 -514501 -341215
36136 -341215 190376 758200 897872 500277 24345 -34213 218005 238819 -205689 -759449
$$ packed form
36207a32352j82167N8005L89722M19337K2973l64380k41286K49385M85330K36669
36197I41236q2189j20756m5301p2131o1473Q1605P1802k42949m38551j27040L04735
36186B08988J94284l42599n24596n4021M79336M76551Q4574j54985k7624K33743
36176E73651L14110J13592j84664k74040p7427J00474l1959k96102k73617O5006
36166B9024L17383K40773J8082j27814k16558k85924k27239k2663J27750R7979
36156d9207L3517R8745K27397K69617K03283O8511j29361l24432l62728j91918
36146a56576N4739K39128L33209L06770R5329k37164m74182m61320k14434J73286
36136c41215N31591N67824J39672l97595m75932n8558K52218K0814m44508n53760
$$ plain form
36126 -759449 -950474 -690324 -247046 89211 258898 452428 836299 1185257 999132 219537
36116 219537 -419979 -190126 627293 1058474 746508 340345 436928 776857 861861 814700
36106 814700 1046209 1410599 1356213 824166 391007 430417 620115 471703 -4597 -394835
36096 -394835 -411816 -116033 253496 482695 482669 323063 157299 72792 51367 73375 163958
36085 163958 307036 407589 388746 265697 103404 -29449 -61957 21418 101110 13054
36075 13054 -228741 -405593 -365645 -230179 -227542 -383958 -499801 -419436 -216101 -81234
36065 -81234 -103278 -197957 -217614 -90209 129579 308994 339781 232556 133916 221176 521584
36054 521584 818233 790729 318175 -349418 -761691 -640579 -103513 450518 667809 514118
$$ packed form
36126g59449j91025K60150M43278L36257J69687J93530L83871L48958j86125p79595
36116B19537o39516K29853Q17419M31181l11966m06163R6583L39929Q5004m7161
36106H14700K31509L64390n4386n32047m33159L9410J89698j48412m76300l90238
36096c94835j6981K95783L69529K29199k6j59606j65764q4507k1425K2008R0583
36085A63958J43078J00553j8843j23049j62293j32853l2508Q3375P9692q8056
36075A3054k41795j76852L9948J35466K637j56416j15843Q0365K03335J34867
36065h1234k2044r4679j9657J27405K19788J79415L0787j07225r8640Q7260L00408
36054E21584K96649k7504m72554o67593m12273J21112N37066N54031K17291j53691
$$ plain form
36044 514118 290121 349199 730641 1089883 1072087 736991 492594 584375 797016 762204
36034 762204 444080 156537 143853 319778 450700 448189 395427 370099 332044 163562 -210350
36023 -210350 -699661 -1037920 -986032 -603969 -233530 -124819 -152398 -17719 318077 563224
36013 563224 481241 201455 47664 139713 290270 287286 160264 106498 231890 475122
36003 475122 767581 1118194 1466240 1588055 1321143 827080 444452 287654 189452 53819
35993 53819 6797 96158 114153 -73807 -246905 -139601 140655 309849 378549 562053
35983 562053 798981 778543 476354 253564 316339 462263 518929 642224 931144 1101190
35973 1101190 885925 514748 425892 663065 898203 930352 817609 598281 245062 -110156
$$ packed form
36044E14118k23997N9078L81442L59242j7796l35096k44397R1781K12641l4812
36034G62204l18124k87543j2684J75925J30922k511n2762k5328l8055j68482l73912
36023b10350m89311l38259N1888L82063L70439J08711k7579J34679L35796K45147
36013E63224q1983k79786j53791R2049J50557k984j27022n3766J25392K43232
36003D75122K92459L50613L48046J21815k66912m94063l82628j56798r8202j35633
35993E3819m7022Q9361J7995j87960j73098J07304K80256J69194O8700J83504
35983E62053K36928k0438l02189k22790O2775J45924N6666J23295K88920J70046
35973A101190k15265l71177q8856K37173K35138L2149j12743k19328l53219l55218
$$ plain form
35963 -110156 -242563 -180770 -208241 -443354 -658092 -612420 -374194 -196255 -215400 -374421
35953 -374421 -552371 -688877 -804691 -913919 -925475 -731215 -440149 -356540 -571540 -733043
35943 -733043 -457837 122004 487120 370834 21772 -170044 -70992 201844 474214 642614
35933 642614 737457 863174 992291 937862 687310 575792 837556 1141923 966358 356210
35923 356210 -119303 -166115 -66292 -112502 -210397 -209388 -198844 -240399 -168701 85872 281978
35912 281978 216805 13712 -153913 -333016 -565040 -700919 -688677 -732075 -896179 -892369
35902 -892369 -578671 -332766 -523060 -903170 -992415 -824411 -814217 -1033582 -1137312 -954431
35892 -954431 -670122 -411590 -83845 333288 685796 889757 980725 936323 756430 666527
$$ packed form
35963a10156j32407O1793k7471k35113k14738M5672K38226J77939j9145j59021
35953c74421j77950j36506j15814j09228j1556J94260K91066Q3609k15000j61503
35943g33043K75206N79841L65116j16286l49062j91816R9052K72836K72370J68400
35933F42614R4843J25717J29117n4429k50552j11518K61764L04367j75565o10148
35923C56210m75513m6812R9823m6210r7895J009J0544m1555P1698K54573J96106
35912B81978o5173k03093j67625j79103k32024j35879J2242m3398j64104L810
35902h92369L13698K45905j90294l80110q9245J68004J0194k19365j03730J82881
35892i54431K84309K58532L27745M17133L52508K03961R0968m4402j79893q9903
$$ plain form
35882 666527 880740 1187861 1147016 693663 182222 -161397 -414938 -568000 -418479 12354
35872 12354 368752 435932 392455 439324 498205 432034 267442 47198 -265291 -606241 -801624
35861 -801624 -837222 -869831 -914292 -841353 -727331 -799523 -943036 -722761 -71722 498708
35851 498708 604048 458563 389112 346098 221909 191061 331105 328620 4115 -275664
35841 -275664 -194911 -88624 -362946 -679985 -416543 303201 770609 768259 742086 912538
35831 912538 949406 647648 268408 29954 -160818 -297414 -172854 101471 50331 -419424
35821 -419424 -762806 -591713 -207429 4502 180010 531819 787657 630144 325900 315611
$$ packed form
35882F66527K14213L07121m0845m53353n11441l43619k53541j53062J49521M30833
35872A2354L56398O7180m3477M6869N8881o6171j64592k20244l12489l40950j95383
35861h01624l5598l2609m4461P2939J14022p2192j43513K20275O51039N70430
35851D98708J05340j45485o9451m3014j24189l0848J40044k485l24505k79779
35841b75664Q0753J06287k74322l17039K63442P19744M67408k350k6173J70452
35831I12538L6868l01758l79240k38454j90772j36596J24560K74325n1140m69755
35821d19424l43382J71093L84284K11931J75508L51809K55838j57513l04244j0289
$$ [...]
##END NTUPLES=NMR SPECTRUM
##END=
