##TITLE=31Pdec_SR20
 , 24 sc 11-03
 20.10.2020
##JCAMPDX= 6.0         $$ Bruker NMR JCAMP-DX V2.0
##DATA TYPE= NMR SPECTRUM
##DATA CLASS= NTUPLES
##ORIGIN= UXNMR, Bruker Analytische Messtechnik GmbH
##OWNER= root
$$ XWIN-NMR		Version 3.5
$$ Tue Oct 20 11:04:56 2020 Russian Standard Time (UT+4h)  she@DPX200
##.OBSERVE FREQUENCY= 81.013821
##.OBSERVE NUCLEUS= ^31P
##.ACQUISITION MODE= SIMULTANEOUS
##.ACQUISITION SCHEME= undefined
##.AVERAGES= 24
##.DIGITISER RES= 17
##SPECTROMETER/DATA SYSTEM= spect
##.PULSE SEQUENCE= zgpg30
##.SOLVENT NAME= CDCl3
##.SHIFT REFERENCE= (INTERNAL, CDCl3, 0, 182.463)
##AUDIT TRAIL= $$ (NUMBER, WHEN, WHO, WHERE, WHAT)
$$ ##TITLE= Audit trail, XWIN-NMR		Version 3.5
$$ ##JCAMPDX= 5.01
$$ ##ORIGIN= Bruker BioSpin GmbH
$$ ##OWNER= she
$$ F:/spectra/data/she/nmr/P31/1/pdata/1/auditp.txt
$$ ##AUDIT TRAIL=  $$ (NUMBER, WHEN, WHO, WHERE, WHAT)
(   1,<2020-10-20 11:03:25.25 +0400>,<she>,<DPX200>,
      <created by zg, POWCHK disabled, PULCHK disabled
       configuration hash MD5:
       00 E9 B6 7A A2 85 ED C7 34 08 36 98 17 FE 4E 26
       data hash MD5: 32K
       8F 1E FD D4 ED 8A B9 B2 BB 7D B4 8E 46 80 57 E7>)
(   2,<2020-10-20 11:03:41.50 +0400>,<she>,<DPX200>,
      <Start of raw data processing
       efp BC_mod = 2 LB = 1 FT_mod = 6 PKNL = 1 PHC0 = -2746.592 PHC1 = 42.80141 SI = 64K 
       data hash MD5: 64K
       A1 82 FF 46 7C 97 0C BC 2A 43 0D 2C 80 41 9A 96>)
(   3,<2020-10-20 11:04:01.73 +0400>,<she>,<DPX200>,
      <pk PHC0 = -5.043978 PHC1 = 28.8 
       data hash MD5: 64K
       50 82 1A B3 8D 72 56 F6 9D 6E 82 D5 6B DB 23 67>)
(   4,<2020-10-20 11:04:05.73 +0400>,<she>,<DPX200>,
      <abs ABSG = 5 
       data hash MD5: 64K
       80 0F 6F 5E 11 22 8D 59 6E 79 BA E5 D9 70 4D 24>)
$$ ##END=
$$ 
$$ hash MD5
$$ 30 B3 85 19 E4 F4 A9 BC 64 87 31 2A 67 AF 65 5E
##$RELAX= 
##$RELAX= 
##$RELAX= 
##$RELAX= 
##$RELAX= 
##$RELAX= 
##$RELAX= 
##$RELAX= 
$$ Bruker specific parameters
$$ --------------------------
##$DU= <F:/spectra>
##$EXPNO= 1
##$NAME= <P31>
##$PROCNO= 1
##$TYPE= <nmr>
##$USER= <she>
##$AMP= (0..31)
100 100 100 100 100 100 100 100 100 100 100 100 100 100 100 100 100 100 
100 100 100 100 100 100 100 100 100 100 100 100 100 100 
##$AQSEQ= 0
##$AQ_mod= 1
##$AUNM= <au_zg>
##$AUTOPOS= <>
##$BF1= 81.014009
##$BF2= 200.13
##$BF3= 200.13
##$BF4= 200.13
##$BF5= 200.13
##$BF6= 200.13
##$BF7= 200.13
##$BF8= 200.13
##$BYTORDA= 1
##$CFDGTYP= 0
##$CFRGTYP= 5
##$CHEMSTR= <none>
##$CNST= (0..31)
1 1 145 1 1 1 1 1 1 1 1 1 1 1 1 1 1 1 1 1 1 1 1 1 1 1 1 1 1 1 1 1 
##$CPDPRG= <waltz16>
##$CPDPRG1= <>
##$CPDPRG2= <waltz16>
##$CPDPRG3= <>
##$CPDPRG4= <mlev>
##$CPDPRG5= <mlev>
##$CPDPRG6= <mlev>
##$CPDPRG7= <mlev>
##$CPDPRG8= <mlev>
##$CPDPRGB= <>
##$CPDPRGT= <>
##$D= (0..31)
0 1 0 0 0 0 0 0 0 0 0 0.03 2e-05 3e-06 0 0 0 0 0 0 0 0 0 0 0 0 0 0 0 0 
0 0 
##$DATE= 1603177404
##$DBL= (0..7)
120 120 120 11 120 120 24 19 
##$DBP= (0..7)
150 150 150 150 150 150 150 150 
##$DBP07= 0
##$DBPNAM0= <>
##$DBPNAM1= <>
##$DBPNAM2= <>
$$ [...]
##$SUBNAM3= <"">
##$SUBNAM4= <"">
##$SUBNAM5= <"">
##$SUBNAM6= <"">
##$SUBNAM7= <"">
##$SUBNAM8= <"">
##$SUBNAM9= <"">
##$SW= 369.568048894756
##$SWIBOX= (0..15)
0 1 3 0 0 0 0 0 0 0 0 0 0 0 0 0 
##$SW_h= 29940.119760479
##$TD= 32768
##$TD0= 1
##$TE= 0
##$TE2= 300
##$TE3= 300
##$TEG= 300
##$TL= (0..7)
0 120 53 12 22 120 120 120 
##$TP= (0..7)
150 150 150 150 150 150 150 150 
##$TP07= 0
##$TPNAME0= <>
##$TPNAME1= <>
##$TPNAME2= <>
##$TPNAME3= <>
##$TPNAME4= <>
##$TPNAME5= <>
##$TPNAME6= <>
##$TPNAME7= <>
##$TPOAL= (0..7)
0.5 0.5 0.5 0.5 0.5 0.5 0.5 0.5 
##$TPOFFS= (0..7)
0 0 0 0 0 0 0 0 
##$TUNHIN= 0
##$TUNHOUT= 0
##$TUNXOUT= 0
##$USERA1= <user>
##$USERA2= <user>
##$USERA3= <user>
##$USERA4= <user>
##$USERA5= <user>
##$V9= 5
##$VALIST= <valist>
##$VCLIST= <CCCCCCCCCCCCCCC>
##$VD= 0
##$VDLIST= <DDDDDDDDDDDDDDD>
##$VPLIST= <PPPPPPPPPPPPPPP>
##$VTLIST= <TTTTTTTTTTTTTTT>
##$WBST= 1024
##$WBSW= 4
##$XGAIN= (0..3)
0 0 0 0 
##$XL= 0
##$YL= 0
##$YMAX_a= 100025
##$YMIN_a= -76052
##$ZGOPTNS= <>
##$ZL1= 120
##$ZL2= 120
##$ZL3= 120
##$ZL4= 120
##$ABSF1= 182.463
##$ABSF2= -187.1042
##$ABSG= 5
##$ABSL= 3
##$ALPHA= 0
##$AQORDER= 0
##$ASSFAC= 0
##$ASSFACI= 0
##$ASSFACX= 0
##$ASSWID= 0
##$AUNMP= <proc_1d>
##$AZFE= 0.1
##$AZFW= 0.5
##$BCFW= 0
##$BC_mod= 2
##$BYTORDP= 0
##$COROFFS= 0
##$CY= -3
##$DATMOD= 1
##$DC= 0
##$DFILT= <>
##$DTYPP= 0
##$F1P= 0
##$F2P= 0
##$FCOR= 1
##$FTSIZE= 65536
##$FT_mod= 6
##$GAMMA= 0
##$GB= 0
##$INTBC= 1
##$INTSCL= 5.30512e-09
##$ISEN= 30
##$LB= 1
##$LEV0= 0
##$LPBIN= 0
##$MAXI= 10000
##$MC2= 0
##$MEAN= 0
##$ME_mod= 0
##$MI= 50
##$NCOEF= 0
##$NC_proc= -3
##$NLEV= 6
##$NOISF1= 182.463
##$NOISF2= 159.3651
##$NSP= 0
##$NTH_PI= 0
##$NZP= 0
##$OFFSET= 182.463
##$PC= 4
##$PHC0= -2751.636
##$PHC1= 71.60141
##$PH_mod= 1
##$PKNL= yes
##$PPARMOD= 0
##$PSCAL= 0
##$PSIGN= 0
##$REVERSE= no
##$SF= 81.0140089999434
##$SI= 65536
##$SIGF1= 159.3651
##$SIGF2= -187.1042
##$SINO= 113.3802
##$SIOLD= 16384
##$SREGLST= <1H.CDCl3>
##$SSB= 0
##$STSI= 65536
##$STSR= 0
##$SW_p= 29940.119760479
##$SYMM= 0
##$S_DEV= 0
##$TDeff= 32768
##$TDoff= 0
##$TI= <>
##$TILT= no
##$TM1= 0
##$TM2= 0
##$TOPLEV= 0
##$USERP1= <user>
##$USERP2= <user>
##$USERP3= <user>
##$USERP4= <user>
##$USERP5= <user>
##$WDW= 1
##$XDIM= 65536
##$YMAX_p= 332945974
##$YMIN_p= -1828020
$$ End of Bruker specific parameters
$$ ---------------------------------
##NTUPLES= NMR SPECTRUM
##VAR_NAME=  FREQUENCY,     SPECTRUM/REAL,   SPECTRUM/IMAG
##SYMBOL=    X,             R,               I
##VAR_TYPE=  INDEPENDENT,   DEPENDENT,       DEPENDENT
##VAR_FORM=  AFFN,          ASDF,            ASDF
##VAR_DIM=   65536,         65536,           65536
##UNITS=     HZ,            ARBITRARY UNITS, ARBITRARY UNITS
##FACTOR=    0.456856943014862, 1,           1
##FIRST=     14782.0589164792, 0,            0
##LAST=      -15158.0608439998, 0,           0
##MIN=       -15158.0608439998, -1828020,    0
##MAX=       14782.0589164792, 332945974,    0
$$ Real data points
##PAGE= N=1
##DATA TABLE= (X++(R..R)), XYDATA
$$ [...]
41890F66437j0920k2431Q3920K44536J56122k28008n09014l62871K3045K53399
41880B94215K25368R9625j0145o7521l356J71969K62273J10810j58196l01605
41870F23437k64026j62234p2776l742J4575k9217o3834k8805M5996J25350K07921
41859C92645K21906O3496j78388k52619j10589K836m4379o2366P3028J43108k1310
41848B27368j72173l2568K00141J62806n4555o7880J39693K10498L6603r5280
41838E54653l0541L5850k9032q0250k6607k616n7409k6364J16078J19272j22220
41827D50814l26099k35885Q34J11595R9515J02278Q6574k3477j03758j7599J07897
41816B52689R2078M7275J88165L98248L47841J7230k51279k57747j66295j35887
$$ y = [666437, 655517, 633086, 717006, 961542, 1117664, 889656, 380642, 17771, 40816, 294215, 519583, 619208, 609063, 541542, 538186, 710155, 972428, 1083238, 925042, 623437, 359411, 197177, 124401, 120659, 135234, 106017, 42183, 13378, 59374, 184724, 392645, 614551, 678047, 499659, 247040, 136451, 139287, 94908, 32542, 105570, 248678, 227368, 55195, 22627, 222768, 385574, 331019, 263139, 402832, 613330, 649933, 554653, 524112, 559962, 530930, 450680, 424073, 421457, 364048, 337684, 453762, 573034, 450814, 124715, -111170, -110336, 1259, 100774, 203052, 289626, 266149, 162391, 144792, 252689, 344767, 392042, 580207, 978455, 1326296, 1343526, 1092247, 834500, 668205, 532318]
41806E32318n5857J71557L43346K00619j71136m17016l41096q4174J06325J29444
41796D14330L9769o4654j04028m1146Q7487J82530J63362M1069r9773j81170j78781
41785B58995j04800J3984J22020J40407M4447p3716q8640m432L8028m2559j39396
41774A64338j02189M7193J48938J27721N9242Q720o2321j71707k20745j27215
41764a28025K2410P0882K87o7316n4707R82N4194J01451J13951M9631l3144p829
41752A22767J17980J72294P4540k6728J830M3970o8318k34859k04113L5072K25893
41741B60328K14918J09159K1008r1605k32861k56905j03779M7370L9180j4722
41731g909N9688J78418J28604o8746j74351r0137K3234J5039o2453q9030n4606
$$ y = [532318, 476461, 648018, 991364, 1191983, 1020847, 603831, 262735, 178561, 284886, 414330, 454099, 389445, 285417, 244271, 331758, 514288, 677650, 718719, 618946, 437776, 258995, 154195, 168179, 290199, 430606, 475053, 401337, 312697, 308265, 346293, 303734, 164338, 62149, 109342, 258280, 386001, 445243, 453963, 391642, 219935, -810, -128025, -105615, -34733, -34446, -101762, -156469, -155487, -101293, 158, 114109, 163740, 130596, 122767, 240747, 413041, 487581, 460853, 462683, 506653, 438335, 203476, -637, 34435, 260328, 475246, 584405, 605413, 513808, 280947, 24042, -79737, -32367, 6813, -7909, 51779, 230197, 358801, 290055, 115704, 25567, 48801, 63840, 1387, -87643, -142249]
41720a42249k5765l1351m5314k9247L4413J07969J07020N182q9064m1333J25748
41709b3991K33685J44909q5316k54258j95167N0691K45998K17711R4157J32645
41699E61064K95136K38573j46031m55583k99763J05342K23920l5256k45022j38415
41689A03965N5959O0230m6849o3235q063j451j4155L2463P1631R944p4206m2518
41677H3715Q0227J59330J49974J02037M0660k9050o8553o4324o0596n2412L4011
41666C75019J63494J55298m0670k01822j47174k6577o5642j71420q6157J55095
41656A09444K50999J08498l5272k3062J100r6118j80317r1041O9714J05685L7119
41645B56749K2562O5161K5380j07485j74170j00573r725j3072l7619L9240J83151
$$ y = [-142249, -168014, -199365, -244679, -273926, -239513, -131544, -24524, -19342, -108406, -149739, -23991, 209694, 354603, 269287, 15029, -180138, -129447, 116551, 334262, 428419, 561064, 856200, 1094773, 948742, 493159, 193396, 298738, 522658, 487402, 242380, 103965, 159924, 220154, 173305, 110070, 102007, 100556, 86401, 118864, 190495, 200439, 126233, 83715, 163942, 323272, 473246, 575283, 615943, 586893, 518340, 454016, 393420, 341008, 375019, 538513, 693811, 653141, 451319, 304145, 277568, 211926, 40506, -45651, 109444, 360443, 468941, 433669, 410607, 411707, 315589, 135272, 44231, 113945, 219630, 256749, 279311, 344472, 369852, 262367, 88197, -12376, -22101, -35173, -72792, -33552, 149599]
41634A49599K48076J79897O5056j0047m5517n8726k7574M0551N7055m0567j59365
41623C98438j28814P2173K47067J94650n2957k63730k62183r7576N1935R1722
41613B50725Q1428J09532J63441J66271J00769K1832m3913j17972j68526r9067
41603D64520R0260K25582J51512o3835k26893k58378k05064q2661J06422K30075
41593D31540J29086j01948j66707R733J37653n755k14196j53405J25044K58337
41583D49382J05689q9650j06292l3165l1108m0878O8284K06450J62652n0141j84664
41572D56559j23330l5890p8071j31278k2509J39143R9521j12383j73813N3841
41562G1790K95068K49214l284j73844j76261j36551j10393l9866O5085J29264
$$ y = [149599, 397675, 577572, 642628, 632581, 587064, 528338, 500764, 541315, 598370, 557803, 398438, 269624, 341797, 588864, 783514, 730557, 466827, 204644, 107068, 159003, 250725, 332153, 441685, 605126, 771397, 872166, 893998, 850085, 732113, 563587, 464520, 554780, 780362, 931874, 868039, 641146, 382768, 177704, 95043, 201465, 431540, 560626, 458678, 291971, 301704, 439357, 433602, 219406, 66001, 191045, 449382, 555071, 465421, 359129, 325964, 294856, 253978, 322262, 528712, 691364, 641223, 456559, 333229, 297339, 219268, 87990, 65481, 204624, 304145, 191762, 17949, 71790, 366858, 616072, 612788, 438944, 262683, 126132, 15739, -24127, 40958, 170222]
41552A70222J58771J83623J21332p1235j93991m8266J73179J00822k09379k99256
41542H5822j3180K57713K10910P3279J24133J84230k0648k98591k64319J5871
41532C55220J27349l4759j65882r6540q029m4359q5302j8778O5535P7133P1705
41521B43293R1242P5199K0839K4054P7041L1591j44320k69156k07470n2081M7528
41510f2240P2947O1920Q782o0250n6798L1518J02291J07285J15140J39251P3700
41499E33546j01501k17198j45434Q99L1175o5947j51989j39541n3521M1255Q8556
41488a79700P5063O3633J16690J71225J11410k0385n4573K5341M1039o0114p8374
41477B11255R3562K28592R3993j59066k09804n5046J9064q8494j52624n745J96303
$$ y = [170222, 328993, 512616, 633948, 562713, 368722, 320456, 493635, 594457, 385078, 85822, 72642, 330355, 541265, 614544, 738677, 922907, 902259, 603668, 339349, 355220, 482569, 447810, 281928, 185388, 177359, 133000, 47698, 28920, 94455, 171588, 243293, 334535, 409734, 430573, 454627, 531668, 563259, 418939, 149783, -57687, -109768, -62240, 10707, 72627, 81409, 21159, -35639, -4121, 98170, 205455, 320595, 459846, 533546, 432045, 214847, 69413, 70312, 101487, 35540, -116449, -255990, -309511, -268256, -179700, -104637, -41004, 75686, 246911, 358321, 337936, 283363, 308704, 349743, 289629, 211255, 304817, 533409, 627402, 468336, 258532, 203486, 222550, 134056, -18568, -24313, 171990]
41466A71990K10861L8179j16657j15050r447O1558L4744j4756L3501J74960K50365
41455G20248J47563k5717p8894q090J3023r1439j91691j67918q9428q5043j38697
41444C917j27809r674J31575J93480J30075m6388k47416l17666j71385P3658K00491
41433a87142J51450P4956P8318O9446n6485j95999j67185N464J22636J08987Q6407
41422I0853J29383J50907R4623L9905K2040m7039j54092j06351J34078K61384
41412F15691L8904k83215k92856k8353J16747L7403K8655K09888K88267P1448
41402H02579j75804j49254K7961N8278m3484m5081P2513J10009Q200q0715o3537
41391E21665l088N4079J27202J64479O4719j15501j52562O5014L64830M75718
$$ y = [171990, 382851, 421030, 304373, 189323, 179876, 241434, 276178, 261422, 294923, 469883, 720248, 867811, 842094, 763200, 755110, 768133, 676694, 485003, 317085, 227657, 142614, 3917, -123892, -133566, -1991, 191489, 321564, 275176, 27760, -289906, -461291, -387633, -187142, -35692, 39264, 117582, 187028, 130543, -65456, -232641, -227177, -104541, 4446, 90853, 220236, 371143, 465766, 505671, 527711, 480672, 326580, 220229, 354307, 615691, 654595, 371380, 78524, 50171, 166918, 204321, 232976, 442864, 731131, 802579, 626775, 477521, 505482, 563760, 520276, 475195, 547708, 657717, 665917, 585202, 521665, 518577, 572656, 699858, 864337, 929056, 813555, 660993, 726007, 1090837, 1566555]
41381A566555L17492N4429r1331l0962J69175M03014N95941O41933L86510j71808
41371C840948p10283q29943n21400j86212j25781k24203k43472j87618j81531
41362F30505j95732j34165m7955k1717K3016J61338K27034L0171k72241l35590
41352F4664j27154M2536l28q4515k7466R8135J37768P8256r473q0532q9013o047
41340c169P9426L7174q4929r1087O8297K13839J99635P5647o2281j86435k38846
41329G271j31300O5141J34983K7168n0771L9120J51684J14918k430m9238l5346
41318B71200l2496k416P5248O5358j01285k09738l0822K85873L77089J89131M7070
41307I34212J65896L51308K91275l4657l55278m17135k15110K5437O5014j00279
$$ y = [1566555, 1884047, 1938476, 1847145, 1816183, 1985358, 2388372, 2984313, 3626246, 4012756, 3840948, 3130665, 2300722, 1779322, 1593110, 1467329, 1243126, 999654, 812036, 630505, 434773, 300608, 252653, 230936, 253952, 415290, 642324, 672495, 400254, 64664, -62490, -19954, -20282, -104797, -132263, -34128, 103640, 181896, 172423, 91891, 2878, -3169, 76257, 113431, 28502, -62585, 5712, 219551, 419186, 494833, 432552, 246117, 7271, -124029, -58888, 76095, 103263, 52492, 91612, 243296, 358214, 355784, 306546, 271200, 238704, 236288, 311536, 376894, 275609, 65871, 35049, 320922, 698011, 887142, 934212, 1100108, 1451416, 1742691, 1708034, 1352756, 935621, 720511, 745948, 810962, 710683]
41297G10683k19959r1408J65609K56295R7739r7401j28829l9276R247m6434j43910
41286D72356j88602j18811M2651J69503J49526L7949j0734K4355P794r9558j31490
41275C54939L4819K58936L09230J65353O195m2760j1410K2687Q104q8015k31387
41264G86691k82624j37771J02367K33263K09990J68714J89274K09604K06196K66012
41254A951716L99858M78229M74581N66850P95238Q04013K41140o45072j154741
41245C911812r56942m67251k56447l43577l30539p0065J42378N4566j64260j85715
41235A333960J1853J44621L7313j62467k30288j64400j13598j05585l3465R6261
41225H14205J07318o8929k35332j97997n5744k3106o5701L0998K55989L23556
$$ y = [710683, 490724, 399316, 564925, 821220, 918959, 821558, 692729, 653453, 662700, 616266, 472356, 283754, 164943, 207594, 377097, 526623, 564572, 553838, 578193, 585987, 486429, 354939, 389758, 648694, 957924, 1123277, 1129472, 1086712, 1075302, 1097989, 1106093, 1018078, 786691, 504067, 366296, 468663, 701926, 911916, 1080630, 1269904, 1479508, 1685704, 1951716, 2351574, 2829803, 3304384, 3871234, 4666472, 5470485, 5711625, 5066553, 3911812, 2954870, 2487619, 2231172, 1887595, 1557056, 1486991, 1629369, 1683935, 1519675, 1333960, 1345813, 1490434, 1527747, 1365280, 1134992, 970592, 856994, 751409, 717944, 814205, 921523, 852594, 617262, 419265, 363521, 340415, 274714, 305712, 561701, 885257]
41215H85257J04359j49236j53299K8003J26191M7653p6619j25983r4357j0017
41205E81952R1275J35802P9131j4601n8093p0227j18851j72173j25568K8204J59573
41194E16424J58559O7503K4639R4580J84618J64472O5486O6264K19275L18743
41184A880563J83823n1195j42696j16774j51830j79504O948K76638K64154J3410
41174A983537k531L28489N05305K39260l0124J37593M65702M92729L55278M38548
41164D913786O57554P44040Q71239J277387J643017J657952J840066K844696M334351
41155B0784088N688213P408486J0084440J1900388R359490J677319p078240j1774355
41147D8049829j1273546q425513n997636m429937l204106k348625j982897j711741
$$ y = [885257, 989616, 840380, 687081, 715084, 841275, 888928, 812309, 686326, 591969, 581952, 673227, 809029, 888160, 873559, 815466, 745239, 626388, 454215, 328647, 356851, 516424, 674983, 742486, 767125, 861705, 1046323, 1210795, 1276281, 1342545, 1561820, 1880563, 2064386, 2013191, 1870495, 1753721, 1601891, 1422387, 1429335, 1705973, 1970127, 1983537, 1981006, 2309495, 2814800, 3054060, 3023936, 3161529, 3627231, 4119960, 4475238, 4913786, 5571340, 6315380, 7186619, 8464006, 10107023, 11764975, 13605041, 16449737, 20784088, 26472301, 33880787, 43965227, 55865615, 65225105, 66902424, 59824184, 48049829, 36776283, 28350770, 22353134, 17923197, 14719091, 12370466, 10387569, 8675828]
41139H675828j242727q61389q02937p88866n83462m21870n00998n61605l50745
41130B561229o1409L1908k349M448k293j03695j88547j64102j11751o9245L7193
41119A931387J19743l9808l40341l61043r726K58252J21550j34394j36005N44
41109A410159p198o8177N4630K46926K28413N1336j4091L9496n082j57240k02573
41098A576599p8130O3592J37300J82130J68643K5251j58447k02841j03693j5585
41088A594819j406n47k733m7930r2700o9226l0961n9971r8534n7975l589k4043
41076A105204k1741J22332K72290K07509j012q8254k7191l5797j55842j76810
41066A200688m2108J7550j11737k05754p4787J08007Q7327o1210o3783J14048
$$ y = [8675828, 7433101, 6571712, 5768775, 4979909, 4396447, 3974577, 3473579, 2911974, 2561229, 2499820, 2531728, 2529379, 2533827, 2531534, 2427839, 2239292, 2075190, 1963439, 1894194, 1931387, 2051130, 2011322, 1670981, 1309938, 1300212, 1558464, 1680014, 1545620, 1409615, 1410159, 1402961, 1334784, 1389414, 1636340, 1864753, 1916089, 1901998, 1941494, 1936412, 1779172, 1576599, 1498469, 1562061, 1699361, 1881491, 2050134, 2075385, 1916938, 1714097, 1610404, 1594819, 1593413, 1592866, 1590133, 1542203, 1449503, 1380277, 1349316, 1289345, 1190811, 1132836, 1129247, 1105204, 1083463, 1205795, 1478085, 1685594, 1684582, 1596328, 1569137, 1533340, 1377498, 1200688, 1158580, 1176130, 1064393, 858639, 783852, 891859, 979186, 917976, 854193, 968241]
41056I68241K22820J08624p2239p5831J14106K72833K03209l7381k05552j52588
41046A346242K5442J43534J43167P2548m8061j94048k38164p8202J48631J76859
41036A497948l1917k29352k21523q2934L5293J10379J50392Q3134r5046k07164
41026A009210j17344M0490M6592o8186p8820P0377J75698Q6243p9049j16242q330
41015I60639R6380J00246M2742L339J0005M4513P1757N0896l2550j25840j40056
41004A082071m8840P3827J41972J48888J28975P1754m3702j44806j06079P5602
40994A379662K51860L26281L75853M69933M76714K21026k04217m72912m07844
40985B416356j76206m2889o4673j21140j33088j15709p5027L408O2136o352j95885
$$ y = [968241, 1191061, 1299685, 1227446, 1151615, 1265721, 1538554, 1741763, 1704382, 1498830, 1346242, 1371684, 1515218, 1658385, 1730933, 1682872, 1488824, 1250660, 1172458, 1321089, 1497948, 1466031, 1236679, 1015156, 932222, 967515, 1077894, 1228286, 1311420, 1216374, 1009210, 891866, 932356, 978948, 910762, 831942, 902319, 1078017, 1164260, 1085211, 968969, 960639, 1057019, 1157265, 1200007, 1203346, 1213351, 1257864, 1329621, 1380517, 1347967, 1222127, 1082071, 1033231, 1107058, 1249030, 1397918, 1526893, 1598647, 1554945, 1410139, 1304060, 1379662, 1631522, 1957803, 2333656, 2803589, 3280303, 3501329, 3297112, 2824200, 2416356, 2240150, 2197261, 2132588, 2011448, 1878360, 1762651, 1687624, 1691032, 1753168, 1746816, 1550931]
40974A550931l30799k55782m8326M9335o9008k22400j66753P8391K44002J60568
40964I90159l7059j19220n5068K1394M6517O7500R0039O0225L346J1765N9978
40953A139576K391j72324k50400p9126J86618K78826J71842P2141R1860J16658
40943A558062L0695q5384p8146M4644J19024M8900p0730r3605k5019n209r5206
40932A348026j73285j03085O6966J70178J46293P8644K1520o0705j50842j36106
40922A207604M32Q3605k1479j76992j34512J15747L20193K86145Q8648p3811j08805
40911A586775o5365l0712n2743j16800j58984j28873m6811L1662Q9211J29290
40901A236650J12081k208j45655j75351m4911J30084K07766J59237N4219k3831
$$ y = [1550931, 1220132, 964350, 916024, 965359, 896351, 673951, 507198, 585589, 829591, 990159, 953100, 833880, 778812, 800206, 846723, 914223, 1004262, 1064487, 1067833, 1079598, 1139576, 1141967, 969643, 719243, 640117, 826735, 1105561, 1277403, 1349544, 1441404, 1558062, 1588757, 1503373, 1425227, 1469871, 1588895, 1637795, 1567065, 1473460, 1448441, 1443232, 1348026, 1174741, 1071656, 1138622, 1308800, 1455093, 1533737, 1555257, 1494552, 1343710, 1207604, 1208036, 1291641, 1270162, 1093170, 958658, 1074405, 1394598, 1680743, 1769391, 1695580, 1586775, 1521410, 1490698, 1437955, 1321155, 1162171, 1033298, 986487, 1018149, 1107360, 1236650, 1348731, 1346523, 1200868, 1025517, 980606, 1110690, 1318456, 1477693, 1531912, 1508081]
40891A508081k9743O235j8727j57640k87055k17539L5052K18910J59335k0226
40881A196683r0245j3755P8392J14863J21651R0303q823r1425j7980J76327K71451
40870A827442J57084J1067Q0652L58444N76739N04123J82425j35496k57203k42032
40860C063245k91108m46899n00883k87901K2632J01917r8934k80346j98401N2122
40850A135444K32234K51143J48030m5337k55559l11706j37882P1764O7199j04692
40840A050638j57048K4165K16186J70233o2082k15729j50579o34J8344j07354
40830G86140j65140j0658J91845J66941n7869j57155M636J51524M4330j06711
40820H47883J4488K66122K38650o7461k10365n742J94091R0984r6163l2290J92100
$$ y = [1508081, 1478338, 1484573, 1465846, 1308206, 1021151, 803612, 838664, 1057574, 1216909, 1196683, 1106438, 1092683, 1171075, 1285938, 1407589, 1497892, 1489069, 1397644, 1379664, 1555991, 1827442, 1984526, 1995593, 2076245, 2434689, 3011428, 3515551, 3697976, 3562480, 3305277, 3063245, 2772137, 2325238, 1824355, 1536454, 1559086, 1661003, 1562069, 1281723, 1083322, 1135444, 1367678, 1618821, 1766851, 1721514, 1465955, 1154249, 1016367, 1088131, 1155330, 1050638, 893590, 917755, 1133941, 1304174, 1242092, 1026363, 875784, 875150, 893494, 786140, 621000, 610342, 802187, 969128, 911259, 754104, 758740, 910264, 954594, 847883, 862371, 1128493, 1367143, 1299682, 1089317, 1083575, 1277666, 1368650, 1272487, 1240197, 1432297]
40809A432297K51596R6529o1552j22593j32576n1616J95092M92599O48117O72367
40799C420260O64373M88732o3914p79331j080822p37879j95515L036j38855k39968
40789A340117j37542q404L819k8179k1791k6831q1397j03233l4375K5237m3640
40778H83781j68978j51840N2486K34055J72597q7510k93078k80379j19306L5668
40768B77496J19780J38925R0876N39m1670J6225R3869R1831N1328P7176J32764
40757A049139O2845j62405l65053l70190j89463N1729K54183L43504K48150K080
40747I24519j96803j66920K7761J41567N3922r2477j03958R858Q4429M5130k0417
40736G06611l3717l4982o3952n6845K4648O5564l4192j31520j327K75628L40798
$$ y = [1432297, 1683893, 1780422, 1718870, 1596277, 1463701, 1412085, 1607177, 2099776, 2747893, 3420260, 4084633, 4573365, 4509451, 3730120, 2649298, 1911419, 1715904, 1718940, 1580085, 1340117, 1202575, 1194171, 1197990, 1169811, 1148020, 1121189, 1039792, 936559, 902184, 927421, 883781, 714803, 562963, 615449, 849504, 1022101, 934591, 641513, 361134, 241828, 277496, 397276, 536201, 627077, 627616, 585946, 602171, 696040, 787871, 839199, 916375, 1049139, 1111984, 949579, 584526, 214336, 24873, 76602, 330785, 674289, 922439, 924519, 727716, 560796, 588557, 730124, 784046, 691569, 587611, 597469, 681898, 727028, 706611, 672894, 637912, 573960, 517115, 541763, 607327, 573135, 441615, 440288, 715916, 1056714]
40725A056714O0620k44579k39692l0705M9756m6635p5234O9106K04767J66115
40715I70233R019j34454k02970j61916r856J17864N3222j24625j22393J44911
40705E39035L70670K62390l6924j47297K5731J97602J22103r9219j87605l9174
40695A007312J82282K57343J50267L1801Q4076L04309N24701O18021O32321O87696
40685D480129P66606O66981K14365m70385r80284r94920o38391l47010l52183
40676B344908m47670l52373j17648J0959r372j6825L1447R986j07414j97151k31060
40665I17787l09339l95516k97978k3815J18636o4992l62658m62211l54590k30272
40655a464948j41749O94J99224L41546L50556K27017K7969r1786L9610L46592
$$ y = [1056714, 1117334, 872755, 633063, 602358, 652114, 605479, 530245, 599351, 804118, 970233, 979252, 844798, 641828, 479912, 470056, 587920, 641142, 516517, 394124, 539035, 909705, 1172095, 1135171, 987874, 1013605, 1211207, 1333310, 1234091, 1046486, 1007312, 1189594, 1446937, 1597204, 1629005, 1713081, 2017390, 2542091, 3160112, 3792433, 4480129, 5246735, 5913716, 6128081, 5657696, 4677412, 3682492, 3044101, 2697091, 2344908, 1897238, 1544865, 1427217, 1438176, 1428804, 1411979, 1443426, 1453412, 1345998, 1148847, 917787, 608448, 212932, -85046, -108861, 9775, -55217, -417875, -880086, -1234676, -1464948, -1606697, -1606003, -1406779, -1065233, -714677, -487660, -459691, -551477, -511867, -165275]
40645a65275M80875K40640j33482k77578j64676j8440P1039J53408J63395J481
40635C51387j82691j33085Q5279J43163k5919j05870Q4441K86537K02174p0479
40625F34937k24301j70463n3993J3842K4769k0838q3240m2202J31429K40513R1429
40614E41882j93047k93565j14747J09659J55426O5001O4J106Q626J3871N4095
40603C48371J07664J13684P9656O5874O5883J0767q5279r9535J3545J15251P1053
40592H06934l0406J780J49405J76409k1863k30312j94553K1525J12605o7474l19273
40581D04777l41613q2427K05832K50989O8031p0442O925J35615O2063j49067j77092
40570C13591O5503K65101J55018j02824j87825q0982P212L2231J22507K38409
$$ y = [-165275, 315600, 556240, 422758, 145180, -19496, -37936, 33103, 186511, 349906, 351387, 168696, 35611, 120890, 264053, 238134, 132264, 216705, 503242, 705416, 634937, 410636, 240173, 186180, 200022, 224791, 203953, 120713, 78511, 209940, 450453, 541882, 348835, 55270, -59477, 50182, 205608, 270609, 270673, 271779, 280405, 294276, 348371, 456035, 569719, 649375, 715249, 781132, 791899, 706620, 607085, 620630, 735881, 806934, 776528, 778308, 927713, 1104122, 1082259, 851947, 657394, 678919, 791524, 724050, 404777, 63164, -19263, 186569, 437558, 505589, 435147, 442072, 577687, 639750, 490683, 313591, 379094, 644195, 799213, 696389, 508564, 427582, 434794, 467025, 589532, 827941]
40560H27941J55145j54832m00202l47420j09146O6925J19553J38017J40338O1318
40550D97637q6202j75782j08988O2148J67900Q6684r6438j39602P2004L35015
40540F14376L42891P8455j55266j24181O5391J55070O5443p3584j44047j57059
40530F67489j51104q3856R9012L14457L62827J67548p5939j22953j6231r934j48627
40519A002689j84411j6780Q5734o9972k18056l8163K74502K76232j3500j55583
40509I42692k3639K6284j85870l44815j93215M1009O0252k7824K2364J51269J62776
40498F31283R9355J06093J09257l4104k15790k23793q3347M0493J40183K63908
40488H33538K70707L7259k12943j67519O7108J10491q3350j82482n6057L7964
$$ y = [827941, 983086, 828254, 428052, 80632, -28514, 38411, 157964, 295981, 436319, 497637, 411435, 235653, 126665, 188813, 356713, 443397, 346959, 207357, 279361, 614376, 957267, 1035722, 880456, 756275, 821666, 976736, 1042179, 968595, 824548, 667489, 516385, 432529, 531541, 845998, 1208825, 1376373, 1300434, 1177481, 1161250, 1151316, 1002689, 818278, 801498, 887232, 817260, 599204, 561041, 835543, 1111775, 1098275, 942692, 919053, 945337, 759467, 414652, 221437, 262446, 322698, 294874, 317238, 468507, 631283, 730638, 836731, 945988, 911884, 696094, 472301, 388954, 429447, 569630, 833538, 1104245, 1141504, 928561, 761042, 828150, 938641, 855291, 672809, 616752, 654716]
40478F54716o1530j57087q1986J1603l2975q1892K4142J57210J15985l2652q1499
40467D34035j5743K8298L9588J23619K57337K70011Q7770j51645k58121j75325
40457F39824j28J23798J33516R4144R7522J27609J03634M1003L7362Q3372M8711
40446A530367q9488j74996j14984k1465K607L7450J50454K00880N2637j47678
40436A425784j42966O2748K34034K48394J84510J17815P5087J58477M31667O69472
40426C465022N26597M0454l21601k51530K4368J28557M2381P109J14192K53044
40416D028593L29883K90872M9504l48183n95305m52428j25393k737p9091j0799
40406C084916K63896L98915K44291J33756L33407N93510N78134M14159L99067
$$ y = [654716, 593186, 436099, 354113, 365716, 332741, 250849, 274991, 432201, 548186, 515534, 434035, 418292, 446590, 486178, 609797, 867134, 1137145, 1224915, 1073270, 815149, 639824, 639696, 763494, 897010, 991154, 1088676, 1216285, 1319919, 1360922, 1398284, 1481656, 1530367, 1440879, 1265883, 1150899, 1129434, 1132041, 1169491, 1319945, 1520825, 1573462, 1425784, 1282818, 1345566, 1579600, 1827994, 2012504, 2130319, 2205406, 2363883, 2795550, 3465022, 3991619, 4032073, 3710472, 3458942, 3483310, 3611867, 3654248, 3661357, 3775549, 4028593, 4358476, 4649348, 4698852, 4350669, 3755364, 3302936, 3177543, 3174806, 3095715, 3084916, 3348812, 3747727, 3992018, 4125774, 4459181, 5052691, 5630825, 6044984, 6444051]
40397F444051M03154N6407n65731r41334q25918n42373m36411m31023l08014j12944
40387B739864l5474r4228j64097j81418j50297o2621N0656J03549R4796J22324
40377B423054J65708N0475k27164l55040j05649K94796M69170M32478N09107P51231
40367D408166P94642L93901j78789m53664l16394m6355J11246K01037L64194N73131
40357E851115P00620P80177J008100J436419J830178J955022J861033J685086
40349A7107750J298880M64251o69154j554014j837255j689566j437835j178107
40341A0504950r32156q62722j025564j134382r11356n26440l64152m67862n48292
40332C732024m64424l47362k69125j28327R6417K67245L13372K97290K29433N6039
$$ y = [6444051, 6847205, 6903612, 6337881, 5396547, 4570629, 4028256, 3591845, 3160822, 2852808, 2739864, 2704390, 2610162, 2446065, 2264647, 2114350, 2051729, 2102385, 2205934, 2300730, 2423054, 2588762, 2639237, 2412073, 2057033, 1951384, 2246180, 2715350, 3147828, 3656935, 4408166, 5202808, 5596709, 5417920, 4964256, 4647862, 4601507, 4712753, 4913790, 5277984, 5851115, 6551735, 7331912, 8340012, 9776431, 11606609, 13561631, 15422664, 17107750, 18406630, 18870881, 18201727, 16647713, 14810458, 13120892, 11683057, 10504950, 9572794, 8710072, 7684508, 6550126, 5638770, 5112330, 4748178, 4280316, 3732024, 3267600, 2920238, 2651113, 2522786, 2619203, 2886448, 3199820, 3497110, 3726543, 3782582]
40322C782582j47686k15301j45495q7900o7009K1982J32683P4088j56078l30987
40312B860879l47201l29257l22566k05818r543K1193j58693k47341o8177J22043
40302A315519M8283j39753j36153L4586J19270O2847J6792K6235J839n9364p8608
40291A211493p0484r5794j02254k0490N5295N35r6148n0698J10808J96826J61007
40280A300096J33322J60430J48457P0648J3419l373m4822p2702N2889L25347N26511
40269B610222M86504K70509M8112r4746j57908j60038j32695r9764l3874Q4984
40259B821306J67322Q5199j34858l05445l03356k03717j47766j62740j67069j02212
40249A546664j0938R179p2465j56251j26302k7013j7233j16204j48564k9355P4949
$$ y = [3782582, 3634896, 3419595, 3274100, 3186200, 3119191, 3141173, 3273856, 3347944, 3191866, 2860879, 2513678, 2184421, 1861855, 1656037, 1646494, 1667687, 1508994, 1261653, 1193476, 1315519, 1363802, 1224049, 1087896, 1122482, 1241752, 1304599, 1321391, 1347626, 1349465, 1290101, 1211493, 1141009, 1045215, 942961, 922471, 977766, 978301, 882153, 831455, 942263, 1139089, 1300096, 1433418, 1593848, 1742305, 1812953, 1826372, 1822999, 1778177, 1705475, 1758364, 2083711, 2610222, 3096726, 3367235, 3415347, 3320601, 3162693, 3002655, 2869960, 2770196, 2736322, 2821306, 2988628, 3073827, 2938969, 2633524, 2330168, 2126451, 1978685, 1815945, 1648876, 1546664, 1535726, 1544905, 1472440, 1316189, 1189887, 1162874, 1145641, 1029437, 880873, 851518, 926467]
40238I26467K2904m7211L3682J23991j3450k54030k34339P1633K74052J50445
40228A054144m5450j8807J33256J49019K1693o2622m0883J6333R1868J94635K35787
40217A728973J41903K0097J6143Q0016P1039K1942O5409J42344N0510j93326l03646
40206A841404j31743J02542J22596l7936j46049j17034o0493m8658l2830J4245
40196A506044L7618J3694l730R131M966k4210r785N8145P6163J914l1090R0159
40184A729019K37818J95889j6450j74003j88060j96820k71364k70153j04392O6043
40174A007527P5596J7568N6757J16783N936k19446k83597q8373J42480J59301
40164I90532m0257k64026l12349j12667J89379K99025J00291j30774n9774K02771
$$ y = [926467, 949371, 902160, 935842, 1059833, 1046383, 792353, 558014, 629647, 903699, 1054144, 1008694, 989887, 1123143, 1272162, 1293855, 1231233, 1190350, 1206683, 1298551, 1493186, 1728973, 1870876, 1890973, 1907116, 1987132, 2058171, 2080113, 2145522, 2287866, 2338376, 2145050, 1841404, 1709661, 1812203, 1934799, 1896863, 1750814, 1633780, 1573287, 1524629, 1491799, 1506044, 1543662, 1557356, 1553626, 1562757, 1567723, 1543513, 1533728, 1591873, 1668036, 1669950, 1638860, 1729019, 1966837, 2162726, 2146276, 1972273, 1784213, 1587393, 1316029, 1045876, 941484, 1007527, 1083123, 1100691, 1157448, 1274231, 1280167, 1060721, 777124, 688751, 831231, 990532, 950275, 686249, 373900, 261233, 450612, 749637, 849928, 719154, 659380, 862151]
40154H62151K30294o8681k85643j32646J21702Q6581j61423k51381j00637L4731
40144C35048J8299n484O8829J24090N0517o0195p1070o305J3989l8615p4895j8838
40132C35370R2984J48792R5044J3616J2178N1448p11j21880j18659M7450J19358
40121F74990q2077l23344k68101K409J11221k1009q1794P9964J91452K3499k05630
40110A01580j60141J05393K61278J87428N5190k776k9773o3348n6793j2302K041
40099C87777M082R0020K29962K44981O8387j17868j17860J1341N0342p8122k13082
40088E59960j67796L8043J95175J38630o1597j73418p1449J18627J87167R6134
40078H59476j5430m2726j5477J4833O3031J36105J69841J14554K5292k395M6811
$$ y = [862151, 1092445, 1023764, 738121, 605475, 727177, 813758, 652335, 400954, 300317, 335048, 353347, 347863, 416692, 540782, 591299, 531104, 460034, 453729, 467718, 429103, 354208, 335370, 428354, 577146, 672190, 685806, 697984, 749432, 748721, 626841, 508182, 555632, 674990, 592913, 269569, 1468, 3877, 115098, 94089, 12295, 92259, 283711, 307210, 101580, -58561, 46832, 308110, 495538, 550728, 547952, 518179, 454831, 398038, 385736, 387777, 391859, 481879, 711841, 956822, 1025209, 907341, 789481, 800822, 851164, 773042, 559960, 392164, 430207, 625382, 764012, 702415, 528997, 457548, 576175, 763342, 859476, 844046, 801320, 785843, 800676, 863707, 999812, 1169653, 1284207, 1309499, 1307104, 1353915]
40067A353915J04126J10049P0475K9970R067l2459j47723k93550l24369j74150
40057G05351O281K0075r4844j21191o300N3273n6415j62923q2037Q6188J33412
40046D80870P3431O4058R7769L4291j00265j25114l3972l6455j90252k52117m6257
40035c4013K27357K52721L4052j36478q7836M5986N8382o1747j51810r5002M1118
40024I2730R0324j383r4684l7420J14899J64671N3475n3262l163J46902K42552
40013G15641K30632J56527N2252p0345j71939k19639k27515k02938j11665L9350
40003A90361J49117J29688K0123o7042o6516J4382J23785J75685J13670J0853
39993G94106J1110J19955J72071P8828k6960j066Q8024Q5630o924p3562q0677
$$ y = [1353915, 1458041, 1568090, 1638565, 1668535, 1677602, 1645143, 1497420, 1203870, 879501, 705351, 711632, 731707, 636863, 515672, 509372, 562645, 506230, 343307, 261270, 347458, 480870, 554301, 618359, 716128, 750419, 650154, 525040, 491068, 454613, 264361, 12244, -34013, 193344, 446065, 480117, 343639, 255803, 301789, 360171, 298424, 146614, 51612, 92730, 183054, 181671, 86987, 49567, 164466, 329137, 382612, 329350, 326187, 473089, 715641, 946273, 1102800, 1155052, 1084707, 912768, 693129, 465614, 262676, 151011, 190361, 339478, 469166, 489289, 422247, 355731, 370113, 493898, 669583, 783253, 794106, 805216, 925171, 1097242, 1176070, 1149110, 1148044, 1236068, 1321698, 1314774, 1241212, 1160535]
39982A160535o9891k4072Q6519J70511J00679q6116k25910k47179k09900j48075
39972E07101l4768Q8110J00577k5052j48459j10716Q3328K49410J88792q4421
39962H13902k85766j47458K12099L77928J73034j06342j29749K3145P9109J7987
39952A027889J655J4953p6913k03169j68700j2851N1559K0128O2662J33928J7723
39941H68864k17676k35926K963J19233q8669l24377k77854n7007J06146K27076
39931A22773L56753L18410M435l03141k62808M1157K54141K38328J08253o2870
39921H15431k48594l01714j12183J38512J81544N7202J6931R3633Q8434l6135
39911F93061p9943L1365J02534j0885j69518j61941N512J40199R4218j00545k73513
$$ y = [1160535, 1090644, 1066572, 1153091, 1323602, 1424281, 1338165, 1112255, 865076, 655176, 507101, 472333, 560443, 661020, 635968, 487509, 376793, 460121, 709531, 898323, 813902, 528136, 380678, 592777, 970705, 1143739, 1037397, 907648, 930793, 1009902, 1027889, 1029544, 1044497, 967584, 764415, 595715, 582864, 634423, 654551, 717213, 851141, 868864, 651188, 415262, 418225, 537458, 448789, 124412, -153442, -210449, -104303, 122773, 479526, 797936, 802371, 499230, 236422, 277579, 531720, 770048, 878301, 815431, 566837, 265123, 152940, 291452, 472996, 530198, 547129, 640762, 729196, 693061, 613118, 644483, 747017, 736132, 566614, 404673, 410185, 550384, 644602, 544057, 270544]
39900B70544k77035j45540n4892q2921j07746k0470R3381J10728P3922P4730O5495
39889A96k1144q2438N830J48462J66720Q6704N4017N0840l1545j12005j7046J74262
39877D22853K01210M3258m9970J0470K1189j24044k30653j34458L9033J19611
39867C18499J58755K55061L10065J80789m7599j46267l9664J29723J90253R4636
39857A404251o6921j39311m8328Q6228P0968r5644j98881j02216O5595J02977
39847A078718k90r6534r4732l3803J5470L4382M7455O8407O3393n799q4086m3797
39835I48784J26564K45356J68954J0229l4247R135l3945j60296j86413o7111L1965
39824A058975J3052l7803o0366j13109j93057j86426p1324L9231J08832K02528
$$ y = [270544, -6491, -152031, -206923, -289844, -397590, -418060, -324679, -213951, -140029, -65299, 196, -20948, -103386, -97556, 50906, 217626, 304330, 358347, 409187, 377642, 265637, 248591, 422853, 624063, 667321, 617351, 627821, 649010, 524966, 294313, 159855, 198888, 318499, 477254, 732315, 1042380, 1223169, 1175570, 1029303, 989639, 1119362, 1309615, 1404251, 1337330, 1198019, 1149691, 1235919, 1306887, 1211243, 1012362, 910146, 975741, 1078718, 1078428, 981894, 887162, 853359, 868829, 903211, 950666, 1019073, 1082466, 1076667, 992581, 948784, 1075348, 1320704, 1489658, 1499887, 1465640, 1474775, 1440830, 1280534, 1094121, 1027010, 1058975, 1072027, 1034224, 973858, 860749, 667692, 481266, 409942, 449173, 558005, 760533]
39814G60533K58881J19879j31587j77859N2862K27298J13196p0502n2392M4485
39804A144794k8000j72071j15590R8199J68504J8522j15101n8941J08337K37571
39794A286224K43556P8303k04212l78217k60366K1483J71450J02480k9727j10074
39784I20900j44676j05087M1286J58496P3713j05791r0131J35816K47285O6196
39774A198007j71988j87353m1273L8980J9741K1992N8694L6977m5605r9523j02999
39763G25650j04240r1060r116R8098J12933L0592l754J00308K28590J95013j7997
39752A265017k25979k49985j05122M1052O0823l0614j47297k29370k34047j10926
39742C3552J15632K72881J79212j03388k69018j13856J88833K87112R8727r9169
$$ y = [760533, 1019414, 1139293, 1007706, 829847, 882709, 1110007, 1223203, 1152701, 1100309, 1144794, 1116794, 944723, 829133, 927332, 1095836, 1114358, 999257, 940316, 1048653, 1286224, 1529780, 1608083, 1403871, 1025654, 765288, 786771, 958221, 1060701, 1030974, 920900, 776224, 671137, 712423, 870919, 944632, 838841, 748710, 884526, 1131811, 1198007, 1026019, 838666, 797393, 836373, 856114, 878106, 936800, 973777, 928172, 828649, 725650, 621410, 530350, 521234, 619332, 732265, 762857, 759103, 859411, 1088001, 1283014, 1265017, 1039038, 789053, 683931, 724983, 785806, 755192, 607895, 378525, 144478, 33552, 149184, 422065, 601277, 497889, 228871, 115015, 303848, 590960, 689687, 590518]
39732E90518p6873K6016n4383k59721k66077R884K42663J64970m0798m2529J29815
39721D23485J67602r728j55289j08596o7L3889O0374J46642J87611J01948J0603
39710H58474M3902J18326P8441n3912j35860j21903q0020n1471j2751O0788J54945
39699H58959J94588P4252j73009k83996n8557K76813K97266N273j37046Q5615
39689A140158L16258K27872L0469L9791J23794J4513j43400n8064J31690Q0157
39679A903238j28762j24688P8888J37296M6577J51656M53219N28178K60770M9981
39669C356353J02007J05548j32473l03943j92135j09979l24336n19385l29571
39660A652086j0019k2083k53792k47103n257M4248j74860k48624K1222K91540
$$ y = [590518, 513645, 539661, 485278, 225557, -40520, -30636, 212027, 376997, 336199, 293670, 423485, 591087, 581359, 426070, 317474, 317407, 351296, 411670, 558312, 745923, 847871, 858474, 902376, 1020702, 1099143, 1045231, 909371, 787468, 707448, 655977, 643226, 704014, 858959, 1053547, 1127799, 954790, 670794, 612237, 889050, 1186316, 1191589, 1054543, 1140158, 1456416, 1684288, 1714757, 1754548, 1878342, 1892855, 1749455, 1691391, 1823081, 1903238, 1774476, 1649788, 1728676, 1865972, 1912549, 2064205, 2517424, 3045602, 3306372, 3356353, 3458360, 3563908, 3431435, 3127492, 2935357, 2825378, 2501042, 1981657, 1652086, 1642067, 1619984, 1366192, 1119089, 1113832, 1158080, 983220, 734596, 755818, 1047358]
39650A047358K27772k2909j21631j3629J03429J05685M7978K5848N0036L6679
39640A486616q9912k54366k61232n6948J36759R2002j12218k12452j14873N5953
39630F69329J82881K22918J14957j43391l55163k93883j8883J80846J52724l181
39620G09154j54634k47818k14664k2169J68174J39289m9640j20397m914N9801
39610B62182n2922j38649o794K03119K41833J01088m2276q9486o2176k967K7259
39599D40211l2134j19072q5258N2206Q5525l6054o4888J47916L46601K30915o5434
39588I00534j76251n2545M0463P233K6944J59644K11355Q9517j5203O2853K24201
39577A478745L03585K86350K05704N5286o2666M7845L33728M13325Q1204l24333
$$ y = [1047358, 1275130, 1252221, 1130590, 1116961, 1220390, 1326075, 1374053, 1399901, 1449937, 1486616, 1396704, 1142338, 881106, 824158, 960917, 1052919, 940701, 728249, 613376, 669329, 852210, 1075128, 1190085, 1046694, 691531, 397648, 378765, 559611, 712335, 709154, 554520, 306702, 92038, 69869, 238043, 377332, 327692, 207295, 202381, 262182, 209260, 70611, 63817, 266936, 508769, 609857, 567581, 478095, 415919, 412952, 440211, 408077, 289005, 203747, 255953, 341478, 305424, 240536, 388452, 735053, 965968, 900534, 724283, 671738, 712201, 719434, 746378, 906022, 1117377, 1206894, 1191691, 1254544, 1478745, 1782330, 2068680, 2274384, 2329670, 2267004, 2314849, 2648577, 3061902, 3143106, 2818773]
39567B818773l54359q1844M2964j30041l01581k52582j39991j48035j67985k8455
39557A256864J74332K03233K3272j70027k08474r7789N6892J63700J98171K08959
39547A809133K52575L05341K93570K15069J43389J03514N7178K8118R5701K14847
39537C518435K01204j3714k52327l19643k36657j42274r3383p9291j03844j21997
39527B356509k4336J73429K61471J17175q6121j38485j10238j73219k48206j39567
39517A988412N8999M5399j94644l17934j40094Q6888O5836j25605j96641n3330
39507A217286J42199K19671J52653K3390n3899j6351P8206J11053N0931l2328
39497A892811j01420j85980k72931k89864k22093j26676j9628J17151K16451J75768
$$ y = [2818773, 2464414, 2382570, 2425534, 2295493, 1993912, 1741330, 1601339, 1453304, 1285319, 1256864, 1431196, 1634429, 1657701, 1487674, 1279200, 1181411, 1238303, 1402003, 1600174, 1809133, 2061708, 2367049, 2660619, 2875688, 3019077, 3122591, 3179769, 3207887, 3303588, 3518435, 3719639, 3705925, 3453598, 3133955, 2897298, 2755024, 2661641, 2582350, 2478506, 2356509, 2332173, 2505602, 2767073, 2884248, 2798127, 2659642, 2549404, 2376185, 2127979, 1988412, 2047411, 2092810, 1898166, 1580232, 1440138, 1527026, 1592862, 1467257, 1270616, 1217286, 1359485, 1579156, 1731809, 1755199, 1701300, 1684949, 1763155, 1874208, 1925139, 1892811, 1791391, 1605411, 1332480, 1042616, 820523, 693847, 674219, 791370, 1007821, 1183589]
39487A183589M1003l2126j9312m3904j29460j48189o3019L62j1855k696M3437
39476H17830m312j52038j98765o1130O7561L5783m0856m3606o8758j66847j42912
39465D1950J01965K81818J17302j83320k07370M0866J95285J22094N0930J13170
39455F74690J37975n674j78469k05715j15926l6760j8080l3144l7136l559P864
39444A86066j11602k90119k30746J75021N38336M09076o5658l04481r8408J62811
39434C70296J37969k2026m9573J0020L164k579J09908K20927J46028n4564j87511
39423F82059k14985j98761r3561J36958K97389J49112j98974l58680j58243J55433
39413A97747K73256J81238N5683l4491j52894k88506k97270j00786J54430K33038
$$ y = [1183589, 1224592, 1192466, 1173154, 1129250, 999790, 851601, 788582, 788944, 777089, 774393, 817830, 813518, 661480, 462715, 401585, 469146, 504929, 464073, 420467, 351709, 184862, 41950, 143915, 425733, 543035, 359715, 152345, 193211, 388496, 510590, 561520, 674690, 812665, 806991, 628522, 422807, 306881, 270121, 252041, 218897, 181761, 178202, 186066, 74464, -215655, -446401, -271380, 266956, 676032, 610374, 305893, 207485, 370296, 508265, 486239, 436666, 446686, 449850, 447271, 557179, 778106, 924134, 869570, 682059, 467074, 268313, 174752, 311710, 609099, 758211, 559237, 200557, 42314, 197747, 471003, 652241, 707924, 673433, 520539, 232033, -65237, -166023, -11593, 221445]
39403B21445Q9473p9513q6010L3046J12730Q8803K6208j9615m1548j8183M7775
39392C74611N3344q2442k28263j62057Q3192J98231J4556k38563k34295K6687
39382a94999K48818K20229J3288j55327j48223l648J17686R4484j8945o7772j6341
39371H9250J3084m1293o5571K9185J24090O1814r1025j29998k4819M0045m1353
39360c6591j32144o5467R8757J57311N8141k6435M1250J42462N7393j93187l20377
39349b18887j45493J34624K04406O1024j1305J16958K32078J17253j07921j55502
39339B27235K2659J80096J18651p0830j66255j06038k0181o422l613N6387Q2662
39328C14351m0687k00919j49010J04746K19403j89k66530j95027J28645K85635
$$ y = [221445, 310918, 231405, 145395, 178441, 291171, 379974, 406182, 386567, 345019, 326836, 374611, 427955, 345513, 117250, -44807, 38385, 236616, 251172, 12609, -221686, -194999, 53819, 274048, 287336, 132009, -16214, -19862, 97824, 192308, 173363, 105591, 89250, 102334, 61041, -4530, 24655, 148745, 210559, 119534, -10464, -35283, 4762, -36591, -168735, -234202, -135445, 21866, 80007, 53572, 94822, 237284, 294677, 101490, -218887, -364380, -229756, -25350, 35674, 24369, 141327, 373405, 490658, 382737, 227235, 249894, 429990, 548641, 477811, 311556, 205518, 185337, 178915, 175302, 231689, 314351, 273664, 72745, -76265, 28481, 247884, 247695, -18835, -213862, -85217, 200418]
39318B00418J55450M3036J38903K26145Q7385j06868o7260J56323K52804Q9178
39308A175514j58643k75834k23666q9480L3018R0357Q4643O5043P0477R0545R5793
39297I57767P0756J1648o0913r5816p7823o7039q7419l8606J38945K74477J54344
39286A180321j19453k10444k9190J30790M0097j39917j40265K1606J31755J08246
39276I73546M0262N164J6355O7340R0728k9450k72895m12598k68667M7911K64627
39265E22323K46877P7412p5878r3806L877O0827j1826m7469J58891M56218M63026
39254A760472J45365r3917m7687k6126k92628n73035m98663k09622p5895p8793
39244I471L8975K02188J22236j14675j32239P5468J14933j07742j95355O6969
$$ y = [200418, 355868, 398904, 537807, 763952, 851337, 744469, 677209, 833532, 1086336, 1175514, 1016871, 741037, 517371, 427891, 460909, 551266, 635909, 700952, 771429, 861974, 957767, 1028523, 1040171, 979258, 883442, 805619, 738580, 651161, 612555, 751500, 1025977, 1180321, 1060868, 850424, 821234, 952024, 992121, 852204, 711939, 733545, 865300, 973546, 1013808, 1018972, 1035327, 1102667, 1193395, 1163945, 891050, 478452, 209785, 257696, 522323, 769200, 846612, 770734, 676928, 680805, 741632, 729806, 682337, 841228, 1297446, 1760472, 1905837, 1811920, 1764233, 1738107, 1445479, 872444, 373781, 164159, 88264, 9471, 48446, 250634, 372870, 258195, 125956, 201424, 316357, 208615, 13260, 80229]
39234H0229L35417K58749M287p1791K5209L4126j04430k03558j48257k2828M1704
39223B28857K990p6436p9921L3308J31641N9677j11835j45762L0590K35193L04419
39212F12721K59961J59010l826j67268j91340p9352j8021q9424j35880l2361R5779
39201D09999P4301n9218j46514j33099o6379J9019R3500J07859P2803O8186J08058
39190E48515J14837P7919Q4246J29326P9815q2925j70793o8339O6606K8937j49187
39179F58957k82810k76821j54092L1556J81445J75810L5625o1966l5183j0190
39169B62331o7626p1760P2880J84030N7878j74696k11411k3408J19861N1163r6358
39158A02884j15996J9893J72259J93186O3628o3344j0320J68822J96041n4925
$$ y = [80229, 415646, 674395, 678682, 606891, 632100, 666226, 561796, 358238, 209981, 187153, 228857, 231847, 155411, 75490, 108798, 240439, 300116, 188281, 42519, 73109, 308302, 612721, 872682, 1031692, 1027866, 860598, 669258, 589906, 571885, 482461, 346581, 314220, 409999, 484300, 425082, 278568, 145469, 79090, 98109, 191609, 299468, 372271, 440457, 548515, 663352, 741271, 825517, 954843, 1034658, 951733, 780940, 712601, 779207, 808144, 658957, 376147, 99326, -54766, -23210, 158235, 334045, 369670, 307704, 272521, 262331, 194705, 122945, 195825, 379855, 437733, 263037, 51626, 28218, 148079, 199242, 102884, -13112, 6781, 179040, 372226, 435854, 372510, 362190, 531012, 727053, 672128]
39148F72128l28800l11019n6939J24577J23806R7294J17927N6811j26868k43422
39138A25495j47521L8908J19676R2602P6472Q1988K4745q2912j14297j5903J07628
39127C06881J39352R5639O3199N2095O330n8645m9672L2123L5739j18140k58655
39116B46246j67983R0213K37670J72188Q0173J11278J60618Q9277l0955n6115
39106I32610j0199j1227n9530p1161m7314m8175n7819k8464o187o0157j31467
39095D00910j05174K62O3903N6149N3943P9415P0787J4206k8776l1087k0033P910
39083E62415P2469J16227N4213p5723j33962o5212M6781J18547J45846J31730
39073I73331N8140l9407p8318m8918l4220p5578j08029o6544K3443R5263J08557
$$ y = [672128, 343328, 32309, -24630, 99947, 223753, 321047, 438974, 495785, 368917, 125495, -22026, 16882, 136558, 229160, 305632, 387620, 412365, 329453, 215156, 199253, 306881, 446233, 541872, 605071, 657166, 663496, 604851, 555179, 587302, 623041, 504901, 246246, 78263, 168476, 406146, 578334, 658507, 769785, 930403, 1019680, 988725, 932610, 922411, 911184, 851654, 780493, 733179, 685004, 627185, 598721, 592534, 532377, 400910, 295736, 295998, 359901, 416050, 469993, 549408, 620195, 634401, 605625, 574538, 554505, 562415, 634884, 751111, 805324, 729601, 595639, 530427, 577208, 695755, 841601, 973331, 1031471, 992064, 913746, 864828, 830608, 755030, 647001, 580457, 603900, 699163, 807720]
39062H07720M4260q8838k14342k32240j36537k5646K3130J9848l836l2671k2557
39051A38291P0052J74103J45743k995n1449J27051L23400K38168q5155k86495
39041G90714j68758O0650J16152R820n4665j6451K1829K5438N1274O6065k3920
39030H78148j41305q1063J41198K30372L2890k10826k13306l5176Q3509J03291
39020G87732J33829J49167N5535m8995N560J32663R4718q5997j46278k2766N8140
39009A113308j8963r6450o7865m5983r2265q2101K4135O4912j9952n4034M9439
38998G74181J12346K2388m9542K6495P9441n1936k05323j65204k4578N013m7456
38987D75825k3699O0846R3241R0009J02458O0594m8883m0801J68326L21172J77720
$$ y = [807720, 851980, 763142, 548800, 316560, 180023, 154377, 177507, 197355, 193519, 160848, 138291, 208343, 382446, 528189, 525194, 473745, 600796, 924196, 1162364, 1077209, 790714, 621956, 682606, 798758, 808578, 753913, 737462, 759291, 784729, 836003, 902068, 878148, 736843, 655780, 796978, 1027350, 1060240, 849414, 636108, 600932, 684441, 787732, 921561, 1070728, 1126263, 1077268, 1082828, 1215491, 1310209, 1224212, 1077934, 1055168, 1113308, 1094345, 997895, 930030, 884047, 791782, 709681, 733816, 798728, 778776, 724742, 774181, 886527, 908915, 859373, 885868, 965309, 913373, 708050, 542846, 518268, 523281, 475825, 452126, 512972, 606213, 696222, 798680, 859274, 810391, 769590, 937916, 1259088, 1436808]
38976A436808q5270j59950j01059j63573l08166k78597p3623O3768P2086R9901
38966E02325J47402O3175j10165j54371m9687J2272m799N3125J84748K00956P4650
38955I19631r622K360l0110j19839r7762N0184J16881L2708j6847O7356J30361
38944A045301N4230m3762k6809O6855J46756J96064K06720J68854J55112K30474
38934B199795K84842J64540n8652j84891k03809k43984k64092j16176J16410J88236
38924A882219Q6324R362k2063j47944k80268j75830P2571R2936j33150j88554
38914A195603P6097K51746K2156l34544l86596j32203J41846K78648K66336J11983
38904A491072o0724m2198J35746J69931m4119k17277j30682L3753N2599K6362
$$ y = [1436808, 1351538, 1191588, 1090529, 926956, 618790, 340193, 266570, 330338, 402424, 502325, 649727, 712902, 602737, 448366, 398679, 410951, 406152, 459277, 644025, 844981, 919631, 910009, 912369, 882259, 762420, 664658, 714842, 831723, 864431, 847584, 914940, 1045301, 1099531, 1055769, 1028960, 1095815, 1242571, 1438635, 1645355, 1814209, 1969321, 2199795, 2484637, 2649177, 2590525, 2405634, 2201825, 1957841, 1693749, 1577573, 1693983, 1882219, 1968543, 1977905, 1955842, 1807898, 1527630, 1351800, 1424371, 1517307, 1384157, 1195603, 1271700, 1523446, 1545602, 1211058, 824462, 692259, 834105, 1112753, 1379089, 1491072, 1430348, 1388150, 1523896, 1693827, 1649708, 1432431, 1301749, 1335502, 1388101, 1414463]
38894A414463J19180K22617J68386M4002K5121Q3232R0469M3056m377n2873o6636
38883B086640M0829K21933L12070L01561L35280L98541L18414J25418N3901J22488
38873D317075J04892k0510k5360R3622P0210j05328j18403R8905K49273K32853
38863D897229K78106M14937M24079L98240O66208J062254J053305P21546P45750
38854A0661654J238789J579916J607258J862734K374883K475374K230625K629421
38846B6660654L789847M561515M644501N336711P217238R097091J0579500J3427060
38838H5314117J8673302K4945226L1848785M1364079N1327789N0662070K8810606
38831C32945974q965054m2232697n4610124m8182983l6346363k7612885k1392329
$$ y = [1414463, 1533643, 1756260, 1924646, 1968648, 1993769, 2077001, 2167470, 2210526, 2206149, 2153276, 2086640, 2127469, 2349402, 2661472, 2963033, 3298313, 3696854, 4015268, 4140686, 4194587, 4317075, 4421967, 4401457, 4376097, 4469719, 4539929, 4434601, 4316198, 4415103, 4664376, 4897229, 5175335, 5590272, 6014351, 6412591, 7078799, 8141053, 9194358, 9915904, 10661654, 11900443, 13480359, 15087617, 16950351, 19325234, 21800608, 24031233, 26660654, 30450501, 35012016, 39656517, 44993228, 52210466, 61307557, 71887057, 85314117, 103987419, 128932645, 160781430, 202145509, 253473298, 304135368, 332945974, 323980920, 281748223, 227138099, 178955116, 142608753, 114995868, 93603539]
38824I3603539j5689707j1563726r770602q552449o602691m940146m437430m105740
38816B7941048l123867k355353k525616k714981j989118j047560r50312j373131
38808A1861110j361967r15680o71768o91694n86442l74620l51506m50530m18623
38799F038280l24423l50984l89679k91732k08534k92597l81724l16971k36092
38790C245544k50184j93191J3070J19947k7217j98994j95437j69550k48583k26064
38780A869341L6536K59884J51582j37797k87102k59246j89101q9597L9527O2637
38770A456664n8171j18450m057Q0584m8715k44069k82994j83737n1460J13153
38760F58748K40331J37320j50863k50175j222K33977J21887j14880r3566J01007
$$ y = [93603539, 77913832, 66350106, 56579504, 48027055, 41424364, 36484218, 32046788, 27941048, 24817181, 22461828, 19936212, 17221231, 15232113, 14184553, 13234241, 11861110, 10499143, 9583463, 8911695, 8220001, 7633559, 7258939, 6907433, 6456903, 6038280, 5713857, 5362873, 4973194, 4681462, 4472928, 4180331, 3798607, 3481636, 3245544, 2995360, 2802169, 2815239, 2935186, 2907969, 2708975, 2513538, 2343988, 2095405, 1869341, 1905877, 2165761, 2317343, 2179546, 1892444, 1633198, 1444097, 1354500, 1394027, 1456664, 1398493, 1280043, 1275986, 1356570, 1307855, 1063786, 780792, 597055, 545595, 658748, 899079, 1036399, 885536, 635361, 634139, 868116, 990003, 875123, 781557, 882564]
38750H82564J16461o2741j62258j23517j25676j84314j31279L9200J55373J75264
38740E79077J96764J95382O3315j09496r8254J05132K76552L02143K73607K33355
38730B017577R7152j20622k51008k17009j38805j22928j21453p2472k6023m6103
38720I98306r9484j15812q4840m8271m7515r6725j64311j86261j33851m4034M0180
38709A7382J02750J08104J9708r2494q5352M7339J29836N7254n3307p6997q1942
38698I2281j56714j97297p9062Q0348P3871n1181n2794J25782K75196K37209Q9981
38687D37620k7682r2016j28678j20433n8242J3032N4848P2817P4290N5678L4141
38676C15375K4051n562p8506j40451j21077m3421Q670O206j5597k4461Q415J19659
$$ y = [882564, 999025, 936284, 774026, 650509, 524833, 340519, 209240, 248440, 403813, 579077, 775841, 971223, 1034538, 925042, 826788, 931920, 1208472, 1510615, 1784222, 2017577, 2114729, 1994107, 1743099, 1526090, 1387285, 1264357, 1142904, 1070432, 1044409, 998306, 898822, 783010, 698170, 649899, 602384, 505659, 341348, 155087, 21236, -22798, 17382, 120132, 228236, 247944, 155450, 70098, 117437, 247273, 304527, 251220, 174223, 92281, -64433, -261730, -340792, -260444, -186573, -237754, -290548, -164766, 110430, 347639, 437620, 409938, 317922, 189244, 68811, 10569, 23601, 78449, 151266, 225556, 281234, 315375, 339426, 333864, 255358, 114907, -6170, -49591, -40921, -34715, -50312, -74773, -66358, 53301]
38664E3301K73531L28391J92517l2552j71080j86206j61484j24704l0909J00614
38654B41419J67604J17054Q555n8017k7615O6579J10108K5274r3444q2689J9215
38643D94043n030j78643k29317k7082J47693M1461j23792r089K36982J95409j05974
38632D36661k08962K6076K06418O5178j54146j78771j28325j75588j72523M2808
38622b41174K69919K41056O3893J2236N9896j0836j69543j78486j1285J05685
38612A41361N7402l4711m7693J7770J25735K06791J24286j37608l20265j76384
38602d3316J48882K89423J59829j078m7569o6871j03578p6887j3443m2748j07790
38591I4854r411J95011J98584l8106j57474L1669K35518J58429m7118j05879p1061
$$ y = [53301, 326832, 655223, 847740, 815188, 644108, 457902, 296418, 171714, 140805, 241419, 409023, 526077, 534632, 476615, 449000, 515579, 625687, 650961, 557517, 474828, 494043, 489013, 310370, 81053, 53971, 201664, 243125, 119333, 110244, 347226, 542635, 436661, 227699, 253775, 460193, 525371, 371225, 192454, 64129, -111459, -283982, -241174, 28745, 269801, 333694, 345930, 405826, 394990, 225447, 46961, 35676, 141361, 198763, 164052, 116359, 134129, 259864, 466655, 590941, 453333, 133068, -43316, 105566, 394989, 554818, 553740, 506171, 439300, 335722, 258835, 245392, 202644, 94854, 85443, 280454, 479038, 440932, 283458, 315127, 550645, 709074, 661956, 556077, 485016]
38580D85016j05568j02691P1942J96676M202k92147k65642K7048J26216o8156
38570G6896j45108J04856L32951K08463o9003j27049K3297J03105K3332o9022
38560D62718o8160J0696J28531K09749J40821n0810j43911k1658J18279M9710
38550H35965j25027j44189q241M2325o7010j35438k1101J43524J56016O648j50872
38539E32600j92114j21566m2641n8198j52761j81102l7101J85149K78903J65840
38529C77009k6242j25807r0935j2770Q212k4159j2900Q4948J55493O3602j23215
38518B73236j88195o8159O2065O8609L7291O9889R3870K7549m1112k2105o804
38507C06134p9953j06415N3411K48197K22361K732j63046j71823j10724k8565
$$ y = [485016, 379448, 276757, 348699, 545375, 549577, 257430, -8212, 18836, 145052, 76896, -68212, 36644, 369595, 578058, 509055, 382006, 405303, 508408, 531740, 462718, 394558, 405254, 533785, 743534, 884355, 833545, 689634, 667976, 786255, 835965, 710938, 566749, 558508, 600833, 533823, 398385, 377284, 520808, 676824, 683472, 532600, 340486, 218920, 176279, 118081, -34680, -215782, -252883, -67734, 211169, 377009, 350767, 224960, 134025, 121255, 129467, 105308, 92408, 177356, 332849, 396451, 273236, 85041, 16882, 78947, 147556, 184847, 254736, 348606, 376155, 335043, 312938, 306134, 226181, 119766, 173177, 421374, 643735, 646467, 483421, 311598, 200874, 172309]
38497A72309O3070N4727r5922j65468L0740K44492J14114k06900k34525M7893
38487B4530J42299j16881k69494k1165K49472J45394q8413k8161K01917J92406
38477D31904m1174j46833n6919r271n5982l1022N2943K6660n0980L6200K21523
38466C77049K18325L1042l7948O5308N2967j49640k22259r550J73394O0354j19681
38455D39361m2399J69859J78073j4099j17542n2037n885m3171j0836J19184J33381
38444G53889p2423k65845j79261J03315K46616R9909j30827j68565l564J30994
38434E14238O6556j15612k16682j51931L660J39035J93227J48107K8740q1814
38424E27524j01004l5999L6419P4628R4401R4641M4532l9484q1604m3535K3489
$$ y = [172309, 235379, 290106, 194184, 28716, 59456, 303948, 418062, 211162, -23363, 24530, 166829, 49948, -219546, -240711, 8761, 154155, 65742, 37581, 239498, 431904, 390730, 243897, 186978, 177707, 121725, 90703, 143646, 170306, 119326, 155526, 377049, 595374, 626416, 588468, 653776, 706743, 557103, 334844, 325294, 498688, 559042, 439361, 396962, 566821, 744894, 730795, 613253, 561216, 555331, 512160, 501324, 620508, 753889, 681466, 415621, 236360, 339675, 586291, 686200, 555373, 386808, 383244, 514238, 580794, 465182, 248500, 96569, 100229, 239264, 432491, 580598, 609338, 527524, 426520, 390521, 426940, 501568, 595969, 690610, 735142, 695658, 614054, 570519, 594008]
38413E94008M8620J5317m7935r8243q9991j3578O7009P4960K6266O483L5324M2933
38401F61173P895J6842J19135K09594J61967L3131Q827J35549K25179R8699j51230
38390A526761k54370j09152Q4672R4219m4297j03685K263J11061O3392o4731p2026
38379A234107Q5257K17200J21989j54441l24117j68584J64437K85486M7422k31662
38369A277094j80408J17299K66760J39797n679Q627M5714j3905m9055J1749k49
38358A617744j54853j97395L5422K49263J11605j83868j97505N8876J62869l8160
38348A463998k40184j97146j0027J58092K76794K82186Q3520j63762j45410J28937
38338A636998K71620Q6435j43343j05692J24993L23432M60125N80332O05591N09677
$$ y = [594008, 642628, 657945, 610010, 511767, 421776, 408198, 475207, 550167, 576433, 582916, 618240, 661173, 669068, 685910, 805045, 1014639, 1176606, 1209737, 1218564, 1354113, 1579292, 1677991, 1526761, 1272391, 1163239, 1247911, 1342130, 1297833, 1194148, 1196411, 1307472, 1370864, 1306133, 1234107, 1319364, 1536564, 1658553, 1504112, 1179995, 1011411, 1175848, 1461334, 1508756, 1277094, 1096686, 1213985, 1480745, 1620542, 1614863, 1623490, 1669204, 1655299, 1606244, 1617993, 1617744, 1462891, 1265496, 1300918, 1550181, 1661786, 1477918, 1280413, 1339289, 1502158, 1463998, 1223814, 1026668, 1016641, 1174733, 1451527, 1733713, 1817233, 1653471, 1508061, 1636998, 1908618, 1995053, 1851710, 1746018, 1871011, 2194443, 2654568, 3234900, 3840491, 4350168]
38328D350168M74054O30487Q44428R64969J074430J269679J436767J512986J732315
38319A4290283K254819K707933K478129J419297k0119j313464k204174k604714
38311A7007990k516259k129609j742900j473108j212951r10733p01446o90019
38303E630965p67378p42625n67179l55461k35893k26603k39851j98862j34379
38294B162734j13901r7360J2106J57747J41141p8465k72342k52014j26672j00578
38284A432396j67847j89300j43119j03931p3936k0818Q290j6519k099J01369J51454
38273I75940L1089j11425p0239Q4749J34308O9112M7845P4094R983j26927j70701
38262I47828r8290m2247k5774M0390J06919K3095j60534k13369p7609P4721J54452
$$ y = [4350168, 4824222, 5454709, 6299137, 7264106, 8338536, 9608215, 11044982, 12557968, 14290283, 16545102, 19253035, 21731164, 23150461, 23130342, 21816878, 19612704, 17007990, 14491731, 12362122, 10619222, 9146114, 7933163, 7022430, 6320984, 5630965, 4863587, 4120962, 3553783, 3198322, 2962429, 2735826, 2495975, 2297113, 2162734, 2048833, 1951473, 1963579, 2121326, 2262467, 2184002, 1911660, 1659646, 1532974, 1432396, 1264549, 1075249, 932130, 828199, 754263, 733445, 741735, 725216, 723117, 824486, 975940, 1007029, 895604, 825365, 910114, 1044422, 1113534, 1161379, 1235473, 1245456, 1118529, 947828, 849538, 807291, 781517, 821907, 928826, 951921, 791387, 578018, 500409, 575130, 729582]
38251G29582K28981K62636J17886j21569j74889j4495N2962j08596k34411j23135
38241F14952J8310m5905j62718o8802J46540J97528O8490j895Q3874J89718K01986
38230A242078J38173L5014p2547j02407k8743K4492m3914j27481p4891N1085P6874
38219A117733O635n618P4685J30637J06639O1015K4371j6907k0518N0755R8569
38208A627996P847j32279j29894M575P5439K7080J4632J09829J77518J28307O8555
38197A979605Q2827P4726k7333r1349O065J32964P8004j17951k21541j55106p2768
38186A668143q4049j04934m3861L5807M3315K7417Q7227J82957J66896n262j92262
38175A781394k14502k9509K36468L81341K74660p675k05316j27981J03282J83070
$$ y = [729582, 958563, 1221199, 1339085, 1217516, 1042627, 1028132, 1081094, 972498, 738087, 614952, 633262, 587357, 424639, 355837, 502377, 699905, 768395, 766500, 850374, 1040092, 1242078, 1380251, 1415265, 1342718, 1240311, 1211568, 1236060, 1192146, 1064665, 989774, 1040859, 1117733, 1124368, 1118750, 1193435, 1324072, 1430711, 1491726, 1516097, 1499190, 1478672, 1529427, 1627996, 1635843, 1503564, 1373670, 1378245, 1453684, 1480764, 1495396, 1605225, 1782743, 1911050, 1979605, 2062432, 2137158, 2109825, 2018476, 2024541, 2157505, 2235509, 2117558, 1896017, 1740911, 1668143, 1584094, 1479160, 1435299, 1471106, 1514421, 1541838, 1629065, 1812022, 1978918, 1973656, 1781394, 1566892, 1537383, 1773851, 2155192, 2429852, 2422177, 2216861, 2088880, 2192162, 2375232]
38165B375232J7161j53915j04213O5900J21719O0492N4952J03569K3786j76702
38155B387981k15374M0101L03466K41140m8456j76933j0983J82541J50465j5465
38145B838483n5282J02943K90980L38257K50291J52202J24520J29849R0252N893
38135D268388l4266L9227J89181L05175L00918J78904L4561q905P7437J76256
38125E526876J63023Q5154R2853J84293J77552Q337j09408L3111L17017M42073
38115F920881L26934J68940J33855J86646K41026K74847K42767O8445j74075k38499
38105H151767j0356K83952L29157J06866j24168j75814q4618N9415K37072L97733
38095I171006M09591K35018M9451N3338K20454L48940L24681K21112J60824J90751
$$ y = [2375232, 2392393, 2238478, 2134265, 2200165, 2321884, 2382376, 2437328, 2540897, 2564683, 2387981, 2172607, 2212708, 2516174, 2757314, 2708858, 2531925, 2520942, 2703483, 2853948, 2838483, 2783201, 2886144, 3177124, 3515381, 3765672, 3917874, 4042394, 4172243, 4262495, 4268388, 4234122, 4273349, 4462530, 4767705, 5068623, 5247527, 5282088, 5273183, 5350620, 5526876, 5689899, 5775053, 5867906, 6052199, 6229751, 6238088, 6128680, 6161791, 6478808, 6920881, 7247815, 7416755, 7550610, 7737256, 7978282, 8253129, 8495896, 8564341, 8390266, 8151767, 8141411, 8425363, 8754520, 8861386, 8737218, 8561404, 8476786, 8536201, 8773273, 9171006, 9580597, 9815615, 9865066, 9918404, 10138858, 10487798, 10812479, 11033591, 11194415, 11385166]
38085A1385166K83958L58085L08129J39808M2072J63592L34477K39623q7795k25645
38075A2941470L7193L39475K49512r2180j86189R0273L57360L30761J53416M6621
38065A4267712q811q2521r2109J416L7433q6258j99157j26861j866o3513k79739
38054A3365726m17058l97010l40616l14537k67649k01892j95520k45279k55805
38045A0730360j99238j45898j36758j55275k17741l60325n31395o08507n34259
38036G840964l64389k01653j38150k02179k95058k66645j29982q2234k10566l27723
38026E622385k53606j05309r7406j85022j59397j3783N4664l0015j45928j99186
38016D487397j94453j15850J8240K8259k14868m80488m02387k3733K23071J32717
$$ y = [11385166, 11669124, 12027209, 12335338, 12475146, 12517218, 12680810, 13015287, 13254910, 13167115, 12941470, 12978663, 13318138, 13567650, 13475470, 13289281, 13379554, 13736914, 14067675, 14221091, 14267712, 14258901, 14176380, 14084271, 14085687, 14123120, 14036862, 13837705, 13710844, 13708978, 13645465, 13365726, 12948668, 12551658, 12211042, 11896505, 11628856, 11426964, 11231444, 10986165, 10730360, 10531122, 10385224, 10248466, 10093191, 9875450, 9515125, 8983730, 8375223, 7840964, 7476575, 7274922, 7136772, 6934593, 6639535, 6372890, 6242908, 6160674, 5950108, 5622385, 5368779, 5263470, 5166064, 4981042, 4821645, 4807862, 4862526, 4832511, 4686583, 4487397, 4292944, 4177094, 4195334, 4223593, 4008725, 3528237, 3125850, 3102117, 3325188, 3457905]
38006C457905l7838n3630l9906j44435k15255r3618M5616l7238k27024k21401
37996B433176m388J44540O6163j04001j68849q6316M9358J07049J0943j71784
37986B275891k72345k12246p7342M2495J47061J93925O9628j75091k64383o5297
37976A662296J59665R6927j69778l09498k21293q2563o146N0588O7853m5851k25175
37965I77025k76023j70757p4700m4873M0600J90088K04981M316j89958j59607
37955E01092k308M6618k8091m3159O8765J57171P9527j01088j96425j16439L6787
37944D02450J02546N6872J4648L1595J6021q1992j18502L8290K34245J93374n9275
37933H30272j97380p3329O7659o023j35882l8017K18801K89696O1721j91377k09571
$$ y = [3457905, 3420067, 3366437, 3326531, 3182096, 2966841, 2873223, 2918839, 2881601, 2654577, 2433176, 2428788, 2573328, 2639491, 2535490, 2366641, 2280325, 2329683, 2436732, 2447675, 2275891, 2003546, 1791300, 1713958, 1756453, 1903514, 2097439, 2167067, 1991976, 1727593, 1662296, 1821961, 1918888, 1749110, 1439612, 1218319, 1135756, 1129610, 1180198, 1248051, 1202200, 977025, 701002, 530245, 455545, 410672, 451272, 641360, 846341, 850657, 660699, 501092, 498784, 545402, 517311, 474152, 542917, 700088, 779615, 678527, 482102, 365663, 402450, 504996, 561868, 576516, 608111, 624132, 542140, 423638, 461928, 696173, 889547, 830272, 632892, 559563, 627222, 621199, 485317, 447300, 666101, 955797, 1017518, 826141, 616570]
37922F16570p1516m991m3712m2568M7744J06336N0998l4910n5380n9625j24670
37911C84276j63474l0768J90145K18017k6941k51334j74543P4304J63441M6563
37901D29686l1739K6387M2304p8981j61103o5597O6400O5787J5561O0047J09538
37890D78290l036j84657j83466J4054J54053R4485k6966m9454J655L6437M9281
37879C80676N6428L0765j8307k4363J6030L4607M6356J39968K46650J35925k16221
37868H28514m66535l28271Q615J39779R356q8690r194P9248M9162J606L596n3002
37856A74184j80376j70544N3554K23079J16322o2045r306J54424Q1301j90014
37846A90579k55044j912J83025R501k90820l53021j88666l6032N9774J96197K93374
$$ y = [616570, 545054, 540063, 496351, 453783, 501527, 607863, 658861, 623951, 568571, 508946, 384276, 220802, 190034, 380179, 598196, 571255, 319921, 145378, 219682, 383123, 429686, 397947, 424334, 466638, 387657, 226554, 160957, 227357, 293144, 308705, 368752, 478290, 475254, 290597, 107131, 121185, 275238, 369723, 342757, 293303, 294958, 331395, 380676, 437104, 467869, 449562, 425199, 441229, 475836, 522192, 662160, 908810, 1044735, 828514, 361979, 33708, 42323, 182102, 191458, 102768, 93574, 172822, 221984, 223590, 227186, 174184, -6192, -176736, -123182, 99897, 216219, 154174, 144868, 299292, 380593, 190579, -64465, -66377, 116648, 126149, -164671, -517692, -706358, -742390, -682616, -486419, -193045]
37835a93045J72835p7868j34240J08868L48743K58094r0714l11295j56477K07785
37825A32686L91282K04998j47596l28240k43887o4495P8773K10291L05943K23267
37815G63022l7325k21579j54802k414P018o0176j0423J10903J17057K5915r870
37804E27326k5570j44641k23945j3345L24466L10779j18216m24927k30323J44897
37794A26501J98665l8455j84671j46494j42982k18918j66505O5645K46993K20696
37784c9525J07762O5618O6010K2744k8740l778P6879J08844M3265n4017p8586
37773B86476j6322J5152r0535k38336j95279R4058L74410L73461J33396p9675
37763F56806j17949n7527j6088j8543l5538m3331m4726q0662j66972j92505k2045
$$ y = [-193045, -20210, -98078, -232318, -123450, 225293, 483387, 392673, 81378, -75099, 132686, 523968, 728966, 581370, 253130, 9243, -55252, 23521, 233812, 539755, 763022, 725697, 504118, 349316, 346902, 353920, 293744, 283321, 394224, 511281, 537196, 527326, 501756, 357115, 133170, 119825, 444291, 755070, 636854, 211927, -18396, 126501, 325166, 286711, 102040, -44454, -187436, -406354, -572859, -507214, -260221, -39525, 68237, 133855, 199865, 222609, 193869, 190091, 266970, 375814, 419079, 365062, 286476, 270154, 285306, 194771, -43565, -238844, -144786, 229624, 603085, 736481, 656806, 538857, 481330, 465242, 446699, 411161, 367830, 323104, 242442, 75470, -117035, -139080]
37752a39080K27874K26378r0532l01749m6222L93828M35645L7774k41865p7554
37742D24497J78306P4864k76937m22833k15769O9106J66908R5240Q785j5864j4209
37731G2094n4391j41190j74445n7411J34928K05780J04087J1440P8393K06581
37721C85866K11780R1388j0304k4570p316j3893m2138p0248p0795k8474N214m6328
37709C80182j41513j40182l4597j349j09287j59443P40J78524J08721j02617j21368
37698a42189Q4803K05620J03267J2765J05430J82874K7634j98307j89258L2254
37688B24893J79570J53744J24872J69264J32947n1504j78146p5085Q7369K1096
37678G89020k45085l95589k77818q6037l3845n9998l970R3190P5012k9673l1349
$$ y = [-139080, 88794, 315172, 224640, -77109, -123331, 270497, 706142, 743916, 502051, 424497, 602803, 677667, 400730, -22103, -237872, -168766, -1858, 93382, 102167, 86303, 72094, 17703, -123487, -297932, -355343, -220415, -14635, 89452, 100892, 179285, 385866, 597646, 689034, 678730, 654160, 646844, 632951, 590813, 520565, 449770, 421296, 426510, 380182, 238669, 98487, 63890, 62541, -46746, -206189, -205449, -26925, 81796, -20821, -142189, -57386, 148234, 251501, 264266, 369696, 552570, 580204, 381897, 192639, 224893, 404463, 558207, 683079, 852343, 985290, 933786, 755640, 680555, 767924, 789020, 543935, 148346, -129472, -215509, -249354, -309352, -313322, -220132, -145120, -174793, -206142]
37667b06142R7505J59498N9997k1078P7122K09988J35719r6076j93834m2837J38955
37656C18817J16130n9759j58059p8866N4579P9401j6829j08898j01954m1911k8738
37645b6087n7740m0329J5399j3847j36109j54318M5314K55329K15592K2494q012
37634A17686J48061J76696m5359k16951q5590J42161J29777o9714j42421k6055
37624A28291N0324r483m5814K4666O6120K095l7338K8415P1713M755m1359K8178
37612B70563N1662j11915k64136j30965J61717K23334o151j57444j3407J59054
37602A82312N5348j76737j84813L2680J53884M6706p9757o4420k2119o4801o3571
37591a85288J08830K86541K16685k9874j16219Q2702K93901K25150n1196k33765
$$ y = [-206142, -108637, 50861, 110858, 89780, 166902, 376890, 512609, 416533, 222699, 179862, 318817, 434947, 375188, 217129, 138263, 192842, 272243, 255414, 146516, 44562, 2651, -26087, -83827, -124156, -108757, -122604, -258713, -413031, -367717, -112388, 103204, 125698, 117686, 265747, 442443, 397084, 180133, 94543, 236704, 366481, 296767, 154346, 128291, 178615, 169132, 123318, 147984, 214104, 216199, 178861, 207276, 278989, 283744, 242385, 270563, 322225, 210310, -53826, -184791, -23074, 200260, 194109, 36665, 23258, 182312, 237660, 60923, -123890, -91210, 62674, 109380, 29623, -34797, -56916, -121717, -185288, -76458, 210083, 426768, 396894, 280675, 363377, 657278, 882428, 831232, 597467]
37581E97467j96823r0437p6800j35196j61500j28066o9561l65O4553O9607o42
37570a27763m6246K5503J28956R4090o3995j37831m2524M6012j7161r7142j0984
37559b49085J39228J18816m2041r8750j7740k6183j80642k23632j9712J77260
37549d22481J18879m2304l6221O3591N840j55550j28139J14308K69030J82187
37539c0860M8047M0700N6602l2806j31275r8378J1544O0809L3860j0346n8034
37528a10137q7035k8260R5656J30399J8241p5011r739Q8417K1003j56349k01302
37517c14117l3144J62085J67924m0123k90111l49763j22787K11476L38045J72336
37507i8179k8855l3132M2828m0161k24815k25873K6107K71742K87663J48030N3016
$$ y = [597467, 400644, 310207, 233407, 98211, -63289, -191355, -260916, -261281, -196728, -127121, -127763, -174009, -148506, -19550, 74540, 10545, -127286, -169810, -123798, -140959, -238101, -249085, -109857, 8959, -33082, -131832, -149572, -175755, -356397, -580029, -599741, -422481, -303602, -345906, -382127, -318536, -312696, -468246, -596385, -482077, -213047, -30860, 17187, 57887, 114489, 81683, -49592, -147970, -136426, -75617, -41757, -52103, -110137, -197172, -225432, -129776, 623, 18864, -56147, -65886, 22531, 43534, -112815, -314117, -347261, -185176, -17252, -57375, -347486, -697249, -820036, -608560, -270515, -98179, -127034, -160166, -117338, -157499, -382314, -608187, -582080, -310338, -22675, 125355, 178371]
37496A78371O7693J19288J34826R6887K7534l5116p7471j17931j32696l4850J84377
37485D10912L59627L22261J23675l8791p5400m9901k2171q07j5789p6027q6335
37474H51254K4462J29065M9385j42749j87655j0865J78907J97824R0810j6334
37464A164104p4632o8010J0673Q8303P1871r97l1429n0734j33010j68649j4775
37453G92715J58690M2608k59088k77704R3181L66848J88803j38614j81864l8309
37443G47266n9848k22303k39599j04324m8283q9790n6547K9566N972o5656K980
37432a00566J28884P8702o4315n296K09453K25990P11j17014j0869J2634j72136
37421A86178k39455j2772J51957n1065l20621k07887J73544L53725K11386K2674
$$ y = [178371, 246064, 365352, 500178, 597065, 624599, 589483, 512012, 394081, 261385, 226535, 410912, 770539, 1092800, 1216475, 1177684, 1102284, 1052383, 1030212, 1029405, 1013616, 937589, 851254, 875716, 1004781, 1054166, 911417, 723762, 712897, 891804, 1089628, 1180438, 1164104, 1089472, 1021462, 1032135, 1120438, 1192309, 1191312, 1159883, 1109149, 976139, 807490, 792715, 951405, 994013, 734925, 457221, 550402, 917250, 1106053, 967439, 785575, 747266, 687418, 465115, 225516, 121192, 72909, -16881, -73428, -43862, -37890, -103546, -100566, 28318, 107020, 42705, 37409, 246862, 472852, 473563, 356549, 345680, 358314, 186178, -53277, -66049, 85908, 34843, -285778, -493665, -320121, 33604, 244990, 267664]
37411B67664n6660j14229j47550k8340J80300K26650M8083j39330j74838j17225
37401e5475l9687P0694J46440M1288j90616k55529j3942K73191K69839P592j83763
37390G0032j20312M4771P6573m6430j58027j37272k0710R7225J75891J99174J21865
37379C02780n3936j94846j59779m148P5476J5813m7841k7455j0509n8189o7417
37368b30051K6601Q7893K311r3211k4944J01372N8973j06149j28386M5637J63569
37357i6385N2625j53461k53867k27743j41132j327J68179K55904J96168P5403
37347a25636P890m270j1499j4817k509k382k4001k1418L0190Q8717J09615Q1703
37335A11583p876j39443j95757p9674Q8830P3173j35749k71227j63859M3333J61590
$$ y = [267664, 211004, 96775, -50775, -79115, 101185, 327835, 375918, 236588, 61750, -55475, -95162, -24468, 121972, 163260, -27356, -282885, -296827, -23636, 246203, 253795, 70032, -50280, -5509, 71064, 24634, -133393, -270665, -291375, -194150, -18259, 180915, 302780, 248844, 53998, -105781, -109929, -34453, -18640, -66481, -93936, -104445, -162634, -230051, -203450, -115557, -113246, -206457, -231401, -130029, -71056, -177205, -305591, -259954, -96385, -43760, -197221, -451088, -678831, -819963, -821290, -653111, -397207, -201039, -125636, -117746, -122016, -133515, -148332, -150841, -153223, -177224, -198642, -168452, -79735, 29880, 111583, 103707, -35736, -231493, -311167, -222337, -149164, -284913, -556140, -719999, -676666, -515076]
37324e15076K14253K64367K07440k5793k30760j69060O2801J77959J27112R1999
37314B05242J12014M5725r3010j01233L9103P8994p7875j79799l5598J58630J41536
37303B93729L218p838Q0009M5580j05636j46198k8248M6972k969j8316O6344O2693
37291B89340j30618k84619j61270J07883K13607J18433N3297J20862J61125L3667
37281E21707j77919l02366k67946j04041J11000K55315K34091R2239l5181r6916
37271B29983j35958j31602j846J94125K39553M4461k05702k96824k41914j67738
37261d73462q8889M0774J60195J68456R7736N6632N6053M6140O0739J43334J78411
37250D46119Q061k81850l95878j97759J14553K56938J58202k7164r7545K4912
$$ y = [-515076, -300823, -36456, 170984, 145191, -85569, -254629, -191828, -13869, 113243, 205242, 317256, 362981, 269971, 168738, 207841, 286835, 208960, 29161, -6437, 152193, 293729, 296947, 289109, 369118, 414698, 309062, 162864, 134616, 181588, 178619, 160303, 226647, 289340, 158722, -125897, -287167, -179284, 34323, 152756, 206053, 326915, 488040, 521707, 343788, 41422, -226524, -330565, -219565, 35750, 269841, 362080, 326899, 229983, 94025, -37577, -39423, 154702, 394255, 438716, 233014, -63810, -305724, -473462, -562351, -521577, -361382, -192926, -95190, -38558, 17495, 63635, 124374, 267708, 446119, 454180, 172330, -223548, -421307, -306754, -49816, 108386, 81222, -16323, 8589]
37240H589K07259K05432m2638k81374k50783n9305j3251j27226j14842J05494
37230c62645K42709J00145j11128j26276j5180K6224L1116J24073K20261J67755
37220B97054M5690J4419m158j64155l17900j84155J38585K31635j6644k31116
37210a90745j25476R6723J11807n1828j53669j24645n2285M9285J92993K56719
37200H879J21726r1825j56868o4537o72k7117j8116P0989J06407K4999k4290P7489
37188B7064J88531R5834j42017k37465o8996J42828J41646j5128o8581M0247Q5153
37177A89116q1520k75339k39339k3866R8846L7307l3911L830M8544J4043O362
37166b55927J16205K10548J18641q7521j87573j16503M288Q8847J57823K05928
$$ y = [8589, 215848, 421280, 378642, 97268, -153515, -212820, -226071, -353297, -468139, -362645, -119936, -19791, -130919, -257195, -272375, -246151, -215035, -90962, 129299, 297054, 342744, 357163, 353005, 188850, -129050, -313205, -174620, 57015, 40371, -190745, -316221, -219498, -107691, -159519, -313188, -437833, -490118, -440833, -247840, 8879, 130605, 38780, -118088, -182625, -183297, -210414, -228530, -157541, -51134, -26135, -50425, 27064, 215595, 311429, 169412, -68053, -137049, 5779, 147425, 132297, 63716, 103963, 189116, 107596, -167743, -407082, -430948, -332102, -294795, -328706, -324876, -276332, -262289, -255927, -139722, 70826, 189467, 101946, -85627, -202130, -197842, -108995, 48828, 254756]
37156B54756J71946N8996n0073j09777j29684q7780L7612J54240J26055k4869
37146D01422j32149j24799j01294j29797j40910q4685l1368k3296J9532J30249
37136b17095J76551N9203r1229q8948K1918M3791o2163j35609q1908J2634O5598
37125b97257J22570K14871K33458O8546j93113l27190k22693m641J08134L7526
37115b59789p9878n8679J08175K33304J66791j9004j39321j34279r5850r1030
37105c69560q5394n0679j9866O875R2116K27615K74465J36361p4848j54412n6068
37094g3395O5401N4230q2929k18884k44189j42379K5212J71553K29871J79707
37084c5802O1316k7422N138J30611J82233L2182k19452l27544j90313M0517J63792
$$ y = [254756, 426702, 485698, 435625, 325848, 196164, 108384, 145996, 300236, 426291, 401422, 269273, 144474, 43180, -86617, -227527, -312212, -343580, -366876, -347344, -217095, -40544, 18659, -72570, -161518, -139600, -95809, -157972, -293581, -375489, -362855, -297257, -174687, 40184, 273642, 342188, 149075, -178115, -400808, -405449, -297315, -259789, -339667, -398346, -290171, -56867, 109924, 90920, -48401, -182680, -278530, -369560, -454954, -505633, -525499, -518624, -426508, -198893, 75572, 211933, 137085, -17327, -73395, -7994, 46236, -36693, -255577, -499766, -642145, -616933, -445380, -215509, -35802, 25514, -1908, 3230, 133841, 316074, 348256, 128804, -198740, -389053, -348536, -184744]
37073a84744J35094K5729r7800j67772j04379O9512J86888J32190O927k2524L5299
37062A4420N5007K0527J8151N0354M6954L6066R7776J54026L8250j92822k67318
37051G1391j00255O4516M1988k1786M2445R5018n5078k47149j72419J07881K14646
37040D1198K2413j77251j57007n5919n4498o5467K5624P7689n6172j92795p2097
37029f64282J71238J62642j11351k45880m2220J83477J06086j09952j00892J28215
37019e22919K56526J50032k4262j47990k84452m24308m07036k06063l7031m2052
37009a689555q2774n56J22353J49091J52424K61715L81350L21321J35174O6403
36999a83054J73484K49298J42575m7468j50042j27171m2547L6709N8305J6354
$$ y = [-184744, -49650, -23921, -121721, -289493, -393872, -324360, -137472, -5282, 1645, -20879, 14420, 69427, 89954, 108105, 158459, 205413, 241479, 339255, 493281, 531531, 338709, 71391, -28864, 35652, 77640, 55854, 98299, 193317, 138239, -108910, -281329, -173448, 41198, 63611, -113640, -270647, -326566, -381064, -446531, -420907, -343218, -399390, -592185, -664282, -493044, -330402, -441753, -687633, -729853, -546376, -440290, -550242, -651134, -522919, -266393, -116361, -140623, -288613, -573065, -997373, -1404409, -1610472, -1647503, -1689555, -1772329, -1772885, -1650532, -1501441, -1349017, -1087302, -705952, -384631, -249457, -183054, -9570, 239728, 382303, 334835, 184793, 57622, 15075, 51784, 110089, 126443]
36989A26443r617N1331J33939J19326K1474m7529o5974r1806j01116l5613K0814
36978A21672n1829j46508n3383J42018J17852j51264k83406p2537J74179J27166
36968g6040n8169m3070J39813J95630O1517o7215r8728j01997p6771L1369J46269
36957E2608J61094J39313J54277O5282k20007m06479j56012L11616M33403J13035
36947F48130j73923j42164m3754j01684j23622M4310J49081j7300j82865l1420
36937B4789K29290J89393q9487j96167m2285N8006m8870j52658r2583O917K0477
36926i3178K6778R5727J27149M9408k2612K3429J03480P2031n9863j63088j69073
36915i812j11843m6930k622K3073N6159J05269J25750Q1037K3410K5392M2400
$$ y = [126443, 116826, 168157, 302096, 421422, 442896, 395367, 329393, 237587, 136471, 100858, 121672, 69843, -76665, -130048, 11970, 129822, -21442, -304848, -377385, -203206, -76040, -134209, -177279, -37466, 158164, 219681, 152466, 53738, -48259, -125030, -93661, 52608, 213702, 353015, 507292, 572574, 352567, -53912, -209924, 101692, 535095, 648130, 474207, 332043, 288289, 186605, 62983, 107293, 256374, 239074, 56209, 24789, 254079, 443472, 353985, 157818, 115533, 173539, 124669, -27989, -120572, -113655, -93178, -66400, 29327, 156476, 205884, 183272, 206701, 310181, 382212, 322349, 159261, -9812, -121655, -168585, -171207, -148134, -91975, 13294, 139044, 220081, 243491, 268883, 311283]
36904C11283l9784k07753k99678k25967q7365l953N4765J63553K60570K16723
36894A42394M9092p8168p6282k7289j6933K058Q8124J52054O3017j26498k18223
36883d6654j39565k3306J9743L6241O2917J7267j01588r4132J40001L45143K34120
36872D50187m5995j08207P6002J58157L021j26025p2073l9453j49308j67530L3468
36861A2244J38044j03287l66798k24631J38476K08389k2508q4840J43160K40781
36851G9030j6942k75264j87103O0146J03438m3839j18090n3477M262l792M337
36840d47294P7383J80261K56842K34592O3766j59019k33033j11618J8078K757
36830a17285q2172j01904n9952j1556N3883J15919P5310n5316p9511J02192K94691
$$ y = [311283, 271499, 63746, -235932, -461899, -549264, -553217, -498452, -334899, -74329, 142394, 191486, 113318, 37036, 9747, -7186, -5128, 82996, 235050, 298067, 171569, -46654, -186219, -209525, -189782, -153541, -90624, -73357, -174945, -269077, -129076, 216067, 450187, 404192, 295985, 371987, 530144, 533165, 407140, 335067, 295614, 146306, -21224, 12244, 150288, 47001, -319797, -544428, -405952, -197563, -220071, -304911, -161751, 79030, 62088, -213176, -400279, -340133, -236695, -280534, -398624, -452101, -447839, -451631, -447294, -369911, -189650, 67192, 301784, 365550, 206531, -26502, -138120, -120042, -117285, -199457, -301361, -361313, -372869, -318986, -203067, -127757, -183073, -262584, -160392, 134299]
36819A34299K68801P9784n9622r5410j20757j52969j27347m4037N2437J62462
36809I7641K42658J42997j67887m20739l28768Q926K27005J79697N8380K9933
36799F9843K3667n2610j12012l4594J21897J83106P6917q1159j11463K6424J54187
36788B64203O3491j92974l22956j82354J6873K8638o3327k3851J24086J50825
36778a37346J7283p6874l6105K9186P0507J79146L25648L05244O5087j57499j62242
36767D22035m0814L0116M3941O1128M8162o961O731J23244J58351k4280k40841
36756E80812k13205K1644J63043O8591r2325j10176K0514J56321J70395L7975
36746H03589j47884k41098j93720j13734j04545j13757m0395Q2304J41336J21884
$$ y = [134299, 403100, 482884, 423262, 327852, 207095, 54126, -73221, -117258, -64821, 97641, 340299, 483296, 315409, -105330, -434098, -425172, -198167, -18470, 39910, 69843, 93510, 40900, -71112, -105706, 16191, 199297, 276214, 195055, 83592, 110016, 264203, 327694, 134720, -188236, -370590, -353717, -325079, -388406, -412257, -288171, -137346, -120063, -196937, -233042, -203856, -133349, 45797, 371445, 676689, 741776, 584277, 422035, 381221, 411337, 455278, 516406, 564568, 557607, 564338, 687582, 845933, 821653, 580812, 367607, 389251, 552294, 620885, 528560, 418384, 438898, 595219, 765614, 803589, 655705, 414607, 220887, 107153, 2608, -111149, -151544, -69240, 72096, 193980]
36736A93980R1221N7721k123k4450N8333J43052O1559j32429j86627r802J83940
36725D34375J76624K5308p2080n2076N516M6407Q0693J02955Q9318N3798K9237
36714I20075J4233n289j7077j5096k6990o0811p7368o5320p5607j14562q2352
36703C93836P6678K22031J53425j09273l13303k71144o7142Q0255P5818J563k7276
36692B15468J5879P1694O3074l5160j57946j89012p5350R7360J78897J13950l087
36681B95767n1681l2930m8799j39082k00117j09886R8572K53603K39246J14123
36671D18816R546l7537r0846j74652k01005p6021J48151K82139J92086l4913j70045
36660B65719j03715L2309N5004k2217m0798L6902P1599q129p6474l0902J6400
$$ y = [193980, 285201, 342922, 340799, 316349, 374682, 517734, 579293, 446864, 260237, 250435, 434375, 610999, 636307, 564227, 512151, 517667, 564074, 644767, 747722, 837040, 890838, 920075, 934308, 929019, 911942, 896846, 869856, 809045, 731677, 666357, 590750, 476188, 393836, 470514, 692545, 845970, 736697, 423394, 152250, 85108, 165363, 241181, 242744, 215468, 231347, 303041, 366115, 330955, 173009, -16003, -91353, 6007, 184904, 298854, 295767, 244086, 211156, 162357, 23275, -176842, -286728, -188156, 65447, 304693, 418816, 428362, 390825, 299979, 125327, -75678, -151699, -3548, 278591, 470677, 435764, 265719, 162004, 194313, 249317, 227100, 186302, 223204, 294803, 286674, 210200, 179298, 195698]
36649A95698n9295j26611K5263K94954L41488R0706j22166n0285R7734J9928j72148
36638E35266j39403J05660J91835j1263j60652L3782L57425M20440K31142J32378
36628A696610K64034M11349M05458L88275N67883R09869J199069J262080J011847
36619H116474M23472l59236r87498j178358j012021q09974p27832o28665l77608
36610B458754q6940K3493j03030l24472m60798m14547k07425J5197P7635l7463
36600I40404j43784q0587P2252J16711J9644o8870n9082k3724l2482m0806j3008
36589F86668k2104j20218k02770j26568P8474K27308K03386P8934q92Q456K7549
36578H38223j4953o3614M083J83776K85705J59836p6880j81933j31247j26167
$$ y = [195698, 136403, 9792, 35055, 330009, 671497, 762203, 640037, 589752, 687486, 707414, 535266, 395863, 501523, 693358, 682095, 521443, 555225, 912650, 1333090, 1564232, 1696610, 1960644, 2371993, 2777451, 3165726, 3733609, 4643478, 5842547, 7104627, 8116474, 8539946, 8180710, 7193212, 6014854, 5002833, 4192859, 3465027, 2836362, 2458754, 2371814, 2395307, 2292277, 1967805, 1507007, 1092460, 885035, 900232, 977867, 940404, 796620, 716033, 788285, 904996, 924640, 855770, 796688, 772964, 740482, 699676, 686668, 664564, 544346, 341576, 215008, 293482, 520790, 724176, 803110, 802218, 810674, 838223, 823270, 759656, 763739, 947515, 1233220, 1393056, 1316176, 1134243, 1002996, 876829]
36568H76829k25756k14454K9399K63292K10921m714n2075P9891Q4743j24646k39591
36557F83839m6269K10319J77995r2019k48504j45058K2930O2442J7237l842l5924
36546F03146j58384k88968k40764J1152K46195K51852Q6521j6438K6192O4022
36536E84526j5114r8541n2759K7804l4453j88595k10776n3146Q6628P2879m709
36525A13744l3635l7239m3648M690R5456Q6689n9736j59495q0607K8167k4955
36514a10569j53865j40134J937N8266k6075o6309O0236K34749K78006J64960J135
36503C02337j11293j38965j18693j14941j35954j17233l1560M7147N4868L1956
36493c32331K4770p556p9735q5194M0973J66162J35004R952m1441q135J5956N1905
$$ y = [876829, 651073, 436619, 466018, 729310, 940231, 935517, 883442, 963333, 1048076, 923430, 683839, 637570, 847889, 1025884, 933865, 685361, 540303, 563233, 625675, 642912, 639070, 603146, 444762, 155794, -84970, -73818, 172377, 424229, 510750, 494312, 520504, 584526, 569412, 470871, 418112, 445916, 411463, 222868, 12092, -41054, 45574, 118453, 113744, 80109, 42870, -778, 3912, 99368, 186057, 126321, -33174, -113781, -85614, -110569, -264434, -404568, -402631, -344365, -370440, -436749, -376513, -141764, 136242, 301202, 302337, 191044, 52079, -66614, -181555, -317509, -434742, -466302, -419155, -364287, -332331, -307561, -315117, -394852, -480046, -439073, -272911, -137907, -127955, -169396, -177531, -161575, -109670]
36481a09670J64091K38653J05326j47041k49573j44049k4798Q082M2555Q4517
36471c1907K1942p8103J8813K88659L79414J39694j14326q5777N9562K0698j37163
36460D81506j51193l7317k8145j37132j39973K9935J71406J29836j1159q9084
36450B18680m2836Q0269J68442J20935j2222m4430P3325J24664n0719k57757k12918
36439A65433J3637J16413L1520l3027q390m7817j63262j40476O8645J95330O6317
36428B64323j09556p3570Q9752J24283J914r0311o3277k657K3745M8611R6542
36417C09799J23699P8840l9580j67389j87138l0897J87052K43820Q3644q8562
36407E13288p7485N2932J14886P0296J5455k7831j23462k43583k49731q6781J18887
$$ y = [-109670, 54421, 293074, 398400, 251359, 1786, -142263, -167061, -158979, -116424, -31907, -9965, -88068, -69255, 219404, 598818, 738512, 624186, 538409, 597971, 618669, 481506, 330313, 292996, 264851, 127719, -12254, 17681, 189087, 318923, 307764, 218680, 175844, 256113, 424555, 545490, 533268, 488838, 562163, 686827, 636108, 378351, 165433, 179070, 295483, 327003, 293976, 285586, 237769, 74507, -65969, 2676, 198006, 264323, 154767, 81197, 170949, 295232, 297146, 206835, 143558, 140901, 164646, 213257, 309799, 433498, 512338, 472758, 305369, 118231, 87334, 274386, 518206, 601850, 513288, 435803, 488735, 603621, 673917, 689372, 661541, 538079, 294496, 44765, -42016, 76871]
36396G6871J97423J04920n9843j51218q8448P4924J95072J84774Q8222j8427j26491
36385D77779k25632k26218q0342P7655P1588n5018r1710R263N1866p7698j97670
36374b66137j01423J01364J32188k7553r5723Q6524L07457K82439M4893j26473
36364C37556r0078K6047N7634K778n3841q2830j00357r9896o7846j8911L1813
36353e7931Q3263J04054M3882o9277j23562p0472O127L3269O1168J36962J71270
36342C18753P1909o7695q2418O650K8872n6002j06258n0471j453n1784j21778
36331a11675j04441k7748K6422N1746O5442K7852p4909j44077p6728Q0158J71853
36320a16105J08285n5165j74045j27903O4169K27351K09299P3487p98j330q0737
$$ y = [76871, 274294, 379214, 319371, 168153, 79705, 154629, 349701, 534475, 622697, 604270, 477779, 252147, 25929, -54413, 23242, 94830, 39812, -51898, -42635, 9231, -68467, -266137, -367560, -266196, -134008, -161561, -257284, -170760, 136697, 419136, 464029, 337556, 247478, 273525, 331159, 333937, 280096, 197266, 96909, -2987, -70833, -89744, -57931, 25332, 129386, 173268, 103991, -19571, -90043, -83916, -50647, 10521, 147483, 318753, 390662, 322967, 240549, 247199, 276071, 220069, 113811, 63340, 61887, 10103, -111675, -216116, -243864, -217442, -165696, -100254, -72402, -147311, -291388, -368116, -287958, -116105, -7820, -62985, -237030, -364933, -300764, -73413, 135886, 209373, 208575, 207245, 126508]
36309A26508k36477k32058L1716K89822K59451L8813p4554k5272O738l8366m3134
36298A03187J6421K1307m8144o5985O074O1379O0285P8447J04270K2421j39450
36287B20212j87183o9692K5793o075k0754Q1651J44184L3012r3247l5880J00670
36276A92691Q4080o1147j23207o6220l8068o2114p496J27587J67608M1697j06403
36265A49008j43388r1881j2109P1837Q8036m2298k23631k40878o2597J05351J42630
36254b59920J72549K81800L06832R1199k07413k88145j00790J20264J66989M8966
36244C32331q6724r8930M4150K02830J71048n6219k15618j07713J05175J12058
36234D02388j09399k80497k25974p4445j3470k9503J5043J55566K66580J96819
$$ y = [126508, -109969, -342027, -310311, -20489, 238962, 277775, 203221, 177949, 184687, 146321, 103187, 119608, 140915, 92771, 26786, 32860, 94239, 154524, 232971, 337241, 359662, 220212, 33029, -36663, -10870, -16945, -37699, 43952, 188136, 221148, 127901, 92021, 192691, 276771, 215624, 92417, 26197, -11871, -73985, -81481, 46106, 213714, 255411, 149008, 5620, -86261, -98370, -26533, 61503, 19205, -204426, -445304, -507901, -402550, -259920, -87371, 194429, 501261, 592460, 385047, 96902, -3888, 116376, 283365, 332331, 245607, 146677, 190827, 393657, 564705, 508486, 292868, 185155, 290330, 402388, 292989, 12492, -213482, -287927, -301397, -330900, -315857, -160291, 106289, 303108]
36224C03108n7127k92386k65926J8194K62102K17019r271j26580n7318L5969O0073
36213H7857Q8638J44858J26963J1237p7935p5638o6887r6102p7085J9005P6191
36202A61102L7692R040M1293R510j42986k34759j14362O9208Q8636k492J4051
36191f4067J31199J20275q1078k41179j65049L6903J18228K3797o3033K6424K21124
36180F3544K83522J10024j15150j54109l9181N78r4093j50234r5193p3074j23276
36169c86642m5649K15741L47162J11852k20306k35624J6763J62418J05891P1890
36159A43496J13273L5123j63398k09284k3627J15886K5334j10602q0538L1908
36149a22429M5071m8412j60333k33658j76657P5986L28430K50423j12790k80570
$$ y = [303108, 245981, -46405, -312331, -294137, -32035, 184984, 175713, 49133, -8185, 27784, 87857, 176495, 321353, 448316, 459553, 381618, 305980, 239093, 142991, 65906, 84911, 161102, 198794, 207834, 249127, 258637, 115651, -119108, -233470, -164262, -75626, -78118, -64067, 67132, 187407, 106329, -134850, -299899, -262996, -144768, -120971, -184004, -157580, 63544, 347066, 457090, 341940, 187831, 148650, 149228, 55135, -95099, -190292, -263366, -386642, -432291, -216550, 130612, 242464, 22158, -213466, -196703, -34285, 71606, 143496, 256769, 291892, 128494, -80790, -104417, 11469, 36803, -73799, -154337, -122429, -77358, -125770, -286103, -519761, -696418, -620432, -292002, -41579, -154369, -434939]
36139d34939M463L74157L58751K6110k19937k34494j62414n9710J20003K57417
36129B9407J68286m9320j02322N2873J54677N8316p1741p0868l1396j19564k90118
36118b71770l19961q2975K69631M16044J95170j67209k83336q8633Q5838J8398
36108b28803p7058O0515K70962K26494r523p9422O8815J00042j33087l27396j99779
36097c28240R3329K17134J15181j3925m8287l9943m9541n2953q431O8647J02097
36086E5068K1353j28344j75289j7345K00732K40133Q6441m4088k9432P603o4202
36075A52630j65808j39111J1740J28398J02769n803m9522L3294J22538M1502j89662
36064D2965l21846j91419M2861J26525O5631M7398Q8222L0925j25391j83600q4625
$$ y = [-434939, -430476, -56319, 302432, 328542, 108605, -125889, -288303, -348013, -228010, 29407, 197693, 148373, 46051, 98924, 253601, 311917, 240176, 169308, 137912, 18348, -271770, -591731, -674706, -405075, 10969, 206139, 38930, -244406, -333039, -247201, -228803, -305861, -245346, 25616, 252110, 242587, 163165, 231980, 332022, 198935, -128461, -328240, -234911, -17777, 97404, 83479, 35192, -4751, -54292, -107245, -115676, -47029, 55068, 76421, -51923, -227212, -244557, -43825, 196308, 282749, 238661, 209229, 216832, 152630, -13178, -152289, -140549, -12151, 90618, 84815, 35293, 68587, 191125, 232627, 42965, -278881, -470300, -427439, -300914, -235283, -187885, -99663, -68738, -194129, -377729, -462354]
36053d62354q743n0241n2723R8357K52852K30833Q9110j7009p4728j42552j76752
36042c13950j08580N682P0158J00995J58237K11511J98360J34161N6402m3936
36032D69040j33589j02096N8487J62757O8299j10260j79256j42882j21915j04896
36022a36311k976J13344P6433q5446j46953j6164J37315J53166R5837R2772J07442
36011C88459K3862j23297j63011l0030J31094J48467L0448p3301p1930j3864J8605
36000B65502K849n3427j37792j86507j18478J3467K5234j32033k34520q3594J68707
35989d70592K14923M0834q4601m4383n864p6782j20753j9727J33707K25144K65218
35978E7124K34604L8987k37591l05029q6132R7589m706j67657m9817K47603L31177
$$ y = [-462354, -471097, -521338, -574061, -475704, -222852, 7981, 97091, 80082, 5354, -137198, -313950, -422530, -416848, -346690, -245695, -87458, 124053, 322413, 456574, 512976, 469040, 335451, 233355, 291842, 454599, 522898, 412638, 233382, 90500, -31415, -136311, -139287, -25943, 50490, -34956, -181909, -198073, -60758, 92408, 188245, 281017, 388459, 412321, 289024, 126013, 95983, 227077, 375544, 405992, 332691, 260761, 246897, 265502, 268351, 214924, 77132, -109375, -227853, -214386, -189152, -321185, -555705, -639299, -470592, -255669, -214835, -299436, -343819, -349683, -426465, -547218, -566945, -433238, -208094, 57124, 291728, 330715, 93124, -211905, -298037, -200448, -205154, -372811, -422628, -175025, 156152]
35967A56152J01603j56034k12522j13729J5187J01262O7549r4659j99910n9927
35957c95028K02601K78119J12891k7124L2384J49183J23693k8617j54527j55998
35947A37577m1166R0577R2077p1703k18005j57699J3681L4636j21345j93438k1288
35936d56096K33386L25924K07477n233j77134k12997j18247m2469j14621k24670
35926e84680j51059Q7030K28668J60236O2548R3123J65966J59686J10829O1549
35916C93896n9808k38520k67758n0124J73819J32609p4773j32864K1305J39425
35906C7207N0210j28164k02087j45533n7276R70L8408O6304O7566L6668K0454
35895b15273Q3506K08524K68036J60061m8481j91422j96607j18899j3383R3258
$$ y = [156152, 257755, 101721, -110801, -224530, -209343, -108081, -40532, -135191, -335101, -395028, -192427, 85692, 198583, 171459, 203843, 353026, 476719, 448102, 293575, 137577, 96411, 186988, 279065, 207362, -10643, -168342, -154661, -120025, -241370, -434808, -456096, -222710, 103214, 310691, 305458, 128324, -84673, -202920, -245389, -360010, -584680, -735739, -648709, -420041, -259805, -197257, -104134, 61832, 221518, 332347, 393896, 334088, 95568, -172190, -222314, -48495, 84114, 9341, -123523, -102218, 37207, 87417, -40747, -242834, -388367, -445643, -444673, -406265, -339961, -272395, -235727, -215273, -131767, 76757, 344793, 504854, 456373, 264951, 68344, -50555, -63938, 29320]
35885B9320J25339J9601j22944j25108o803K4309q7679j37704J05J44883R4673
35874d2008m6701m5850Q8284J45552N8612k5552j1462N705q5856k29901k54500
35863d43677o6733K20511L59984K21344l1547j17692j367Q0723j175p1887M2072
35852A90556K11824K11703P1716n999K1924L1423j2361k7334j2988n2385j22666
35841E05413j12827l7318l2870j22926j73347j13947l0474o63L19j039j7314j4753
35829a51746N6124J26991Q1331k3814m931J38752J87019N1823o4237P96R9453
35818D97561L2138j08760r5276N3656J08522k175j12288j06989n4769j4586N9202
35807B56236J39382P3879j50815k81549j24286J36652J70461k7256j47495m4594
$$ y = [29320, 154659, 174260, 51316, -73792, -80595, -56286, -143965, -281669, -281564, -136681, -42008, -88709, -134559, -46275, 99277, 157889, 132337, 120875, 126580, 40724, -189177, -443677, -510410, -289899, 70085, 291429, 259882, 142190, 140823, 221546, 220371, 148484, 190556, 402380, 614083, 685799, 679800, 701724, 733147, 720786, 693452, 680464, 628079, 505413, 392586, 355268, 322398, 199472, 26125, -87822, -118296, -118959, -118640, -119679, -136993, -151746, -95622, 31369, 112700, 88886, 83955, 222707, 409726, 461549, 397312, 398108, 497561, 529699, 420939, 325663, 379319, 487841, 485666, 373378, 266389, 211620, 197034, 256236, 395618, 469497, 318682, 37133, -87153, 49499, 219960, 192704, 45209, 615]
35797F15P2210P177j12561o9162Q5695J24658J832j05626p8986J5622Q0671R4817
35785A16962N4119m1405j25108j21476o8193m9726l8908L0137P6084j7877j32652
35774c18043l9160J80354J72366j22988l04968j09196J74131J72463J5113N6505
35764a23423K39622J99081r5200k66602j28531P0030R5505N2710R3244J14697
35754B51133k7297k22090k44329o6926J42168K45261K16436P9141r9558j96185
35744G7754j28232L9152J48260J12934Q69n2160j2147o205j42902k88140j79588
35733d30405J69529L79923J86898j66573k55731n1172J22004J02743L0676r65
$$ y = [615, 72825, 80002, -32559, -101721, -16026, 108632, 110464, 4838, -74148, -58526, 22145, 116962, 171081, 129676, 4568, -116908, -185101, -234827, -273735, -243598, -167514, -185391, -318043, -357203, -176849, -4483, -127471, -432439, -541635, -367504, -195041, -179928, -123423, 116199, 315280, 220080, -46522, -175053, -105023, -9518, 43192, 136436, 251133, 223836, 1746, -242583, -309509, -167341, 77920, 294356, 373497, 273939, 77754, -50478, -11326, 136934, 249868, 250737, 198577, 186430, 180225, 37323, -250817, -430405, -260876, 119047, 305945, 139372, -116359, -167531, -45527, 57216, 87892, 86927]
$$ [...]
##END NTUPLES=NMR SPECTRUM
##END=
